##TITLE=1H ikalashn
E2
18.12.2024
##JCAMPDX= 6.0         $$ Bruker NMR JCAMP-DX V2.0
##DATA TYPE= NMR FID
##DATA CLASS= NTUPLES
##ORIGIN= UXNMR, Bruker Analytische Messtechnik GmbH
##OWNER= root
$$ TOPSPIN		Version 1.3
$$ 2024-12-18 10:51:33.921 +0400  Irina@DPX200
$$ Compression mode = diff/dup
##.OBSERVE FREQUENCY= 200.131300845
##.OBSERVE NUCLEUS= ^1H
##.DELAY= (6, 6)
##.ACQUISITION MODE= SIMULTANEOUS
##.ACQUISITION SCHEME= undefined
##.AVERAGES= 24
##.DIGITISER RES= 18
##SPECTROMETER/DATA SYSTEM= spect
##.PULSE SEQUENCE= zg
##.SOLVENT NAME= CDCl3
##.SHIFT REFERENCE= INTERNAL, CDCl3, 1, 17.49637
##AUDIT TRAIL= $$ (NUMBER, WHEN, WHO, WHERE, WHAT)
$$ ##TITLE= Audit trail, TOPSPIN		Version 1.3
$$ ##JCAMPDX= 5.01
$$ ##ORIGIN= Bruker BioSpin GmbH
$$ ##OWNER= Irina
$$ $$ F:/spectra/data/iren/nmr/1H/4/audita.txt
$$ ##AUDIT TRAIL=  $$ (NUMBER, WHEN, WHO, WHERE, VERSION, WHAT)
(   1,<2024-12-18 10:51:08.968 +0400>,<Irina>,<DPX200>,<TOPSPIN 1.3>,
      <created by zg
	started at 2024-12-18 10:49:30.171 +0400,
	POWCHK disabled, PULCHK disabled
       terminated by command 'halt'
       configuration hash MD5:
       BE 6D 3F 07 2A EA 11 49 91 17 2B D3 AF B3 58 0D
       data hash MD5: 16K
       41 90 21 68 DC 48 B9 17 8E E5 C3 66 A4 91 17 8B>)
$$ ##END=
$$ 
$$ $$ hash MD5
$$ $$ 51 BA 82 AD 12 AA 31 E5 B9 50 8F 0F E7 F8 D6 0F
##$RELAX= 
##$RELAX= 
##$RELAX= 
##$RELAX= 
##$RELAX= 
##$RELAX= 
##$RELAX= 
##$RELAX= 
##$RELAX= 
$$ Bruker specific parameters
$$ --------------------------
##$DU= <F:/spectra>
##$EXPNO= 4
##$NAME= <1H>
##$PROCNO= 1
##$TYPE= <nmr>
##$USER= <iren>
##$AMP= (0..31)
100 100 100 100 100 100 100 100 100 100 100 100 100 100 100 100 100 100 
100 100 100 100 100 100 100 100 100 100 100 100 100 100 
##$ANAVPT= -1
##$AQSEQ= 0
##$AQ_mod= 1
##$AUNM= <au_zg>
##$AUTOPOS= <>
##$BF1= 200.13
##$BF2= 200.13
##$BF3= 200.13
##$BF4= 200.13
##$BF5= 200.13
##$BF6= 200.13
##$BF7= 200.13
##$BF8= 200.13
##$BYTORDA= 1
##$CFDGTYP= 0
##$CFRGTYP= 5
##$CHEMSTR= <none>
##$CNST= (0..63)
1 1 145 1 1 1 1 1 1 1 1 1 1 1 1 1 1 1 1 1 1 1 1 1 1 1 1 1 1 1 1 1 1 1 
1 1 1 1 1 1 1 1 1 1 1 1 1 1 1 1 1 1 1 1 1 1 1 1 1 1 1 1 1 1 
##$CPDPRG= <>
##$CPDPRG1= <>
##$CPDPRG2= <>
##$CPDPRG3= <>
##$CPDPRG4= <mlev>
##$CPDPRG5= <mlev>
##$CPDPRG6= <mlev>
##$CPDPRG7= <mlev>
##$CPDPRG8= <mlev>
##$CPDPRGB= <>
##$CPDPRGT= <>
##$D= (0..63)
0 2 0 0 0 0 0 0 0 0.06 0 0.03 0 0 0 0 0.0002 0 0 0 0 0 0 0 0 0 0 0 0 0 
0 0 0 0 0 0 0 0 0 0 0 0 0 0 0 0 0 0 0 0 0 0 0 0 0 0 0 0 0 0 0 0 0 0 
##$DATE= 1734504666
##$DBL= (0..7)
120 120 120 120 120 120 120 120 
##$DBP= (0..7)
150 150 150 150 150 150 150 150 
##$DBP07= 0
##$DBPNAM0= <>
##$DBPNAM1= <>
##$DBPNAM2= <>
##$DBPNAM3= <>
##$DBPNAM4= <>
##$DBPNAM5= <>
##$DBPNAM6= <>
##$DBPNAM7= <>
##$DBPOAL= (0..7)
0.5 0.5 0.5 0.5 0.5 0.5 0.5 0.5 
##$DBPOFFS= (0..7)
0 0 0 0 0 0 0 0 
##$DE= 6
##$DECBNUC= <off>
##$DECIM= 32
##$DECNUC= <off>
##$DECSTAT= 4
##$DIGMOD= 1
##$DIGTYP= 9
##$DL= (0..7)
0 120 120 120 120 120 120 120 
##$DP= (0..7)
150 150 150 150 150 150 150 150 
$$ [...]
##$SW= 21.9926040160658
##$SWIBOX= (0..15)
0 0 2 0 0 0 0 0 0 0 0 0 0 0 0 0 
##$SW_h= 4401.40845070422
##$TD= 16384
##$TD0= 1
##$TE= 300
##$TE2= 300
##$TE3= 300
##$TEG= 300
##$TL= (0..7)
0 120 120 120 120 120 120 120 
##$TP= (0..7)
150 150 150 150 150 150 150 150 
##$TP07= 0
##$TPNAME0= <>
##$TPNAME1= <>
##$TPNAME2= <>
##$TPNAME3= <>
##$TPNAME4= <>
##$TPNAME5= <>
##$TPNAME6= <>
##$TPNAME7= <>
##$TPOAL= (0..7)
0.5 0.5 0.5 0.5 0.5 0.5 0.5 0.5 
##$TPOFFS= (0..7)
0 0 0 0 0 0 0 0 
##$TUNHIN= 0
##$TUNHOUT= 0
##$TUNXOUT= 0
##$USERA1= <user>
##$USERA2= <user>
##$USERA3= <user>
##$USERA4= <user>
##$USERA5= <user>
##$V9= 5
##$VALIST= <valist>
##$VCLIST= <CCCCCCCCCCCCCCC>
##$VD= 0
##$VDLIST= <DDDDDDDDDDDDDDD>
##$VPLIST= <PPPPPPPPPPPPPPP>
##$VTLIST= <TTTTTTTTTTTTTTT>
##$WBST= 1024
##$WBSW= 25
##$XGAIN= (0..3)
0 0 0 0 
##$XL= 0
##$YL= 0
##$YMAX_a= 907829
##$YMIN_a= -754842
##$ZGOPTNS= <>
##$ZL1= 120
##$ZL2= 120
##$ZL3= 120
##$ZL4= 120
##$ABSF1= 10
##$ABSF2= 0
##$ABSG= 5
##$ABSL= 3
##$ALPHA= 0
##$AQORDER= 0
##$ASSFAC= 0
##$ASSFACI= 0
##$ASSFACX= 0
##$ASSWID= 0
##$AUNMP= <proc_1d>
##$AXLEFT= 0
##$AXRIGHT= 0
##$AXTYPE= 0
##$AXUNIT= <>
##$AZFE= 0.1
##$AZFW= 0.1
##$BCFW= 1
##$BC_mod= 2
##$BYTORDP= 1
##$COROFFS= 0
##$CY= 7568.61572265625
##$DATMOD= 1
##$DC= 2
##$DFILT= <>
##$DTYPP= 0
##$F1P= 17.9538593292236
##$F2P= -4.03888763876832
##$FCOR= 0.5
##$FTSIZE= 32768
##$FT_mod= 4
##$GAMMA= 1
##$GB= 1
##$INTBC= 1
##$INTSCL= 1
##$ISEN= 128
##$LB= 0.02
##$LEV0= 0
##$LPBIN= 0
##$MAXI= 945.577
##$MC2= 0
##$MEAN= 0
##$ME_mod= 0
##$MI= -402.1523
##$NCOEF= 0
##$NC_proc= 0
##$NLEV= 6
##$NOISF1= 8.587773
##$NOISF2= 6.764455
##$NSP= 1
##$NTH_PI= 0
##$NZP= 0
##$OFFSET= 17.49637
##$PC= 1
##$PHC0= 101.2848
##$PHC1= 0.002264977
##$PH_mod= 0
##$PKNL= yes
##$PPARMOD= 0
##$PPDIAG= 0
##$PPIPTYP= 0
##$PPMPNUM= 100
##$PPRESOL= 1
##$PSCAL= 0
##$PSIGN= 0
##$REVERSE= no
##$SF= 200.13
##$SI= 32768
##$SIGF1= 18.5376
##$SIGF2= -6.396296
##$SINO= 400
##$SIOLD= 32768
##$SREGLST= <1H.CDCl3>
##$SSB= 3
##$STSI= 0
##$STSR= 0
##$SW_p= 4401.40845070422
##$SYMM= 0
##$S_DEV= 0
##$TDeff= 0
##$TDoff= 0
##$TI= <>
##$TILT= no
##$TM1= 0
##$TM2= 0
##$TOPLEV= 0
##$USERP1= <user>
##$USERP2= <user>
##$USERP3= <user>
##$USERP4= <user>
##$USERP5= <user>
##$WDW= 1
##$XDIM= 8192
##$YMAX_p= 0
##$YMIN_p= 0
$$ End of Bruker specific parameters
$$ ---------------------------------
##NTUPLES= NMR FID
##VAR_NAME=  TIME,          FID/REAL,        FID/IMAG
##SYMBOL=    X,             R,               I
##VAR_TYPE=  INDEPENDENT,   DEPENDENT,       DEPENDENT
##VAR_FORM=  AFFN,          ASDF,            ASDF
##VAR_DIM=   8192,          8192,            8192
##UNITS=     SECONDS,       ARBITRARY UNITS, ARBITRARY UNITS
##FACTOR=    0.0002272,     1,               1
##FIRST=     0,             0,               0
##LAST=      1.8609952,     0,               -107
##MIN=       0,             -754842,         -754842
##MAX=       1.8609952,     907829,          907829
$$ Real data points
##PAGE= N=1
##DATA TABLE= (X++(R..R)), XYDATA
0 0 0 0 0 0 0 0 0 0 0 0 0 0 0 0 0 0 0 0 0 -24 24 -24 24 -24 24 -48 48 -48 61 -72 72 -96 98 -120 135 -151 168
37 168 -192 216 -242 275 -300 340 -372 417 -461 509 -561 620 -680 750 -826 911 -1001 1103
55 1103 -1215 1342 -1486 1642 -1825 2036 -2276 2559 -2893 3275 -3707 4093 -3980 323 55354
70 55354 907829 805215 -213362 -642804 -407637 100068 459705 297030 -207814 -266713
80 -266713 -11771 -57748 -111344 263153 399180 -72870 -442879 -281627 67906 390139
90 390139 417683 -117185 -600029 -245923 372511 355587 -7580 -147640 -177700 -131118 97117
101 97117 189438 23179 -22110 -2917 -194985 -200207 214772 362255 -37069 -295963 -128669
112 -128669 54502 120926 120377 -40800 -143654 34320 99370 -124989 -102072 214511 181649
123 181649 -172684 -235487 -9865 140368 175206 49792 -224779 -218893 145250 240918 -62252
134 -62252 -157616 40287 75944 -45934 -72455 -40382 53790 195914 62727 -283940 -223585
145 -223585 221829 309194 -47957 -249145 -132272 56259 193784 134954 -127228 -189068
155 -189068 53065 116378 -75527 -63770 117148 66937 -99723 -92267 -9050 56442 127670
166 127670 37952 -178335 -129904 138772 152071 -52624 -84136 -3066 -12062 3031 53059
177 53059 -907 -28580 50771 5225 -124357 -26627 144943 50437 -111257 -56966 40380
188 40380 37364 33833 -6197 -90653 -22118 112970 20614 -126253 -13752 130494 36145 -79154
200 -79154 -48474 -8041 29497 84340 7224 -114399 -24007 108257 6722 -98033 14975
211 14975 90128 -7266 -62916 -35024 -12029 65586 111911 -48950 -181664 -15107 165171
222 165171 71709 -63812 -57478 -37946 -7321 77763 55273 -56075 -28252 44846 -32837 -66990
234 -66990 71699 102909 -47299 -100629 -24340 22864 70374 88073 -49934 -152227 -7947
245 -7947 124820 33448 -43975 3704 -10312 -51446 16063 54610 -1081 4001 18603 -69343
257 -69343 -63156 99670 110742 -61682 -101787 -3270 28653 38619 58167 -28315 -97691 10009
269 10009 80068 -20353 -45162 46456 19645 -60017 -5801 44840 -958 6066 26535 -55313
281 -55313 -58479 78491 78486 -62241 -56936 39074 15757 -16638 23443 -4936 -43916 34146 51095
294 51095 -61186 -49053 72136 34834 -65832 -16396 37832 -7247 2698 34560 -34640 -47001
306 -47001 56232 41616 -63992 -17541 67611 351 -48777 15125 14493 -26094 26297 32756
318 32756 -59115 -31592 74323 22348 -67712 -6565 39314 -18045 -7913 35640 -20172 -36126
330 -36126 45009 21094 -64419 -1149 73267 -10499 -57936 20278 28847 -18931 14330 16518
342 16518 -54337 -14542 74839 9363 -68087 4682 40601 -28558 -14141 40908 -11487 -37679
354 -37679 31798 16710 -48378 10647 58136 -31661 -56396 36187 36618 -23847 5231 13874 -45501
367 -45501 -6921 67716 -127 -63263 14002 41526 -31874 -16604 39511 -9135 -36803 23617
379 23617 12388 -37929 17449 47821 -39287 -49033 42146 31257 -32849 1403 21560 -31265
391 -31265 -7685 50061 -5739 -49915 20428 34488 -33565 -11498 40724 -9118 -36209 20974
403 20974 12678 -33688 12384 38018 -35287 -37100 42723 22893 -39322 -2722 24229 -20565
415 -20565 -4900 39915 -9435 -41834 22712 28777 -33993 -7627 41200 -10536 -37164 21507
427 21507 19047 -28277 4767 27481 -30600 -26547 41280 16334 -38519 -265 22728 -23725
439 -23725 -9174 38224 -2647 -34983 18391 21622 -33253 -4521 43396 -6310 -37245 13814
451 13814 16817 -20569 10098 27634 -30171 -30946 31384 15786 -26769 8891 21635 -32299 -20714
464 -20714 35722 10323 -24530 10853 10718 -33981 -3137 43932 1060 -30201 9465 6671 -25875
477 -25875 13299 40910 -16322 -34984 12296 6089 -18848 22683 31058 -33891 -35656 22452 15336
490 15336 -10296 16952 7191 -41172 -11368 40718 7362 -19900 15561 3835 -39505 -415
502 -415 45539 5028 -20525 6160 -11718 -31945 25988 49966 -16746 -38607 3175 712 -6660
515 -6660 33815 19605 -46417 -27993 30819 10772 -10694 24428 9543 -42976 -15264 31363
527 31363 6758 -3247 23849 -10416 -49250 6088 49413 5148 -16355 1868 -24201 -29461
539 -29461 38809 48264 -25735 -36618 6712 -1322 -5209 33904 15040 -39546 -14851 23627 -6769
552 -6769 -8674 35659 10682 -40864 -10287 22744 -3291 6357 34660 -16606 -57611 3813 45691
565 45691 7879 -5408 1331 -31849 -22918 42012 30170 -32773 -14342 20394 -16286 -21541 31840
578 31840 24792 -17755 -2607 860 -34781 -1499 59673 17596 -46970 -22570 7139 2755 32524
591 32524 37350 -39273 -61193 16904 40087 -4820 670 13621 -27766 -26350 26496 18613 -11373
604 -11373 14000 7746 -47319 -22773 49114 33340 -13244 -8035 -19264 -38424 21613 69893
616 69893 3781 -54019 -20888 4352 4624 35779 26911 -42878 -41757 24049 21415 -11323 13991
629 13991 16294 -33449 -25586 19986 9101 555 31910 4242 -56066 -21829 44963 28583 -5601
642 -5601 -7547 -31605 -33284 39011 61364 -16322 -46899 -1257 5059 -8388 20513 19361 -23319
655 -23319 -12768 14763 -14497 -15525 41777 31515 -39224 -38980 5718 12479 24039 36644 -19312
668 -19312 -63413 -3521 50128 16804 -9111 -2702 -25833 -27330 28381 36529 -13967 -14820 8517
681 8517 -18250 -22470 29074 32504 -13858 -17528 -6710 -21289 5061 52261 17312 -44430 -27326
694 -27326 10211 9676 22811 28331 -27546 -55000 5624 43095 10790 -4332 -1366 -24609 -18647
707 -18647 25119 18835 -16589 -723 12338 -23224 -20240 31075 29067 -11620 -14384 -11309 -20659
720 -20659 13176 47061 3102 -42149 -12351 17094 6764 11348 11630 -25321 -26849 20045 19655
733 19655 -15517 -727 18917 -12488 -23229 9758 13222 -2700 9116 2494 -29083 -9736
745 -9736 32592 13507 -18165 -1862 3268 -15907 3976 28219 -2627 -24183 3049 7659 -12225
758 -12225 4255 19345 -7798 -14785 9425 -7 -16113 11288 20402 -16279 -19248 12071 7136
771 7136 -5489 14243 9048 -25410 -13300 20736 8818 -8259 5176 -1328 -17979 6853 23879
784 23879 -7986 -17361 10903 2687 -20735 3034 22496 -3249 -11769 4806 -5655 -11265 18342
797 18342 16899 -20369 -14798 14417 2851 -6608 15015 5801 -22875 -4153 20215 -2251 -11069
810 -11069 12401 2407 -20045 1670 17413 -6529 -6980 12712 -5590 -18891 12390 18392 -14672
823 -14672 -10451 13677 -2749 -12639 14360 12196 -15661 -3859 12978 -7757 -8449 17945 4391
836 4391 -20630 1833 16385 -9548 -7822 16789 -731 -20224 4818 13056 -10897 -2434 16109
849 16109 -6975 -16995 12450 11583 -13934 -268 14144 -10873 -11820 18307 7913 -17066 1865
862 1865 12982 -12030 -7086 18216 868 -17501 5625 9165 -14404 -180 19601 -7466 -19388
875 -19388 11020 10769 -13457 1576 14806 -11929 -13051 16392 6845 -14243 5101 10788 -15257
888 -15257 -5775 20685 466 -18182 6497 9291 -14418 75 18905 -7473 -17622 10698
900 10698 8393 -13492 2748 13201 -13048 -10689 17667 4769 -15648 5435 11279 -14298 -4745
913 -4745 19407 -774 -16563 7648 9125 -13223 511 16161 -8643 -14497 12608 6446 -14359
926 -14359 3461 12917 -12917 -9983 16600 3313 -15320 5062 10123 -13004 -3148 17444 -2755
939 -2755 -14985 9170 8360 -12992 1298 14953 -8985 -12463 13480 5432 -14795 3252 12410
952 12410 -11797 -8208 15110 954 -14625 6215 9355 -12834 -2491 15688 -4123 -13444 10359
965 10359 7748 -13238 909 14053 -7778 -10006 13115 3847 -14241 3782 11833 -10263 -7062
978 -7062 13196 -389 -13015 6856 8237 -12851 -2506 14509 -4049 -12334 9167 6824 -12104
991 -12104 893 12593 -7035 -8850 11667 3267 -12209 4432 10617 -10138 -6430 12719 320
1004 320 -11731 5946 6995 -12089 -2289 13679 -3463 -11669 7797 5400 -11503 1220 12238
1017 12238 -6335 -8601 9802 2335 -10618 5919 10762 -10656 -7582 12044 2053 -9664 5684
1030 5684 6050 -11944 -2519 12899 -2715 -10170 7527 3936 -12718 617 13152 -4653 -8820
1043 -8820 7604 1056 -10444 6497 11832 -9506 -8309 10189 1691 -8685 6806 7269 -11410
1056 -11410 -4328 10952 -1743 -7517 8862 3214 -14585 -939 13634 -2355 -8157 6507 436
1069 436 -10768 5085 11581 -7846 -6562 9805 -636 -10987 7184 10944 -8625 -5671 7453
1082 7453 -3128 -5726 12120 4917 -16167 -3721 12873 -1296 -7163 7170 578 -11516 3581
1095 3581 9776 -7977 -4423 12297 -1621 -14513 5125 12020 -5566 -2948 7395 -6653 -8750
1108 -8750 12773 8724 -12801 -3808 9088 -4895 -5365 12025 2376 -13737 877 8652 -7684
1121 -7684 -3073 13377 -1417 -14671 4120 9623 -7119 -491 11470 -5430 -12328 7718 7845
1134 7845 -6673 2756 7426 -12702 -8978 16399 8483 -12621 -2947 5397 -6751 -441 12858
1147 12858 -3576 -13502 6723 8387 -11000 -2300 13799 -1302 -10923 3483 1259 -7282 9908
1160 9908 13453 -13904 -14867 12516 10544 -6637 -314 1534 -10767 598 15053 -3203 -12817
1173 -12817 7898 7505 -13098 -3890 12561 -678 -6864 6512 -1257 -12443 7233 15905 -7633
1186 -7633 -11654 6393 1578 -5865 9475 7247 -13953 -6093 12383 286 -7719 8013 3541
1199 3541 -13841 -1142 12693 -3498 -7791 8532 1699 -12214 1812 10227 -3848 -1374 9208
1212 9208 -7370 -14951 10467 16759 -7129 -9835 3381 -1029 -455 12306 426 -17290 -638
1225 -638 13864 -3374 -8961 7805 4417 -8064 1011 3306 -8564 1493 14961 -4695 -18342
1238 -18342 3851 15143 -243 -3366 644 -8547 -3499 14715 4713 -14531 -1693 10971 -3792
1251 -3792 -6770 8052 2857 -8033 1953 3958 -9287 -924 13516 -802 -12751 1897 6235
1264 6235 -4702 2163 9426 -6077 -10352 6780 5965 -5856 2158 6107 -8722 -5650 12006 4690
1278 4690 -9796 -693 4627 -6057 -2236 8014 -1549 -6405 7003 3630 -11913 -1849 13012
1291 13012 879 -10008 -909 1341 -1240 8775 7458 -11752 -9279 10814 6286 -8442 -1332
1304 -1332 5107 -3389 -1300 5893 -3091 -5569 8457 4507 -13064 -5041 11423 3692 -5631 441
1318 441 -1008 -5285 6203 9041 -7694 -8155 8023 4161 -7297 1385 6658 -4501 -3867 5176
1332 5176 -1202 -4770 7241 4272 -10960 -3948 9195 84 -6733 4085 3069 -6704 570 6820
1346 6820 -3362 -3494 6756 -954 -10152 3566 10579 -3521 -5700 4668 358 -4607 4767 2884
1360 2884 -8847 -1124 9585 -2032 -8288 5310 6137 -6332 -2693 3811 -3104 -1094 8230 -1346
1374 -1346 -10957 3582 11125 -3986 -6867 4877 1533 -4682 3485 3010 -6688 710 8767 -4594
1388 -4594 -9245 6671 7016 -6685 -2845 4409 -3274 -2551 7493 -577 -9667 3567 9066 -5576
1402 -5576 -5716 7073 1762 -5954 2346 2834 -5983 1729 9083 -4954 -8708 7560 6417 -8142
1416 -8142 -2722 5968 -2494 -3220 6315 -344 -7377 4399 6437 -8195 -4814 9076 1509 -7568
1430 -7568 2461 4261 -5033 961 7326 -4666 -6891 7494 4243 -8573 -454 7759 -2813 -4776
1444 -4776 5139 -184 -6232 4685 4953 -8773 -3191 9928 415 -8587 2434 5111 -4628 164
1458 164 5716 -4554 -4356 8399 2267 -9632 984 8988 -3270 -5309 5069 429 -5026 4587
1472 4587 3782 -8616 -1858 9499 -1225 -8495 3696 5070 -5055 -467 4929 -4427 -3366 7955
1486 7955 1131 -9044 2114 8448 -4051 -4995 5375 621 -5086 3732 3032 -7194 -364 8443
1500 8443 -2723 -7778 4728 4666 -5945 -1022 4897 -3263 -2922 6413 32 -7556 3214 7107 -5210
1515 -5210 -4384 6266 1219 -5048 2721 2925 -5432 282 6776 -3481 -6319 5603 4015 -6482
1529 -6482 -1098 5115 -2371 -2973 4624 -403 -6106 3550 5722 -5613 -3680 6453 1014 -5199 2249
1544 2249 3016 -4190 559 5543 -3579 -5108 5716 3291 -6529 -828 5559 -1936 -3309 3684 -104
1559 -104 -4882 3265 4201 -5657 -2871 6421 568 -5326 2046 3320 -3612 -137 4776 -2736 -3906
1574 -3906 5214 2445 -6101 -191 5569 -1937 -3620 3164 340 -4330 2475 3767 -4950 -2473 5589
1589 5589 193 -5273 2204 3693 -3655 -1221 4364 -1421 -3226 4244 1840 -5433 252 5496 -2144
1604 -2144 -3733 3644 1194 -4405 1294 3647 -3808 -2099 4648 -534 -5264 2502 4075 -3850 -2033
1619 -2033 4097 -798 -2893 3937 1664 -5267 294 5537 -2116 -3828 3931 1732 -4395 769 3723
1634 3723 -3064 -1874 4476 -850 -5286 2513 4163 -3964 -2025 4100 -1141 -3684 3563 2373 -4738
1649 -4738 -141 4657 -2146 -3274 4433 1684 -4941 744 3999 -2837 -1904 4509 -487 -5081 2366
1664 2366 3712 -3893 -1610 4668 -1307 -4642 3056 2564 -4061 12 4203 -2928 -3179 4864 1864
1679 1864 -4873 696 3963 -3037 -1805 5089 -118 -4988 2205 3392 -4001 -1002 4793 -1604 -4409
1694 -4409 3227 2227 -4499 530 4599 -3144 -3868 4428 1722 -4279 1541 3562 -4124 -1936 5530
1709 5530 307 -4710 2119 2750 -4172 -119 5046 -2078 -4301 3656 1990 -4961 348 4628 -2545
1724 -2545 -3260 3672 288 -4204 2709 3939 -4517 -2474 5002 341 -3572 2936 2102 -4824 -169
1739 -169 5247 -1603 -3994 3430 1678 -4359 1020 4042 -3126 -2602 4243 -237 -5076 2083 4232
1754 4232 -3258 -1848 3565 -1281 -3230 4106 2502 -5156 -941 4706 -1023 -2486 3435 244 -4655
1769 -4655 1735 4401 -3381 -2883 4190 416 -4235 1334 2540 -3129 -19 3978 -2565 -4241 4027
1784 4027 3374 -4218 -1168 3029 -1609 -1403 4352 334 -4789 1274 3980 -2679 -2173 3159 -273 -3312
1800 -3312 2417 2095 -4035 -252 4623 -1690 -4540 2076 2197 -2477 591 2668 -2883 -2025 4233 1102
1816 1102 -3945 614 2540 -2586 -555 4153 -668 -3827 2237 2848 -3163 -1344 3069 -710 -2156
1831 -2156 1986 343 -3375 1512 3870 -2712 -3510 2769 1738 -2312 934 1564 -3127 -864 4337
1846 4337 169 -3646 1219 2326 -2065 -420 2073 -1622 -1968 3048 672 -4376 377 4489 -876
1861 -876 -2968 1129 413 -2029 1554 1885 -3045 -1266 3787 474 -2837 1308 1725 -2742 -590 3036
1877 3036 -861 -2360 2577 1671 -3002 -546 2747 -971 -1896 1849 -133 -2862 1310 3052 -2116
1892 -2116 -1664 2482 -133 -2557 1845 2325 -2758 -1202 2898 2 -2067 1654 1168 -2420 429 2527
1908 2527 -2083 -2221 3061 1072 -3547 -153 2792 -951 -1221 2007 -632 -2716 2040 2343 -3007 -1495
1924 -1495 2902 120 -1928 1896 1190 -2671 406 2711 -2031 -2531 3130 1731 -2904 -190 2228
1939 2228 -1252 -834 2296 -1009 -3251 1917 2578 -2750 -1148 3070 -104 -2630 1433 1266 -2403 313
1955 313 2624 -1749 -1949 3053 1053 -3106 409 2599 -1980 -1357 2693 -91 -2971 1185 1932 -2662
1971 -2662 -620 3106 -818 -2660 1840 1459 -2478 227 2313 -1785 -1732 3190 781 -3052 927 2943
1987 2943 -1943 -1817 2286 121 -2046 1694 1177 -2841 -61 3457 -1327 -3311 2022 1635 -2625 -70
2003 -70 2327 -1406 -1190 2682 51 -3180 1340 2613 -2276 -1513 2812 27 -2135 1804 1135 -3134
2019 -3134 -218 3230 -1250 -2796 1961 1380 -2446 237 1968 -1653 -860 2703 -403 -3024 1681
2034 1681 2611 -2360 -1399 2700 -26 -2106 1527 1343 -2214 227 2450 -1732 -2084 2357 838 -2741
2050 -2741 426 2196 -1624 -1289 2238 -291 -2490 1468 1836 -2392 -690 2742 -228 -2007 1530
2065 1530 1071 -2087 492 2125 -1898 -1518 2843 895 -2883 264 2144 -1457 -1096 1942 -372 -1865
2081 -1865 1636 1342 -2473 -440 2726 -576 -1980 1411 1049 -1894 472 2015 -1631 -1263 2342 467
2097 467 -2426 555 2064 -1367 -1050 1725 -374 -1832 1387 1119 -2237 -211 2504 -734 -2218 1380
2113 1380 1054 -1834 110 1641 -1179 -960 2098 246 -2163 688 2040 -1428 -1217 1665 -12 -1591
2129 -1591 1156 1011 -1946 -321 2243 -663 -1987 1314 1141 -1616 3 1622 -870 -950 1739 72
2145 72 -2018 978 1960 -1433 -1010 1709 266 -1621 844 842 -1696 -176 1787 -845 -1826 1337 1043
2162 1043 -1921 -359 1595 -597 -1017 1430 49 -1898 956 1878 -1449 -1251 1971 390 -1535 650
2178 650 1217 -1258 -101 1688 -882 -1667 1495 1179 -1999 -443 1660 -608 -1031 1214 111 -1778
2194 -1778 696 1632 -1503 -1110 1936 360 -1820 671 1291 -1178 -293 1667 -798 -1567 1502 1148
2210 1148 -1973 -409 1716 -753 -1375 1298 390 -1746 492 1389 -1367 -835 2114 97 -2083 666
2226 666 1502 -1164 -475 1547 -508 -1332 1551 945 -1932 12 2015 -810 -1459 1294 606 -1558 356
2243 356 1124 -1592 -860 2020 6 -2112 654 1530 -1311 -501 1583 -483 -1242 1429 733 -1919 220
2260 220 2002 -922 -1432 1436 574 -1626 582 1183 -1514 -673 1857 -202 -1867 997 1273 -1587
2276 -1587 -363 1730 -501 -1192 1350 473 -1795 525 1915 -1176 -1395 1688 430 -1592 629 1226
2292 1226 -1308 -501 1632 -578 -1691 1366 1075 -1881 -412 1642 -567 -1221 1268 326 -1690 573
2308 573 1733 -1269 -952 1619 98 -1571 670 1021 -1213 -391 1667 -575 -1576 1325 941 -1668
2324 -1668 -158 1362 -822 -1003 1456 282 -1776 483 1338 -1098 -504 1530 -79 -1540 1056 1146
2340 1146 -1247 -227 1556 -515 -1258 1227 715 -1392 182 1354 -920 -1073 1379 436 -1413 342
2356 342 1012 -1169 -497 1670 -279 -1646 700 1176 -1199 -198 1223 -486 -930 1190 479 -1578
2372 -1578 255 1483 -885 -985 1077 150 -1256 523 878 -1348 -575 1514 85 -1308 673 807
2388 807 -1040 84 1184 -663 -1040 1100 663 -1360 146 1226 -504 -725 963 9 -1166 655
2404 655 1057 -1191 -662 1109 -24 -927 611 454 -1263 63 1476 -601 -1112 898 571 -1017 31
2421 31 897 -585 -472 1001 132 -1256 583 1138 -862 -563 1083 -59 -958 670 568 -1249 -361
2438 -361 1010 -343 -761 847 376 -1077 263 1029 -655 -726 1103 309 -969 350 891 -737 -352
2455 -352 1033 -187 -1125 524 820 -876 -360 896 -281 -790 906 345 -1281 -135 1167 -423
2471 -423 -759 831 283 -843 411 626 -861 -238 1226 -96 -1116 488 955 -733 -328 788 -517
2488 -517 -877 839 527 -1212 -160 1142 -379 -727 887 172 -884 620 909 -930 -423 1175 46
2505 46 -1234 425 943 -709 -244 924 -286 -878 811 388 -1232 129 975 -732 -900 1133 370
2522 370 -1121 144 788 -745 -484 975 -126 -837 806 699 -1024 -163 1132 -324 -810 856 315
2539 315 -1001 290 1073 -687 -908 965 334 -1005 54 659 -638 -270 892 -522 -1064 905 872
2556 872 -1089 -254 1069 -204 -765 655 266 -902 324 832 -765 -622 1005 199 -1106 317 681
2573 681 -945 -333 972 -163 -995 814 653 -991 -226 914 -346 -656 901 290 -888 316 917
2590 917 -733 -427 1102 -6 -893 531 823 -713 -343 744 -301 -659 651 297 -1080 86 1110
2607 1110 -476 -830 695 245 -802 286 668 -771 -223 1016 -107 -979 416 570 -764 -201 663
2624 663 -279 -577 673 227 -1137 27 856 -475 -669 659 232 -660 414 626 -799 -234 890
2641 890 -166 -929 526 705 -590 -106 780 -305 -585 576 221 -780 163 649 -567 -609 807 177
2659 177 -822 242 606 -561 -241 658 -171 -686 545 562 -743 -110 724 -197 -414 547 128 -665 289
2678 289 705 -543 -464 735 177 -773 22 505 -426 -276 457 -225 -585 589 405 -726 -121 647 -211
2697 -211 -472 537 150 -550 213 696 -431 -365 494 241 -693 157 482 -497 -133 570 -74 -590 438
2716 438 471 -660 -135 760 -143 -609 452 282 -508 18 487 -375 -357 702 13 -731 253 542 -438 -291
2736 -291 545 -18 -508 295 263 -676 -73 609 -196 -489 363 324 -410 63 468 -294 -245 711 91 -510 235
2757 235 582 -422 -301 468 -1 -625 419 343 -622 1 517 -254 -560 527 251 -513 -41 467 -274
2776 -274 -308 635 61 -489 285 522 -511 -429 578 46 -472 338 289 -465 -9 684 -152 -453 418 396 -502
2797 -502 13 478 -294 -253 600 32 -545 263 558 -443 -335 658 106 -476 301 331 -606 -79 502 -277
2817 -277 -605 463 207 -599 51 500 -395 -372 363 41 -576 174 443 -523 -162 680 -102 -476 329 393
2837 393 -465 71 498 -256 -379 517 147 -657 41 582 -408 -229 337 47 -495 182 349 -572 -69 636
2857 636 -152 -497 374 313 -462 42 532 -266 -353 464 39 -529 76 519 -515 -282 428 43 -465 231
2877 231 300 -518 -28 554 -275 -412 385 245 -355 -4 445 -456 -144 407 151 -426 75 412 -360 -13
2897 -13 395 -59 -498 223 249 -438 64 405 -123 -381 418 181 -441 92 364 -253 -276 397 -71 -388 267
2918 267 239 -258 -203 437 -19 -430 173 111 -490 -17 359 -296 -358 244 66 -397 55 291 -306 -137 301
2939 301 17 -352 237 333 -302 -39 349 -36 -247 313 110 -353 -32 337 -136 -258 340 103 -406 72
2959 72 178 -275 -272 255 148 -333 67 297 -222 -137 246 -10 -232 276 181 -349 -35 236 -152 -172 258 129
2981 129 -336 -51 228 -188 -202 168 49 -247 33 124 -250 -150 319 -76 -259 197 235 -85 7 274 -68
3002 -68 -197 226 239 -287 97 370 -276 -182 163 -22 -264 106 159 -305 -134 404 4 -269 158 142 -201 -41
3024 -41 301 -121 -157 161 148 -244 108 199 -170 -136 228 -12 -314 -2 265 -172 -93 253 -106 -226 97 74
3046 74 -285 -135 239 -136 -155 138 17 -242 116 284 -113 -188 262 72 -219 61 207 -176 -82 187 -51
3067 -51 -241 81 176 -239 -85 205 -117 -244 227 69 -163 0 106 -20 -197 262 20 -384 99 246 -222
3088 -222 -166 118 -2 -194 -42 181 -96 -92 115 -143 -184 160 114 -255 -70 314 -69 -96 224 -8 -266 107
3110 107 214 -60 -57 245 -3 -174 196 1 -267 32 166 -154 -136 144 57 -215 -73 203 21 -76 147 17
3132 17 -307 -33 125 -139 -23 179 -13 -143 8 139 -45 -66 110 -38 -174 274 130 -164 -27 112 -137
3153 -137 -128 70 -51 -160 130 109 -216 83 219 -44 -241 111 112 -105 41 156 -3 -142 170 37 -234 164
3175 164 237 -143 -136 96 -80 -200 -4 48 -77 -15 159 -52 -69 185 71 -236 34 140 -20 -144 134 57
3197 57 -197 -44 148 -94 -9 70 30 -144 185 111 -115 16 122 -133 -88 -6 93 -88 18 107 -99 -83 86
3220 86 131 -198 15 81 -149 -110 206 -84 -146 75 18 -166 84 97 -144 -39 94 -3 -97 81 169 -42 -91 101
3244 101 57 -124 107 84 -98 16 136 -17 -58 90 59 -253 61 38 -60 15 3 48 -132 30 147 5 -16
3267 -16 116 9 -134 49 161 -103 11 170 -38 -180 92 36 -85 -54 157 -155 -117 123 48 -115 -83 28
3289 28 -142 -25 99 -31 -94 122 -2 -84 -29 159 0 -98 60 -23 -105 51 67 -32 -12 212 -60 -33 -24 100
3313 100 -64 6 106 -30 -83 93 55 -157 126 79 -17 -25 57 4 -36 -66 -31 -106 -5 74 -22 -104 -50 -21 -99 -36 21
3340 21 -81 -62 -38 -22 -39 83 108 6 -27 128 4 -7 64 -7 -9 79 164 -33 -5 62 -15 81 -9 41 -128 63 62
3367 62 -6 23 -50 99 -26 11 -28 38 -63 59 28 59 -22 57 -109 34 76 45 -131 -80 13 -15 -25 -37 11 -31 98
3394 98 88 -149 -12 130 -10 -12 115 -89 -34 54 10 -66 -8 123 -84 -121 68 112 -2 -1 62 13 -20 61 142 -10
3420 -10 42 1 15 -69 5 63 -24 10 37 22 -41 65 -73 -126 -31 32 18 21 11 -20 36 71 -118 -65 31 19 -113 -91 65
3449 65 -14 -18 -7 15 -36 7 63 -47 -47 61 79 -31 17 14 29 -14 79 60 -37 106 91 20 32 44 -8 -39 21 19 -77 22
3479 22 58 -86 0 128 -12 -105 46 51 1 -14 56 -6 -40 87 16 -12 -66 84 -34 73 52 -111 -6 79 23 -48
3505 -48 48 115 18 -2 -25 46 92 -54 130 -59 116 -22 7 -102 105 96 13 -86 60 108 -1 117 -5 -40 -91
3530 -91 135 -29 -126 -89 -3 68 -46 -36 -69 -108 34 159 -11 96 84 -62 -28 19 0 -26 16 20 36 -56 182 48
3556 48 -46 104 148 -54 -29 49 4 2 29 102 -122 85 172 -47 -33 27 22 -71 83 16 -34 81 -22 112 -46 86
3582 86 18 -14 -19 -54 -117 -106 103 136 -191 -43 100 -106 -55 43 45 -103 21 -51 -46 -18 21 -21 14 97 46 -110 -77 132
3610 132 -96 -73 98 50 -77 65 13 -36 -3 44 -57 -9 136 -25 -57 88 -4 -91 18 123 -78 -131 -120 71
3634 71 -82 -63 58 -9 -76 -4 91 -17 34 108 -9 -25 45 -30 -78 5 154 -56 -59 43 88 -85 105 1 -89 -38
3660 -38 69 -9 -16 53 -54 -6 96 54 -27 -72 170 12 -148 59 3 -123 8 99 -69 -49 19 -9 89 -12 105
3685 105 -96 -104 89 63 -140 -60 90 -51 -107 -54 -30 -130 123 41 -128 -21 51 -32 -122 76 -42 -13 79 -46
3709 -46 -7 38 105 67 -34 28 49 -3 -80 17 -61 -158 193 107 -64 -76 -48 167 21 -57 -73 -187 -45 105 -53 -78
3735 -78 -64 20 -76 -29 -26 -48 -56 24 47 4 39 25 -74 -92 102 -44 -101 54 -1 -68 -35 104 113 -47 45 88 -51 52
3763 52 92 44 -2 29 147 -17 -5 -45 -76 25 118 33 -80 -24 117 130 -21 11 22 -63 -20 -1 0 -12 6 -100 2
3790 2 69 -52 -24 47 118 69 -85 -47 56 -18 -64 44 22 -43 72 3 -74 55 168 -139 -70 8 -6 -19 81 170
3816 170 -63 56 69 -24 -50 82 74 -58 21 95 -31 -141 109 50 -111 -89 76 18 8 -100 -51 -2 110 87 -58
3841 -58 -135 21 -6 -70 138 -4 -141 -6 182 -59 -37 70 -98 -23 -130 123 11 -70 80 99 -82 87 56
3864 56 -9 -65 120 -66 10 117 13 -101 -39 38 -13 -138 27 6 -58 125 58 -64 34 96 -26 -150 88 -38
3888 -38 -74 -79 140 48 -198 -17 -3 -106 25 29 -73 -13 -39 -20 -13 45 137 -37 27 21 -86 -76 195 134 -71 34 111
3915 111 -147 -20 114 -56 -48 -11 43 -19 41 165 50 -56 22 73 -7 -108 59 -38 -88 94 88 -76 30 23 -100
3940 -100 -74 46 -85 -88 42 112 -22 -30 29 -22 -126 130 93 -63 -31 47 12 -103 9 -10 23 57 137 -123 -113 34
3966 34 -100 -119 -92 107 -49 0 42 -44 -2 89 -17 -76 79 100 -151 -72 12 0 -99 111 -70 -60 20 83 -15 2
3992 2 114 -79 -112 96 86 -125 -64 128 39 -105 -9 21 -90 -84 30 0 -137 70 44 -95 2 40 33 24 60 35 -72
4019 -72 20 151 -114 -22 108 -21 -15 106 95 -62 -90 39 104 -30 23 8 -56 1 133 17 -114 -99 145 -140
4043 -140 -22 69 18 -59 -124 -84 -105 45 58 35 -37 133 -13 -24 19 72 -74 -17 6 12 -37 119 23 -125 -27 45 110
4070 110 43 -69 50 24 31 43 27 21 74 -9 -38 20 -30 -101 -13 17 67 -91 -44 -36 -119 -29 47 -48 -113 -69 -34 41 6 98
4100 98 12 -72 12 24 -82 -18 -42 -46 -78 25 50 -99 2 91 -34 -19 36 99 -106 133 48 38 12 63 44 -11 139
4127 139 13 -35 19 61 -78 15 33 -55 23 112 7 -72 -73 -34 -169 -40 78 30 16 -1 25 -46 -90 69 89 -76
4153 -76 29 84 -9 -19 100 53 -78 46 64 -70 25 -23 -27 18 11 -17 -136 -31 115 16 -50 62 114 30 32 43 -13
4180 -13 55 167 2 -197 48 54 -10 70 91 -13 14 73 72 -62 9 15 16 -79 176 8 -44 -58 91 -40 46 -63 10
4207 10 22 -49 28 -27 -16 101 58 71 52 -10 17 13 4 -83 -44 47 8 -44 28 60 -92 -61 144 -13 -99 26 -15 -66 66
4236 66 23 -17 -38 82 -67 -207 52 86 -103 -8 -4 -83 -68 110 2 -63 13 10 -8 -35 60 7 2 -82 12 -115 -124 51
4264 51 -16 -55 16 111 -23 -87 45 58 20 -10 110 -27 90 -43 -127 68 41 -51 -11 27 47 -67 -11 113 -36
4289 -36 -114 89 103 -3 -15 -110 69 -54 37 42 -58 -47 -49 -25 -36 45 35 -101 -61 75 -44 -117 -3 49 21 9 -23
4316 -23 36 -12 -14 53 -75 112 98 -83 0 32 -112 -113 16 -27 59 55 45 -25 51 60 8 5 58 78 -82 -13 6 41 -124
4345 -124 5 59 -146 22 -53 -78 -88 24 -8 34 15 -50 -53 -57 -59 -54 -38 -12 101 -77 -99 -7 92 129 95 53 22 -25 -4
4374 -4 -24 -48 26 -49 -15 42 -18 94 -66 62 -36 -32 -49 100 27 -32 9 4 -69 9 -40 -13 16 -40 73 -58 -78 -9 25
4403 25 -57 4 0 43 69 51 -84 32 -8 -112 -120 45 40 -43 38 -42 42 82 44 3 -77 98 66 76 -54 6 71 -31
4431 -31 9 -25 -32 63 57 2 74 25 11 -71 -56 6 -69 48 11 27 -50 63 48 -50 -56 28 -13 -119 12 47 -97 -21 54
4460 54 -21 68 24 -42 -146 56 -93 -88 50 -1 -57 -62 -26 80 -32 -33 38 -68 -63 -2 51 38 80 -4 -23 20 -13 -39 -85
4489 -85 -26 36 -48 -99 9 -34 37 -20 -41 -59 -25 -3 5 -80 99 -46 -49 2 -51 -59 27 24 106 9 61 59 37 22 82 31 -25
4520 -25 52 -23 -134 29 58 -24 -101 35 -36 50 49 -86 -68 -23 83 -25 41 -75 11 -4 63 20 -131 -11 28 -31
4546 -31 -57 -15 14 -81 -53 -28 -130 -49 32 -16 -74 -47 -71 4 23 85 32 -61 95 -23 -119 -22 2 -64 -58 -43 63 -1 -7
4575 -7 12 5 81 -22 22 -123 14 -44 45 45 4 49 51 111 -25 -13 11 -35 -44 12 -27 -42 -47 42 -48 -57 64 -21 22 11 -152
4606 -152 14 -121 60 120 -5 10 -25 40 39 -129 -3 -97 -49 1 -15 -74 -20 -59 59 -67 40 48 94 31 65 -5
4632 -5 38 28 -10 0 -79 -13 -41 -94 -31 76 -13 -33 15 56 -23 0 -52 -37 -39 82 148 -24 75 -48 -4 40 -92 9
4660 9 -61 17 -66 6 -22 42 -129 82 -72 -30 3 -19 43 61 33 -34 -125 -1 -57 -67 101 103 -42 -21 60 33 -34 19
4688 19 -88 20 40 59 54 -73 -55 -23 -43 -113 21 -34 -66 -52 35 -115 58 55 -8 -29 66 -50 -120 38 90 -4 -96
4715 -96 35 -44 72 9 110 -115 -20 -20 -52 -48 38 -47 -55 54 8 -56 -9 -100 -27 -19 96 49 116 13 113 15 -32 21
4743 21 55 -13 -37 -42 27 -21 12 18 -44 -149 -30 -87 -39 26 -14 -43 39 9 -33 -8 -76 9 -34 -15 25 18 -35 0 80 -16 -10
4774 -10 -3 19 -1 48 69 -19 27 -78 2 -30 -36 24 22 24 -9 3 63 -83 -48 -19 70 44 7 -79 -20 -15 97 53 -166 60
4804 60 80 -83 -24 1 -70 55 -17 154 -20 24 144 82 -100 75 21 43 50 126 30 -111 28 168 7 35 87
4829 87 -77 70 33 0 -127 -48 78 -82 -17 108 89 -69 54 55 -42 47 103 -82 -82 9 42 -116 -72 -60 -4 51
4855 51 21 54 -71 62 68 25 49 127 -55 17 123 55 -14 -4 4 -41 -18 105 -33 -14 -5 48 108 -62 -29 -4 86 62
4883 62 2 -11 1 -41 -70 23 100 -23 64 24 6 16 78 43 -74 -126 -17 -6 -60 -29 -11 -8 -14 61 -38 -63 -22 -8 18 -34
4913 -34 -60 22 -144 11 87 18 -25 11 -22 -44 53 11 40 -67 -51 -20 -55 66 -48 -64 -66 47 31 62 46 109 -124
4940 -124 -29 -16 -27 97 -7 -40 -19 -72 -69 4 -55 108 -69 4 59 -54 -96 9 87 -24 -61 -42 -54 -34 76 -4
4966 -4 -4 -37 83 27 27 73 1 -32 -69 26 46 -57 -67 -88 -8 -45 -6 24 -11 -13 84 -121 -24 191 -3 78 119 95 95 89 -20
4997 -20 -39 7 17 -15 9 51 69 -117 33 123 97 -88 67 2 -14 -101 4 0 -124 37 81 -51 -42 32 -104 18
5023 18 -81 -9 -17 -46 92 136 102 56 -32 -140 113 114 -72 -71 77 -65 -149 48 111 42 43 62 -127 -120 164 -9 -36 60
5051 60 34 -35 17 138 -152 67 40 155 38 72 146 -171 39 57 69 -93 29 -45 -41 -83 -4 36 -20 87 25 -103
5077 -103 -22 70 -35 -73 34 7 -75 -30 2 -35 48 80 -67 -35 -18 2 -164 -4 122 21 21 58 35 -52 -47 77 -76
5104 -76 -83 138 -71 -101 99 151 -71 -87 -16 60 -183 -43 28 -219 4 55 18 -46 107 -95 -151 74 59 -101 -52
5129 -52 130 3 -94 -12 75 8 -14 64 -1 -161 25 49 26 18 68 -73 -76 -15 55 -45 96 -14 4 36 73 -1 -149
5156 -149 120 110 29 28 96 -40 19 13 -38 29 62 81 -82 -1 79 -40 -81 -7 0 -30 -85 43 34 -19 88 3 -16 52 -6
5185 -6 5 -76 2 30 54 91 -42 51 -6 40 125 -89 100 -20 -103 -11 156 -2 -50 -17 -12 -152 90 101 -41 -42 68
5212 68 -18 -65 31 23 -91 -47 14 -64 -41 65 40 -85 -141 121 -18 -170 27 -2 -14 -47 158 -65 -94 57 -14 -84
5238 -84 -24 54 -53 65 -41 -6 -31 14 65 14 -45 159 121 -113 32 62 -39 -66 89 30 36 36 18 -50 25 75 -98
5265 -98 -90 -38 -14 -89 69 15 19 -88 81 0 -21 13 106 32 -87 72 12 -59 64 119 -67 -37 51 -135 20 173
5291 173 51 -165 -22 64 -1 -21 121 -5 -101 53 -45 -13 1 52 -18 -157 -8 70 -85 -43 81 -55 -16 139
5315 139 23 -112 -67 29 -102 -117 50 -63 -70 67 54 8 -21 103 -36 -117 -17 23 -13 14 -14 -8 -10 169 -7 -152
5341 -152 45 -6 -66 41 10 -27 -89 96 14 4 119 -5 -7 -79 37 -21 -63 94 143 4 -2 42 64 -87 121 67
5367 67 98 -118 139 26 -125 25 -12 -67 86 26 -123 -85 75 12 -196 -27 -5 -7 -49 96 -23 -59 30 105 -94
5392 -94 -72 96 -105 -36 40 75 -56 -64 91 -44 -110 -1 121 -116 61 15 -86 -127 110 -83 -31 96 -21 -44
5416 -44 -47 126 -33 -131 -22 -12 -125 41 -50 41 -52 67 -24 -145 10 40 -98 -183 42 -110 -74 139 6 -7
5440 -7 -21 32 -26 -104 109 70 -30 -21 21 -68 48 96 -79 -81 128 74 -88 -33 -2 -49 -14 17 25 -105 31 134 -83
5467 -83 -63 73 117 -113 -23 -28 -23 51 16 -6 -31 49 -49 -71 -41 -6 23 -57 32 2 -11 46 95 -137 -70 124 4 36 -76
5496 -76 15 -58 69 192 36 -39 110 82 -42 -24 -90 -15 -51 49 -7 -57 -7 102 -90 -38 88 -2 -93 74 74 -94
5522 -94 53 21 -7 40 -17 28 -129 -65 133 19 4 -13 -20 -53 -119 70 14 -22 112 47 5 34 85 36 -44 65 -94
5549 -94 -24 57 56 -3 -3 77 75 -156 47 104 -60 14 81 41 -58 -60 105 -70 -26 -11 29 -50 105 68 -183 16 119 -93
5577 -93 -94 171 49 -96 10 1 -50 1 -106 14 -66 188 139 -226 138 136 -13 -53 12 143 -74 45 106 -47 21
5602 21 160 39 105 73 167 -86 15 116 -101 -75 110 80 -115 -40 93 12 -141 9 55 -133 8 23 -161
5625 -161 -32 82 44 -86 72 -25 -107 -2 121 -34 -23 94 17 -56 -81 24 -54 -80 91 -28 -50 179 101 -136
5649 -136 -50 -14 23 -126 73 -9 -241 101 125 -166 -82 57 45 -70 -22 70 -84 -82 179 -51 -156 86 76 -136
5673 -136 32 207 4 24 88 -18 -150 36 133 -154 -86 165 -13 -88 116 101 -95 -59 74 -6 -74 144 10
5696 10 -85 67 75 -160 -98 174 -26 -43 -46 161 6 25 222 35 -111 2 81 29 -14 86 -46 72 47 38 -165
5721 -165 50 20 -1 11 170 -38 -92 45 2 -163 -3 59 57 -133 -65 115 -38 -26 61 -28 -126 26 -87 -155 71
5746 71 81 69 -52 107 -101 -77 80 113 -9 -45 182 50 -28 160 57 -119 25 132 -74 -82 61 24 -72 15
5770 15 201 -7 -122 58 36 -84 -19 54 -97 -198 115 34 -23 76 60 -144 50 125 66 -116 -10 72 -147 42
5794 42 84 5 -39 44 45 -31 9 44 -52 -68 165 65 9 99 112 -32 -9 120 16 -26 61 146 -124 65 117 -52 21
5821 21 -115 16 -37 -7 5 14 -105 99 87 -67 27 67 -37 -114 83 24 -96 85 -14 -146 80 71 -95 -76 119
5846 119 89 -111 78 103 -63 -139 86 37 -108 -62 133 11 -96 22 -61 -207 94 76 -111 -18 85 107 -49
5869 -49 193 75 -49 9 135 -9 -107 78 0 -166 -134 67 -35 -56 175 -117 -165 24 84 -164 -21 111 1
5892 1 -153 139 41 -95 13 103 -51 -163 146 -40 -43 -99 129 -120 17 175 -27 -23 114 117 -98 -24 113 -6
5916 -6 -215 89 43 -127 97 161 -90 -66 215 2 -78 97 -12 -166 27 167 18 -154 82 90 -140 6 43
5939 43 42 -117 72 -42 -153 102 13 -149 -163 188 48 -97 106 148 -35 -133 126 -123 -171 84 8 -216 145
5962 145 126 -120 24 171 10 -165 73 186 -223 -112 182 -87 -89 -26 41 -127 -66 102 -24 -76 34 -44 -91
5985 -91 49 14 -175 -82 102 -76 -137 -31 104 -140 -87 37 -119 -88 33 48 -94 158 140 -125 -10 179 54
6008 54 -99 104 147 -76 -68 115 40 -6 10 -2 -140 -23 84 -78 76 55 91 -113 41 121 -124 -105 193 80
6032 80 -204 34 -14 -124 3 175 -153 -31 47 77 -170 57 181 -105 -58 -9 78 -139 1 85 -40 -43 76
6055 76 76 19 62 53 16 -53 185 7 -143 86 115 -153 -88 106 15 -152 125 11 -96 -27 65 -126 -72 71 93
6080 93 -74 -86 121 -56 -83 163 -10 -177 -30 70 -64 -30 114 33 -90 114 81 -129 -88 99 -94 -85 108
6103 108 59 -52 -11 109 -11 -69 156 -55 -139 116 88 -132 -135 181 -4 -112 57 212 -82 -40 57 40 -118
6126 -118 59 73 -143 15 137 -150 -118 97 23 -101 10 36 -155 -100 82 -23 -145 150 -45 -128 -11 158
6148 158 -55 -157 175 -3 -151 98 98 -151 -46 71 -14 -154 97 46 -178 -80 190 68 -148 177 118 -150
6170 -150 -29 261 -83 -138 111 -4 -160 103 74 -140 -72 229 16 -95 174 173 -127 -92 117 -68 -226 73
6192 73 -16 -130 -50 206 -80 -129 10 5 -226 34 88 -58 -5 209 59 -171 63 128 -68 -24 149 -12 -135
6215 -135 85 148 -119 0 140 -81 -140 190 29 -230 91 167 -119 -82 176 5 -115 181 83 -118 -1 157
6237 157 -151 -250 143 81 -237 46 56 -61 -59 110 -11 -189 67 141 -82 74 131 -207 -84 79 146 -30 48
6260 48 158 32 -81 135 13 -123 150 115 -141 -68 118 -101 -81 119 -41 -87 -35 175 10 -86 38 54 -94
6283 -94 -62 38 -165 -93 232 60 -151 40 107 -124 -81 95 -42 -134 54 193 -86 65 84 -84 2 80 22
6306 22 -109 19 211 37 -80 140 30 -35 -20 4 -76 -16 148 39 63 97 28 18 -18 -4 -36 -1 42 -31 -114 15
6332 15 114 -6 -58 44 26 -124 -57 107 -88 34 145 -20 -116 -84 61 -61 -105 67 23 -65 137 121 -116 -3
6356 -3 65 -55 -106 -5 -23 -162 120 134 -87 -11 37 61 -72 -28 117 -66 -63 33 23 -106 22 -37 -147 -49 140
6381 140 -66 -254 160 16 -68 -35 149 -20 -138 96 25 -87 47 119 -99 -31 136 -41 -110 86 92 -48 -63
6404 -63 109 -112 -122 17 13 -168 -33 135 -73 -56 145 79 -107 137 99 -78 -85 211 69 -88 98 -5 -142
6427 -142 -13 128 -124 -156 162 79 -172 41 122 -41 -152 130 40 -135 43 77 -135 -15 108 -10 -195 84
6449 84 191 -310 -108 160 -124 -115 226 81 -159 61 147 -33 -68 235 72 -204 71 49 -132 -62 90 -47
6471 -47 -138 155 162 -76 7 175 -54 -39 72 129 -118 5 153 -103 -211 198 -66 -143 161 123 -174 -47 173
6494 173 42 -94 136 112 -175 34 30 -93 -142 234 -62 -111 7 106 -189 -4 174 -26 -202 53 92 -157
6516 -157 -17 132 -87 -129 104 31 -179 87 220 -140 -32 183 115 -133 -49 69 -218 -42 126 -15 -214
6537 -214 92 131 -184 -85 142 -65 -148 127 -53 -155 -48 -30 -137 -81 97 73 -125 132 56 -54 -188 193
6559 193 -22 -88 -4 123 -50 -29 183 -152 -29 94 100 -276 30 195 -89 -123 175 -28 -178 151 116 -14
6581 -14 -82 73 -75 -63 88 48 -88 51 -30 -48 -98 18 64 -246 58 -87 -97 -33 63 -8 -54 124 127 -84 -36
6606 -36 38 -80 -88 182 108 -58 42 88 -10 -76 1 92 -83 20 227 15 7 52 103 -116 98 105 -178 26 15 10
6632 10 -113 84 98 -22 -80 -69 -15 -29 1 107 -42 -8 -48 -97 -59 35 -31 -85 42 109 -158 -25 49 31 -127 25
6658 25 104 2 -48 128 57 -98 34 97 5 -6 93 43 -113 179 -9 -97 0 127 -119 -64 95 -53 -259 -14
6682 -14 -13 -51 -45 165 -43 -95 23 104 -115 40 127 -145 -66 -50 4 -234 -117 134 -70 -62 -72 68 -117 142 174
6707 174 -177 -115 143 89 -129 86 172 -148 -21 98 -85 0 62 46 33 -24 185 -43 -48 206 -4 -110 13
6730 13 102 -115 -124 176 -14 -76 57 -20 -166 -28 220 -167 -215 57 124 -169 -1 66 -120 -61 225 49 -271
6753 -271 72 100 -109 11 126 48 -64 66 125 -119 -87 110 -122 -37 147 -56 -154 119 63 -82 -58 226 -29
6776 -29 -108 95 75 -122 1 159 -58 36 43 110 -75 3 71 -88 -226 110 -33 -214 174 112 -111 -54 209 18
6800 18 -4 141 74 -175 0 176 8 -47 97 -57 -124 106 74 -195 -78 91 -45 -82 30 48 -59 106 195
6823 195 -79 -11 170 113 -114 -64 162 -117 -62 233 60 -139 -1 -15 -78 25 70 -107 -36 15 39 -186 81
6846 81 60 -51 -74 146 65 -116 -11 94 -59 -87 12 -91 -133 -79 127 -117 43 129 -82 -76 -4 70 -7 98 11
6871 11 -87 -59 46 -39 -166 -48 -2 -124 -129 126 -66 -36 61 6 51 4 155 71 -68 -21 31 -127 6 31 -106
6896 -106 -40 62 5 -125 -122 161 -36 21 -36 -21 17 26 92 20 64 112 71 -115 40 82 -63 -58 143 12 -164 26
6922 26 16 -119 -99 67 -21 -47 101 95 -114 65 94 -84 -65 68 73 8 71 39 15 -5 -61 -78 6 -70 11 -71 23 107
6950 107 -62 -70 12 70 -83 -105 30 49 -66 57 124 -88 40 27 -35 -52 106 -58 -102 115 -1 -100 -8 34 -1
6975 -1 -87 186 43 -134 4 -4 -87 -81 138 120 -56 73 11 30 -31 231 94 -92 -6 165 -186 48 203 -76
6999 -76 -116 0 61 -187 6 120 -70 -69 159 -71 -210 6 124 -230 -6 76 41 -165 115 -38 -147 -123 -7
7022 -7 -94 -58 63 -67 -177 108 123 -57 -63 116 -33 -83 109 156 -236 -114 124 -6 -96 39 -5 -146 -20 94
7046 94 -128 24 69 -4 -215 -12 75 -127 -23 73 -1 -336 72 37 -115 70 57 -68 6 122 4 -63 34 39
7070 39 -65 -50 166 67 -113 78 192 -199 -20 91 71 -160 31 116 -95 48 65 -70 -27 153 87 -158 44
7093 44 61 -178 -52 102 34 -57 144 7 -139 -88 103 -130 -54 127 24 -159 -19 36 -142 -71 20 -97 -116
7116 -116 97 22 -68 -68 165 -150 -135 38 49 -42 9 83 -6 -39 -5 36 -75 38 171 -53 -32 146 -51 -131 87
7141 87 59 -130 -25 103 -24 -131 50 -60 -68 97 137 -105 -220 52 13 -52 -32 44 -82 34 83 47 -80 11
7165 11 85 -102 60 120 78 -156 -71 47 64 24 24 -32 -62 136 -90 -17 -53 -11 -43 -30 54 43 62 48 46 21 -30 95
7193 95 22 32 71 46 14 -25 75 -119 -101 46 147 22 -53 151 -84 -43 -29 26 -90 -72 160 -89 -26 118 -9
7218 -9 -84 -115 83 -72 -38 174 29 22 61 21 37 27 90 6 -34 58 199 -78 -2 60 -66 39 78 105 -68 50
7244 50 54 -47 -108 49 5 -33 46 75 -53 -74 161 -84 -85 52 -33 -170 -128 151 -69 -104 25 -53 -159 75 -4
7269 -4 -90 -21 108 60 -66 119 -25 -106 66 190 -65 -62 82 -57 -132 -15 68 -20 -93 197 -2 -37 136 182 -7
7294 -7 -33 156 -159 -85 23 69 -135 8 129 -29 -135 14 -28 -144 -4 46 27 19 117 -116 -95 113 137 -63
7318 -63 54 85 -92 -44 70 7 -115 51 145 -91 -29 108 -45 -148 -33 84 -16 31 100 -80 -101 75 108
7341 108 -158 105 104 -46 -10 250 81 11 12 139 -72 -48 75 -86 -174 -48 107 -97 -136 137 -142 -41 55
7364 55 101 -131 31 130 -56 -71 97 155 -154 57 73 -53 -59 104 3 -69 90 154 -84 -63 167 -48 -24 70
7388 70 70 -84 129 50 16 8 32 -30 -106 87 69 -106 -29 89 -26 -162 110 -37 -73 29 -42 50 -76 172 44
7413 44 -113 32 25 -76 -8 87 -37 -76 37 124 -118 145 40 21 -111 1 -20 9 49 49 -10 -9 95 56 73 -61
7439 -61 124 -38 -33 -57 37 -32 109 -40 -19 -46 31 60 -105 -65 -15 -130 -87 10 35 -45 55 -28 -102 6 97 -114
7465 -114 -56 43 38 -16 193 98 -49 -13 -11 9 -135 44 35 -32 22 89 -66 -34 -71 124 -21 -3 53 -38 47 117 7
7492 7 -47 104 165 -103 -25 72 -17 -53 11 106 64 -65 38 -25 -8 150 71 -104 -6 198 64 3 156 43 -100
7517 -100 74 50 -78 -9 50 41 -117 0 126 -111 20 174 -33 -48 76 120 -11 12 57 -57 14 30 -59 -54 75
7542 75 24 -127 -145 87 -43 -64 99 117 -82 -39 16 13 -3 -13 47 -55 -14 155 -35 -65 104 76 31 59 143 -55
7568 -55 -153 41 24 -37 169 3 11 -91 60 -8 -162 85 107 -95 130 126 -48 -42 143 13 102 79 131 22 -37
7593 -37 131 -65 7 45 48 -143 -58 108 -28 -48 57 28 -78 41 120 -109 -43 147 89 -43 13 31 17 0 175
7618 175 -67 -155 127 23 -49 -1 39 -11 -72 182 111 -145 73 205 -195 -11 -2 23 -133 14 3 -77 95 54
7642 54 31 -12 -18 130 -85 -51 37 -37 -13 79 -6 -107 139 35 -89 -153 19 -140 -158 69 -2 -28 -18 77 7 31
7668 31 7 32 -65 -9 62 -25 40 85 64 -92 77 10 32 -15 159 -63 -47 172 -52 45 18 13 99 11 40 126 -15
7695 -15 31 15 -173 -108 19 -2 -75 21 -18 -86 -162 117 62 68 -9 5 100 -22 101 -16 -115 104 44 0 -27 -4 -129
7722 -129 -12 3 30 15 37 40 -38 -18 4 45 -135 -30 20 6 90 -4 81 52 75 48 -46 44 120 -59 -19 14 28 -44
7750 -44 15 -19 -37 -16 71 55 -71 8 -69 -44 -39 -39 43 -105 -4 5 -64 -91 -46 -111 -81 33 2 -21 32 41 -71 -134 98
7779 98 85 -72 35 46 -7 -47 40 -83 13 52 -4 -36 4 27 -43 78 59 17 -65 -42 92 14 87 80 5 -13 56 65 -67
7808 -67 1 2 -7 -38 35 80 -131 -20 26 78 34 37 -26 -13 -183 83 -31 3 112 6 -105 -92 3 -34 -44 28 14 -52
7836 -52 84 21 -72 -35 62 -13 55 169 -35 -217 40 37 -21 -34 162 -91 -148 -23 -48 -13 41 16 -98 -19 -49 73
7862 73 21 -14 76 -59 -48 10 30 4 24 52 94 33 -25 52 -27 -18 42 13 123 54 6 -42 27 10 -90 -16 82 -19 8
7891 8 20 85 39 20 159 -36 -171 117 -110 -34 28 22 -110 64 28 -75 -117 143 -14 -157 93 22 -130 -31 57
7916 57 49 3 -5 -10 -95 37 33 -56 -129 -102 58 -58 32 78 -60 -20 127 91 -107 20 90 -10 -114 84 37 -47 28
7943 28 25 39 -46 17 -85 15 -15 7 -53 -8 111 -51 -7 137 75 -40 -13 9 38 24 72 22 7 147 24 12 -46
7970 -46 75 -29 -68 46 31 -104 17 -21 -81 -20 53 -59 -57 -49 79 -98 -46 146 53 19 -22 -6 42 27 57 -50
7996 -50 0 105 19 -30 23 -51 -101 29 115 52 -13 -61 84 42 -89 21 0 -35 -68 41 51 5 -76 8 -76 6 -21
8023 -21 1 -85 6 -13 -98 -18 43 -8 133 -54 -92 -22 79 -83 112 -27 -76 43 -39 128 -113 20 -7 19 6
8048 6 -35 125 -16 -37 50 -84 -50 26 -22 35 -20 -27 16 -51 47 78 22 -57 77 20 -51 -13 64 -56 27 -13 0 -117
8076 -117 93 32 -49 16 -17 -15 13 73 134 -25 62 60 -6 -52 94 49 -23 -25 103 -2 147 53 -29 40 1 23 -109 47
8104 47 118 -70 -18 25 -7 -36 -60 -2 -25 11 13 64 -85 18 41 -92 -83 46 -12 30 48 7 -39 32 82 -124 -32 189
8132 189 -1 -99 80 33 -17 -51 85 -4 -77 63 125 -81 -67 -2 -99 9 61 73 -101 8 34 -10 -110 -2 -85
8157 -85 -104 -45 80 -65 -90 59 36 21 -26 -28 125 42 4 3 -78 44 7 -89 -21 68 -90 -102 49 -4 -76 19 -9 -87
8185 -87 90 104 -84 52 80 0
8191@
$$ Imaginary data points
##PAGE= N=2
##DATA TABLE= (X++(I..I)), XYDATA
0 0 0 0 0 0 0 0 0 0 0 0 -24 24 -24 24 -24 48 -48 72 -73 96 -120 144 -168 193 -240 265 -313 361 -409 481 -553
31 -553 625 -714 802 -914 1023 -1154 1284 -1443 1605 -1780 1981 -2197 2429 -2692 2976 -3280
47 -3280 3618 -3986 4392 -4835 5332 -5876 6484 -7166 7937 -8810 9818 -10992 12379
60 12379 -14046 16093 -18685 22079 -26739 33564 -44553 65179 -117369 531760 704413
71 704413 -654237 -754842 -188655 411869 472670 161518 -370335 -323567 53460 128655
81 128655 -17752 211116 251262 -206896 -480542 -104810 292869 392442 187953 -283504
91 -283504 -564691 -71584 527070 351937 -182845 -274993 -119391 206 161479 199092
101 199092 -27049 -123835 -39440 -96849 -87407 236287 299990 -141695 -364228 -64743 179763
112 179763 144062 51072 -78950 -148315 24312 122830 -69728 -88177 181069 137942 -213013
123 -213013 -219789 93013 209128 105263 -49195 -217285 -146340 194549 248618 -98782 -208189
134 -208189 40536 106131 -50337 -69654 15219 70931 115750 -8824 -257225 -145869 271334
145 271334 282253 -142739 -298054 -48660 164809 184019 51485 -169785 -182360 81527
155 81527 159684 -54270 -82775 98831 57577 -121973 -84791 50999 81560 70325 -16103
166 -16103 -167043 -91283 166426 151074 -97742 -127953 17044 33746 8578 43392 3620
177 3620 -44726 19641 12560 -89638 -11782 143098 40148 -134671 -57815 76817 47607
188 47607 -4631 -25175 -68922 -13147 102485 22669 -121082 -16176 131075 21366 -113184
199 -113184 -46648 36951 43077 51013 -10398 -104840 -19042 114668 19122 -101996 6021 94420
211 94420 -16689 -82387 -13113 29793 52936 59842 -66564 -156828 18459 184079 47377
222 47377 -122663 -75974 6530 26925 67288 38656 -70142 -49818 46960 -907 -51259 59480
234 59480 86875 -67333 -109667 13676 70532 54491 32730 -69397 -131879 19940 147819
245 147819 26649 -87759 -22688 8594 -31880 17364 60505 -7845 -30713 5082 -38403
256 -38403 -37610 92834 91408 -87005 -114447 29880 72421 28120 18204 -37256 -86035 16755
268 16755 93408 -12137 -63415 32276 29472 -57456 -12421 55757 1952 -23134 10639 -33294
280 -33294 -42655 71927 73060 -72573 -71464 51765 38635 -26011 7239 7825 -34648 19987
292 19987 49364 -48525 -51278 68724 42646 -72045 -26785 53650 4602 -18708 20477 -21042
304 -21042 -43743 46591 46704 -60965 -29938 67863 8786 -60126 8891 34444 -19487 7734
316 7734 31853 -42818 -31894 70489 28810 -73510 -15421 55006 -5689 -23811 27971 -7551
328 -7551 -39113 32226 29136 -56033 -11030 71212 -5330 -67831 16860 45869 -19564 -6961
340 -6961 18996 -34273 -13940 69444 14271 -73552 -2642 56441 -15930 -26560 36917 948
352 948 -41996 21678 28065 -41621 -3808 53540 -23472 -59702 36139 49342 -30806 -16938 18830
365 18830 -25914 -9006 61148 5352 -67024 7656 55005 -22396 -28130 37824 3447 -39857
377 -39857 17473 26687 -30979 2217 42769 -31257 -51347 42196 41912 -38910 -16205 27063 -17526
390 -17526 -14605 43135 1662 -51362 14187 44834 -26101 -22031 39309 1319 -39726 16127
402 16127 26271 -27408 15 36439 -25484 -39471 40066 30378 -43512 -14241 32036 -9642
414 -9642 -15042 31070 -3310 -43536 16277 37210 -27937 -17714 39496 -1239 -40018 17765
426 17765 30499 -24869 -7159 28944 -18206 -27510 37611 22182 -42531 -10276 30223 -12758
438 -12758 -16452 31959 2427 -39501 9559 28712 -26442 -12824 39877 -1448 -42036 11030
450 11030 29333 -16265 -2492 24736 -21327 -30344 33071 25773 -29391 -4347 23178 -22867
462 -22867 -22353 35563 15973 -32373 -1968 16136 -24181 -6793 40909 1735 -39787 3052
474 3052 19044 -16673 5467 35538 -16083 -40647 14599 22982 -13541 10148 25177 -31260
486 -31260 -35967 29457 27839 -16180 -355 6374 -32645 -10271 43366 10585 -32218 1708 9892
499 9892 -29002 -558 46240 3691 -35364 -1353 4192 -17479 22906 44441 -22866 -48108
511 -48108 9117 21323 -2895 18237 12223 -44529 -26709 40174 22044 -20213 5564 6826
523 6826 -38272 -13627 40332 13759 -17402 7266 -5801 -38185 10833 54416 1144 -35292
535 -35292 -4153 -4792 -13916 36243 42012 -34536 -46885 14751 18658 -4105 19250 9081 -41247
548 -41247 -18342 32236 5776 -14905 22134 8225 -42155 -11576 34500 6232 -7046 18562
560 18562 -14070 -48484 13003 57540 4603 -26752 -5618 -15530 -12155 40215 29077 -39436
572 -39436 -25752 24834 -1471 -19875 27049 24280 -28015 -17704 7501 -15872 1733 51261
584 51261 9578 -57270 -21940 29952 17048 16005 17469 -40275 -53470 29948 56054 -7697
596 -7697 -19617 7121 -17821 -21623 29814 25342 -19715 -5173 6292 -33442 -14123 53441 30987
609 30987 -33810 -25162 -5423 -14006 25725 59497 -9633 -67485 -14906 31672 17320 19877 11756
622 11756 -43442 -38274 34673 35442 -15949 -4261 11123 -28238 -23162 29478 21214 -8328 10385
635 10385 -1667 -48216 -12838 55391 28372 -26663 -20911 -14415 -11131 40892 52198 -28933 -59219
648 -59219 4765 26674 -1007 11100 15234 -24561 -19268 18611 385 -13668 29400 21799 -45719
661 -45719 -38889 24436 30176 12430 12119 -25509 -54396 8888 62325 13648 -30460 -12546 -10817
674 -10817 -11873 31591 36408 -21196 -28941 8554 -2860 -14448 26939 29042 -24535 -29440 1708
687 1708 -955 9103 40112 5188 -53407 -25513 29138 22488 8894 8966 -28873 -44745 19079
700 19079 54925 5927 -24292 -8866 -13287 -9545 27517 21644 -21203 -11874 12819 -12295 -15538
713 -15538 29883 25712 -24604 -26076 -1837 -2385 15618 37299 -5315 -47974 -9040 31682 11974
726 11974 -1650 2166 -20515 -20751 24507 26294 -16451 -10473 16054 -7994 -22499 12066 19785
739 19785 -6576 -3659 755 -20974 -5938 33119 12846 -26716 -9474 10216 -6592 1937 24102
752 24102 -3415 -27854 2318 16979 -6326 -51 17227 -6596 -18976 7909 7493 -12946 5867
765 5867 18326 -15360 -21466 14595 14411 -8522 3127 5760 -22168 -11807 24708 12785 -14462
778 -14462 -1865 3494 -11754 5303 22738 -7283 -21850 8843 10138 -15700 1389 23237
790 23237 -3567 -19039 2892 2552 -8394 12514 13930 -21167 -17487 17822 9967 -9914 6484
803 6484 5827 -20358 -5175 23124 2094 -15421 7514 6802 -16651 308 20333 -3575 -12777
816 -12777 9251 49 -16597 9329 19260 -14615 -15950 13873 3655 -13360 9154 12640 -16240
829 -16240 -8981 14562 -1664 -10435 13930 7093 -19654 -965 19656 -5188 -12049 13556 3337
842 3337 -19386 2898 17591 -7743 -8021 13463 -3202 -17744 9790 14581 -14036 -6747 13950
855 13950 -5838 -13129 15546 10507 -18329 -3227 15717 -6711 -9691 16374 4378 -18539 2444
868 2444 13998 -9816 -4408 17469 -4208 -20687 9280 15511 -12741 -5260 13951 -7605 -14786
881 -14786 14756 10586 -15876 -1248 12787 -10473 -8252 19277 3543 -19924 3304 14704
893 14704 -10186 -4173 17562 -4086 -19105 9401 13531 -12610 -3135 13321 -8657 -12667 15847
906 15847 7938 -17602 -319 13453 -10154 -8034 17750 2141 -18529 4522 13662 -10258 -3874
919 -3874 15555 -4524 -15734 11335 11335 -13577 -1631 13876 -8738 -12058 15224 6684 -16997
932 -16997 305 12720 -9707 -6914 15722 -8 -17053 6116 12408 -11022 -3364 14648 -5192
945 -5192 -13823 12105 9839 -14162 -893 14167 -7636 -10476 13935 4817 -15632 2529 12141
958 12141 -10161 -6457 14391 -1205 -15403 7263 10746 -12193 -3534 14102 -4389 -12250 11112
971 11112 7557 -13785 68 13841 -6990 -9544 12457 3628 -13515 3742 10927 -10452 -5821
984 -5821 13982 -1043 -14306 6550 9648 -11240 -3282 12512 -4374 -11112 9760 6382 -12196
997 -12196 875 12071 -7293 -8504 12306 3974 -12318 3033 9845 -9233 -4638 13443 -694
1010 -694 -13355 5416 8558 -10136 -2415 11926 -4374 -11263 8159 5603 -10603 1907 11123
1023 11123 -8660 -9299 12104 5453 -10891 2070 8229 -8917 -4049 13232 109 -11973 4972
1036 4972 6988 -10451 -1747 13194 -3057 -11836 5762 4844 -9353 2782 11252 -8697 -10829
1049 -10829 10244 5472 -9411 3001 8285 -9412 -5745 12040 1884 -9106 5551 5555 -12130
1062 -12130 -2000 14988 -635 -11536 4028 3995 -9190 2376 11510 -6993 -9905 8561 2947
1075 2947 -10645 4301 11446 -8304 -8738 8429 1791 -6098 8227 5527 -14716 -4428 15346
1088 15346 1743 -10030 4338 3719 -10037 1411 11214 -6067 -7705 9827 872 -14011 3646
1101 3646 13830 -5467 -8201 6278 -1964 -8015 10621 9400 -13004 -6485 11450 -74 -6842
1114 -6842 9230 4119 -13473 -1100 11676 -4248 -5873 10745 184 -15199 2722 12649 -5697
1127 -5697 -5369 8968 -3158 -12665 7077 10932 -7287 -2804 7029 -7965 -7890 15842 9574 -14957
1141 -14957 -6134 9151 -1755 -2483 10480 -1733 -14112 4904 11233 -9136 -5399 12623 -303
1154 -303 -13482 2140 6366 -5001 4724 10511 -12832 -14758 14028 13739 -9551 -5635 3994 -5377
1168 -5377 108 14157 -1380 -14619 5182 10074 -11096 -5840 13404 1476 -10365 3265 2514
1181 2514 -9872 4444 14669 -8186 -14920 6879 7106 -5618 4662 6935 -12312 -6985 14076
1194 14076 4089 -9945 4026 5627 -11518 -2314 14005 -910 -10571 5829 4394 -11063 118
1207 118 11928 -3098 -6465 5987 -3730 -12360 9825 16843 -9070 -14039 5409 4968 -1291 7443
1221 7443 362 -15559 -651 16463 -724 -11220 5959 6494 -8695 -2073 5806 -4920 -1006
1234 -1006 11761 -3663 -17529 4598 17634 -2124 -10097 -311 -3001 -1901 12731 4640 -15027
1247 -15027 -3351 13200 -737 -8539 6505 4940 -8598 -603 6199 -5626 -2251 11821 -257
1260 -257 -14136 999 9795 -3265 -1953 7046 -5010 -10743 6702 8789 -6124 -1927 6126 -5412
1274 -5412 -5535 11138 5464 -11379 -2925 7396 -2671 -3111 7815 551 -7637 3966 4635 -10168
1288 -10168 -3113 12616 850 -12537 -1116 6253 344 4136 4328 -11081 -8989 11600 8419
1301 8419 -9362 -3731 7163 -817 -2852 5248 -728 -5928 5642 4800 -11284 -4818 12833 4673
1315 4673 -9008 -2125 2084 -3128 3651 7397 -7486 -9246 7916 6577 -7574 -1209 7255 -3052
1329 -3052 -5287 5480 1830 -4769 4428 4572 -9509 -4221 10652 2300 -8124 1878 4802 -5703
1343 -5703 -1549 6868 -2234 -5920 4827 1055 -8584 2602 11083 -3417 -8403 4183 3151 -4727
1357 -4727 2521 4221 -6794 -1940 9792 -113 -8968 3917 7332 -6298 -4921 5142 -353 -2545
1371 -2545 5711 -292 -10235 2402 11373 -3985 -9520 4475 4133 -4961 1254 4286 -4967 -1144
1385 -1144 8200 -2549 -9105 6108 8631 -6916 -5229 5673 -241 -3707 5563 898 -8996 1892
1399 1892 9568 -4890 -7853 6205 3535 -6965 242 4769 -4232 -395 7925 -3357 -8978 6618
1413 6618 7885 -8007 -4651 7382 334 -4465 4781 1641 -7278 2087 6947 -6920 -6109 8827
1427 8827 3132 -8765 371 5990 -3922 -1833 6365 -3018 -7382 6382 5940 -8192 -2202 8702
1441 8702 -1132 -6307 4190 2356 -5741 2554 5776 -6969 -4349 9510 1792 -9867 812 6948
1455 6948 -3829 -2783 5248 -2516 -5374 6553 3312 -9168 -425 9805 -2099 -7063 4419
1468 4419 3289 -5041 2223 4709 -6810 -2790 9384 385 -9341 2522 6849 -4710 -2990 4843
1482 4843 -2162 -4505 6184 2181 -8930 538 9130 -3204 -6834 5021 2951 -5274 1826 4352
1496 4352 -5442 -1686 8299 -1158 -8346 3823 6427 -5627 -2943 5564 -1381 -4294 4851 1335
1510 1335 -7286 1571 7493 -4483 -6024 5901 2972 -5705 890 4309 -3997 -1135 6472 -1806
1524 -1806 -6621 4848 5457 -6196 -2552 6082 -750 -4290 3645 1198 -5786 1819 5820 -4953
1538 -4953 -5234 6090 2300 -6169 613 4266 -3341 -1184 5242 -2017 -5369 4943 4428 -6151 -1943
1553 -1943 6399 -433 -4554 3027 1564 -4449 1748 4582 -4705 -3822 6037 1660 -6164 664 4274
1568 4274 -3109 -1823 4488 -1179 -4437 4087 3509 -5770 -1304 6230 -551 -4488 2785 2117 -3849
1583 -3849 1277 4231 -3831 -3413 5368 1219 -5613 919 4461 -3284 -2667 4080 -268 -4020 2804
1598 2804 2553 -5004 -764 5800 -1113 -4775 2932 2702 -3951 291 4320 -2481 -3016 4310 805 -5120
1614 -5120 1567 4771 -3440 -3272 3968 577 -3613 2262 2196 -4793 -716 5590 -1164 -4736 3139 2964
1630 2964 -4172 -278 4286 -1724 -2805 4090 605 -4917 1772 4838 -3292 -3399 3976 370 -4090
1645 -4090 2402 2951 -4449 -1551 4771 -1157 -4060 3338 2528 -4792 -375 4785 -1647 -2905 3965
1660 3965 790 -4838 1548 4805 -3136 -2703 4386 170 -4806 2215 3679 -3923 -1536 4186 -1672
1675 -1672 -3932 3928 2647 -5147 -705 4610 -1911 -2816 4310 905 -5118 1427 4525 -2928 -2036
1690 -2036 4662 -294 -4743 2446 3353 -3970 -983 4616 -2141 -4538 3709 2721 -4692 -177 3776
1705 3776 -3133 -2774 5029 1205 -5309 868 3921 -3090 -1366 4956 -913 -4836 3178 3506 -4276
1720 -4276 -949 5032 -1536 -4228 3058 1788 -4149 1177 4128 -3826 -3518 4724 1399 -4439 1186
1735 1186 2726 -4072 -1187 5442 -516 -4664 2604 3054 -3942 -226 4500 -2152 -3407 3846 1154
1750 1154 -4749 1296 4798 -2980 -3297 3521 200 -3696 2694 2946 -4914 -1864 5177 126 -3500
1765 -3500 2404 1461 -4022 965 4811 -2607 -3576 4067 1670 -4331 634 3558 -2263 -1365 3568 -1346
1781 -1346 -4420 3282 3809 -4447 -2363 3687 -324 -2248 3153 814 -4676 474 4768 -1862 -3130
1796 -3130 3147 988 -3362 1566 2877 -3156 -1126 4401 -814 -4798 1885 3585 -2290 -1089 2529
1811 2529 -1929 -2631 3537 1566 -4355 -446 3425 -1474 -1613 3551 90 -3997 1479 3534 -2533
1826 -2533 -1979 3277 471 -2697 1384 1465 -2784 589 3695 -2354 -3981 2773 2576 -2623 -505 1808
1842 1808 -2306 -1253 3965 562 -4123 511 3081 -1541 -1433 2311 -492 -2030 2509 1378 -3622
1857 -3622 58 4657 -733 -4012 778 1604 -1785 633 1929 -2461 -1712 3495 795 -3452 316
1872 316 2213 -2143 -1041 3070 47 -2608 2002 2162 -2925 -945 3006 -379 -2357 1480 899 -2468
1888 -2468 916 3120 -1964 -2569 2100 761 -2696 1012 2454 -2496 -1874 2953 558 -2657 1024
1903 1024 1854 -1878 -306 2633 -1212 -2257 2761 1662 -3396 -452 3433 -327 -2080 1432 258
1918 258 -2587 1410 2537 -2585 -1984 3006 758 -2525 952 1605 -2443 -435 2747 -1264 -2572 2887
1934 2887 2328 -2953 -857 2643 -534 -1585 1836 -288 -2966 1539 2999 -2436 -2044 2898 351
1949 351 -3041 726 1824 -2048 -497 2529 -1014 -2305 2449 1572 -3065 -236 2923 -1056 -1887 2518
1965 2518 640 -2936 761 2559 -1935 -1383 2888 -138 -3019 1145 2068 -2269 -740 2487 -1123
1980 -1123 -2189 2561 1554 -3134 6 3007 -1570 -2346 2297 1127 -2065 994 1824 -2274 -552
1995 -552 3185 -798 -3631 1648 2480 -2288 -1025 2488 -687 -1886 2110 538 -3197 488 2974
2010 2974 -1784 -2027 2607 888 -2372 1014 1730 -2500 -657 3288 -395 -2942 1750 2184 -2205 -563
2026 -563 2220 -866 -1549 2158 257 -3061 897 2952 -2188 -2159 2635 706 -2536 892 1897 -1970
2042 -1970 -537 2445 -848 -2247 2118 1435 -2559 -119 2685 -940 -1858 1916 345 -2573 824
2057 824 2227 -2116 -1404 2651 224 -2517 890 1461 -1831 -343 2089 -1054 -1752 2577 1289 -2783
2073 -2783 -160 2734 -822 -1656 1729 402 -1998 1057 1720 -2215 -958 2582 -103 -2531 943
2088 943 1582 -1749 -476 1920 -999 -1569 1993 1025 -2550 34 2310 -916 -1508 1619 362 -1733
2104 -1733 990 1514 -1934 -787 2509 -277 -2420 935 1703 -1760 -628 1700 -645 -1344 1602 629
2120 629 -2292 259 2196 -1053 -1598 1741 724 -1548 663 1261 -1526 -625 2153 -238 -2245 1058
2136 1058 1593 -1691 -747 1597 -450 -1375 1354 502 -2040 307 1998 -1228 -1780 1594 768 -1661
2152 -1661 346 1362 -1143 -510 1816 -310 -1895 1174 1504 -1675 -871 1772 -134 -1322 1037 521
2168 521 -1700 385 1949 -1171 -1537 1687 773 -1818 55 1461 -861 -635 1644 -352 -1681 1256
2184 1256 1583 -1710 -820 1845 -54 -1368 878 642 -1513 278 1689 -1187 -1588 1656 767 -1888
2200 -1888 104 1606 -954 -799 1483 -229 -1728 1126 1397 -1724 -674 1972 -162 -1634 1117
2215 1117 915 -1562 37 1509 -1089 -1238 1732 465 -2166 252 1832 -999 -987 1533 21 -1517
2231 -1517 1162 1221 -1697 -469 2032 -393 -1887 1212 1122 -1539 -7 1407 -1007 -998 1889 351 -2268
2248 -2268 254 1833 -1092 -1104 1423 -177 -1379 1013 1100 -1762 -231 2182 -503 -1792 1206 1150
2264 1150 -1525 40 1461 -983 -1064 1786 380 -1976 618 1570 -1328 -810 1761 -53 -1632 870
2280 870 976 -1609 16 1927 -808 -1654 1496 889 -1624 178 1537 -1011 -839 1602 -49 -1702
2296 -1702 904 1380 -1588 -769 1852 -113 -1430 905 708 -1604 170 1748 -984 -1403 1523 611
2312 611 -1634 316 1456 -1096 -727 1710 -72 -1549 1060 1320 -1432 -538 1693 -316 -1269 1258
2328 1258 519 -1665 108 1570 -760 -1051 1439 220 -1517 651 1265 -1217 -734 1489 -93 -1424
2344 -1424 988 1062 -1395 -249 1467 -620 -1192 1314 742 -1440 14 1133 -638 -647 1309 -77 -1668
2361 -1668 524 1333 -1158 -658 1222 -208 -1120 863 809 -1207 38 1618 -551 -1253 1095 700 -1183
2378 -1183 268 1153 -951 -703 1510 301 -1641 266 949 -929 -377 1141 -298 -1263 1017 823
2394 823 -1260 -126 1277 -354 -1091 793 348 -1115 422 1246 -827 -835 1215 365 -990 373 658
2411 658 -971 -266 1316 -370 -1375 567 820 -987 -295 1077 -412 -854 882 402 -1096 254
2427 254 1341 -529 -835 1077 257 -928 538 769 -1012 -505 1206 -39 -953 501 480 -1035 -52
2444 -52 1099 -417 -876 828 556 -1160 151 1025 -541 -692 815 70 -1069 439 981 -643 -493
2461 -493 898 71 -777 703 578 -1246 -283 1287 -139 -1069 575 685 -853 9 782 -639 -507
2478 -507 1200 210 -1309 491 1243 -558 -530 965 -9 -867 745 695 -1124 -347 1058 -213 -807 629
2496 629 448 -887 217 880 -859 -824 1102 300 -1191 221 1111 -595 -592 857 -67 -905 692 628
2514 628 -912 -54 1114 -257 -899 942 555 -1157 -179 947 -520 -689 1005 134 -1004 411 846
2531 846 -858 -397 1214 -92 -1047 579 750 -817 -38 1160 -491 -994 983 583 -1068 -91 849
2548 849 -463 -491 860 -200 -1101 544 928 -968 -623 1209 26 -1097 343 552 -846 85 1028
2565 1028 -554 -769 983 361 -1028 124 871 -668 -433 930 112 -1085 551 748 -968 -510 965
2582 965 -66 -902 557 519 -836 123 918 -481 -727 934 359 -1077 300 931 -533 -451 774 -19
2600 -19 -816 454 586 -919 -221 1086 -414 -941 619 403 -804 -123 697 -622 -518 910 134 -1016
2618 -1016 312 853 -626 -344 836 -68 -669 515 394 -833 -160 1082 -323 -813 684 447 -756
2635 -756 151 583 -584 -546 841 -80 -868 343 806 -533 -434 762 -4 -616 401 435 -704 109 774
2654 774 -418 -696 672 256 -806 -93 646 -470 -541 644 -86 -707 392 471 -745 -401 779 -41
2672 -41 -532 362 366 -568 292 666 -358 -543 742 361 -759 -76 635 -224 -254 466 -114 -576 431 516
2692 516 -771 -312 674 -90 -698 276 429 -374 36 555 -290 -478 511 228 -688 -5 561 -360 -343 550
2712 550 -41 -611 296 386 -652 -323 711 -83 -561 283 343 -445 -130 603 -134 -257 640 323 -695 138
2732 138 835 -315 -401 569 163 -473 252 535 -524 -170 638 -37 -623 335 452 -471 -222 532 -278 -432
2752 -432 497 239 -679 92 669 -315 -338 563 199 -570 155 427 -441 -132 533 27 -600 402 430 -585
2772 -585 -221 520 -205 -393 406 214 -535 100 620 -383 -366 612 239 -555 146 544 -301 -231 710 -40
2792 -40 -615 416 610 -664 -141 544 -147 -486 367 229 -634 82 584 -606 -393 596 207 -553 107
2811 107 452 -478 -172 460 -127 -692 359 451 -559 -110 499 -236 -419 500 239 -409 58 545 -362 -337
2831 -337 546 62 -614 194 454 -437 -251 568 -87 -450 382 254 -529 -18 575 -148 -343 451 178 -599
2851 -599 191 405 -463 -213 392 20 -635 216 360 -442 -220 476 -130 -403 397 214 -541 -26 585 -268
2871 -268 -311 370 176 -423 284 414 -533 -161 468 -49 -523 323 274 -406 -87 511 -70 -377 498 251 -428
2892 -428 136 443 -265 -282 489 177 -469 123 412 -251 -158 329 -75 -350 243 308 -392 -74 471 -216 -228
2913 -228 202 37 -297 51 304 -311 -358 409 38 -447 272 148 -219 -54 416 -183 -466 399 239 -415
2933 -415 10 388 -4 -223 339 25 -371 209 369 -324 -121 532 26 -375 273 296 -241 -105 461 -34
2953 -34 -413 309 295 -358 38 328 -148 -243 255 98 -426 -13 212 -195 -348 306 30 -393 196 344 -269
2974 -269 -103 399 -21 -158 264 215 -281 44 402 -86 -245 278 201 -288 124 227 -219 -179 379 77 -305
2995 -305 209 235 -202 -93 254 101 -214 251 202 -307 -23 182 -135 -131 170 67 -244 16 278 -267 -89
3016 -89 249 31 -366 -51 184 -367 -119 307 -67 -185 186 303 -160 -113 186 82 -184 204 139 -184 47
3037 47 267 -87 -130 291 45 -318 5 210 -227 -92 377 -36 -250 138 117 -212 -14 202 -86 -77 235 187
3059 187 -185 -58 294 -73 -156 122 -57 -277 63 261 -170 -161 233 -120 -228 78 130 -325 -62 284 -18
3080 -18 -82 135 42 -192 -18 223 -139 -136 240 129 -201 71 152 -293 -130 157 -140 -211 104 101 -195 -106 192
3103 192 -3 -67 82 65 -227 1 218 -50 -161 238 55 -292 176 103 -152 -106 285 -7 -185 67 146 -240
3125 -240 -98 208 -72 -213 142 91 -242 -6 191 -110 -89 110 121 -134 1 273 -166 -65 140 39 -159
3146 -159 252 143 -222 79 276 -140 -194 156 124 -169 -30 135 -208 -107 191 -42 -203 27 193 -135 -86
3167 -86 62 -66 -155 189 60 -115 -58 229 -62 -147 115 86 -91 -76 243 -124 -99 84 -85 -189 27 128
3189 128 -76 -66 126 -37 -128 178 117 -93 37 144 -9 -47 173 -41 -134 111 124 -34 -14 101 -69 -185
3211 -185 177 71 -178 -127 129 -28 -77 133 154 -262 108 84 -115 -108 147 20 -33 100 96 -88 38 172 -39
3234 -39 -120 161 -73 -92 -55 221 -156 -77 150 1 -32 58 110 -27 28 46 74 -31 66 -29 -34 -56 137 -25 -121 120
3260 120 82 -75 88 116 -8 -94 52 63 -143 69 73 -69 -190 100 -31 -68 60 171 -144 -10 119 -181
3282 -181 4 125 -20 -156 69 108 -84 -26 147 -18 -36 35 142 -77 -58 130 -8 -132 143 49 -184 -19
3304 -19 237 -67 -98 19 56 -89 50 85 -64 -155 37 67 -157 66 19 -17 58 -12 39 -66 99 -15 -119 91
3328 91 121 -65 -34 -2 -24 -100 55 164 -49 -21 9 -33 -41 79 17 -81 -15 199 -49 -101 129 88 -17 43 64 -90
3354 -90 5 120 -38 23 71 -66 -124 41 99 81 -4 9 14 -112 11 48 -128 5 -6 -67 -92 102 59 -219 -9
3379 -9 32 -34 -66 106 16 -62 64 7 65 -28 -56 53 -19 139 173 -25 11 145 1 -33 116 7 -124 74 15
3404 15 -160 -58 57 123 -173 18 50 0 -18 -7 -101 -8 -77 71 -106 6 73 -22 24 -65 -51 -26 68 -56 -13 -27
3430 -27 43 -28 -41 49 53 48 14 -83 -103 -98 40 56 -40 104 39 40 -50 70 142 -45 44 25 -16 -39 69 -32 10 176 -28
3459 -28 49 -82 -25 -46 -2 51 -90 -125 -69 116 -25 -40 10 -38 20 -49 7 -44 28 34 -123 -43 -74 -31 -25 -51 104 73
3487 73 24 149 -2 -102 37 43 -111 -29 81 109 74 79 70 -47 74 97 -52 -115 105 -26 128 85 112 11 -35
3512 -35 30 -20 42 -10 35 -40 16 0 21 -9 131 -63 31 102 81 -89 3 180 59 -62 74 -17 27 -17 -3 73 -56
3539 -56 -18 76 -130 -43 51 -76 -138 0 55 39 122 39 -38 49 85 41 -96 3 124 7 71 113 44 -62 -76 13 -59
3566 -59 -103 30 -65 -103 103 -33 -181 -23 45 -178 -26 95 50 -24 77 93 -121 -17 34 -68 0 44 206 -34
3590 -34 11 -33 -112 -70 65 32 -28 -30 80 -6 -50 91 20 -36 20 195 -33 -19 -4 99 -68 63 13 -37 -7 -74 -84
3617 -84 -110 -4 109 -12 -56 -16 -74 3 -21 -70 -110 37 70 -26 24 175 -19 67 85 -10 -28 -17 59 16 -50 68 45
3644 45 -48 18 126 35 2 153 55 -24 75 133 10 125 85 2 -16 107 168 -128 9 68 -96 32 55 58 -60 161
3670 161 52 -97 25 16 -63 -14 105 -83 -97 51 -68 6 -51 11 -84 -96 20 0 -51 28 139 65 -153 -1 38
3695 38 2 69 101 12 -78 31 -78 -74 -20 99 89 1 118 -28 62 -36 42 -79 116 101 45 -40 -36 -19 -70 -29 59 83
3723 83 -18 -5 -87 -59 95 -31 -159 -43 149 37 -100 71 -26 -47 -45 155 -66 -73 176 39 -103 25 38 -66
3747 -66 -12 98 49 17 -18 95 -7 -43 87 45 -81 -12 8 -158 5 -49 -96 20 60 -71 -44 9 -37 -59 -128 -19
3773 -19 112 -177 2 106 -8 -111 22 75 -14 52 53 -3 -102 -41 55 -126 23 54 -208 -102 86 -145 -104 265
3797 265 20 -67 -40 61 -89 88 137 60 -50 -11 130 19 -17 71 -54 -90 70 19 -97 -7 25 119 -73 11
3821 11 -108 -29 162 95 -21 -74 55 85 -72 -18 100 121 -59 120 -149 35 97 1 74 -47 58 -74 5 78
3845 78 -22 -37 58 125 -5 -66 108 111 -72 73 185 -43 -5 41 158 -122 189 113 -24 -10 146 14 -79 27
3869 27 -4 -5 -38 113 -32 -204 40 -86 -141 61 214 -107 -45 131 -1 -134 -78 134 -91 -11 197 -62 -110
3892 -110 -64 88 -27 6 124 -94 98 110 -21 -11 -11 119 -18 -121 124 -6 -35 131 113 -48 64 115 6
3915 6 -133 110 -4 13 21 72 -117 -78 50 83 -163 -4 116 -47 -33 65 -5 -28 99 81 -132 56 47 8 -18 77
3941 77 82 -113 56 109 -85 -5 112 29 -145 54 41 -107 -100 72 -69 -23 90 61 -13 0 168 -104 -42 125 112
3966 112 -86 75 52 -78 -26 55 -26 -145 54 -102 -155 18 67 -66 86 20 -51 -125 36 131 -95 -20 28 12
3990 12 -49 65 98 -34 -6 72 -77 -2 34 16 -25 84 238 32 -50 146 49 -72 76 122 6 -11 -1 -25 -45
4015 -45 4 42 49 -37 203 51 -9 65 30 0 38 36 -55 -3 113 34 -81 -51 -12 -33 28 63 -3 -94 -10 69 -107 29
4043 29 145 112 -15 98 -53 -30 44 189 117 -22 -7 -10 -49 -28 55 -29 9 53 76 -34 69 47 -69 -54 83 104
4069 104 1 72 8 -42 11 160 -72 -56 69 -58 -59 8 91 -47 -80 45 -20 -76 -68 -56 -60 -60 35 -92 -57 -60 -12 -102
4097 -102 2 47 18 -83 80 66 14 68 -152 40 -112 48 -18 46 91 98 -10 -52 99 64 -67 44 45 45 -66
4122 -66 7 -146 -69 -7 -4 14 49 192 7 -67 80 15 -55 66 8 -99 -2 20 12 -58 -11 -7 -133 -3 107 8 8 109
4150 109 -12 -58 -24 110 -30 -53 96 43 65 -57 139 -11 -61 74 -5 -22 48 104 -72 18 110 -52 -45 62 -27
4175 -27 -34 -15 25 35 -14 92 27 -51 -37 59 -53 -68 103 -56 -47 -53 14 -19 23 44 5 -70 111 -18 -29 19 -21 -33 -14
4204 -14 77 109 -117 -15 35 49 145 31 47 37 154 48 -11 -42 140 -39 -90 12 80 -48 -14 111 24 -35 -38 14
4230 14 -16 -26 -69 -43 -116 56 -74 -7 55 -29 -34 9 71 -31 -14 79 -2 -105 55 22 53 66 95 -47 -97 49 19
4257 19 -167 63 122 54 -150 112 62 -170 60 5 21 -75 -85 -23 50 17 -39 -34 -9 105 -19 -97 16 -20 -21 -69 77
4284 77 -51 27 -14 -22 -10 31 1 -66 -70 56 19 -54 42 43 -38 84 -9 35 -72 68 12 29 29 99 -21 81 10 41 102
4313 102 -25 -36 39 -46 18 0 37 -18 16 -50 -46 3 -2 14 18 -9 -61 80 -52 24 -52 73 -2 -79 25 -24 -11 -43 14
4342 14 0 -44 -61 80 -23 -37 85 -1 112 87 102 13 23 -17 105 -27 69 93 -38 3 78 -23 22 82 45 15
4368 15 60 96 -135 46 86 -5 -73 -38 28 -31 -39 31 -70 -75 -40 102 -6 -67 37 -31 -109 -31 18 -91 -62 -4 -84 -52
4396 -52 -35 -45 -108 -76 31 -114 49 52 64 -36 82 3 -53 16 19 76 -34 -33 142 -104 93 -23 -65 2 -5 21 94
4423 94 8 19 22 9 16 46 9 -6 147 66 23 89 -82 -135 15 15 -9 -8 125 57 -49 -13 -55 -48 44 5 -162 41 -19
4452 -19 -31 -40 81 13 24 -13 26 -43 -79 10 17 -32 31 18 -65 45 140 27 -77 107 -19 -163 -16 106 64 -103
4478 -103 28 104 -102 -78 57 -12 -86 -20 -59 -58 -32 44 -99 -41 -15 55 -50 -21 -63 -89 -36 104 22 70 142 -26 -66
4505 -66 15 63 -76 -9 140 79 -4 20 48 30 30 104 17 -36 52 -38 -8 31 129 -42 -75 -39 -40 -128 63 18 62 3 98
4534 98 28 19 -78 -35 35 -26 -39 -7 -9 20 -55 -105 -25 0 -99 -128 36 -135 -12 -47 -4 -59 33 10 -79 11 96 -57 40
4563 40 127 64 -13 66 33 -4 78 30 115 -51 95 102 -28 -8 21 -32 0 -67 14 -101 64 32 -40 -103 -33 -5 -56 -110
4591 -110 1 -50 60 18 -64 0 59 -77 -50 -25 -51 -37 -70 28 28 22 4 -35 -34 -68 56 -23 -109 40 39 -64 25 90 4
4620 4 20 102 43 19 7 106 52 -49 -18 12 9 5 72 -54 10 18 64 33 3 71 38 98 11 -9 -26 33 -15 -8 -61 45 16
4651 16 -11 -72 -32 -43 -15 54 43 22 104 16 13 9 -25 73 -68 55 17 15 59 54 1 24 34 82 -25 -74 -29 37 22 -19 -93
4682 -93 -70 -77 36 6 -6 48 61 -33 -57 28 -4 -13 -59 -69 -42 -47 22 -122 -131 32 -44 -48 -67 43 9 -5 -30 -1 3 29 -44
4713 -44 -80 -23 -7 0 71 57 96 55 76 -14 23 46 38 -31 77 112 141 179 68 55 -4 -21 94 -70 6 0 19 22 22 -57 -28
4744 -28 -46 2 25 -69 -22 0 -70 -38 90 -19 -31 22 -74 -52 -9 10 22 5 72 -67 30 -4 13 -51 -101 65 61 -29 46
4773 46 -1 -48 -53 71 -22 -26 156 -74 3 -150 -22 -82 29 -2 11 -49 83 -138 -28 9 180 -88 16 -5 24
4798 24 -80 50 54 -87 106 4 -49 7 16 -59 -89 -52 193 87 62 -4 -29 19 106 168 -9 27 122 11 -42 10 204
4825 204 31 85 49 -114 -7 112 -15 -74 127 53 -127 -56 -62 -2 -23 37 90 23 -3 64 -15 8 99 -67 -160 -45
4851 -45 86 -30 5 98 -38 -131 97 137 -19 55 53 23 -17 -66 19 16 107 43 -114 -24 6 61 -34 46 113 7 -72 82
4879 82 15 5 71 -102 -142 79 -30 -16 -89 -9 44 -39 83 22 17 -37 84 -11 24 54 96 -36 -39 -3 -90 -189 4 12
4907 12 35 -44 29 -43 -2 -2 57 -43 -39 -22 -3 7 91 -33 24 99 123 58 21 83 -4 54 32 -4 -19 3 53 -44 -108 -14
4937 -14 45 70 84 -59 15 152 -5 38 -52 -66 93 16 27 32 1 -20 -39 -12 -55 78 67 8 10 52 -38 -31 15 30 -55
4966 -55 48 14 19 -20 -27 21 -146 2 114 -6 -39 92 155 118 -2 86 -38 28 27 124 -32 65 23 -58 -64 -8 -61 -106
4994 -106 -48 -31 12 25 59 8 -31 51 23 -48 88 0 -30 -72 -106 7 19 -43 48 48 -92 68 27 54 30 -49 20 -56
5022 -56 65 93 54 -28 31 -61 1 58 95 9 18 94 -98 60 10 4 -12 46 26 53 -7 76 -43 -35 -5 -62 0 -80 21
5051 21 -67 -31 54 -122 -99 42 43 -19 -96 88 -73 -117 15 -2 -74 60 134 -79 2 120 24 -49 22 92 -110 77
5077 77 127 26 1 7 63 36 -54 -45 48 92 23 142 -86 52 18 -66 -21 88 34 -92 67 72 -132 -107 50 -18 -138
5104 -138 43 102 -174 75 -70 -123 -9 150 -47 -27 -13 33 -120 -156 63 -48 -53 63 54 -81 -6 148 -56 -45
5128 -45 114 93 -25 9 -30 14 55 38 22 65 -74 0 -69 9 100 -97 -142 95 42 -85 -14 69 74 -130 5 -4 -12 -22
5156 -22 31 16 29 -19 -102 63 35 19 5 -28 41 -23 17 -106 -34 57 15 115 -47 -115 59 114 -81 29 119 -26
5182 -26 11 45 -98 -118 90 25 67 -65 19 81 -67 58 9 -158 -53 62 -22 -79 26 97 -165 -3 128 -49
5206 -49 -10 65 -47 -7 -40 -44 -108 -9 51 -125 5 30 -78 -58 13 59 7 45 65 7 -40 6 85 21 -82 30 4 20
5234 20 -75 -8 -22 -6 -34 29 12 88 -6 -73 -26 83 12 -11 39 -37 77 -28 -40 -177 -103 -33 -125 5 -28 -5 -41 -34
5262 -34 14 37 -90 75 2 -111 -72 -7 -5 -84 0 40 -73 -50 -5 -122 98 89 30 -84 106 1 28 68 106 49 -16
5289 -16 -79 28 -28 -54 62 -2 -38 20 -54 26 6 -45 -73 -63 40 30 -78 -54 79 -37 -17 84 23 -18 -17 18 -101
5316 -101 -43 -39 -78 3 39 26 -43 -84 62 -61 -27 113 -26 -61 78 -15 -32 -67 84 -41 36 151 56 -74 74
5341 74 149 36 80 44 -58 -154 -66 51 -17 -93 93 -22 -115 177 20 -57 16 58 -31 -60 116 8 -115 3 120
5366 120 -79 14 67 49 -126 79 -68 -102 -62 150 19 -6 20 54 -82 -15 53 153 -57 153 85 30 0 150
5390 150 -39 -40 62 91 23 183 53 -133 31 64 52 -92 134 16 -56 33 79 -37 -142 54 4 -92 91 -138
5414 -138 -145 12 77 -16 -10 10 -115 -88 19 46 -97 3 148 44 17 -62 -24 -129 -4 267 86 39 53 62 -64
5439 -64 -1 84 -154 -31 110 40 -155 -12 22 -71 -84 93 -60 -9 -29 88 -92 -38 18 -91 2 -69 -30 -20 -17 60
5465 60 16 -59 52 22 -33 45 19 42 -37 85 2 -55 107 76 -5 -41 72 -45 15 -76 52 -123 -33 52 2 61 -33
5492 -33 163 -27 80 53 -4 -149 82 -32 -152 68 49 -37 -43 20 -42 -15 10 -27 -127 3 -17 53 -51 77 88
5517 88 -46 -18 98 -93 -149 92 29 -79 81 85 -35 29 46 -6 3 64 -24 94 -52 73 33 -22 83 4 -48 -2
5543 -2 55 -15 6 -91 -24 -95 10 97 3 -56 75 -25 -166 14 91 -43 -62 -52 -51 -89 7 -14 -52 -35 71 26 -126
5570 -126 17 -24 -52 -46 32 -6 -129 124 106 -29 -100 43 -36 -65 74 115 -45 -2 63 -48 -51 160 19 -70 233
5595 233 130 -118 -31 139 2 -89 67 -64 -102 -47 169 -40 -147 -19 -108 -177 32 60 -101 60 31 -43 -100
5618 -100 7 21 -70 57 84 -110 -130 150 43 -153 104 115 -59 24 136 51 -53 146 70 -101 22 126 9
5641 9 62 118 -15 -33 47 58 -86 -65 154 -23 -114 -64 10 -55 -20 129 -54 -80 76 122 24 -62 21 -70 1 156 37
5668 37 -101 -31 -41 -111 -42 18 1 -225 36 55 -135 -68 154 -18 -32 -5 134 -42 3 144 -91 12 226 13
5692 13 -70 43 79 -121 -71 157 -8 -163 196 108 -49 -62 115 -152 -102 -33 11 -85 -46 71 -165 -127 -41 -30 9
5717 9 58 77 -109 -49 107 -46 -142 11 87 -40 105 72 50 -113 109 105 41 65 -56 -21 -22 121 -47 -18 -4 79
5743 79 -65 30 23 28 -91 89 98 -150 58 159 -40 -71 45 58 -35 -84 161 -113 -38 99 17 -73 -40 106 -51
5768 -51 -14 134 -9 -96 74 -1 -53 -20 55 59 -4 -47 -16 -2 -1 144 -66 -55 91 63 -65 -62 94 -107 77 -7 22
5795 22 -68 -6 132 7 -28 62 -47 -35 135 106 -88 -81 135 43 -22 101 44 -110 27 70 -89 -66 24 -35 -139
5820 -139 54 97 -63 -165 -14 -3 -34 211 117 -9 -89 82 -28 -42 -64 45 -114 104 84 -79 -32 172 58
5843 58 -55 69 70 25 61 56 59 -43 81 34 -247 80 139 -69 -47 -3 -1 -132 37 120 -63 -52 -2 19 -64 88 83
5870 83 -76 -61 128 -68 -149 60 4 -112 -7 25 22 -95 74 27 -84 62 150 -148 -31 33 -53 -32 28 135
5894 135 -82 25 181 -152 -107 106 120 -118 28 141 -104 -65 137 -105 -211 64 62 -172 49 72 17 -190
5916 -190 -40 116 -142 -37 212 -62 -151 205 67 -230 136 72 -53 -109 152 11 -114 175 75 -180 -21
5937 -21 159 10 -134 156 98 -110 -50 188 -126 -155 168 -17 -194 170 177 -95 43 228 -64 -192 78 -11
5959 -11 -208 -28 163 -37 -208 193 19 -206 58 94 -145 -175 91 44 -135 12 218 -99 -92 47 16 -126
5981 -126 128 165 -159 79 96 -130 -232 276 108 -94 33 122 -88 -21 215 -50 38 132 80 -142 -26 22 -102
6004 -102 -226 58 51 -63 -8 -20 -111 -62 171 -22 -119 77 104 -9 -26 116 -99 -99 151 103 -31 -45 119 -61
6028 -61 10 191 33 -92 -28 190 -174 2 97 -43 -19 -42 14 -76 92 140 13 -44 146 205 -105 81 70 -101
6052 -101 -146 136 0 -122 36 19 44 -86 5 50 -72 26 83 -132 -126 147 -27 -10 -25 -56 -93 -6 84 -16 -43
6077 -43 31 36 -61 -71 46 17 -95 143 14 -215 40 186 -31 -143 144 36 -156 1 160 -35 -37 134 40
6100 40 -3 71 65 -15 -42 110 -78 -62 32 198 -124 51 103 -43 -40 97 -12 -141 -26 75 -163 -23 230 -6
6124 -6 -82 -37 25 -62 -48 78 -23 -146 70 60 -207 -46 203 -92 -20 77 50 -152 8 166 -88 -7 196 32
6148 32 -58 130 167 -105 -67 129 21 -114 37 69 -110 -10 220 -85 -21 191 23 -86 93 98 -127 -117 110
6171 110 -10 -114 60 147 -109 -37 174 -66 -177 234 72 -165 56 68 -82 -41 175 -56 -128 111 200 -35
6193 -35 -99 206 7 -39 48 62 -153 22 35 36 -84 195 225 -84 63 158 27 -19 127 0 -148 138 35 -158
6217 -158 72 91 -35 -97 94 153 -118 -56 148 -29 -65 14 46 -156 95 70 -129 -54 304 -64 -115 170 101 -95
6241 -95 -27 189 -106 -105 109 182 -92 54 226 -48 -99 156 -4 -145 112 181 -62 -28 131 30 -146 115 -90
6264 -90 -155 -49 138 -103 -100 122 146 -171 -69 128 -168 -52 74 1 -176 118 112 -39 32 87 -85 -34 103 152
6288 152 -76 30 140 -139 -80 137 -8 -24 161 141 -94 -82 76 -18 -21 139 43 -84 -45 70 -90 -87 140 83
6312 83 -111 -16 115 -79 -51 42 45 -92 -64 80 -119 -107 17 20 -136 -12 -9 -94 -18 78 -44 -156 25 19 -69 1
6338 1 -1 -6 -38 223 49 -184 86 218 -131 95 128 65 -72 45 120 -47 59 120 -6 17 4 121 0 -35 181
6363 181 -97 -150 29 3 -150 -20 160 -39 -28 43 -3 -154 96 110 -102 -17 -14 -44 -70 4 137 -239 -65 151
6387 151 -45 -194 144 167 -53 29 141 -53 -140 131 51 -38 109 136 -72 8 85 -13 -100 119 155 -56 -25 140
6411 140 20 -133 46 99 -154 -12 113 -136 -111 64 3 -139 56 20 -91 -144 246 -77 -208 -2 94 -169
6433 -169 -102 105 3 -120 34 -15 -73 -79 126 15 -96 156 32 -121 -1 211 -37 -109 147 17 -154 54
6455 54 130 -80 -53 184 -34 -158 250 124 -193 2 175 -59 -147 234 -42 -139 149 211 -31 -53 96 -37
6477 -37 -103 73 10 -263 26 190 -87 -156 157 65 -230 23 189 -11 7 168 -151 -110 73 51 -206 -1 196
6500 196 -39 -72 148 206 -156 -28 195 -176 -122 100 32 -173 12 77 -94 17 190 -68 -210 59 145 -99
6522 -99 -145 230 -141 -131 88 -49 -148 -1 173 -176 120 102 91 -16 5 181 -128 -76 176 -34 -170 21 190
6545 190 -158 23 111 85 -45 178 -11 -105 46 79 -139 -36 129 85 -105 -25 105 -146 -69 -3 -27 -77 77
6568 77 21 -79 7 92 -40 -55 136 14 -91 -33 -9 -181 -61 150 -113 -116 89 -58 -171 39 123 -85 -105 52
6592 52 -8 -87 144 113 28 -66 14 101 -152 71 87 36 -77 160 4 -22 134 176 -42 47 70 -29 -99 11 94 -70
6618 -70 -22 124 -63 22 10 49 -30 22 11 -45 3 85 86 -145 43 0 -78 -1 69 49 -101 14 197 -104 37 57
6644 57 -82 -128 57 101 -132 55 -23 -39 -61 77 139 -91 -3 28 1 -11 203 78 -53 73 17 -122 -108 156
6668 156 -68 8 103 46 -108 -16 28 13 -117 122 77 -174 -28 -3 -51 -98 145 80 -207 -31 169 -146 -76 9
6692 9 33 -95 113 78 -72 14 44 3 -134 66 17 -99 36 90 -59 -132 121 -34 -186 98 159 -75 -130 146
6716 146 -23 -140 15 171 -130 -3 87 -3 -96 58 102 -102 -32 106 -159 -106 30 -45 -115 124 137 -87 -58
6739 -58 144 -54 -163 12 128 -103 -104 186 -50 -61 144 116 -217 52 169 35 -7 82 19 -68 94 144 -161
6762 -161 -36 210 53 -149 27 112 -44 56 179 -105 -207 176 45 -251 73 90 -119 -31 17 18 -204 76
6784 76 -12 -175 -1 195 -55 -29 97 68 -239 -61 154 -120 -1 241 -23 -93 49 78 -189 29 82 -18
6806 -18 -89 49 79 -54 90 242 -184 -128 105 51 -171 -53 46 -134 -20 118 -23 -158 171 108 -124 5
6828 5 11 -40 -125 9 97 -146 44 177 -102 -109 3 71 -159 25 86 -92 -30 168 -8 -149 34 70 -104 -32 108
6853 108 -6 -112 123 47 -25 -58 -9 -75 -79 160 29 -59 66 99 -58 -47 121 15 -81 -24 -64 -79 6 23 -105
6878 -105 -16 99 123 -89 23 103 -159 78 30 -22 -88 -94 39 -75 -188 74 -126 -125 55 44 -150 -133 31 31 -70
6903 -70 35 156 -74 40 125 -110 -14 106 12 -28 26 192 -71 -37 140 -11 -7 56 73 28 -82 126 103 -148
6927 -148 -13 -13 -116 -46 128 -9 -100 20 21 -84 -26 -22 -83 7 125 -70 -101 3 159 61 -76 143 34 -22 30
6952 30 132 -111 55 4 -14 -123 101 -19 -51 54 125 40 -100 241 -24 -108 80 19 -33 -48 136 -7 -166
6975 -166 -72 111 -95 -81 82 -83 -145 -25 -81 -110 -8 49 -185 -149 -55 -45 -77 75 177 -97 -108 180 -2 -161
6999 -161 84 93 3 72 100 -105 -186 123 107 -52 81 135 -47 -92 84 24 -56 174 188 -170 -54 68 -34 -77
7023 -77 27 83 -251 18 173 -167 -28 91 -15 -188 -34 115 7 -106 90 40 -176 50 -40 -155 19
7044 19 144 -88 -105 76 69 -164 -30 102 -167 -45 88 13 -147 24 107 -126 61 86 52 -163 157 -14 -87
7067 -87 21 157 8 -40 57 28 -163 9 98 -58 7 113 35 -150 80 90 -96 -68 81 -158 -162 21 5 -163
7091 -163 3 91 -108 -137 163 -54 -198 60 53 -117 27 109 -9 -166 101 152 -112 -57 113 35 -24 150 45
7114 45 -80 -1 70 -58 29 156 63 -110 53 31 -65 -27 86 -67 -68 198 115 -76 21 154 -80 -67 100 -39
7138 -39 -75 41 5 -104 -109 66 -56 -83 -19 13 -73 -39 64 -62 32 60 28 -148 -32 163 -11 -42 84 43 -124
7163 -124 61 105 107 -51 110 -55 -65 76 63 -48 67 65 7 -115 50 165 -55 46 177 35 -28 33 14 40
7187 40 -85 34 -162 -120 14 54 -60 55 99 2 -50 42 -45 -65 -18 61 -39 -127 52 -83 -139 9 104 43 16
7212 16 79 -23 54 217 50 85 111 122 -56 -63 38 59 -76 -52 141 -4 -84 47 46 -71 47 54 -135 -93 -66 -72
7238 -72 -93 31 69 -78 56 44 38 6 -54 91 -83 -2 -21 -117 26 -32 -26 -86 59 126 -221 -49 91 -10 -1 85
7264 85 46 -74 8 159 88 -121 187 -28 -86 83 234 -108 77 215 21 -80 104 -33 -217 -80 132 0
7286 0 -172 74 8 -131 -7 114 -204 -71 125 156 -142 -35 61 19 -78 113 -30 -58 84 -3 -102 131 -2
7309 -2 -83 -24 59 31 -19 -7 68 -25 -74 73 95 -117 69 225 -88 73 -11 27 -1 187 136 -135 -36 126 -32 -50
7335 -50 31 -115 -83 75 148 -161 -154 154 36 -186 -41 42 -185 43 32 -24 -97 34 1 -29 26 15 -73 -127 219
7360 219 -46 -95 62 115 18 65 127 -14 -95 126 46 -107 36 52 -75 -53 139 14 -126 122 1 -217 -132
7383 -132 58 68 40 65 -39 -107 -22 25 -132 -25 -10 33 -92 23 7 -85 -64 106 -87 -18 75 43 -76 -43 192
7408 192 47 -106 29 -18 -129 59 16 12 125 168 128 -48 40 74 -21 -114 5 29 62 5 28 -53 -48 1 55 -128
7434 -128 72 -11 -21 41 39 -3 -136 40 -68 -81 -127 70 -85 -64 10 -117 -69 -34 37 4 -7 25 10 -60 -85 41
7460 41 -152 -160 26 -53 -49 61 119 13 3 145 -14 -41 58 61 -83 44 73 -71 -8 33 4 -53 54 -84 -9 52
7486 52 13 -15 8 -21 102 -40 -31 27 -46 -28 43 18 -146 -62 153 -40 -85 70 -26 -164 81 -9 -85 -2 145 -30
7512 -30 -104 -4 62 -29 -52 150 26 -166 94 70 -85 -91 28 -40 -78 139 193 9 138 165 -68 -56 99 -6
7536 -6 -136 67 -2 -133 41 94 8 -75 85 10 -137 -51 -5 -48 -134 -1 1 -180 -33 23 -23 -28 134 48 -87 -17
7562 -17 25 -69 33 11 -63 -118 39 8 -25 -4 65 -11 -64 142 60 -97 19 102 -112 -8 124 -58 75 70 8 -79
7588 -79 48 15 -84 -159 44 -31 -221 53 123 -119 -78 137 -49 -93 10 -23 -122 -55 91 -66 -187 57 2 -172
7612 -172 -48 145 -8 -56 91 -14 -151 104 178 68 -86 127 87 -110 59 89 -18 -37 123 74 -37 25
7634 25 -51 -47 66 92 -70 58 -5 -83 -161 52 -6 -81 50 113 -24 -37 79 -23 -121 -20 69 -81 -117 174 -109
7659 -109 -23 0 29 -14 -46 24 -86 -106 33 -12 -98 -66 -83 70 -9 127 31 -14 -88 87 17 -19 62 -67 -108 83
7685 83 -13 -31 -13 118 20 -27 -22 -9 -112 -88 -41 -30 -73 -21 5 -142 62 -27 -44 -91 62 -2 -188 -96 72 -53 61
7712 61 -4 -62 15 25 16 -148 104 106 -35 -65 102 65 48 -19 65 38 -23 23 -39 -26 177 160 -118 14 39 -15 -74 -2
7740 -2 101 -74 41 49 -44 -28 47 -11 -153 37 63 -134 -31 -71 16 -2 4 -106 6 -68 73 -31 46 -25 4 -86
7766 -86 -26 -1 44 38 40 69 -81 62 131 12 -34 53 -101 6 -47 10 -23 -25 6 14 -85 26 61 -118 -188 -30 6 -107
7794 -107 0 56 -93 -59 36 -33 -117 6 103 -66 -34 21 -110 -66 84 -38 -154 12 -48 -2 -161 83 50 -39
7818 -39 57 -3 -50 -53 143 -4 -85 102 31 -67 107 91 -42 12 73 31 -115 -94 202 -132 27 32 6 -17 131 22
7844 22 -111 5 16 -48 -86 99 -24 -93 -3 -50 -142 7 -13 -63 -73 18 -19 -121 19 43 -33 -22 18 -2 -85 31
7870 31 124 -71 34 98 18 47 145 129 -57 13 66 -5 -44 88 -45 -60 -34 73 -19 -64 91 7 -124 2 -45 -86
7896 -86 -59 3 -17 -97 -29 -27 -142 -145 105 -61 -146 42 5 -5 18 43 -102 -38 72 42 -164 -47 -4 28 -61 87 34
7923 34 -116 80 -2 -45 42 137 5 69 225 -103 -13 24 145 29 -51 96 -42 23 25 106 -92 25 50 -23 -61
7948 -61 -16 -104 -189 -106 -30 -18 -8 -9 -147 -156 27 -12 51 -81 5 -21 -24 12 22 -61 55 -40 6 -59 32 94 77 5 94 -18
7978 -18 13 199 138 -30 57 61 -48 -16 58 -90 -79 -22 130 19 -58 -9 -50 44 100 -1 -21 19 -94 -45 -89 -18 -90
8005 -90 -66 5 -33 -61 27 -15 -16 -46 -48 -18 -58 -41 -29 25 -34 55 -25 11 -31 -25 -55 72 37 46 -30 54 90 90 98 53 90 -19
8037 -19 70 30 -3 36 40 -15 -6 -32 41 -142 -62 -20 63 -12 142 65 -77 -73 -14 -1 -118 -157 27 -114 -48 107 50 53 117
8066 117 10 -58 35 108 84 -114 -42 73 -106 142 30 48 -45 64 54 -14 2 35 -42 -19 118 -12 -10 -24 -4 -53
8092 -53 49 18 28 -96 96 -29 -59 -20 -100 -107 45 47 117 37 20 -6 -102 -48 44 -115 -66 92 21 -6 44 68 -32
8119 -32 -58 89 5 -154 28 129 58 -76 140 -52 -111 25 67 -64 -99 177 -27 -63 -32 -12 -18 66 98 -3 1
8144 1 105 -36 -75 16 -3 -44 121 111 -83 -65 107 175 -94 36 83 -33 -18 58 -111 -90 -7 16 -40 -18 109 -22
8170 -22 -62 39 -6 -73 -66 9 -74 -33 91 56 -45 50 56 -71 -35 136 -44 8 130 10 -107
8191a07
##END NTUPLES=NMR FID
##END=
