##TITLE=1H ikalashn
Dep22
25.10.2024
##JCAMPDX= 6.0         $$ Bruker NMR JCAMP-DX V2.0
##DATA TYPE= NMR FID
##DATA CLASS= NTUPLES
##ORIGIN= UXNMR, Bruker Analytische Messtechnik GmbH
##OWNER= root
$$ TOPSPIN		Version 1.3
$$ 2024-10-25 16:20:55.640 +0400  Irina@DPX200
$$ Compression mode = diff/dup
##.OBSERVE FREQUENCY= 200.131300845
##.OBSERVE NUCLEUS= ^1H
##.DELAY= (6, 6)
##.ACQUISITION MODE= SIMULTANEOUS
##.ACQUISITION SCHEME= undefined
##.AVERAGES= 32
##.DIGITISER RES= 18
##SPECTROMETER/DATA SYSTEM= spect
##.PULSE SEQUENCE= zg
##.SOLVENT NAME= CDCl3
##.SHIFT REFERENCE= INTERNAL, CDCl3, 1, 17.49637
##AUDIT TRAIL= $$ (NUMBER, WHEN, WHO, WHERE, WHAT)
$$ ##TITLE= Audit trail, TOPSPIN		Version 1.3
$$ ##JCAMPDX= 5.01
$$ ##ORIGIN= Bruker BioSpin GmbH
$$ ##OWNER= Irina
$$ $$ F:/spectra/data/iren/nmr/1H/4/audita.txt
$$ ##AUDIT TRAIL=  $$ (NUMBER, WHEN, WHO, WHERE, VERSION, WHAT)
(   1,<2024-10-25 16:20:28.015 +0400>,<Irina>,<DPX200>,<TOPSPIN 1.3>,
      <created by zg
	started at 2024-10-25 16:18:15.546 +0400,
	POWCHK disabled, PULCHK disabled
       configuration hash MD5:
       BE 6D 3F 07 2A EA 11 49 91 17 2B D3 AF B3 58 0D
       data hash MD5: 16K
       CA D4 B3 D4 32 03 80 1D E4 4D 13 66 72 33 35 24>)
$$ ##END=
$$ 
$$ $$ hash MD5
$$ $$ F4 E1 0B 4F 52 7E 15 43 D6 5E 47 58 7D 6C B4 FD
##$RELAX= 
##$RELAX= 
##$RELAX= 
##$RELAX= 
##$RELAX= 
##$RELAX= 
##$RELAX= 
##$RELAX= 
##$RELAX= 
$$ Bruker specific parameters
$$ --------------------------
##$DU= <F:/spectra>
##$EXPNO= 4
##$NAME= <1H>
##$PROCNO= 1
##$TYPE= <nmr>
##$USER= <iren>
##$AMP= (0..31)
100 100 100 100 100 100 100 100 100 100 100 100 100 100 100 100 100 100 
100 100 100 100 100 100 100 100 100 100 100 100 100 100 
##$ANAVPT= -1
##$AQSEQ= 0
##$AQ_mod= 1
##$AUNM= <au_zg>
##$AUTOPOS= <>
##$BF1= 200.13
##$BF2= 200.13
##$BF3= 200.13
##$BF4= 200.13
##$BF5= 200.13
##$BF6= 200.13
##$BF7= 200.13
##$BF8= 200.13
##$BYTORDA= 1
##$CFDGTYP= 0
##$CFRGTYP= 5
##$CHEMSTR= <none>
##$CNST= (0..63)
1 1 145 1 1 1 1 1 1 1 1 1 1 1 1 1 1 1 1 1 1 1 1 1 1 1 1 1 1 1 1 1 1 1 
1 1 1 1 1 1 1 1 1 1 1 1 1 1 1 1 1 1 1 1 1 1 1 1 1 1 1 1 1 1 
##$CPDPRG= <>
##$CPDPRG1= <>
##$CPDPRG2= <>
##$CPDPRG3= <>
##$CPDPRG4= <mlev>
##$CPDPRG5= <mlev>
##$CPDPRG6= <mlev>
##$CPDPRG7= <mlev>
##$CPDPRG8= <mlev>
##$CPDPRGB= <>
##$CPDPRGT= <>
##$D= (0..63)
0 2 0 0 0 0 0 0 0 0.06 0 0.03 0 0 0 0 0.0002 0 0 0 0 0 0 0 0 0 0 0 0 0 
0 0 0 0 0 0 0 0 0 0 0 0 0 0 0 0 0 0 0 0 0 0 0 0 0 0 0 0 0 0 0 0 0 0 
##$DATE= 1729858822
##$DBL= (0..7)
120 120 120 120 120 120 120 120 
##$DBP= (0..7)
150 150 150 150 150 150 150 150 
##$DBP07= 0
##$DBPNAM0= <>
##$DBPNAM1= <>
##$DBPNAM2= <>
##$DBPNAM3= <>
##$DBPNAM4= <>
##$DBPNAM5= <>
##$DBPNAM6= <>
##$DBPNAM7= <>
##$DBPOAL= (0..7)
0.5 0.5 0.5 0.5 0.5 0.5 0.5 0.5 
##$DBPOFFS= (0..7)
0 0 0 0 0 0 0 0 
##$DE= 6
##$DECBNUC= <off>
##$DECIM= 32
##$DECNUC= <off>
##$DECSTAT= 4
##$DIGMOD= 1
##$DIGTYP= 9
##$DL= (0..7)
0 120 120 120 120 120 120 120 
##$DP= (0..7)
150 150 150 150 150 150 150 150 
##$DP07= 0
##$DPNAME0= <>
$$ [...]
##$SW= 21.9926040160658
##$SWIBOX= (0..15)
0 0 2 0 0 0 0 0 0 0 0 0 0 0 0 0 
##$SW_h= 4401.40845070422
##$TD= 16384
##$TD0= 1
##$TE= 300
##$TE2= 300
##$TE3= 300
##$TEG= 300
##$TL= (0..7)
0 120 120 120 120 120 120 120 
##$TP= (0..7)
150 150 150 150 150 150 150 150 
##$TP07= 0
##$TPNAME0= <>
##$TPNAME1= <>
##$TPNAME2= <>
##$TPNAME3= <>
##$TPNAME4= <>
##$TPNAME5= <>
##$TPNAME6= <>
##$TPNAME7= <>
##$TPOAL= (0..7)
0.5 0.5 0.5 0.5 0.5 0.5 0.5 0.5 
##$TPOFFS= (0..7)
0 0 0 0 0 0 0 0 
##$TUNHIN= 0
##$TUNHOUT= 0
##$TUNXOUT= 0
##$USERA1= <user>
##$USERA2= <user>
##$USERA3= <user>
##$USERA4= <user>
##$USERA5= <user>
##$V9= 5
##$VALIST= <valist>
##$VCLIST= <CCCCCCCCCCCCCCC>
##$VD= 0
##$VDLIST= <DDDDDDDDDDDDDDD>
##$VPLIST= <PPPPPPPPPPPPPPP>
##$VTLIST= <TTTTTTTTTTTTTTT>
##$WBST= 1024
##$WBSW= 25
##$XGAIN= (0..3)
0 0 0 0 
##$XL= 0
##$YL= 0
##$YMAX_a= 1325491
##$YMIN_a= -1045067
##$ZGOPTNS= <>
##$ZL1= 120
##$ZL2= 120
##$ZL3= 120
##$ZL4= 120
##$ABSF1= 10
##$ABSF2= 0
##$ABSG= 5
##$ABSL= 3
##$ALPHA= 0
##$AQORDER= 0
##$ASSFAC= 0
##$ASSFACI= 0
##$ASSFACX= 0
##$ASSWID= 0
##$AUNMP= <proc_1d>
##$AXLEFT= 0
##$AXRIGHT= 0
##$AXTYPE= 0
##$AXUNIT= <>
##$AZFE= 0.1
##$AZFW= 0.1
##$BCFW= 1
##$BC_mod= 2
##$BYTORDP= 1
##$COROFFS= 0
##$CY= 7568.61572265625
##$DATMOD= 1
##$DC= 2
##$DFILT= <>
##$DTYPP= 0
##$F1P= 17.9538593292236
##$F2P= -4.03888763876832
##$FCOR= 0.5
##$FTSIZE= 32768
##$FT_mod= 4
##$GAMMA= 1
##$GB= 1
##$INTBC= 1
##$INTSCL= 1
##$ISEN= 128
##$LB= 0.02
##$LEV0= 0
##$LPBIN= 0
##$MAXI= 945.577
##$MC2= 0
##$MEAN= 0
##$ME_mod= 0
##$MI= -402.1523
##$NCOEF= 0
##$NC_proc= 0
##$NLEV= 6
##$NOISF1= 8.587773
##$NOISF2= 6.764455
##$NSP= 1
##$NTH_PI= 0
##$NZP= 0
##$OFFSET= 17.49637
##$PC= 1
##$PHC0= 128.9279
##$PHC1= -7.22868
##$PH_mod= 0
##$PKNL= yes
##$PPARMOD= 0
##$PPDIAG= 0
##$PPIPTYP= 0
##$PPMPNUM= 100
##$PPRESOL= 1
##$PSCAL= 0
##$PSIGN= 0
##$REVERSE= no
##$SF= 200.13
##$SI= 32768
##$SIGF1= 18.5376
##$SIGF2= -6.396296
##$SINO= 400
##$SIOLD= 32768
##$SREGLST= <1H.CDCl3>
##$SSB= 3
##$STSI= 0
##$STSR= 0
##$SW_p= 4401.40845070422
##$SYMM= 0
##$S_DEV= 0
##$TDeff= 0
##$TDoff= 0
##$TI= <>
##$TILT= no
##$TM1= 0
##$TM2= 0
##$TOPLEV= 0
##$USERP1= <user>
##$USERP2= <user>
##$USERP3= <user>
##$USERP4= <user>
##$USERP5= <user>
##$WDW= 1
##$XDIM= 8192
##$YMAX_p= 0
##$YMIN_p= 0
$$ End of Bruker specific parameters
$$ ---------------------------------
##NTUPLES= NMR FID
##VAR_NAME=  TIME,          FID/REAL,        FID/IMAG
##SYMBOL=    X,             R,               I
##VAR_TYPE=  INDEPENDENT,   DEPENDENT,       DEPENDENT
##VAR_FORM=  AFFN,          ASDF,            ASDF
##VAR_DIM=   8192,          8192,            8192
##UNITS=     SECONDS,       ARBITRARY UNITS, ARBITRARY UNITS
##FACTOR=    0.0002272,     1,               1
##FIRST=     0,             0,               0
##LAST=      1.8609952,     10,              217
##MIN=       0,             -1045067,        -1045067
##MAX=       1.8609952,     1325491,         1325491
$$ Real data points
##PAGE= N=1
##DATA TABLE= (X++(R..R)), XYDATA
$$ [...]
2080c67J347m79j078O10M09l28p84Q68J027k41j219K63N56k71p52N06J043o3j798
2099g51l24J279R7o34n96J074M57q68q29P06J052K40j292J50J004k56q24l70J499
2118H14L26o73p06L99L1o02N6O06o1o72m21J94M23j74n92J183L46n29p35M50R21
2139E84J01o99r7J049k38j031J90M40L57k96o12L15O28m22j055N38N69p64k36
2158f79J95L68p6r0J56J92qm99M80K77k66J35l77P59J87m33l93N07L18o35l32
2179b14P1mJ02l89J17O3l2L67p62%Q43L5o54O60k8j05K64Q1K39m30j29P7K5j08
2203H9j22J31K18k54l18K25j1j2n84M10k2L44p89K36P19j93jj30O6L69K78n07
2225A42j33J92L97l96R0J28j74m7j73k57o09O32K96m19n31K20J99O48m43j96K14
$$ plain form
2080 -367 980 501 -577 33 442 114 -670 198 1225 984 -235 28 584 313 -439 67 1110 1047 -751
2099 -751 -1075 204 301 -333 -929 145 602 -266 -1095 -389 663 903 -389 -239 765 509 -315 -685 814
2118 814 1140 467 -239 160 191 -411 -355 251 190 -482 -903 -709 -286 -460 -1052 131 477 -52 -787 -337 584
2139 584 685 -14 -111 938 700 -331 -141 299 656 360 -252 63 691 269 -786 -248 321 -443 -679
2158 -679 -484 -116 -192 -282 -126 66 58 -441 39 316 50 185 -192 567 754 321 -72 435 753 118 -214
2179 -214 -143 -147 -45 -434 -317 -254 -286 81 -681 -681 162 197 -457 203 175 70 334 415 654 224 95 172 197 89
2203 89 -33 98 316 62 -256 -31 -42 -54 -638 -228 -250 94 -695 -459 260 67 66 -64 2 371 649 142
2225 142 9 201 598 202 292 420 246 199 26 -231 -840 -208 88 -331 -862 -642 -443 205 -238 -434 -220
2246b20OO82n3n22L54K22j15o2j54k7J07L70m88k40J68M36n78L5K85l81j81J58
2268a98n93L83L05k31K38k50N19k02j24M71l89O04J10k4l70k86K94J38m45l27
2288c77N61j42j50J04l94K97j96O5j76J86J10n1J55m02K44K90J86l1j52J09q2
2309A54J82J17l23J40k15l27J98l11%L05J78n31j30L95N6m34l11P94r0L3r6N90
2331C74p9pk22j33O40k2m92J40J11k32o3l1l8O4k48j70K98L01m07N6L76n01n06
2354g91L62N51L78p36l7M43L37m06QJ94J43K38q82P79j77m03o4k19M8J16K6l49
2376d41Q58n02o99M09L82J20n44r5M77M46k0o3l9N53n87l13L08L9j35j79R6J96
2398B67l49k46J17N86N9p60o63O57O19k30l19L22M60m86n02K82N64J59p23K37
$$ plain form
2246 -220 -214 468 415 -107 247 469 354 292 138 111 218 588 100 -140 28 464 -114 -79 206 -175 -356 -198
2268 -198 -791 -408 -103 -334 -96 -346 173 -29 -153 318 -71 533 643 619 249 -37 257 395 -50 -377
2288 -377 184 42 -108 -4 -398 -101 -297 -232 -408 -222 -112 -163 -8 -410 -166 124 310 279 127 236 154
2309 154 336 453 130 270 55 -272 -74 -385 -385 -80 98 -433 -563 -168 -112 -546 -857 -63 -153 -120 -216 374
2331 374 295 288 66 -67 573 551 59 199 310 78 15 -16 -54 10 -238 -408 -110 191 -216 -160 216 -285 -791
2354 -791 -429 122 500 -236 -273 170 507 101 109 303 446 684 -198 581 404 1 -63 -282 -234 -118 -92 -441
2376 -441 417 -85 -784 -375 7 127 -417 -512 -35 411 391 328 289 842 255 -58 250 289 154 -25 71 267
2398 267 -82 -328 -211 375 434 -326 -989 -332 287 57 -262 60 520 34 -468 -186 378 537 -186 51
2418E1N40n31k47J08N18K27o34n14L27K89j058L1J207M57r12n16J62M22k07J55
2438a25j4Q16o16r25P22Q68j49j052M67N61j90q50J56J207n4j021k71N18k1n06
2458d79k60M02P03j68j146M68P40l03l31Q40M99o22j379L11J228K19m64l96Q27
2477F89j4j057j007J591R42p42o22l63J079j111p72J196R76l7j325P3M34M44q28
2496d54M37J178J50j477q40J191P48r71k71Q28L78j384j118J222J069j02j135
2513e51p2Q05k05j255L69J454K06j174n01R15O66p92J19J014L57j237j018N62
2531c38Q09j20m17K46N86p07j339M27J412O8q34l75Q45l49q13Q4J314J189j611
2550G7q26P60P58n20o22Q52Q81n17j423K75L16N00p53K90N90l53j216p7J144M85
$$ plain form
2418 51 591 60 -187 -79 439 666 32 -482 -155 134 -924 -893 314 771 -141 -657 -495 -73 -280 -125
2438 -125 -139 677 61 -864 -142 726 577 -475 -8 553 363 -487 -331 876 822 -199 -470 48 27 -479
2458 -479 -739 -337 366 198 -948 -480 260 -43 -374 466 965 343 -1036 -725 503 722 258 -138 689
2477 689 675 -382 -1389 202 1144 402 -220 -583 496 -615 -1387 -191 785 748 -577 -504 -70 374 -454
2496 -454 -17 1161 1311 -166 -1006 185 933 -38 -309 519 897 -487 -1605 -383 686 584 -551
2513 -551 -623 182 -23 -1278 -909 545 751 -423 -924 -9 657 -135 -16 998 1355 118 -900 -338
2531 -338 471 351 -66 180 766 59 -1280 -853 559 627 -207 -582 263 -86 -899 -815 499 1688 77
2550 77 -749 11 769 249 -373 479 1360 843 -580 -305 11 511 -242 48 638 285 -931 -1008 136 621
2570F21o86m64O36p9q02m68J618Q82o27r90P3P55j51n91O39R19k82j736l33J013
2590e3O80m86n70Q42L42j659l52Q43P86k31m22R9L40m04k24J59J507n70p85L22
2610A64J18o3q05M75J217r7j452n61N39P91q97L29N53N56j067j307N32J432l11
2629A46n98L79N52m68p03K98R69L77j102J10M06J31r31J15O92L01n59j075Q62
2648i8M51l93p77R93O77j161j042R67O77K01o08l25J099j59j205J75J015O78q22
2667C43m73j06L38k63r3O05L49p47p83N10L44j53k98mR23k78p80j52J239k3r24
2688d26K2R37j66l35m86L42R21j9j272K5O94k31o30L47M30K10n03p57R47K04o18
2709c64N47K45l21k55k36N00K44q1k63N56O4q43k89Q02L8j40j99j69M28j69n53
$$ plain form
2570 621 -65 -529 107 28 -774 -1242 376 1258 631 -359 -286 469 318 -273 366 1285 1003 -733 -1066 -53
2590 -53 627 141 -429 413 755 -904 -1256 -413 373 142 -280 -181 159 -245 -469 -310 1197 627 -158 164
2610 164 282 219 -586 -111 1106 1009 -443 -1004 -465 326 -571 -242 311 867 -200 -1507 -975 457 146
2629 146 -452 -73 479 11 -692 -394 575 952 -150 -40 366 497 -434 -319 373 674 115 -960 -98
2648 -98 353 -40 -817 176 853 -308 -1350 -383 294 495 -113 -438 661 502 -703 -528 487 1165 343
2667 343 -130 -236 102 -161 -254 351 700 -47 -830 -320 24 -129 -427 -431 492 214 -566 -718 521 498 -426
2688 -426 -404 533 367 32 -454 -112 809 790 -482 -457 237 6 -624 -277 153 363 -140 -897 50 254 -364
2709 -364 183 428 107 -148 -384 116 360 279 16 572 636 -207 -496 306 344 204 5 -164 264 95 -458
2730d58O2M87K49m04m35N35K72m99k22L90M69k71k53k6K95k17m7M75l15M0j77
2751e0j85O78K97q60k27L91K98o84m04O95M32m13n38M70J91k98R6N8J69L43m83
2772b4O7K70K16l40J72j60r8j59K6J27K8k69J03K11j96j8m38M43K41n67J82j62
2794c45R83q76K40K58J47j23m34P4K07N44j11m99j67K1P2m30K94M02l17j25J56
2815b9k76J17L4K18r8k55K43R7J48j80M3J69p8j52M51k59J13J8L5l27K03j45l66
2838b76J39%J62k7p4l42K6R0K42oj91L60l33L08j68J74k19K97R1N5K4l44Q8K22
2862B98j10j87R1j8l81j27J60q8L06k59K36J01q4PJ74j84L04J44l54j94p8N66
2884C23k66L37j99k96L37k00L43k22k95lO3j81n2rN16n57J37J29j73J77o3J53
$$ plain form
2730 -458 -396 91 340 -64 -499 36 308 -191 -413 -23 446 175 -78 -104 191 -26 -73 402 87 127 -50
2751 -50 -235 443 740 -120 -347 44 342 -342 -746 -51 381 -32 -570 -100 91 -207 -111 -53 116 459 -24
2772 -24 43 313 529 189 361 201 103 -56 -30 97 125 -144 -41 170 -26 -44 -482 -39 202 -365 -183 -345
2794 -345 638 -238 2 260 407 284 -150 -76 131 675 564 65 -102 -81 -9 -439 -145 257 -60 -185 -29
2815 -29 -305 -188 -154 64 -34 -289 -46 51 199 19 62 231 153 1 452 193 306 324 359 32 235 90 -276
2838 -276 -137 -137 25 -2 -76 -418 -392 -302 -60 -66 -257 103 -230 78 -90 84 -135 162 253 308 332 -12 76 298
2862 298 188 1 92 74 -307 -434 -274 -362 -56 -315 -79 22 -62 -55 119 -65 239 383 29 -165 -243 323
2884 323 57 394 195 -101 236 36 379 157 -138 -141 -78 -259 -311 -320 196 -361 -224 -95 -268 -91 -154 -1
2906aJ53j24J05n3L0n1Q2L45l97L3K16k57k49q0K12q1J07j0Mj15p1nj54L1K93
2931c7l97K34L04n0r7q0L23j45j34K89k46O2p5L9j34L06J3j99J69l15j6L6J83
2954C3K29l73O1K06k02J19O9k60K92lL58m64k1k93O66k55j8p8K54l79K31l30j72
2977c30M26j90M3J7l40M13m1j38J69k14K85J59m95M26J68k36J08K44j52m72J22
2998b8K06Q1j09m43N04j78j26k60K64K43k30j15M3K34k54J29k95M83N7m74O10
3019C42qj07K4k9j7O47q07p5L9K99K27l61k92K84l36m11L13M53o1m22J43k05M94
3042A34j98m5J21M60n26K6N4L04l49K05J3L72m44l64L58J52J00m09j19J49K53
3063B47p24j06N50L65l27r9P5J83n7l08M18M85n63l92oK93L64o29J25M43j63m63
$$ plain form
2906 -1 152 28 133 80 110 59 141 486 89 122 338 81 -168 -248 -36 -117 -10 -20 -16 -131 -202 -207 -361 -330 -37
2931 -37 -434 -200 104 54 -43 -123 200 55 -79 210 -36 26 -49 -10 -144 162 175 -24 145 -170 -186 -150 33
2954 33 262 -111 -50 156 -46 73 142 -118 174 171 529 65 44 -249 417 162 144 66 320 -59 172 -158 -330
2977 -330 96 -94 -51 -34 -374 39 -2 -140 29 -185 100 259 -236 190 358 122 230 474 322 -150 -28
2998 -28 178 259 150 -293 211 33 -93 -353 -89 154 -76 -191 -148 86 -168 -39 -334 149 206 -268 342
3019 342 334 227 251 222 205 852 45 -30 9 308 535 174 -118 166 -170 -581 -268 185 124 -298 -155 -360 134
3042 134 -64 -109 12 472 -54 -28 26 330 -19 186 199 571 127 -237 121 273 373 -36 -155 -6 247
3063 247 -477 -583 -33 332 5 -94 -19 164 107 -201 217 702 139 -253 -259 34 398 -231 -106 337 174 -289
3085b89k70M78J81k00p6R0K48n54k29N77j0L82n40M4J90j23J46R2M26J89r04n9
3107b11O88l30m16L20K17p6k87o44N92M84j22m22K40K63m37n68M94P30p2l01k64
3128a22M45l11k74J00N63M66n07o63M77o3R5n77N93K43m89o26L53L01K79j66k90
3149a73L12k66m3l70J066k07l11p12P05L35n85r0N13N75n04o14J14M63j7m03J9
3170a93O18k63p13N0Q38n2k04kK37J66r94J08M82M60o0o50M19r4k30k33P48O5
3192E03l39n74M2P75l13o21K03P85l96m70q3O63L19o04j61N44M37m65q86M03Q59
3213F21n75K98m74J75r0Q9K23M2L3k19n92L97Q7k03k3O48k54m93m35O76J02J63
3235A96j83J79K50l39k53Q6N75m4l26n18N41k26l55K12N02R3k94j43j13K05n57
$$ plain form
3085 -289 -559 -81 100 -100 -176 -86 162 -392 -621 -44 -54 328 -212 -168 22 -101 45 137 563 752 -152 -211
3107 -211 477 147 -269 51 268 192 -95 -739 -147 337 215 -207 33 296 -141 -709 -215 515 443 142 -122
3128 -122 323 12 -262 -162 401 867 360 -303 174 111 206 -371 222 465 -24 -650 -297 4 283 117 -173
3149 -173 139 -127 -170 -540 526 319 8 -704 1 336 -249 -339 174 749 245 -369 -255 208 191 -212 -193
3170 -193 425 162 -551 -501 337 285 81 79 316 482 -512 -404 78 538 478 -172 247 153 -77 -310 438 503
3192 503 164 -410 -368 407 94 -527 -324 461 65 -405 -488 175 494 -110 -271 273 710 245 -641 -238 621
3213 621 46 344 -130 45 -45 44 267 309 342 123 -469 -72 15 -188 -211 437 183 -310 -745 -69 33 196
3235 196 13 192 442 103 -150 -64 511 467 141 -377 164 -62 -417 -205 297 390 96 -47 -160 45 -512
3256e12K20L51L17l08m09L00L19Rm67K45K19k6m62N1N71k82l5m00M46J61l08m95
3278d95M60J68j18M8m84L55PO0j04J59O7k78J05r7L11k6l41K75K25l90j75L89
3300A21M06p11j41K42L04m77n6K76ON6l20L9O04o1m98N42M4J51j91p18L90K15
3322B23l64L11K1K76l25j73r5J24N63n37K11k99j39M4p8O5L62o57J55P1J07l6
3344a70K14K60J27m87j44n8K39J61Pk50M0Q2ll35O26l61l2k72N07k98k00j48R33
3367D38l56n1Q5j37j03j23L8Q03j13n40n6j18O08p01L91K65l18N8l7l47K7K27
3389f0J14k34o1L16j33j66J21M29M3p30K57M50k67j02nP6K33J83n95K40p9l49
3411c19L80n8r6K88m74L82l75K01J27j40r8J80r4j49J78R6o5j58L94P8m2J4o8
$$ plain form
3256 -512 -292 59 376 68 -341 -41 278 287 -180 65 284 258 -204 -153 418 136 101 -299 147 308 0 -495
3278 -495 -35 133 15 63 -421 -66 -59 1 -103 56 123 -155 -50 -147 164 138 -203 72 297 -93 -268 121
3300 121 527 -184 -325 -83 221 -256 -312 -36 -30 26 -294 -255 349 288 -210 332 376 527 336 -382 8 223
3322 223 -141 170 191 467 142 -31 -126 -2 561 24 235 -64 -203 -159 -237 -172 190 -467 -312 -241 -134 -170
3344 -170 44 304 431 -56 -200 -258 -19 142 149 -101 -61 21 18 -317 309 -52 -84 -356 151 -147 -347 -495 438
3367 438 82 31 116 -21 -124 -247 -209 594 481 -59 -115 -233 375 -326 65 330 12 70 33 -314 -287 -60
3389 -60 54 -180 -241 75 -58 -224 -103 326 369 -361 -104 346 79 -23 -28 48 281 464 -131 109 30 -319
3411 -319 61 3 -93 195 -279 103 -272 -71 56 -84 -182 -2 -96 -245 -67 29 -36 -194 200 278 236 250 182
3434A82L2j24m55M85L6O4m52K75n7PR7N7k7m70L73J09j18j42k5K10J25j59j48
3457a25K33q8J49k80j19J71n8K75k10j41R4K04l30K92m16L72K27l51r1j6n6K53
3479a1jj04J12j40L59k85K37j80J74j46P3M6j67j43n5J88l00K84j65M41j94l65
3501c42L88k80L53k9l33N99o19L32N2J58j33j38r8K87j2m81L20J9J62k31k5k46
3523b97J62J63k25J84k58K68k86L42l22M46k60k05O01l38K04j62L7J42R9l44J71
3544A22n34N44j33n7n2p1J79J5K45j98j19O3J14q6k27J8M40l95L16l83L22p4j78
3567a29J17j06L94m64L33o6n44J12J50J26j3j18J27M8j79p3M10k99K36j97P7L21
3589B63n35K22J24k79L31j56L1J30k26K0l42L8M86K62n48K03k7Rk8Q0j27l4p5
$$ plain form
3434 182 214 90 -365 120 156 220 -232 43 -14 -7 90 147 120 -350 23 132 14 -128 -153 57 182 23 -125
3457 -125 108 20 169 -111 -230 -59 -117 158 -52 -193 -99 105 -225 67 -349 23 250 -101 -192 -208 -264 -11
3479 -11 -12 -116 -4 -144 215 -70 167 -13 161 15 88 134 -33 -176 -231 -43 -343 -59 -224 217 23 -342
3501 -342 46 -234 119 90 -243 356 -263 69 121 279 146 8 -90 197 185 -296 24 43 205 -26 -51 -297
3523 -297 -135 28 -197 -13 -271 -3 -289 53 -269 177 -83 -288 313 -25 179 17 54 196 295 -49 122
3544 122 -412 132 -1 -58 -110 -181 -2 13 258 60 -59 4 118 32 -195 -177 263 -132 184 -199 123 49 -129
3567 -129 -12 -118 276 -188 145 79 -465 -353 -203 -77 -90 -208 -81 -33 -212 -285 125 -174 62 -135 -58 263
3589 263 -272 -50 74 -205 126 -30 1 131 -95 -75 -417 -379 107 369 -179 24 -3 6 -22 58 -69 -103 -178
3612a78J90k2p4Q4J15j9O7r6k53M67k59J10J23P2m60K31l24L37M02m58j45L03
3634B13l55o8n1K67k0j94L04O6m91L64n04L77K92m17M5n4P60m21K3l5m50M17o5
3657Cj90J3N51l66l08J79J17r2n5J72r2M6l22N17l89L24Np0k0L57n3m35K97P7
3681B66n40J36K50jN9k55J33m0J75l15j01Q2J72K15l26l8K96l04m6L3m2L42l60
3704b09J68J33ql61L18M41l17m77K15J98J44k89k97L77P0k76J24J84l83K84r0
3725e1K60K20j79m49KL42M18m85j15K23k68R5J70J84r8l11o2m6J37L61l00j01
3747e3M71m20j55q2K12R7O9L76k07n58J10J52J37J83j21k09N0J37j44l33J38K93
3769A43m1k10j45O10k12l20L44pJ0m68N45j82J41m17K25L76k64j13q5K67k71N75
$$ plain form
3612 -178 12 -10 -84 0 115 96 163 67 -186 281 22 132 255 327 -133 98 -226 111 513 55 -90 213
3634 213 -142 -210 -261 6 -14 -208 96 162 -329 35 -469 -92 200 -217 -172 -226 534 113 136 101 -349 68 3
3657 3 -187 -174 377 11 -297 -118 -1 -93 -148 24 -68 -22 -344 173 -216 108 113 43 23 380 327 -108 189 266
3681 266 -274 -138 112 111 170 -85 48 8 183 -132 -233 -151 21 236 -90 -128 168 -136 -182 -149 -191 151 -209
3704 -209 -41 92 84 -277 41 482 165 -312 -97 101 245 -44 -341 36 106 -170 -46 138 -245 39 -51
3725 -51 209 429 250 -199 -197 145 563 78 -37 186 -82 13 183 367 269 -42 -104 -150 -13 348 48 -53
3747 -53 418 -2 -157 -239 -27 70 139 515 308 -250 -140 12 149 332 211 2 52 189 45 -288 -150 143
3769 143 102 -108 -253 357 145 -175 169 162 172 -296 249 67 208 -209 16 392 128 15 -70 197 -74 501
3791E01n39J63J72p1k72L90k68K95k69k95L15k26m43O54j66K99m08k3K39J50J34
3812C32n92Q15l25J24n83p3O50l06n7%K03n23O8OK66N4k27k01L40Q8q1o1o3O58
3836E12l39k02o8K33J07r7L2K07m38J2l14Q20l51k80P2J09j7l8k15O5K83j07k30
3859b44K49J63n66M28O0J92j16l44K70K35p8l40M58o6k76j92j69K33j96M52l04
3880a51K74Q8l82O5N45j50j28n76M60j94K25m12J67N12k6n07L81o7L41l80P7L7
3902A99K49m81l1K99l82L7N3J79j3m48K80K50j72j37J98j12K72m38O5J34K26R6
3924C23m80L20j11k23J8j6L10K54l1m88r8M78l51k03M48j07r1j0J05J42l10o5
3946a86J15K8r9J05J30M25l35l20L96j36O5k89k60K68l8K91k05O2Q6m24K70K64
$$ plain form
3791 501 -38 125 297 226 -46 344 76 371 102 -193 122 -104 -547 107 -59 240 -168 -191 48 198 332
3812 332 -260 555 230 354 -229 -302 348 42 -15 -15 188 -335 -267 -261 5 59 -168 -369 -29 59 -22 -83 -146 512
3836 512 173 -29 -97 136 243 146 178 385 -53 -41 -355 465 114 -166 -94 15 -2 -40 -255 -190 93 -14 -244
3859 -244 5 168 -398 30 90 282 166 -178 92 327 249 -91 367 301 25 -167 -336 -103 -299 153 -151
3880 -151 123 211 -171 -106 439 289 161 -415 45 -149 76 -336 -169 343 317 -190 191 124 465 85 162 199
3902 199 448 -33 -64 235 -147 -110 -57 122 109 -339 -59 191 19 -118 80 -32 240 -198 -133 1 227 323
3924 323 -157 163 52 -171 -153 -169 141 395 364 -124 -222 256 -95 -298 150 43 -48 -58 47 189 -121 -186
3946 -186 -71 -43 -142 -37 93 518 183 -137 259 123 188 -101 -361 -93 -131 160 -45 17 103 -321 -51 213
3968B13n7m52N70j29m14J08K99o22N65l34K66j02K45R9l47m64N19R1K89m28J96
3989A11K22k45l2L1j24J10J99k88J74k45K29m38P7L06l18p4O62j67k95j94K82
4010a7j17k8K21J41k04k83L20J44m66K54l2j68j7k1N0L84J59k49l45J20o3J55
4032f2K31l12K44j52K07J5k53n2L4K16k78J83k4L96k64k49q4k1J82K5j86J84j16
4055a36M20l1l98J74k43L95k26QJ51j02j75J27k69Q8K60l03N39k6l99J26j2J53
4077A21j69L07j04k30K00j43M4J77o8j0j69K67k7K91l74K70o18J05L09M6j72J62
4099B15k13L3j48J84K3j89O9J76n58K21M13k53RR2j97r8j19L40l9L78q6l22J95
4122A26l13j37K64k04L50m53J42N0P0Q3j54K04o0j1J89k48O1M91j87J2q35M43
$$ plain form
3968 213 156 -296 274 145 -269 -161 138 -484 81 -253 13 -89 156 255 -92 -556 -37 54 343 -85 111
3989 111 333 88 56 87 -37 73 272 -16 158 -87 142 -296 -219 87 -231 -305 357 190 -105 -299 -17
4010 -17 -134 -162 59 200 -4 -287 33 177 -289 -35 -67 -235 -252 -273 -223 161 320 71 -274 -154 -217 -62
4032 -62 169 -143 101 -51 156 171 -82 -134 -100 116 -162 21 -3 393 129 -120 -204 -225 -43 -18 -204 -20 -136
4055 -136 284 253 -145 29 -214 181 -45 -37 114 12 -163 -36 -305 -217 43 -260 279 253 -146 -20 -32 121
4077 121 -48 259 155 -75 125 -18 26 203 135 125 -44 223 196 487 113 383 -235 -130 179 225 53 215
4099 215 2 35 -113 71 94 -95 -26 150 -408 -187 226 -27 -18 74 -123 -221 -340 0 -39 339 253 -69 126
4122 126 -187 -324 -60 -264 86 -367 -225 -175 -105 -22 -176 28 -32 -43 146 -102 -41 450 263 275 -560 -117
4144a17p1N14j81M3k65J34k73L19k08Q9P9j91M1O0K47n79M32j55m7L42L0k55N8
4167D6K07q4k22P4j90K89k13J89P5k05K83j73J2J69L3p60K72J75j73K13k44J07
4189a20J78m4k58M08p5L93m92j84K7K27Q8MM34o76M8L41j76l10K94l54k32M94
4211A5j58K31j58l0j31M72m21L06j31K88k27j63J63J78l85j09M41j78M2J32m46
4232b69k8O3J14N1rP4o8K85nOm63K25J09L49m75o1J62j94L41k29l70M97k30M1
4256h4J97n5j47K78J00m5k37j67j07K2K85j90j16M70k81k25L05j20J29l09p9O98
4278C22k55o2n6Q6N07m26l08N49p3j34j01j36Lq0J64j91J01KJ21k17P2J14p7K56
4302A81j38o2K17o3J94k59l06L24j80J64m2nj19J92J35m11J00oO8L89p44L55N1
$$ plain form
4144 -117 -188 326 145 188 -77 57 -216 103 -105 -16 63 -128 -87 -27 220 -359 73 -82 -129 213 243 -12 46
4167 46 253 169 -53 21 -169 120 -93 96 171 -34 249 76 88 257 290 -470 -198 -23 -196 17 -227 -120
4189 -120 58 14 -244 164 89 482 -10 -194 -167 60 148 152 586 -90 -42 299 123 -187 107 -247 -479 15
4211 15 -143 88 -70 -100 -231 241 -180 126 -5 283 56 -107 56 234 -151 -260 181 3 45 177 -269
4232 -269 -297 -234 -120 -69 -78 -4 -72 213 208 214 -249 -24 85 434 -41 -102 60 -134 207 -22 -392 105 -125 -84
4256 -84 113 58 -89 189 289 244 7 -160 -267 -245 40 -150 -266 204 -77 -302 3 -117 12 -297 -376 322
4278 322 67 5 -51 35 542 116 -192 357 284 150 49 -87 -84 -164 0 -191 -90 -88 33 -184 -112 2 -75 181
4302 181 43 -19 198 135 329 70 -236 88 -92 72 30 25 -94 98 233 -178 -78 -84 -16 373 -371 -16 35
4325C5n2K96l18J75K22m39Q1K48l07R5J03j70L38l95L92n46Q1K08l34K75j92J65
4347c9j36L92n10M02m8K21j42k71M4J35Q9L47j03j80j27j5k15J62qj85J57K3L05
4370B98m78K54l34J73pP3q0J71j52O6n7j41O07j61m71N6K38q7N2l8J05Q8n29j27
4394d81M40K78l40nJ2L63o15J27L23K01l10k74M26j65L67n46O1J84K36k11k4J0
4416E7K38l61j63N07k75j21k2K62K76l45k12K10J07k12j19L59r8j53j54p0J72
4437a17J01J69j56J25K05j40j68J46o8J45j24L50l72k66L51m09L87L2m04M60l12
4458f5K43L9o10N00K02k6p4l16K64j27qj07J52k79k22N61n04M33q8l31O29l99
4480a33L13l10K26m4J9l72M73N7n58L24k07N71q4k43J24N8k39k82M31k89j9K15
$$ plain form
4325 35 -17 279 -39 136 358 -81 0 248 -59 36 139 -31 307 -88 304 -242 -161 47 -287 -12 -204 -39
4347 -39 -175 217 -293 109 61 282 140 -131 -87 48 137 484 381 201 74 59 -156 6 -2 -187 -30 -7 298
4370 298 -180 74 -260 -87 -94 -21 -101 70 -82 -16 -73 -214 393 232 -239 -183 55 -32 20 -18 87 175 -354 -481
4394 -481 -41 237 -103 -108 -96 267 -348 -221 102 303 -7 -281 145 -20 347 -199 -138 46 282 71 47 57
4416 57 295 -66 -229 278 3 -118 -140 122 398 53 -159 51 158 -54 -173 186 88 -65 -219 -289 -117
4437 -117 -16 153 -3 122 327 187 19 165 97 242 118 468 96 -170 181 -228 159 191 -213 247 -65
4458 -65 178 217 -393 107 309 283 209 -107 157 30 22 -85 67 -212 -434 127 -377 56 -32 -363 266 -133
4480 -133 180 -130 96 52 71 -301 172 229 -329 -5 -212 359 275 32 156 214 -25 -307 124 -165 -184 31
4502C1O9j90L10j92j25L14K23l28j60J00onJ65o7J59m68K23j06J28L6k6J0J50
4525B45l13OR2L26k74L34o27K53J19n34M59l27M49l10N4j08K41j34m07N04j92
4546a44J28p5j36O75p33J39K17l0k52k89P85j51J52k59P1L47l41K74n26J70Ml23
4568b97K98qL10o08J53M41m15L81o26M63Oj34N2M5n9j38N4J62k68L15o2k8l81
4591c44L78q0j74L3p1l3L73o8n9K7o2Q0n3J14K03m13L05M1l12J25j03l11N15L0
4615A41j79R8P1l77L15k61Q8l9K58Q8m56M20n19M51j9j90Q5K27l18R6k11K01J39
4638A09q6J52qJ57j85l54K25l50J66PJ05J16k55M39k33j75J49J03j04K28l43L12
4660A75k4l97L03j65K0N1K57k04L24k97k2J78j12o4q7j04J30L8O7k6r0j02L2K34
$$ plain form
4502 31 100 -90 220 28 -97 217 440 112 -48 52 46 41 206 139 298 -170 53 -53 75 111 85 95 245
4525 245 -68 -62 30 356 82 416 -211 42 161 -373 86 -241 208 -102 -48 -156 85 -49 -456 48 -144
4546 -144 -16 -91 -227 448 -285 -146 71 41 -211 -500 285 134 286 27 98 445 104 378 -148 22 26 -297
4568 -297 1 -7 303 -305 -152 289 -126 255 -371 92 98 -36 16 61 2 -136 -82 80 -188 127 65 37 -344
4591 -344 34 -46 -220 -187 -258 -291 82 14 -45 -18 -80 0 -53 61 264 -149 156 197 -115 10 -93 -404 111 141
4615 141 -38 60 131 -246 69 -192 -104 -143 115 203 -253 167 -352 99 80 -110 -25 202 -116 -20 -231 -30 109
4638 109 23 175 167 324 139 -215 10 -340 -174 -167 -62 54 -201 238 5 -170 -21 82 -22 206 -137 175
4660 175 151 -246 57 -108 -88 -37 220 16 340 43 21 199 87 23 -64 -168 -38 0 67 41 -49 -151 -119 115
4684A15j39O5k46J36K63l25Mp5J77K26j12J07k86P3K47l56P8L19k67K70j87l3
4706E4K00m65J09K88n90M45l5k85N03k13lL94l19l65K42N1j06l6J49j11l56L95
4728e4K82J49k79j89L02o75M43k49M11j01o6Q7R2p5n2lJ62l03k5J79j73N9M6m1
4752g3m1J40k29L13o16M17j5J47j5NK88k65J39j23J30M0j10nl59K04J42j75M2
4775a9K98l54O5k52K18P1k06N44k77m0L4j28j67K46qK70l36l34K88M8K90m37N1
4798a35R5j6K25m6k6k43L44l2k06K33k56j15J43J61k18m2P5j06pK17L6q1q6K17
4822A31j59L04j66P7n1j07m1L63m69q8L77j86M2L70k79r7p7K6k92M83o4N3k29
4845g9j61M11K70m40l0K83r5L29n20m9n3L86k78l7L06k54m8j81M21j22k11Q3J39
$$ plain form
4684 115 -24 41 -205 -69 194 -131 -127 -202 -25 201 89 196 -90 -17 230 -126 -48 271 4 274 87 54
4706 54 254 -211 -102 186 -404 41 6 -279 224 11 8 402 83 -282 -40 11 -95 -131 18 -93 -449 -54
4728 -54 228 377 98 -91 211 -464 -21 -270 141 40 -26 61 153 78 26 23 185 -118 -143 36 -137 -78 -32 -73
4752 -73 -114 26 -203 110 -506 -89 -104 43 28 33 321 56 195 72 202 242 132 127 -232 -28 114 -61 -19
4775 -19 279 -75 -10 -262 -44 27 -179 365 88 48 82 -46 -213 33 25 295 -41 -375 -87 -39 251 -186 -135
4798 -135 -40 -56 169 123 97 -146 198 166 -40 193 -63 -178 -35 126 -92 -134 -59 -165 -172 45 81 0 -86 131
4822 131 -28 276 110 187 136 29 -12 351 -118 -206 171 -15 27 397 118 21 -56 -30 -322 161 97 150 -79
4845 -79 -240 171 441 1 -29 254 159 488 -32 -81 -134 252 -26 -63 243 -11 -59 -240 181 59 -152 -69 70
4868G0j4j97J33r7L44j82n8j68m2K44q5M02l16j36j30J81j26N63n14J50Q3l9J19
4891A85j47m48M49r3j45O21m22m7K25n29M36Q7r8j9Q5K83l53j03j08J17L14j82
4913A08O1k45K64j90J73k48k86L60J2m0J70j74O6k4l95K75m6L80m34L69M00m66
4935I0k98P2P2P6j17L05k66J39j02J91l06l06M47l8k02J50J37J30j16n42L06K43
4957F5k59K62j64j19L89k47K85Kk54R2J51l9k33j8J68r2J00P4k62M21n58K39j51
4980a48J48j5k19L43l0J31n26J66J62J24k04K90j33j1J6k89J45k31N09o35L94
5001a3K27j76%k04K42l33J88j46N24l74R4k0OL02k96P2k16O7m5L0K35j65Q3n53
5025d71K63N85m15k89L35Q7k47j44J61k97N27j23Q4k99K38k54K16M22k65k03L76
$$ plain form
4868 70 56 -141 -8 -105 239 57 -1 -169 -211 33 -52 350 34 -102 -232 -51 -177 386 -128 22 105 66 185
4891 185 38 -410 39 -54 -199 422 0 -47 178 -351 85 172 74 55 140 423 70 -33 -141 -24 290 108
4913 108 169 -76 188 -2 171 -77 -363 -3 9 -31 139 -35 31 7 -388 -113 -159 221 -213 156 556 90
4935 90 -208 -136 -64 12 -105 200 -66 73 -29 162 -144 -450 -3 -41 -243 -93 44 174 58 -484 -178 65
4957 65 -194 68 -96 -215 174 -73 212 214 -40 52 203 164 -69 -87 81 -11 89 163 -99 322 -236 3 -148
4980 -148 0 -15 -234 109 79 210 -316 -150 12 136 -68 222 89 78 94 -195 -50 -281 228 -407 -13
5001 -13 214 38 38 -166 76 -257 -69 -215 309 -65 29 9 15 317 21 93 -123 -56 -101 -71 164 -1 82 -471
5025 -471 -208 377 -38 -327 8 95 -152 -296 -135 -432 95 -28 56 -243 -5 -259 -43 379 114 -89 287
5046B87o49N17j71n3J04q7J41J19m32L45k7l24J54j0K24J92k11k94L63n71R3K59
5068c1P6K38r2k96K78j79j9J10J54j63M71m74j37O4r1j5oL81k58j14j87M01k26
5091a15K06O3O1j60Q7k72K95k88K3L24k67L15m65L78j20k23J87k94K84n7j36j91
5113c65J13J00L30k10J11L2k03J04j7K39j23N7k90rR4K87l25K09m05K74k40j21
5135c58K19JJ36k18L58k59J21j64j87J56k2R0j23K58K2L18k98J80j56j3k68N59
5157C52m54K08Q8j54M52n67P2OL96n92l09M71K46k7p82P96k37P0j05K91R2m56
5179a43k4K71j16l5j80K54K19l10p0n9O78n57k12O27k05N4q4m5M0m7n7N4J09k94
5203a32M32m38N2m2j18L15n1K17o27L19K05n9k42q2L37pJ15r2j20j25J31kJ55
$$ plain form
5046 287 -362 155 -16 -69 35 -52 89 208 -224 121 94 -230 -76 -86 138 330 119 -175 188 -383 -290 -31
5068 -31 45 283 191 -105 173 -6 -25 85 239 76 547 73 -64 0 -91 -106 -112 269 11 -103 -290 111 -115
5091 -115 91 154 215 55 142 -130 165 -123 -100 224 -43 272 -193 185 65 -158 29 -265 19 -38 -174 -365
5113 -365 -252 -152 178 -32 79 111 -92 12 -5 234 111 168 -122 -131 -37 250 -75 134 -271 3 -237 -358
5135 -358 -139 -138 -2 -220 138 -121 0 -164 -351 -195 -217 -127 -250 8 30 348 50 230 74 61 -207 352
5157 352 -102 106 194 40 492 -75 -3 3 399 -193 -502 -31 215 188 -594 202 -35 35 -70 221 313 -143
5179 -143 -167 104 -12 -47 -227 27 246 -64 -134 -193 485 -72 -284 343 138 192 108 63 103 56 -1 53 162 -132
5203 -132 300 -138 -86 -128 -246 69 18 235 -392 -73 132 73 -169 -251 86 79 194 102 -18 -143 -12 -14 141
5226A41O2P8o52L25K01k32K70n0l10M01k37K1j21M6K41K1j15j91K77j79j86K15
5248B6J39l27J36p0K1J1l46K55J36n0O8k89K26J0L64p25N35J15m62P24n80N17
5270D34n28L17r3j15k68K84J65Nk59k63L42M20k78j81R9n0Q5j15L0M7K1j90J20
5293B9mL64o03L50k95K8J0q7K48l60N48o13L54J80J7J11M8m73p9J90k21Q5L62
5316A89Q4k16J11j91K42k28r8J74o0j86J51J97o5j86K22J42k40J8k14P9J64q9
5338@N2K49k88j06k44K44K26l46n3K53J52Q6j57k6k67K87j15K7J33k9j18j84L08
5361H4j29l1N8J1J12J20n67K12L81j86Q1Pk35L06k62K72p7J19Om7k77P8K25m35
5385a74l2K18m75O38l90K31j66O3JK73k2k18q2j43O02j00j12J70L9p14K35L70
$$ plain form
5226 141 203 281 -371 -46 155 -77 193 143 -167 234 -3 18 -103 -57 184 205 90 -101 176 -3 -189 26
5248 26 165 -162 -26 -96 -75 -64 -410 -155 -19 -69 -1 -290 -64 -54 310 -415 120 235 -227 497 -83 434
5270 434 -94 223 130 15 -253 31 196 201 -58 -321 21 441 163 -18 81 31 116 1 31 78 99 -91 29
5293 29 25 389 -214 136 -159 -131 -121 -208 40 -320 228 -385 -31 149 166 277 325 -148 -227 -37 -258 -173 189
5316 189 273 57 168 -23 219 -9 -107 67 7 -179 -28 169 104 -82 140 282 42 60 -154 -75 89 0
5338 0 52 301 13 -93 -337 -93 133 -213 -266 -13 139 225 68 42 -225 62 -53 -26 107 78 -40 -224 84
5361 84 -45 -76 -18 -7 105 225 -342 -130 251 65 146 153 -82 224 -38 234 157 276 282 235 -42 36 261 -174
5385 -174 -206 12 -463 175 -215 16 -150 -87 -86 187 165 -53 -135 -278 324 224 112 282 321 -393 -158 212
5407B12l96M69l97Q0J4K30k66m1L47k23J30m4l36M10jm52K71M9J14J4k35J13j62
5430a00j5j04M37l89PK67l25M35k84q7l1L89k81j23l3K5L34Ll20R5j79J38l3J41
5454c3J62k40J04k4K37j68M7O9k49m6mj68L00J03J70m19K50Oj13Q8j01K22M7J62
5478D02j46k28OK75RJ12m90K18j34j08O0J14l68M25l19l3K24j50Q3k91J33J08
5500i8J63o2m32M97J65j32j9p8K8j52L36j61n5P2k67O0l3R9K91l12J31mnj13m5
5525a26J99n1k63L70k69J74N3j62J71j02j40K5Ok4J1K0J59k6k8K49q3j11p9M87
5549D60l66j3j2j61j15k5M96k25N5j00J52l3k7j21J91J76r5l47k5l6J41pl82O14
5573A95Q4k67n4L18k08r1L8l7o5Q3J37j18k35K80J03j77J3J38k74J45j31m2j1
$$ plain form
5407 212 -184 285 -112 -32 -18 212 -54 -95 252 29 159 115 -221 189 188 -264 7 56 170 184 -51 62 -100
5430 -100 -115 -219 218 -171 -164 103 -222 213 -71 -158 -189 200 -81 -204 -237 -212 122 125 -195 -100 -279 -141 -174 -33
5454 -33 129 -111 -7 -31 206 38 85 154 -95 -141 -145 -313 -13 90 260 -159 91 97 -16 72 -29 193 240 402
5478 402 256 28 34 309 318 430 -60 158 24 -84 -24 90 -278 147 -172 -205 19 -131 -48 -339 -206 -98
5500 -98 65 3 -429 68 233 101 82 4 32 -120 216 55 0 72 -195 -135 -168 -69 222 -90 41 37 32 -81 -126
5525 -126 73 22 -241 129 -140 34 87 -75 96 -6 -146 -121 -115 -139 -128 -108 51 25 -3 246 163 52 -27 460
5549 460 94 81 69 -92 -207 -232 264 39 94 -6 146 113 86 -35 156 332 237 -110 -135 -171 -30 -37 -419 195
5573 195 279 12 -42 276 68 -23 15 -22 -87 -4 133 15 -220 60 163 -14 -1 137 -137 8 -123 -165 -176
5596a76J40nL04j01k68p3M44k03k35L79l71j47K47J67k40l0M22k83J92m53L82
5617I2N2m5K52n69N16l01M08o30M49l55K61j02L2J0m56L54j65L37l43K88k91K71
5639F5l12J87J7J60k69K05j7j92L44p8K01o63N72j95J32k24L93m65K56J81k40
5660E8M6M44l09k5J01m82J50M6J44j42k22M33p09L32L09l49P8J39r5k06K81k78
5682b56K75L79l91j03J62j10q3J18o1n4L54J00m64p3M3Q9Q7P2o0j56J95q8j98
5705b23K94K3jN7k90M4L9K15k90K23j17j61J97L0o8J65m23L30j03L25J06l34K78
5728C16J4l23j10q5L59P9j52k99Q6N30n96k52R8J60j25J70M09j84k67K50k63K27
5750D2j74JOj3j04L02K41l19J33k54M64m09K87k66j53N95k57j67Q9l99L63k67
$$ plain form
5596 -176 -36 -41 263 162 -106 -179 265 62 -173 206 -165 -312 -65 102 -138 -168 254 -29 163 -290 92
5617 92 144 99 351 -218 298 -3 405 -225 224 -131 130 28 60 70 -386 -32 -197 140 -203 85 -206 65
5639 65 -247 -60 -43 117 -152 53 36 -156 188 110 311 -352 220 25 157 -67 326 -139 117 298 58
5660 58 104 548 239 214 315 -167 -17 29 173 31 -191 242 -467 -135 174 -175 -97 42 -53 -259 22 -256
5682 -256 19 398 7 -96 66 -44 -127 -9 -70 -124 230 330 -134 -207 -164 -75 12 84 24 -132 63 -25 -223
5705 -223 71 94 93 150 -140 -96 -57 158 -132 91 -26 -187 10 40 -28 137 -286 44 -59 266 372 38 316
5728 316 330 7 -103 -188 171 250 98 -201 -115 415 -181 -433 -335 -175 -300 -130 279 95 -172 78 -185 42
5750 42 -132 -131 -125 -138 -242 60 301 -18 115 -139 325 -84 203 -63 -216 379 122 -45 44 -355 8 -259
5772b59Q5L43K9J92o81M11K45j92p2k83K00Ql9rL27m27K70m36j22M24k59L89L5
5795A79r3m57K42J22k90J99qJ90j99j0K5N5L76n31M15k45k1p6K13q1J81l43K61
5818A04l88K12L32k80mk89L31k13M55q0l32l3M41l15K84m12K67n8K88n06N52l6
5840C20j23l18k34M48j90K57j31K15m40K91j16j17K27J62k08k24J01j38Q5J44
5860A1k36K15K14q7J58m8n4k58N3J2J14j91L50n74L29J77l43J09JL44l18J01k70
5883a91M46m81J19nK45R0n38J08K50q4K9q8N6l0J70m1q8Q5j61Mj80j7J95J97p5
5908A5l9M1K17k56j53M56p04O01K86m05j76O3J98j23L44o97M88k78J35j67j1N51
5930C86m66k44K55J94k49J8K92M9k15m20Q84n80j2J44j50K13j35j9P0J00k55L9
$$ plain form
5772 -259 -174 169 198 390 -291 120 365 173 101 -182 18 26 -13 -22 305 -122 148 -288 -410 14 -245 144 179
5795 179 86 -371 -129 -7 -297 -98 -106 84 -115 -125 -100 -45 331 -200 215 -30 -51 -127 86 5 186 -157 104
5818 104 -284 -72 260 -20 -24 -313 18 -195 260 180 -152 -185 256 -59 225 -187 80 22 310 -196 356 320
5840 320 197 -121 -355 93 -97 160 29 244 -196 95 -21 -138 89 251 43 -181 -80 -218 -133 11
5860 11 -225 -10 204 117 275 227 173 -85 -32 -20 94 -97 253 -321 8 185 -158 -49 -48 296 -22 79 -191
5883 -191 255 -226 -107 -112 133 223 -315 -207 43 -41 -12 -100 -44 -74 96 55 -33 52 -109 -105 -285 -302 -107 90 15
5908 15 -24 17 234 -22 -175 281 -423 178 464 59 -117 -54 144 21 365 -332 156 -122 13 -154 -165 386
5930 386 -80 -324 -69 125 -124 -106 186 235 20 -400 484 -96 -108 36 -114 99 -36 -55 15 115 -140 -101
5952a01J61j44J08L73m3n63J14J45n17N73N8k46n7j78N17k37J50p4n5j32M98l49
5974AP0J98l50Q5o6K4L90n73M07l48ML6M28l8l53N5n5l19L06K25jk0R0q8m6J62
6000B24qj29m03N06n17J82Q7J28j19K14J92k25j34K54l4j63j14K96m06Q3J8N3
6022a5O2j46K02kP1k3Qm32K38J32l3J28O5J55m49j23k84L89k2j53L68n9m87K40
6046a70L36J05j15l10QJ95J70n5j52J9L05l50M36o12k51M70J77k27j62M90m24
6067a17J8J77Q2j31j28k29L98j41jM8j4j9K12k56J26Qk03M53n92L24J22l09K26
6090E4k02L25O6l50n2O4J70k36L55l31J1K44m0j7k93M42r7l75K96k32J71rJ14
6113G8m5K44M6k3J41j01k36j26K06j07j08J78l85K84J70l77n0L5J93l14M43j75
$$ plain form
5952 -101 60 -84 24 397 354 -209 -95 50 -467 106 164 -82 -139 -317 200 -37 113 39 -16 -148 350 1
5974 1 71 269 -81 4 -62 -38 352 -221 186 -162 -158 -122 306 268 -85 -30 -85 -404 -98 127 126 106 196 108 62 224
6000 224 216 87 -316 190 -327 -145 -58 70 -49 165 357 132 -2 252 218 55 -59 237 -169 -86 -68 -15
6022 -15 47 -99 103 101 172 149 157 -275 -37 95 62 190 255 410 -39 -162 -446 -57 -79 -232 136 77 -410 -170
6046 -170 166 271 156 -154 -146 49 219 164 12 31 336 -14 422 -190 -441 29 206 -21 -183 307 -117
6067 -117 -99 78 160 29 -99 -328 70 -71 -72 -24 -38 -57 155 -101 25 33 -170 283 -309 15 137 -172 54
6090 54 -148 177 243 -107 -159 -95 75 -161 194 -137 -126 118 78 61 -232 210 113 -262 34 -198 -27 -36 78
6113 78 33 277 323 300 441 340 104 -22 184 77 -31 147 -238 46 216 -161 -211 -176 17 -297 146 -29
6135b9K38j86l3K04l40M03m42R7L92J7m52J9n9j32J00K56j39l16N94L0N1n00K26
6158aJ88l3J51m88K12j01J23n7l44M34jj46K41k94J86m74N66J52k43R0j91R2L9
6181A01J73m37k09M60j45NJk35M34l46K74J89n19M32m01j23K15M8j23J01K36l22
6203a91N35l97L63o19K51p4L10l04r4K26l9l2P2n6J7J66j29J32k71J61J63r3k27
6226a30l6J37k46L54P5k1Jn83M49k82J83q5O4J95m0k42P0R7K67j89j18m6J71j6
6250B9Q1J49l11j97L78N1j44k26K27l43L26l19M08J70m51J34m3J82J99m43J4J1
6272a18K48j72Q2M15k01l29n6O5j65J23l9l1J79O7l29J88K77n84M80l75K63o0
6294g2j64L53n8K7pk23K40K92j25k61K36p3M2j98J91n1n8K33m31K53q4j11j1R6
$$ plain form
6135 -29 209 23 -10 194 -146 257 -185 -88 304 321 -131 -112 -171 -303 -203 53 -86 -402 192 222 273 -227 -1
6158 -1 187 154 305 -183 29 -72 51 -6 -350 84 83 -63 178 -116 70 -404 162 314 71 161 -30 62 101
6181 101 274 -163 -372 88 -57 -52 -51 -286 148 -198 76 265 -254 178 -223 -346 -131 -83 -206 -105 131 -191
6203 -191 344 -53 310 -309 -58 -132 178 -126 -220 6 -33 -65 7 -49 -32 134 5 137 -134 27 190 97 -130
6226 -130 -166 -29 -275 79 154 133 134 -449 0 -282 -99 -184 -120 75 35 -207 -137 -40 227 38 -80 -126 45 29
6250 29 110 259 -52 -249 129 180 36 -190 37 -306 20 -299 109 279 -172 -38 -81 101 300 -143 -129 -118
6272 -118 130 -42 40 455 254 -75 -131 -66 -231 -108 -147 -178 1 68 -261 -73 204 -380 100 -275 -12 -72
6294 -72 -236 117 59 86 79 -144 96 388 263 2 238 165 207 9 200 149 91 324 -107 146 62 -49 -60 36
6318C6K56R8j59K28m34l75l1M91K01K4l19R3J1k32J72j12J67K63p38O18m84l2
6340b58K47k23M79k68J03j26L15m27p2K48l8k3J80l07L63M3p6K23n65n9J98j34
6362a77J53J5O6j87J78M09o19k58K31M01J70n05OK94m15K22q5J3O9J57k08r3J91
6385B8L36l47p9K76m95L85p2K30k08O2k61K08n1k60M20j01l41M43j77K0o8K89
6407B37k68l7L25m56J60j79L65j35O5qj03L8L79m78K99M2j86l35J44P7M5j29j
6430a39j58K62r0J83m36M71j72J43r7J57q8l29M90m67l5J47j9n6M12l02J20k40
6452b43M29L7l80J02J76k68r2J68J77l14J80P5pJ26m21L59N3n29N05j0j13J10
6474A20l26K56m1p6l7l13N37K5j52J23j42PK21l30J41K09k57Q7L2j11k16K44L7
$$ plain form
6318 36 292 390 231 459 25 -350 -381 110 311 335 16 109 120 -112 60 -52 115 378 -360 258 -226 -258
6340 -258 -11 -234 245 -23 80 -46 269 -158 -230 18 -20 -43 137 -170 193 236 160 383 -182 -241 -43 -177
6362 -177 -24 -9 57 -130 48 457 -162 -420 -189 212 382 -123 -117 177 -238 -16 -101 -88 -19 138 -70 -163 28
6385 28 364 17 -62 214 -281 104 32 262 54 116 -145 63 12 -248 172 71 -270 173 -4 16 -52 237
6407 237 -31 -68 257 -199 -39 -218 147 12 77 69 -34 4 383 -95 204 246 60 -275 -131 -54 -9 -138 -139
6430 -139 -297 -35 -125 58 -378 93 -79 64 -33 124 36 -293 197 -270 -305 -158 -177 -233 179 -123 -3 -243
6452 -243 186 223 -157 -55 121 -147 -239 -71 106 -208 -28 47 40 166 -255 104 157 -372 133 123 10 120
6474 120 -206 50 9 -67 -104 -417 120 145 -7 116 -26 -19 202 -128 13 222 -35 52 84 -27 -243 1 38
6497C8j4j3k03R7k82P4R8J12j52J12J14j99L34j43N8m27L43o5L01N9m78M65j37
6520I2J92O4q8k04K30J3l94K60j85mK85l49r7M6N45k56l74Qn6L89L3n47L98k14
6544b13L49k51P5M14k01K13n02K11L82k12k22k33p3K10MK46kl07K53l39Qn7L94
6567A47k10j87M55m63K98q8k90N0M79k63K12J01j56K9k93M59k8k63L53k27k29
6588a14n9O0J92j93j23M60l28K40j02j93L06l26K00j9J4J71j29q7%m7m7k77L79
6611b2K67r8K7n1j56k46N64j83j21K16j66L54l44L63o67L49p1j10L69l12K28k04
6633a4K78k46N8k08J49K2K87n64k3L18L24k20m70L3J28L67k46O0O9J7k99R8K42
6656A60kj03NKk84J48O5k8J08R7j30j04j59L01r8N3j21K20k50L49J30n25K75k67
$$ plain form
6497 38 24 11 -192 -95 -377 -303 -205 -93 -245 -133 -19 -218 116 -27 31 -396 -53 -118 183 242 -236 229 92
6520 92 284 348 260 56 286 299 -95 165 -20 -24 261 -88 -185 -139 406 150 -224 -216 -272 117 150 -397 1 -213
6544 -213 136 -115 -40 374 173 386 -116 95 477 265 43 -190 -263 -53 -49 197 195 -112 141 -198 -190 -247 147
6567 147 -63 -250 205 -258 40 -48 -338 -288 191 -72 140 241 85 114 -179 280 252 -11 342 115 -114
6588 -114 -173 -113 79 -114 -237 223 -105 135 33 -160 146 -180 20 1 15 186 57 -30 -30 -77 -124 -401 -22
6611 -22 245 147 174 123 -33 -279 285 102 -19 197 31 385 41 404 -263 86 15 -95 274 -38 190 -14
6633 -14 264 18 76 -132 17 39 326 -238 -261 57 381 161 -309 -276 -148 219 -27 33 102 119 -180 -82 160
6656 160 158 55 60 62 -222 -74 -9 -37 71 168 38 -66 -225 76 -22 31 -90 130 -120 229 359 -166 109 -158
6680a58j24L44j26R3l07L96p9l48M47k6n2k95K4L14k24o6K98o7k45J18j26J62
6702d7k12K19M01j91k08K85m54L97m01J75P1q7K27k68k07N47l74O0l70L62J45
6723G0K28j79m99P25l21O0k03R4L0m6K22M8k21N0J95n37M14P0k63J45k12K19k03
6746a14J09l8J50l35R3K68l9k70M33j14j73R2k29k14O43k89k54L98k83L42j89
6767a3k09J81j33M39m55J46m1r3J11k5K3p7j73J42M17l92J24p9Q3O8m41K80j98
6790c15J84j80M43O2L1l84L64J00k56j91K36k45L68m00r6J10q4K45K7k47N09j54
6812A27k74k33L37kL6K62j65o0J33p8K8J87k85k5r4K75l04J71k07R8M66j43l4
6835B16r9k45R9L11o1l07q8M06Q0l66j32L8%L28r5J15n30N23j51j72J85j78L88
$$ plain form
6680 -158 -282 62 -64 29 -278 118 39 -309 138 112 60 -235 -211 103 -121 -187 111 44 -201 -83 -209 -47
6702 -47 -259 -40 361 170 -38 247 -207 190 -211 -36 35 -52 175 -93 -300 247 -127 -67 -437 -75 70
6723 70 298 119 -380 345 24 84 -119 -25 5 -41 181 229 8 58 253 -284 130 200 -63 82 -130 89 -114
6746 -114 -5 -43 107 -228 -135 133 94 -176 257 143 -30 62 -167 -381 262 -27 -281 117 -166 176 -13
6767 -13 -222 -41 -174 265 -190 -44 -85 -178 -67 -92 -69 -146 -319 -177 240 -152 -28 -107 -24 44 -397 -117 -315
6790 -315 -131 -311 132 194 225 -159 205 305 49 -142 94 -151 217 -183 -279 -169 -253 -8 19 -228 281 127
6812 127 -147 -380 -43 -45 -9 253 88 28 161 83 111 298 13 -12 -106 169 -135 36 -171 -73 393 250 216
6835 216 117 -128 -29 282 221 -86 -174 232 312 -54 -186 -148 -148 180 85 200 -330 193 42 -130 55 -123 265
6858B65j82L22k35l59J02P7J40K4o6j10J79k27j91L88k68P8J19K2M64m40j92O5
6880b5J33qK1k87j55N2J32o7J4J65L28m54no1kJ12J2j18K6J94k34L4k1L33m22
6905c03J02J74J42k62p9J88M40m80J79mM3m03M16J36o52K40q3M21n01J63K21O3
6927A61k69M25l75J09J38kl17Q1R5J84k25P2K18m0m10J58q5N1j3L1L94n36N43
6950C88k99j46J42N3j10j32L93q0l53L04m08O43l08l93K51M05m66j53M42Pl54
6971a74K10j37k0K22j35J22L3k08K23m84N79j65k13k03M66k69L08j65j9K3j9R
6993a6K51Q1k86p9m1J10j34Q0J32k37J70M1J15J95m22J67j65J39j60Lj4J77j86
7016g9M34k10M1l86L16J21j63k83J73K27PJ6N0l01P9l6J68k10mJ5jK2Rq4M9M4
$$ plain form
6858 265 83 405 170 -189 -87 -10 130 154 88 -22 157 -70 -261 127 -141 -63 56 78 542 102 -90 -25
6880 -25 108 100 121 -166 -321 -269 -137 -204 -190 -25 303 -151 -156 -217 -219 -107 -95 -213 -187 7 -227 -193 -214 119 -303
6905 -303 -201 -27 115 -147 -226 -38 402 -78 101 97 140 -263 153 289 -363 -123 -206 215 -286 -123 98 161
6927 161 -108 317 -58 51 189 187 -130 -49 46 230 5 77 295 255 -155 3 -82 -31 -44 -13 381 -155 388
6950 388 89 -57 85 138 28 -104 289 209 -144 160 -248 395 87 -306 -55 350 -116 -269 173 180 -174
6971 -174 36 -101 -121 101 -34 88 121 -87 136 -348 231 66 -147 -350 116 -153 155 -10 -29 -6 -25 -16
6993 -16 235 316 30 -49 -90 20 -114 -34 98 -139 31 72 187 382 -40 127 -38 101 -59 -56 -70 107 -79
7016 -79 355 145 186 -200 116 237 74 -209 -36 191 198 214 264 -37 42 6 174 -36 -40 -25 -26 -4 5 -79 -30 14
7042A4o7l61O86k50j52J13j44M94n70J39L31l32J52mj3J45l12M0J60m0j74j86
7064c31L29j2M3K44J3j77k90j54N02q5J2k48L45j55j62J70j90K14r9K27k11r5
7086a10M56j81k45j67M03j35j39J18K03k94k35O71l28L6m1K37l51j6K12Pp1q1
7108e1j70j85N91j59j36o0K69j07K99j82J66m27L67n8j94Q7j67J91K22j8k99n8
7130g9k19M53j35k12O62m58N2o9j52L17j76L69l32lj12J09k85M50oN4j96K69j23
7153A78M26o53J85O2l00J57k76j43K41o9M40m4k7j66M52l41j14N2Jl52L28k65
7175b28M28j89l04J30q2K75n66L77J42j27J49K80l00o5o5N8j96M19K06m62l5J74
7197A9K50m92n9N95j14J21l29J51l56mK81p0o8j43M13j77J6j83L31k45L16k15
$$ plain form
7042 14 -53 -414 272 22 -130 -17 -161 333 -237 -98 233 -99 53 49 36 181 -131 -91 69 29 -145 -331
7064 -331 -2 -14 29 273 286 109 -181 -335 167 82 94 -154 191 36 -126 44 -146 68 -31 196 -15 -110
7086 -110 346 165 -80 -247 156 21 -118 0 203 -91 -326 345 17 53 12 249 -102 -118 94 101 30 -51
7108 -51 -221 -406 185 26 -110 -170 99 -8 291 109 275 -152 215 157 -37 50 -117 74 296 278 -21 -79
7130 -79 -298 155 20 -192 470 12 64 -5 -157 160 -16 353 21 18 -94 15 -270 180 174 228 32 301 178
7153 178 604 -49 136 198 -102 55 -221 -364 -123 -192 248 204 177 11 463 122 8 60 61 -291 37 -228
7175 -228 200 11 -293 -163 -245 30 -536 -159 -17 -144 5 285 -15 -80 -145 -87 -283 136 342 -120 -155 19
7197 19 269 -223 -282 313 199 320 -9 142 -214 -218 63 -7 -75 -218 195 18 34 -149 182 -63 253 38
7219C8k03L75l40L21l09J28M42l18l21l8J72l70M8M60j79K77rJ7k01L10m4k14
7241D2j70j14l26O33k39L24J7K00k58k23k44K33P6P8R4N2k69J24Q3j35K82j78
7263H2mNj64k51L04L60l38j69O6J52M9JJ27l08O8k06N91j98l41J79k36%O25l38
7287E6p6m2Q1K48j73M6j08Q1J34k8k25R4j30L01j72j44J15P5k81k08L77K11j47
7310H5P4J76k78j53K41J15J4p0m2j61j59J62r3M47l51M6L19l05k52L18m33L3M51
7333A84p6P3Q9m02L39m27m0L53k45K62K67l28j3K53k20j25N6O4L6K16m64N13k06
7356A59m38o8L19k54L58N6r2j87Jj64K15K79j52P6k36Kr1K11j34K65J33n29J40
7379a31J88R4j51PK03q8J67k41K37p05O25Nn99L90ll7J49j44l0kL92k74k38m3
$$ plain form
7219 38 -165 210 -130 191 -118 10 452 134 -187 -225 -53 -423 -375 85 -94 183 174 191 -10 300 256 42
7241 42 -128 -242 -568 65 -174 150 167 367 109 -114 -358 -125 -49 29 123 175 -94 30 113 -22 260 82
7263 82 78 83 -81 -332 -28 332 -6 -175 -109 43 92 93 220 -88 -20 -226 365 167 -174 5 -231 -231 394 56
7287 56 -20 -62 19 267 94 140 32 113 247 219 -6 88 -42 259 87 -57 58 133 -148 -356 21 232 85
7310 85 159 335 57 -96 145 260 274 204 162 1 -158 4 -89 358 7 53 372 67 -185 133 -300 -267 184
7333 184 108 181 270 -132 207 -220 -260 93 -152 110 377 49 36 289 69 -56 0 64 100 316 -148 365 159
7356 159 -279 -347 -28 -282 76 132 40 -147 -146 -310 -95 184 32 108 -128 -126 -217 -6 -140 125 258 -271 -131
7379 -131 57 151 0 7 210 122 289 48 285 -420 205 210 -389 1 -2 -39 110 -34 -64 -66 326 52 -186 -229
7403b29J65K79q4k20K18j98J21M9L26j18m21K46j90J42j98j83K35n1k6M6J46K22
7425B77K0j67J75j31R9l21K18o6k4j45K41O5l84j75K66o9K90k63j05N28k15j50
7447c6k90L74k14K50K92l85P0k8o9J12j15P6O1L21n16K8Q2n2J22L46p05j79N22
7470F7k30K22p3k45O6K61q8j40l1J32O2q0L47Ql15l81L39K30Kj44p8Q0k67O6J53
7495c7J24J0n92O03L2o5K31l01j30N38k05k72K22k12k52L50m10L71O5j57L51k42
7517B2q0K00j2p9l07M39m13J75K74o89N55n18P74k65l07J00K33j04K90m84j1N57
7539C50n92J67N6j31p3J92K67l87K48q6j67N3R5N9p5J9l71L38L81o06K95K72n07
7562b03L61l07N0j33K81M3j77j08M60j14J74j31o2Pj84q5N15l23j38J12o2m5N12
$$ plain form
7403 -229 -64 215 131 -89 129 -69 52 101 427 309 -112 134 -56 86 -112 -295 -60 -111 -137 -91 55 277
7425 277 297 130 305 174 273 -48 170 104 80 -65 176 241 -143 -318 -52 -121 169 -94 -199 329 114 -36
7447 -36 -326 48 -166 84 376 -9 61 33 -36 76 -39 37 98 419 -97 -69 13 -39 83 429 -276 -455 67
7470 67 -163 59 -14 -259 -193 68 -20 -160 -191 -59 3 -77 270 278 -37 -418 -79 151 153 9 -69 11 -256 -190 -37
7495 -37 87 97 -495 108 140 75 306 5 -125 413 208 -64 158 -54 -306 44 -366 5 70 -87 264 22
7517 22 -58 142 130 51 -256 183 -230 -55 219 -470 85 -433 341 76 -231 -131 102 -2 288 -196 -207 350
7539 350 -242 -75 -19 -150 -223 -31 236 -151 97 11 -156 -103 -8 51 -24 -5 -376 -38 343 -263 32 304 -203
7562 -203 158 -149 -99 -232 49 92 -85 -193 267 153 327 196 134 141 -43 -128 387 64 -74 38 -24 -69 443
7585D43k43p9j28k1L35l39M07n75K05J28p5j7l74L75l22J46k51L95j56J02L82
7606C38l73m05J27K57O1Q5J6m7l17L24j56K35L6k43j65M15k89K21O4P7j39j38
7628a6M7R0k11K21k15o4J57n1k3J7J60J30k45m5K64j08j22j9K17m60J81J59N64
7651F28m03n54O24J30l46l70K26L10N1m36J29N3j42j11j30K03L34k68j30J38j28
7672a92K12j81J15J61l0l9j16K48l46M4M7r0J72k16P4pR7m48P65q2r1o5J90n4
7696A68L2j26j58j18K62j55L26J01j78j59k43N89k49o9k17j14K55O6n1qk70N56
7718B40L9l91k91K74M09l70L74n72L31j79Q2k66M13j24K09k87J48K19l97L1J46
7739C8l5j45R8N4k41J07O8L17k76k78M11J19k90Q4k44N4k3J64J40k50J0K82k11
$$ plain form
7585 443 200 121 -7 -28 307 -32 375 -200 5 133 58 41 -333 42 -280 -134 -385 10 -146 -44 338
7606 338 -35 -440 -313 -56 5 90 106 59 -258 66 -90 145 181 -62 -227 188 -101 120 184 261 122 -16
7628 -16 31 121 -90 131 -84 -148 9 -42 -65 -48 112 242 -3 -48 216 108 -14 -33 184 -276 -95 64 628
7651 628 225 -329 295 425 79 -291 -65 245 296 -140 -11 42 -100 -211 -341 -138 196 -72 -202 -64 -192
7672 -192 20 -161 -46 115 85 46 -70 178 -168 -124 -77 -167 5 -211 -137 -144 -47 -495 270 188 97 32 222 168
7696 168 200 74 -84 -202 60 -95 231 332 154 -5 -248 341 92 23 -194 -308 -53 13 -38 -46 -316 240
7718 240 279 -112 -403 -129 280 -90 284 -288 43 -136 -54 -320 93 -31 178 -109 39 258 -139 -108 38
7739 38 3 -142 -44 10 -231 -124 -56 261 -15 -293 118 237 -53 31 -213 -159 -182 -18 122 -128 -118 164 -47
7762d7k32J65K90k09K77j18l01m3L29Q7R6m60j28P42o20J75p3O1J61O7j33j26
7784d0O1%l07J68M98k93k75J84k39K60M5j09j84J02K16j85K3k6k01Q5J48O8K70
7807B69l12K9mo0L94m23M84l85j63J34j52N69n43P1L29r3l46L94m44J50j0J88
7829G6k51J0J93K74m07j52m8J98Q4J16k9k31r8P34l77j81J3J96Jl54K28k80J94
7852i1j08P4j1J61k10L17J49l85K48k24L66k65J61j06l11J36j00Q7K72k53J06
7873A3J27l09K12O3m40Q8P6K83j54R8k81k43N74Qk2j78K20j3p2M94n13o4mj16
7897a53K26k55O28m48o6j20J7N1q7N4K4M7K9q8K48n06P06m79l6J79J28j89Q2J57
7921A49J88l86M0j05K03j10J34o0m44M7J30LJ97l08K84L84m21k7J09J14J17p7
$$ plain form
7762 -47 -279 -114 176 -33 244 126 -175 -218 111 198 294 -166 -294 448 -172 3 -70 -9 152 219 86 -40
7784 -40 21 21 -286 -118 380 87 -188 -4 -243 17 62 -47 -231 -129 87 -98 -75 -101 -302 -217 -69 -1 269
7807 269 -43 -14 -18 -78 316 -107 377 -8 -171 -37 -189 380 -163 -92 237 144 -202 192 -252 -102 -112 76
7829 76 -175 -165 28 302 -105 -257 -305 -107 -23 93 64 -167 -265 469 92 -89 -76 120 121 -233 -5 -285 -91
7852 -91 -199 -125 -136 25 -185 132 281 -104 144 -80 286 21 182 76 -235 -99 -199 -112 160 -93 13
7873 13 140 -169 43 106 -334 -246 -170 113 -41 57 -224 -467 107 115 93 -85 135 122 50 544 31 -33 -37 -153
7897 -153 73 -182 446 -2 -68 -188 -171 -120 -207 -153 -129 -82 -53 -141 107 -399 307 -172 -208 -29 99 -90 -8 149
7921 149 337 -49 -9 -114 89 -21 113 53 -391 -344 -214 -211 -14 -322 -38 346 -75 -102 7 121 238 161
7943A61K4l18J76m2j3K97j09j67r6L44k16j81J77j27m4o2L80m58L14J6l53K75
7965b2K21j22OK68m79J74j95K99M0k51J25N9m8O0K61m81N9J67m59L76o3j39J45
7988Ao4M24l21K6%Q4nj68J7J7R6K21l63p8k3J55l1K49j96l71J58k07N82l88L21
8013A36j5J2k77O2O5j21k64L9M62j17k54K81J45m2j42k51M15O9O6k11o5j77K16
8036C2L05l38p9j06R0M6J54k30j69K99l74M93j0K8j33j48K00%j23K49n2r3N3K54
8060C48j72l44J26o0L01l46L2o3J36m4j95l03O62L8l59L8K46j42M8j42K94j41
8082d2k12J92P2J31p6p8N8K52j19k44O1L89n16L50l89M00n91K24J69K02l11L3
8104d5j55J27l41K29n6K03j13L56m27K77K06m80L35r6nL74l98m1l00N67j71j06
$$ plain form
7943 161 185 -133 43 1 -12 285 176 9 -87 257 41 -140 37 -90 -134 -196 184 -274 40 56 -297 -22
7965 -22 199 77 83 351 -128 46 -149 150 190 -61 64 123 75 135 396 -85 -26 141 -318 58 -5 -144 1
7988 1 -63 361 40 66 66 150 145 -23 -6 11 107 328 -35 -113 -136 19 -12 237 41 -330 -172 -379 203 -185 136
8013 136 121 133 -144 -82 -17 -138 -402 -363 99 -18 -272 9 154 112 -30 -281 134 203 269 58 -7 -184 32
8036 32 337 -1 -80 -186 -96 -50 104 -126 -295 4 -370 123 113 141 8 -140 60 60 -63 186 134 41 94 348
8060 348 176 -168 -42 -102 199 -147 -115 -178 -42 -86 -281 -584 78 116 -243 -205 41 -101 -53 -195 99 -42
8082 -42 -254 -62 10 141 65 -13 45 297 178 -66 -5 384 -132 218 -171 229 -362 -138 31 233 -78 -45
8104 -45 -200 -73 -414 -185 -241 -38 -151 205 -222 55 261 -219 116 20 15 389 -9 -50 -350 217 46 -60
8126f0j02K21j08l18L28j36J7J23K57J76n15l8K76J47k74K43jo03M00j04Oo3J15
8149a3J07j86J19J26o1J91l62N3J0l9L09m46K66j33J06O2R0j98j07J49k8q0j26
8172a91P92p10O2K10J4p7j69K41m3j20k6Q7k9L2j35l9K66r2o3
$$ plain form
8126 -60 -162 59 -49 -367 -39 -175 -158 -35 222 398 -117 -155 121 268 -6 237 236 -367 33 -71 -65 -128 -13
8149 -13 94 -92 27 153 92 283 -79 -26 -16 -55 254 -192 74 -59 47 109 199 1 -106 43 15 -65 -191
8172 -191 601 -109 -47 163 177 100 -69 172 129 9 -17 70 41 73 -62 -101 165 73 10
8191A0
$$ Imaginary data points
##PAGE= N=2
##DATA TABLE= (X++(I..I)), XYDATA
0@%%%%%%%%%%%Jl3O4o4O5r7J28j60J92k24K88l21L54m27N21o08P04q01R01j052
31e69J210j373J560j758J976k220K488k782L106l459L846m272M731n233N786o382
47c345P035p756Q548r417J0373j1436J2619j3936J5422j7111J9043k1283K3917
60A2673k7065L0908l5728M1970n0421O2571q1651J16133j97988P36974P17115
71A325491j479507q91051L15303J097910L34976m47093n78797k1216J86582J45272
81a2130P3516K08816L7742l04413m37747J9548N01214M53847j88985o21089l36084
92f05765L92019O28600J36082m64596m30404M5434L27366J51417p6067p7286j3151
103A3649j14138j46141J08546L64779J56089l08854l97564K2753L54210J88772
$$ plain form
0 0 0 0 0 0 0 0 0 0 0 0 0 1 -32 32 -32 33 -64 64 -96 96 -128 160 -161 193 -234 287 -321 383 -418 483 -569
31 -569 641 -732 828 -930 1046 -1174 1314 -1468 1638 -1821 2025 -2247 2484 -2749 3037 -3345
47 -3345 3690 -4066 4482 -4935 5438 -5998 6621 -7315 8107 -9004 10039 -11244 12673
60 12673 -14392 16516 -19212 22758 -27663 34908 -46743 69390 -128598 608376 1325491
71 1325491 -154016 -1045067 -729764 368146 703122 256029 -322768 -343984 -157402 -12130
81 -12130 61386 270202 307944 3531 -434216 -414668 86546 540393 351408 -269681 -605765
92 -605765 -213746 414854 550936 86340 -344064 -298630 28736 180153 104086 26800 13649
103 13649 -100489 -246630 -138084 226695 382784 73930 -323634 -300881 53329 242101
113B42101j60954j95001L3820J12466l8813q4645J03992K01896k3456k83119j91254
124b82967J58065L12817P4897k55703k60700O2384K93465J37266j73472k12342
134a46290K9517J69548J7880j47130l2020J81652J05381k00112k44235J16121
144a49688L76370J20150l23010l42949P3515L60717J75591j85120k55633j9466
154a69523J65831J04426l7956o4174o104R300l0669l8017K6959Q3552L5004p9941
166a312r9123K8136J31470N6894r5171j11464K4990J12825K9690q6093n3005O0003
178b160O0008m4411o0857M1094Q0061k2817j07872l6077Q6189Q0395l8086r0328
190e4861q185P6042L9632m7144n1913K3182O1113J1430o2630n9810K8370R2761
$$ plain form
113 242101 81147 -113854 -80034 32432 -6381 -91026 12966 214862 191406 -91713 -282967
124 -282967 -124902 187915 262812 7109 -253591 -191207 102258 239524 66052 -146290
134 -146290 -116773 52775 70655 -76475 -108495 73157 178538 -21574 -265809 -149688
144 -149688 226682 346832 23822 -319127 -245612 115105 290696 105576 -150057 -169523
154 -169523 -3692 100734 62778 -1396 -7500 1800 -28869 -66886 -39927 43625 78629 -1312
166 -1312 -100435 -72299 59171 116065 20894 -90570 -65580 47245 76935 -9158 -62163 -2160
178 -2160 57848 13437 -47420 -6326 73735 50918 -56954 -93031 -6842 73553 35467 -54861
190 -54861 -63046 12996 52628 5484 -46429 -23247 37866 49296 -13334 -73144 -44774 47987
202D7987L8357o8125p6290K2964Q0037J3370p1171m1545N2197N4498m5375q0663
214g3759K2112J06487K9308r4625p8760N0627R7623J749r0838n1937N4428P9826
226E2241Q63o2463l0443L4928M4260k013l8658k5395J6049K7019n351k9533j641
239b0137L3161J5505k6408k5301J4715K6661j3010l9627k08M9185K3314m5623
251g773m5839L2671P0199R782n7848m3624K1105M2143M516k8185j0354J7173O713
264A0679j6623n269K3880J7745j8583l9806j4762K9931L9998j897m5056k7230
276d6993L0547M9163O628l6824k8953J1592K6354K072j7377q7J6886l788k2965
289a3745Q1L3555J9637k7550m2502m325L6503K5824j9905l4913j62L0306J5540
$$ plain form
202 47987 86344 18219 -58071 -35107 44930 58300 -12871 -54416 -2219 52279 6904 -73759
214 -73759 -51647 54840 84148 -10477 -89237 -38610 59013 60762 -30076 -82013 -27585 52241
226 52241 53104 -9359 -39802 -4874 39386 37373 -1285 -26680 -10631 16388 11037 -18496 -20137
239 -20137 13024 28529 2121 -23180 -8465 18196 5186 -34441 -34649 14536 37850 -7773
251 -7773 -53612 -20941 49258 59040 1192 -42432 -21327 20816 25332 -2853 -13207 3966 10679
264 10679 -5944 -11213 12667 30412 11829 -27977 -42739 -12808 27190 25293 -19763 -46993
276 -46993 -16446 32717 39345 2521 -26432 -14840 11514 13586 -3791 -3878 13008 9220 -13745
289 -13745 -13664 19891 39528 11978 -30524 -34849 1654 27478 7573 -27340 -27502 2804 18344
302A8344j3700j5876N275J3348l3j4871q245J4740J8267n550j9237j545J9688
315A0605J1321j0379j7574l563J0602M931j0356p391J0374J0271r838j4436O600
328h833J9423M109j9257j8850N980K5291J1437j6553j8142P995K0383N194j0144
341H033j0257k53N930l22o107l07Q345L11j1432m246J1800R681o597j5327o779
356a7527R322J3969r4j2930m394J1349J0129j987n496j198J418Q18k208l420L607
371A358O293l186r134K60J0797M130q619j1076k537Q122P397n182r551J088J0516
386F76M656m065k167J380J325k08j496K25K061J880l883j436O385M587m045p734
402a859k096K397L859j073o697n954M486Q631J537l971k632j38J978K398p5j451
$$ plain form
302 18344 4644 -11232 -5957 7391 7358 -7513 -15758 -1018 17249 11699 -7538 -9083 10605
315 10605 21926 11547 -6027 -9590 1012 5943 -4413 -11804 -1430 8841 -997 -15433 -8833
328 -8833 10590 14699 -4558 -23408 -17428 7863 19300 2747 -15395 -7400 12983 18177 8033
341 8033 -2224 -2477 3453 3131 -2976 -3283 5062 5373 -6059 -10305 1495 11176 4579 -10748 -17527
356 -17527 -8205 5764 5670 -7260 -11654 -305 9824 7837 2341 1143 2561 3379 1171 -2249 1358
371 1358 7651 4465 -4669 -4409 6388 10518 1899 -9177 -11714 -3592 3805 -1377 -10928 -9840 676
386 676 5332 1267 -900 480 1805 1597 101 326 2387 4267 384 -1052 5333 9920 5875 -1859
402 -1859 -3955 -1558 2301 1228 -5469 -11423 -6937 1694 3231 -740 -3372 -3510 -1532 866 791 -660
418f60O88L03j670R86O744M221m579o504j265L098L523j182o573m438K935L430
434i43k87K87K241j260n508j358L451M973J471m121m842J185P453M982L14k344
450E694m063m035K606M959K53m528k527j473o92K543M366J319l977p059l536M523
466e627Q611M81p267l260L586L205K496N175J311o770q281J285R463P159l055
481H512j1481m873M519O124L815O48m279j1411o673P828J2401J856p439p600j930
496i983M068Q321P036J135r374j1438N23J3994R868o223j1018j309M259J843L312
511E014L684k919j1943q151O715J4094L453j1740j1400J925R578O295L912j222
525G295j0399j2306M232J7671J0163p554j2447l533N131M900L008M589o42j3353
$$ plain form
418 -660 28 331 -1339 -353 6391 10612 6033 -471 -1736 1362 4885 3703 -2870 -7308 -4373 -943
434 -943 -1230 -943 1298 38 -5470 -6828 -3377 1596 3067 -1054 -5896 -4711 2742 7724 8038 5694
450 5694 1631 -2404 202 5161 5414 886 -1641 -3114 -3806 -1263 3103 4422 445 -6614 -10150 -5627
466 -5627 2984 3465 -3802 -7062 -3476 -271 2225 7400 8711 1941 -6340 -5055 4408 11567 8512
481 8512 -2969 -7842 -3323 2801 6616 7264 2985 -8426 -15099 -7271 5130 6986 -453 -8053 -9983
496 -9983 -5915 2406 9442 10577 1203 -10235 -9712 4282 14150 7927 -3091 -4400 -141 1702 5014
511 5014 8698 5779 -6164 -14315 -7600 6494 9947 -1793 -13193 -11268 -1690 4605 8517 7295
525 7295 -3104 -15410 -11178 6493 16656 9102 -3345 -6878 -1747 3153 6161 10750 10108 -3245
539c245j2858N641J6898M667j0866o834J935Q57j583M653P176k369j2319n343
553a3590J1482J2585k578j0480l95O480p41k173P359L457j2432j4206N877J9008
567I653O223j1581j2988q51L856J714N688J0008l718k1090j1865J6451K2964J854
581A6318j2683p788j027j848L052J3033J0110j0467k1551k919J9044J3352q713
594G913j2398J26K417l437K512J0053j413j6968p242J6302J7817m682j8762o288
608a4050J1272P056k259L132P910q308j9302j316K2290J5136q032j5601o306k36
622h614M83Q074J3319J376j9430j7313Q253K0797L789j1263k993N692m886q756
636a1472P220J7587N69j7904q167J2849J2970n881j3078j51P700R28j399N362
$$ plain form
539 -3245 -16103 -10462 6436 11103 237 -6597 -4662 -3805 -5388 -735 6441 4072 -8247 -13590
553 -13590 -2108 10477 7899 -2581 -2976 3504 2763 590 7949 11406 -1026 -15232 -9355 9653
567 9653 15876 4295 -8693 -9544 -5688 -3974 1714 11722 8004 -13086 -24951 -8500 14464 16318
581 16318 3635 -4153 -5180 -7028 -3976 9057 19167 8700 -12851 -15770 3274 16626 7913
594 7913 -4485 -4359 -1942 -5379 -2867 7186 5773 -11195 -18437 -2135 15682 11000 -7762 -14050
608 -14050 -2778 4278 2019 5151 13061 4753 -14549 -15865 6425 21561 13529 -2072 -8378 -8614
622 -8614 -8131 -57 13262 14638 -4792 -22105 -13852 6945 10734 -529 -3522 2170 -2716 -11472
636 -11472 -4252 13335 13904 -4000 -12167 682 13652 7771 -5307 -5458 2242 3170 1771 7133
650G133N7j5842j1457J3664K0218J84j6934r608L813M333J912P348R941o035k0813
665a2086q296J7175J9242j715j1528k567j374n639J943J3287N358j3197j3793
678a3190O151J4982j689j5589j976J5798O891j3179j0391O883Q403m434k257O769
692C172M739n269n146J612K341k663K468R457J197j6104j3860J0894K0696p78
706A2756j6764l356J0425j560j4044p23J7604J0422j1792j5202K205J2206K450
719D627l764L596L866q079r729N407J1580p61p233K307N187n348j0014J733J1372
734D747J804j1053m352R413M333r487o756J0457R166o406p468N161N252q945o922
749a1056J1976J6046l681j8718o826J1982R197n665n074O510J743j3224q272J0599
$$ plain form
650 7133 7190 -8652 -20109 -6445 13773 13957 -2977 -12585 -8772 -4439 -2527 4821 14762 8727 -12086
665 -12086 -20382 -3207 16035 14320 2792 225 -1149 -6788 -4845 8442 13800 603 -13190
678 -13190 -7039 7943 6254 -9335 -11311 4487 11378 -1801 -12192 -5309 3094 -1340 -3597 3172
692 3172 7911 2642 -2504 -892 1449 -1214 1254 10711 11908 -4196 -18056 -7162 13534 12756
706 12756 -4008 -7364 3061 1501 -12543 -13266 4338 14760 2968 -12234 -10029 2177 4627
719 4627 863 4459 8325 246 -9483 -4076 7504 6743 -490 1817 7004 1656 -8358 -6625 4747
734 4747 6551 -4502 -8854 559 4892 -4595 -11351 -894 8272 1866 -5602 -441 4811 -4134 -11056
749 -11056 920 16966 13285 -5433 -12259 -277 8920 3255 -1819 4691 6434 -6790 -15062 -4463
763d463J3985o29r635n777m24O14L814Q207K193r527q984P271J3465j886j2716
778d492j335J1592L472r465m316P052K036q007l417J0473Q578r438j5827P60J3447
793A113O125n547l694K086k993n442M273J1941K601q707p699J805N559K319J26
808C866R78j478o345k249P233M296o036o481M511O059l662p227J804N921Kn045
824c853L83O892Q51q035m760Q869Q910l431p796k11L978n50j598J777K559q90
840C095m252j591R91R41J41J741J179l762n409J715P040J569n020j745M354Q04
856A791l170q62M306K891l261m170K451N257j428o290n05N689J049l913k853J089
872a929J237j210P79J514J36k029j476N02K081R51L27M11k76k876k14N163K565
$$ plain form
763 -4463 9522 8893 -742 -6519 -6943 -6329 -2515 5692 7885 -1642 -10626 -3355 10110 8224 -4492
778 -4492 -5827 5765 9237 -228 -4544 2508 4544 -3463 -6880 3593 12171 2733 -13094 -12334 1113
793 1113 7238 1691 -2003 83 -2910 -8352 -4079 7862 10463 1756 -5943 -4138 1421 3740 3866
808 3866 4844 3366 -2979 -5228 2005 6301 265 -6216 -1705 4354 692 -6535 -4731 1190 1192 -3853
824 -3853 -3470 3422 4273 -3762 -8522 347 9257 5826 -1970 -2181 1797 1247 -351 1426 3985 3095
840 3095 -1157 -2748 -1757 -816 -675 1066 2245 -1517 -6926 -5211 1829 3398 -1622 -3367 987 1791
856 1791 -1379 -2241 2065 4956 1695 -2475 -24 5233 3805 -2485 -2990 2699 3748 -165 -3018 -1929
872 -1929 -692 -1902 -1123 391 527 -1502 -2978 -2476 -395 556 883 1294 1018 -1858 -2072 3091 5656
889E656l326l768J274K833o72l214Q9K113J42k938j097K836J365l145k939K723
905b068L509r55k839J54J792J478O79p24J57m45j19n6J089K53r95j55O02j337
923B0j729J206K662j804l610m28K609J711j431j814M41J914J028p40q83K075J64
940A391j490o2K993l7j574j086l56J495J008k93k451j369O28R59K59o67j454q06
958b912J588J625q07j127J010P28q80O34J378M64n02p33l64R82J317o69j953K11
976a0N50K64n37m93O9j392N93J24l82J70K91m11o65P71J199L62l44o3l51J026
996G71J078J00j784K72R32J80q41J43p40k75j15j77p98M67j60m36q11Q38N29o11
1016a438N08O37k37j4J202L88m53L31N94q95o1R29k08l7k96j166m43Q85O69j049
$$ plain form
889 5656 2330 -1438 -164 2669 1997 -1217 -1128 985 1127 -1811 -2908 -72 1293 -1852 -4791 -2068
905 -2068 1441 486 -2353 -2199 -407 1071 1750 1026 1183 738 619 563 1652 1905 910 755 1357 20
923 20 -1709 -503 2159 355 -3255 -3683 -1074 637 -794 -2608 -2167 -253 775 35 -848 1227 1391
940 1391 -99 -161 2832 2795 1221 135 -221 1274 2282 1989 -462 -1831 -1203 -244 15 -652 -2106 -2912
958 -2912 -1324 301 -506 -1633 -623 105 -775 -141 1237 1701 1199 466 102 1084 2401 1732 -221 -10
976 -10 540 804 267 -226 -157 -1549 -956 -832 -1214 -1044 -753 -1164 -1829 -1058 141 503 159 96 -255 771
996 771 1849 1949 165 437 1369 1549 708 851 111 -164 -279 -456 -1254 -787 -947 -1383 -2194 -1356 -827 -1438
1016 -1438 -930 -293 -530 -544 658 1046 593 924 1518 623 562 1491 1283 1246 950 -216 -659 226 895 -154
1036a54j253m78O97K3O92l89o42K64P6J120N16M38o18p03O23J185j24R7R8o02
1056H66o27M31Q33l84p22j176o30O23Q50r00r79K42R91o34l8J376K70r98o7N03
1076a70J065O27K79p14q48J86K78J030N31j431k260L82J946o9k126n63J604L80
1094A27j630q40J492J607p0k523k82K707J232q73j136Q39J7m3R61J396j730k288
1112a037L55J989N15j258k201K0R72m01q52J549J593k122k860J306L250M02j292
1129g2q5K33l16n22J435L049k51l954j911L306L113k859l873J202L494n14k852
1146a377n69J218N16o94k29J036q6o24o58R87M48r52K194K943j301n964j68N291
1164B011L773k960n347J048L393J12l078q71L739L13m252j961K704J851j157M4
$$ plain form
1036 -154 -1407 -1885 -1188 -1165 -473 -862 -1504 -1240 -1164 -44 472 910 292 -411 212 1397 1273 1370 1468 866
1056 866 239 670 1503 1119 397 -779 -1409 -786 64 -836 -1815 -1573 -582 -1216 -1254 122 392 -606 -673 -170
1076 -170 895 1522 1801 1087 239 425 703 1733 2264 833 -1427 -1045 901 832 -1294 -1857 -253 127
1094 127 -1503 -2343 -851 756 686 -1837 -2119 588 1820 947 -189 650 667 624 1585 2981 1251 -1037
1112 -1037 -682 1307 1822 564 -1637 -1617 -645 -1046 -1898 -349 1244 -878 -3738 -2432 818 1220 -72
1129 -72 -157 76 -240 -762 673 3722 3471 -483 -2394 912 4025 1166 -2707 -1505 1989 1475 -1377
1146 -1377 -1946 -728 -212 -906 -1135 -99 -185 -809 -1467 -480 -32 -984 1210 4153 2852 -3112 -3280 2011
1164 2011 5784 2824 -2523 -1475 1918 2030 -1048 -1919 1820 2133 -2119 -4080 -1376 475 -682 -638
1180f38O53q3k129R15K984M25k390j524L088L225k385n137R66M969O46k496r77
1197A12O67k200k224K125M593q63m115j847K793J038k172Q9M089K475n462n273
1213f175L872P174j63m641j457K682Q61k049j172J215J073r42K96N77j875l749
1229d473J607N728L41n659k583N041K455m459k878N499O149k782p832j333N855
1244F76L704k754j068K132n24m756l18M713J756l293j635J711m07m265m94N665
1260H43L456l271n529J034N029n77l817K054N353j522n652K24M707M72l705Q17
1276h4M689k69p068m236N908O107k792n344J138M018k740n165K747O371L10m491
1292i01k168J950L70j50J798M023r62n775j784M090K747l756j399N159K756o888
$$ plain form
1180 -638 15 -68 -2197 -1282 1702 2127 -263 -1787 1301 4526 2141 -2996 -2030 2939 3585 1089 112
1197 112 779 -1421 -3645 -1520 3073 2210 -1905 -3752 -959 79 -2093 -2004 2085 4560 -902 -6175
1213 -6175 -2303 4871 4708 67 -1390 1292 2153 104 -1068 147 1220 278 574 1151 -724 -4473
1229 -4473 -2866 2862 3203 -2456 -5039 2 2457 -2002 -4880 619 6768 3986 -3846 -5179 676
1244 676 4380 1626 558 2690 2166 -2590 -2908 1805 3561 268 -1367 344 -63 -4328 -4822 843
1260 843 4299 1028 -4501 -3467 1562 985 -2832 -778 4575 3053 -2599 -2375 2332 2804 -901 -84
1276 -84 4605 4336 -2732 -6968 -1060 5047 2255 -3089 -1951 2067 -673 -5838 -3091 3280 3590 -901
1292 -901 -3069 -1119 -749 -899 899 4922 3960 -1815 -3599 491 3238 -518 -1917 3242 5998 -890
1308h90o568M408P127o09o149n48M201k83m613m25O630K666m539l107K233J875
1324A409l118j80M878K619m415m098K150K871j633j833K204L408l321p138J042
1339e155O701J518m186o63L549j412m897j05O595L265m241l968J709L553j460
1354H03k931K435N069j899n924r65M035M47j766J027K276j412m410p41L245J673
1370I62j896j24K700n6n033j696N650M768k992m345J170L312k157k783K301M561
1386D342K56n471k856K831K404j941j039K596P43l945k133L012K737j487j154
1401a105J955P38l114k078L074M087j122l114M54L086j149m318R44N418O68m966
1417e42k768K673J475j925r10K509K112k819m170J556L601O34k337N02K300j400
$$ plain form
1308 -890 -7458 -3050 4077 3468 -2681 -3229 972 689 -3924 -4349 2281 4947 408 -2699 -466 1409
1324 1409 -1709 -1889 2989 5608 1193 -2905 -755 2116 483 -1350 854 4262 941 -6197 -5155
1339 -5155 1546 3064 -1122 -1785 1764 352 -4545 -4650 1945 5210 969 -2999 -1290 2263 803
1354 803 -2128 307 5376 3477 -2447 -3412 623 1070 -696 331 2607 1195 -3215 -3956 -711 962
1370 962 -934 -1058 1642 1586 -3447 -5143 507 5275 2283 -2062 -892 2420 263 -2520 -219 4342
1386 4342 4598 -873 -3729 -898 1506 -435 -1474 1122 1865 -2080 -4213 -1201 1536 49 -1105
1401 -1105 850 1588 -1526 -3604 -530 3557 2435 -679 -225 2861 1712 -2606 -1662 3756 4424 -542
1417 -542 -3310 -637 838 -1087 -1997 512 2624 -195 -4365 -2809 792 1426 -911 -409 1891 491
1433D91k286P01L667J52j967q81J507k11k599j15L207J288l010k736K420J628
1449A256k326j856K445L015k071l694N59L068J017j775l67K131L47k345j133K311
1465E82K303j441j955J276L53j609p29J735J363j807k190J053J457q76j900J088
1481a297K893l72l050m02K641J196j831l05J477J035j646j476J380J472j01j449
1497A65j95L30J91j312J39J398j03j976k4J009j14j029M84J533k30r76k90R00
1515a00J164o50j015J331R29q50j507M70J879j67j471m47P51q6j261j90M22O72
1533a26k40n41p1P73k73j57O28N59p89l20J058L86m58m35J264L3o76p25M93O73
1553A056j62j170j064J415N04j217p94P51M40o7o50N6L91K68K44R1J00L08j91
$$ plain form
1433 491 -1795 -1094 2573 2725 758 -123 1384 1173 -1426 -1541 1666 2954 -56 -2792 -372 1256
1449 1256 -1070 -2926 -481 2534 463 -3231 -2672 396 1413 -362 -729 1402 1749 -596 -1729 582
1465 582 2885 1444 -511 765 1118 -491 -1220 515 1878 71 -2119 -1066 391 -485 -2385 -1297
1481 -1297 1596 1224 -1826 -2228 413 1609 -222 -527 950 1985 339 -1137 243 1715 1614 165
1497 165 -30 300 491 -821 -682 716 613 -1363 -1387 -378 -492 -1521 -1037 496 266 -710 -1000 -100
1515 -100 1064 414 -601 730 1659 809 -698 -228 1651 1484 13 -434 317 231 -1030 -1220 -798 -126
1533 -126 -366 -907 -978 -205 -478 -635 -7 552 -237 -557 501 887 429 -6 1258 1291 615 -110 383 1056
1553 1056 894 -276 -1340 75 579 -638 -1432 -681 -241 -308 -958 -902 -511 -243 1 92 192 500 309
1572C09J96k30M74m40K82M67p43m46M25L47m80o20n49N48j03K35o91k19R58K40
1592d0q43M44O87m0m56M15K76L97l2R2p36J63O53k76m98J04j10k1r0n00j48l09
1614h68N93l40r3oO29l0l02k77O82K87M13j65o24N97N81m18m93L95O3j06j13j68
1636B37j85l7L1n81n69L80N71Pm97k71L82J07N09J65o72L45P58K2k59J11K36N
1658G95j14k05m02j9O59r35j21J91J64o56N05Pp74j47O30j86N3L14j83J14K61
1679d9P31k08K60p6j15n12K23P09o22m66J61L33m63j4j55J94j28j90l51J54Q13
1700B29q34m05P17L78k26K73N29p9m11j89O25L62o4q6o44L33o2k78l37P96l06
1721C21j428J26O99J11n42q8N84j95k61L41K91K76k66J50R0Q58lj120p1J014j98
$$ plain form
1572 309 505 275 749 309 591 1058 315 -131 294 641 161 -459 -1008 -460 -563 -328 -1019 -1238 -280 -40
1592 -40 -883 -439 248 208 -248 167 443 840 808 900 164 327 980 704 206 310 200 179 89 -411 -559 -868
1614 -868 -275 -615 -708 -714 -85 -115 -417 -694 -12 275 688 523 -101 496 1077 659 166 561 624 518 405 237
1636 237 52 15 46 -535 -1104 -724 -153 -146 -643 -914 -532 -425 84 249 -423 -78 680 702 443 554 790 795
1658 795 681 476 74 55 714 -221 -342 -151 13 -643 -138 -131 -905 -1052 -422 -608 -555 -241 -424 -310 -49
1679 -49 682 474 734 658 543 31 254 963 341 -125 36 369 -94 -108 -263 -69 -197 -387 -738 -584 229
1700 229 -605 -1010 -293 85 -141 132 661 582 171 -18 607 969 905 819 175 508 446 168 -169 627 321
1721 321 -1107 -981 -282 -171 -713 -801 -217 -412 -673 -332 -41 235 -31 119 209 1067 1064 -56 -127 887 689
1742F89l28k66M96k52r15j16P76K29p05o58L83N00n50n00Q57J316r04j591J145
1761c94R81O6l45k1L87N1m83p69J003P43r72l14M99M4j294n00J314Q17j162r91
1781a340R34Q31r35q13P04J424O19j844p62J253Q22q50L10J159R3k124n34J519
1799D66J057q29j309M29P91j412j101R37K005p3k199l72J728K32j453N75J989
1816A461k51j648m03J157J051j001o85J358J111j922k119J291K326n56k406J48
1832a088J937m87k600j18K848J113j682r59P07L70p76j70K272J025k257j617Q54
1849f28K332p74j834J455J816j597k731R5K553P13j951n93J167M29j856q19K026
1866a97J776j475j311J063P65r68r74K135J976r35k348p50K046L13j385K48K214
$$ plain form
1742 689 361 95 591 339 -576 -692 84 313 -392 -1050 -667 -167 -717 -1217 -360 956 52 -1539 -394
1761 -394 587 653 308 287 674 725 242 -527 476 1219 247 -67 432 476 -818 -1318 -4 813 -349 -1340
1781 -1340 -406 425 -510 -1323 -619 805 1424 -420 -1182 71 893 43 353 1512 1605 -519 -1053 466
1799 466 1523 694 -615 -186 605 -807 -1908 -971 1034 961 -1238 -1610 118 350 -1103 -528 1461
1816 1461 1210 -438 -841 316 1367 366 -319 1039 2150 228 -1891 -600 1726 1170 -1236 -1088
1832 -1088 849 362 -2238 -2356 492 1605 -77 -1036 -329 41 -735 -905 1367 2392 135 -1482 -628
1849 -628 1704 930 -904 551 2367 770 -1961 -1866 687 1400 -551 -1144 23 452 -1404 -2223 -197
1866 -197 1579 104 -1207 -144 621 -347 -1321 814 2790 1855 -493 -1243 803 1116 -269 -21 2193
1883B193o56l141j268K860J298j431p24J333j97k147j076K427K803j179k117L44
1899f78J992q29k025J285K604ol187p72K137N65j132j56J235K17j875k343K011
1916i57J292o25p63J374J085k349k099J878L384k83k758J08J583l02k064N91L067
1933B162Q29k877k324J270J986j486m67J726P73k094k268J518K092o50j051P43
1949a18J239r56k355N84L212N16j945n82J812m7k713m97L537J306k477j930N92
1966h22J735j348j160J476K016q62l767O0K782Q24j500J08J915o05k099o67K660
1983G46J413j443j018R38L77j700p67J796K043j345k546K36K216j087k072J247
1999i66K838l17l543o10K326J249j082r11J247J760k207j818J498K577n24j721
$$ plain form
1883 2193 1537 -1604 -2872 -12 1286 -145 -869 464 267 -1880 -2956 -529 2274 1095 -1022 -678
1899 -678 1314 485 -1540 -255 2349 2343 -844 -1616 521 1086 -46 -202 1033 1250 -625 -2968 -957
1916 -957 335 -290 -1053 321 1406 -943 -3042 -1164 2220 1937 -821 -713 870 568 -1496 -905 2162
1933 2162 2991 114 -2210 -940 1046 -440 -907 819 1592 -502 -2770 -1252 840 190 -861 -118
1949 -118 1121 165 -2190 -1606 1606 2122 177 -405 1407 1360 -1353 -1850 1687 2993 516 -1414 -822
1966 -822 913 -435 -1595 -119 1897 1035 -2732 -2672 110 934 -566 -458 1457 852 -1247 -1914 746
1983 746 2159 716 -302 636 1013 -687 -1454 342 2385 1040 -1506 -1270 946 -141 -2213 -966
1999 -966 1872 1555 -1988 -2598 -272 977 -105 -1016 231 1991 -216 -2034 -536 2041 1517 -204
2015b04O15O62j047j660R42K321M3k434o41J431M9j567J90K251O20k323j488K013
2033b27J006m42j187J648J055j594k050P69K368M12j653m36J202l31j954L1J942
2050E59P94j588j193J092L22q39j21J045J078q91j673P33J360k18j129N34J876
2067A741p53j614j64J981L16j730l15P93J91j025n54J011J243j117j406L18J244
2084A60n66p07P89R92k84j240M15R87j23n77L86P68N9j527k85J670K14j380j86
2103d35R45P7j542l9N93J147q87o14k78P08J77p02L88P66M88p98n93R55L98m88
2123B66l43O87J16j046J66M42M6l61o47M36N53o99q74M91J377m36j023J46J248
2142E45n53p21M42J222pn43p60O59K48J09m33L35n4j09o60l9L32o8k22L53m90
$$ plain form
2015 -204 411 1073 26 -1634 -692 1629 1672 -762 -1403 28 77 -1490 -1300 951 1571 -752 -2240 -227
2033 -227 779 337 -850 798 1853 259 -1791 -1022 1346 1758 105 -331 871 540 -1414 -1383 559
2050 559 1353 -235 -1428 -336 -14 -853 -974 71 1149 258 -1415 -682 678 460 -669 -135 1741
2067 1741 988 -626 -790 1191 1507 -223 -538 255 446 -579 -1133 -122 1121 4 -1402 -1084 160
2084 160 -406 -1113 -324 668 384 -856 -441 546 423 -154 232 1000 1059 -468 -753 917 1131 -249 -435
2103 -435 510 587 -955 -994 -401 746 -141 -755 -1033 -325 -148 -850 -462 304 792 -6 -599 356 754 266
2123 266 -77 610 726 -320 -154 288 334 -27 -674 -238 315 -384 -1258 -767 610 174 -849 -703 545
2142 545 -8 -729 -287 935 928 385 -375 284 532 641 208 543 489 380 -280 -319 13 -55 -277 76 -414
2163d14j77l0KL75J12j98k39P39K81o21j30N83P00p74r6J13L97o3o38L86O3k08
2185A63k35m72L73O0J63m87N10k33m35j90N88L64p30Q95k90M2K1NL34J44J3m90
2207A13K72j03r1j70k07K08k74j53K53J41M9m74k11k8L14J48l44L93K01L12j07
2228B42l14K35R0J91j79K9r3J65j70K4k52L2J87j94q5m28j26K04O86o41l87K30
2250e54L15J41L85o86N83Lp6k18L12N8K03J00k84m63J81J62mn62K53P4J35o31
2272e73j1N18m62J45l26O94J28Qk25L15l51N04K1k8k76P8K18j48J3j76J66j8l47
2295a33l69P26j23k5m73J53J9l01M44J24k89k02J26O03r9k44L08K38j10k95M0
2316A18L6K85Ro09M92j40m71K15k00K55j45Jl94J16L16l25r4M41M54m59m10N55
$$ plain form
2163 -414 -591 -621 -619 -244 -132 -330 -569 170 451 -170 -300 283 983 209 113 226 623 560 -78 308 371 163
2185 163 -72 -544 -171 -111 52 -435 75 -158 -593 -783 -195 169 -561 334 44 86 107 112 446 590 603 113
2207 113 385 282 191 21 -186 22 -252 -405 -152 -11 38 -436 -647 -675 -361 -213 -557 -164 37 349 242
2228 242 -72 163 253 444 265 294 201 366 196 220 -32 0 187 -7 -92 -520 -646 -442 244 -397 -784 -554
2250 -554 -239 -98 287 -399 184 187 111 -107 205 263 466 566 282 -181 0 162 158 -404 -151 -77 58 -573
2272 -573 -584 -66 -528 -383 -709 -15 113 121 -104 211 -140 364 385 357 81 159 377 229 242 66 232 214 -133
2295 -133 -502 224 101 76 -397 -244 -225 -526 -82 42 -247 -449 -323 280 181 -63 245 483 373 78 118
2316 118 154 439 448 -161 331 191 -280 -65 -265 -10 -155 -154 -548 -432 -116 -441 -535 -94 360 -99 -509 46
2338D6n8J50k3L24q0k83R7J2J00j03J48j89k65K3l71J9M86kj91k38J14Q4R5j86
2362b91J02M12j02j7l16M98K04j08j59l7K28m61K85L79j35n67k18M57Q5o93n42
2383i96N83J069k86o73m35J049o26N2K73M77l88j18NM18n05j4J92R46m35j147
2403e59j28J226k38m07k72o12J160n26n51J71R34j34n32L74M30k76m19J98Q63
2422G02j90o42l4L49L49n06lR36k57q13q23Q19M80k34l84K92J55m58m29L38J025
2443F72m17q55N6J069k64p50J00J328L78j188q43P11O41m41m61L00N95q88o11
2462h68K70N12K4m20L71K29Q3j241M88J141L28j262L01L36L13r06m42R58J065
2481A280r29j151O84N64m77r0J87R22r43j099J27J052J47o43J64P70k38j231O9
$$ plain form
2338 46 -12 138 115 439 359 76 173 185 285 182 330 141 -124 -101 -472 -453 33 31 -160 -398 -284 -200 -105 -291
2362 -291 -189 223 121 104 -212 286 490 382 223 186 414 -47 238 617 482 -85 -303 154 239 -454 -996
2383 -996 -413 656 370 -303 -738 311 -315 -263 10 487 99 -19 -14 404 -101 -115 77 1023 588 -559
2403 -559 -687 539 301 -106 -378 -990 170 -356 -907 -736 198 64 -468 -94 336 60 -359 -161 702
2422 702 512 -130 -164 185 534 28 25 961 704 -109 -932 -113 367 133 -251 41 196 -262 -691 -353 672
2443 672 255 -600 -544 525 261 -489 -389 939 1317 129 -714 -3 638 197 -264 36 631 -257 -868
2462 -868 -598 -86 -62 -482 -111 118 201 -1040 -552 589 917 -345 -44 292 605 -301 -743 215 1280
2481 1280 351 -800 -116 448 -29 -119 68 990 47 -1052 -925 127 274 -369 -205 565 327 -904 -835
2500h35J368O21r38q49J103J11j022k94P90J369q04p18j47N16Ko74L6J534l02
2519H67j775o60J264J001j271m08J454J61q34q46Q21J146j67j130K02J081r97
2536i1o38M44J032L25j557l26J201L44j521J72J190L70j622o54P71J109n98n92
2554f41Q76O90n54j523R31J190n4q25L23K66k81j334L03J295K11o67j049O91M18
2573B66r07m42J113R88j126r15K25J104l98m04L85J327p99j171J26J092P24q14
2591C74m83R19j48r80n22J005P16r14n73K85M23k64n17P99M59l97j135kJ262l20
2611a3p26Q59J135l23j575l45J408L55l20o03M82N76j108j091Q42J370k82j053
2629d12N2L28l36l11K95J355k56j244R3N13K47m06j29R45J32r50r67J269M44l93
$$ plain form
2500 -835 533 1154 216 -633 470 581 -441 -735 55 1424 620 -98 -245 271 273 -401 -365 1169 867
2519 867 -908 -1568 -304 697 -574 -982 472 633 -201 -1047 -226 920 753 -377 -175 906 -91
2536 -91 -729 -285 747 1072 -485 -811 390 734 -787 -615 575 945 -677 -1331 -560 549 -49 -641
2554 -641 235 925 371 -1152 -221 969 915 90 413 679 398 -936 -633 662 873 206 -843 -152 266
2573 266 -641 -1083 30 1018 -108 -1023 -798 306 -92 -496 -111 1216 417 -754 -628 464 1188 374
2591 374 -109 810 662 -318 -840 165 881 -33 -606 -321 102 -162 -679 120 579 182 -953 -955 307 -13
2611 -13 -739 120 1255 932 -643 -988 420 775 455 -148 334 910 -198 -1289 -447 923 641 -412
2629 -412 -360 -32 -368 -679 -384 971 715 -529 -436 77 324 -82 -211 734 866 -84 -1051 218 662 269
2649B69q80Q80L69p97j090N38J217k32j045J02R42r0m58m68J349K86q40p66O26
2668h8L82n64J07M12P41r91k32p2Q24k21j36j36P84r88p23J02J089K53r10j97
2688e64P66K04r16k07O41Q35p35n04L6P52L3o83M75N01%j016j95J013k84m41j05
2709c94N29J72p80k38P59J80p9m08N64l03k17m11P81O81l91o53k3O13l5o71pP27
2731C96J24n49m51K39Q7Q9K1R0l32K6l17L33K07k09J01p9M80j49m56P44M15n41
2753B69j42l13L45J46n18J07K48K11p01N7K82j19K31l95RK66J75o68k01O79K22
2774A90o2j31K19k60j52L20P7J80j83k23K76k68J73k59o4L76m21n26P16J34l98
2795b86k5m2N87k88q8j54M51j02L22n83N39l65L56N0k99o0l87O41j25j94J50k44
$$ plain form
2649 269 -611 269 638 -159 -1249 -711 506 274 -771 -669 273 183 -275 -743 606 892 52 -714 -88
2668 -88 294 -270 -163 249 990 -1 -233 -305 519 298 162 26 810 -178 -901 -799 290 543 -367 -564
2688 -564 202 406 -510 -717 -76 759 24 -480 -444 308 341 -342 133 634 634 -382 -577 436 152 -289 -394
2709 -394 135 307 -473 -711 48 228 149 -259 305 2 -215 -626 155 836 445 -208 -231 382 347 -324 -331 396
2731 396 520 -29 -480 -241 -154 -65 -44 46 -286 -260 -577 -244 -37 -246 -145 -224 256 107 -349 395 810 269
2753 269 127 -186 159 305 -213 -106 142 353 -348 -291 -9 -128 103 -292 -283 -17 158 -510 -711 -32 190
2774 190 128 -3 216 -44 -196 124 201 381 198 -25 251 -17 156 -103 -167 209 -212 -738 -22 112 -286
2795 -286 -311 -353 234 -54 -142 -296 155 53 375 -208 331 -34 322 372 73 13 -374 267 142 -52 98 -146
2817a46K66m2l25Q5j8k4j88P0L32j35K11k45k34N46K18r7n35N46j36j64K35j5
2839B05J20k35J67j46k57K26n13M75n4j7j03J21k49J52j65N7J07J51j99J66M9
2860E8J62j24K19k36P5K25n34K07R8J55r5k27j12J1J2p7K28k27K66j92k64j92
2882e64L80O6JN69m63j18M89nk48J04l38J16J84L38n58K07J09m38j33J67K1l22
2904d36P2k1O8J59r0J13m5K60k37K77j84O48l10k50M60n33K29J31k52q9J12j50
2926f8n7rJ8J76o8O8N8l04RK96k68L57j09J00J05l26N9k40M14J10k13J91j19K60
2950D40k18k69J08n3j72L8J25J6l03Q2O1K02l58O39l20lK35j35k96L39K4k17J12
2973G7J46l19Q2J90k9m6l18J24N9J4J6j75J97J62l08o6J96K50m78M5N7O7k09N54
$$ plain form
2817 -146 120 78 -247 -162 -180 -204 -392 -322 10 -125 86 -159 -393 153 371 274 -261 285 149 -15 220 205
2839 205 325 90 257 111 -146 80 -433 42 -12 -29 -132 -11 -260 -108 -273 -216 -109 42 -157 9 58
2860 58 220 96 315 79 154 379 -155 52 150 305 210 -17 -129 -118 -106 -183 45 -182 84 -108 -372 -564
2882 -564 -184 -118 -117 452 -11 -129 360 355 107 211 -127 -11 173 511 -47 160 269 -169 -302 -135 -114 -436
2904 -436 -364 -385 -317 -158 -248 -135 -180 80 -157 120 -64 584 274 24 484 -49 180 311 59 -30 82 -68
2926 -68 -125 -134 -116 60 -8 60 118 -186 -177 119 -149 208 99 199 304 -22 37 -203 211 321 108 299 180 440
2950 440 222 -47 61 8 -164 -126 -1 15 -288 -206 -145 57 -301 338 18 15 250 115 -181 158 182 -35 77
2973 77 223 -96 -14 176 147 101 -217 -93 -34 -20 -4 -179 18 180 -128 -194 2 252 -226 -181 -124 -57 -266 288
2997B88l83K43J31k67K40k71K16m87kN32j24l59j70M49k26j45K48J52J05o11N4
3018c87M79K44l85K17j35K59l15j68N8N38k07j60m1M08l88k91o9K11q3J25j80
3039b70M11K7l13j15j2L03n4m44J22O14m1j27K28j63Nj26j09M97m62J26M9K67
3061D13n94j06j24O15L88m99o89M66N1J58p74L48M02j35PK2J99L66o69l04R57
3082D98m37l25n7J181n12k82l4L8k13J06k67L76pk7o93L96K26J26m46J09M08p7
3104H7l83k45Q76o1k50m09M28K65m31k98L42Q34o29k18KJ40j66o34Q72K27k21
3125A28o79K07N21k57l63L61J81L24n09j43Q6O99k44p64O90K35o45r7k7O39O6
3146D09n80j07M19j68m55K65L62K07n06m5J35Q3l33P7Q71N9j063M1R4O20R9p98
$$ plain form
2997 288 -95 148 279 12 252 -19 197 -290 -292 240 116 -243 -413 36 -190 -335 -87 65 170 -441 -387
3018 -387 92 336 -49 168 33 292 -23 -191 -133 405 198 38 -3 405 17 -274 -343 -132 -215 -90 -270
3039 -270 141 168 -145 -260 -272 31 -23 -467 -345 269 228 101 329 166 171 45 -64 433 -29 97 146 413
3061 413 -181 -287 -411 204 592 93 -596 -130 -79 79 -695 -347 55 -80 -73 -51 148 514 -155 -459 498
3082 498 61 -264 -321 860 348 66 32 70 -143 -37 -304 72 65 38 -655 -259 -33 93 -353 -244 164 87
3104 87 -296 -541 335 274 24 -385 43 308 -123 -421 -79 755 126 -92 -90 50 -116 -750 122 349 128
3125 128 -551 -344 177 -80 -443 -82 99 423 -86 -229 -143 556 312 -452 238 473 -172 -269 -296 343 409
3146 409 -171 -278 141 -27 -482 -217 145 352 -154 -199 -64 19 -314 -237 634 693 -370 -329 -235 385 484 -314
3168c14O50K30o88l61K47M81K78o21l79N33P3k76k43O86N40q65n71K25O73l92
3188i4r9R4J119o79o31K57K65o4m73L17L16k83p20J13P45K91m24l49L97j49j49
3209b00l41N76J88Q7l90k81N31j24j22J60N77j74o19m45Q08k11J13k54P72n28
3229A23l3q05O59P02p85j43P3L45j69m81M24O56m5q71K4N36m6q2n9J63K65m81
3251c0p36O65L26p9l11J62K98n20K18j19J76R4j59k10K40l18l04N06K10M68m82
3272I5p8K5L04p09N9M47K47p79r1N58Lm27P8J26J75M8j11n11N96J14p35K56M66
3295A56Jm31K20L84j28k66K78k54K19j04k58J72N29l63l4o01P22j83j90K61J27
3316B57k80m05j2L65L42l67L03l4K20k43k27N11j82j13n07N68L1l32k21M09J47
$$ plain form
3168 -314 336 566 -122 -483 -236 245 523 -98 -477 56 129 -147 -390 296 836 -29 -600 -375 298 -94
3188 -94 -193 -99 1020 341 -290 -33 232 168 -305 12 328 45 -675 -562 183 474 50 -299 98 -51 -200
3209 -200 -541 35 223 310 -80 -361 170 46 -76 84 661 487 -132 -577 231 20 133 -121 651 123
3229 123 90 -715 -56 646 -139 -282 -209 136 -33 -514 -90 566 521 -350 -326 210 164 82 23 186 451 -30
3251 -30 -766 -101 225 146 -165 -3 295 -225 -7 -126 50 144 -15 -225 15 -303 -607 -101 109 577 95
3272 95 17 42 346 -363 -304 143 390 -389 -480 78 81 -346 -268 -142 33 81 -30 -541 55 169 -566 -310 156
3295 156 157 -274 -54 330 202 -64 214 -40 179 75 -183 -11 518 155 121 -480 242 59 -131 130 257
3316 257 -23 -428 -440 -75 267 -100 203 169 389 146 -81 430 248 135 -372 196 227 -105 -326 83 230
3337B30l14p8K5J26k39O1k1n2J34rk14N76j58Jl28r3M94Qn8M7l4j59q3m4P63n57
3363B4l56J09K82M4m14L24j59p2l0K63K06L7q01L01k10O18K02j27j85J09K8k05
3385a2K41l01L01Qn61N71r2l90M9J61j24K23m38L15j71l12Q97o79N36k5k41K50
3407B06j35q4p7l0K74mk52k6J68Q7K07l65j0J48J1O1k55m0J7j80k09L08K65p4
3431A1R7j96q8K97L9k30k02M19k23K26JL7l7m4K6j65J01K06n1m17L11j74M0L05
3455B89l28j89K47J10O3l51j79K6K63M31n03m0K58M92n06N4k01K1m9n3J5K01j45
3478g4O1q9Q3k95L84k78L41K3O8k22j16m0J82J43k61J41k23j32L6J12L52m21L86
3501A61j33j80L13m73J59L9K0m4o2K30j9k36J32n0J10N6k15L16j27J63j38j92
$$ plain form
3337 230 -84 -162 -137 -11 -250 -189 -210 -262 -128 -137 -351 225 67 68 -260 -353 141 149 91 138 104 -55 -138 -182 581 24
3363 24 -332 -223 59 103 -311 13 -146 -218 -248 15 221 258 -543 -242 -452 166 368 241 56 165 193 -12
3385 -12 229 -72 229 237 -324 247 155 -235 -186 -25 -149 74 -364 -49 -220 -532 365 -314 222 197 -44 206
3407 206 71 -13 -90 -120 154 150 -102 -128 40 127 334 -31 -41 107 118 179 -76 -116 -99 -279 -488 -180 85 11
3431 11 108 -88 -176 121 160 -70 -272 147 -76 150 151 188 151 107 133 -32 69 275 224 -193 118 -56 -16 289
3455 289 -39 -228 19 129 192 -159 -338 -312 -49 382 -121 -161 97 589 83 137 -64 -43 -92 -145 -130 71 -74
3478 -74 -13 -102 -19 -314 70 -208 133 156 224 2 -114 -154 28 171 -90 51 -172 -304 -268 -156 196 -225 161
3501 161 28 -152 161 -312 -153 -114 -94 -138 -200 30 11 -225 -93 -143 -33 23 -192 124 -3 160 22 -170
3523a70K55K80l10k7Mk81M77l84j0j85M12j88N7kL15l10K81k29mJ74j95M19k88
3546I1l81L17N9J44P8l87j81K46O5qj76J39j30p7j45j07K63L18l9k09J59l10J19
3569a52L84j02J48m46K34j3k12J68j19M68n48k2K09J27j58K01k65k14N98k40J79
3590B25m82J82Jj66L81k13J68j84k61N43P6m22K73l01p6K14J24J66J9l66mL45
3612B42k12J67n0m12K59o7j03p8J6O6N7J41n5L3k80J34J96M17n47l28L01N18k51
3635A64k98J8K42q5k87J78J53N5m72K28J73j6j41j24L80l39K89k30j55L51k17
3656a33pK71oj54j74J63K62J62k57k02L97m17J14j39K56j0k53j75L07k5k9k00
3678b49M59m93M11k40J0L95J08m87R2qr2K78k85N36n12J90o12P92k29j66M9K59
$$ plain form
3523 -170 85 365 55 28 32 -249 228 -156 -166 -351 61 -127 -70 -72 243 -67 214 -15 -19 155 -40 379 91
3546 91 -290 27 86 230 308 -79 -260 -14 51 43 -133 6 -124 -201 -346 -453 -190 128 89 -120 39 -271 -152
3569 -152 232 130 278 -168 66 53 -159 9 -110 358 -190 -212 -3 124 -34 167 -98 -312 286 46 225
3590 225 -257 -75 -74 -240 141 -72 96 -88 -349 194 270 -152 121 -180 -256 -42 82 248 267 -99 -103 242
3612 242 30 197 147 -265 -6 -73 -176 -254 -238 -172 -115 26 -29 4 -276 -142 54 471 -76 -404 -103 415 164
3635 164 -134 -116 126 41 -246 -68 85 140 -332 -104 69 53 -88 -212 168 -171 118 -112 -267 84 -133
3656 -133 -140 131 125 -29 -203 -40 222 384 127 -75 322 -95 19 -120 136 126 -127 -302 5 -20 -49 -249
3678 -249 210 -283 128 -112 -102 293 401 -86 6 -2 -94 184 -101 435 -77 113 -499 293 64 -102 -53 206
3700B06j85L69o82K38N18n02j79K6L97j55J56q4J72K0n32L43o7J16l52O6r3N16
3722C12k26k52k0L96j53l44J88J05J47l35L50N0j95m93L52L58j6j84k90QL23K6
3744A07n65P63n6nj26j81L12n44K59J84j60l33n9M58L63m33pr3Q6R6Jo3J20L72
3768D96m17l21L98J70j55k53J25o6j43mj92L52K68m60j51N20m76j03K13L72j72
3789AJ15J0j4m2n3l09L74J63l65o1J80k9J73q7j43M38k93k09l17M57k8j43J0O2
3813a10J66k83j45M45j8o0K87k66l02N54k10o0K20P3m89k8M10r7r6j75J90L26
3835C32m64J13j87J83l05J33K40j82OL2j03N21O2n60J59N3m64M25k27O19n16K02
3857G2J04l39K58L3l48Q70n03l74P0n8L73j13n0M7K60j55m99N0J38M61k4k66m4
$$ plain form
3700 206 21 390 -292 -54 464 -38 -217 -191 206 51 207 123 295 315 -217 126 59 175 -177 -111 -204 312
3722 312 86 -166 -186 210 57 -287 -99 6 153 -182 168 218 23 -470 -118 240 224 40 -250 -242 81 107
3744 107 -458 305 249 244 118 -63 249 -295 -36 148 -12 -345 -404 54 417 -16 -23 -116 -30 66 67 4 124 496
3768 496 79 -242 156 326 171 -82 43 -23 -166 -170 -362 -10 258 -202 -353 167 -309 -412 -199 173 1
3789 1 116 126 112 70 17 -292 82 245 -120 -181 -1 -30 143 56 -87 351 58 -151 -468 -11 -39 -182 -172 -110
3813 -110 56 -227 -372 73 55 -5 282 16 -286 268 58 -2 218 291 -198 -226 184 87 -9 -184 6 332
3835 332 -132 -19 -206 -23 -328 -195 45 -137 -131 -99 -202 319 381 -179 -20 33 -431 -6 -233 386 -130 72
3857 72 176 -163 95 128 -220 650 147 -227 -157 -215 158 45 -5 42 302 147 -352 -302 -164 297 273 7 -37
3880c7J55j53jqJ80j25j63K66j62j60M19n69N39L39m56k81L69j51r4k04K62K59
3902B24n23K08J09J74l13k18L30Mj66k06N50j95J39m71L78m1q6l98N72j06Q6k4
3924B7r0M85o29K26l08L89p5j24M1R6R6k38O8J20O2p2j73mM24l6n02l27P35J79
3948C70l69k25N09p72K08M08j86j89J85j57J21O8j08J22J09P2j55J0k30Q8J65
3969D4n6l99N89pk9q5N0k27K39o02M57r1K68j19P1Q2l18K58k26L88m08m9L34k44
3993h0M51m91J51j93L53l13j1K3l1r5K31K32j52J04m42M15j93L84l86j46K80m2
4015D9m0J60j46K3J52l15N11m65K08l16j9K04k49J70K11l07J55L66j37j86M4j74
4037a01k59L06L8J8k51L94k82rJ13j29L65r4q2N5j3m54L10K2J33L1l18L57j09
$$ plain form
3880 -37 118 -35 -36 -44 136 11 -152 114 -48 -208 211 -358 181 520 64 -217 152 1 -93 -297 -35 224
3902 224 -299 -91 18 192 -121 -339 -9 -5 -171 -377 173 -22 117 -354 24 -17 -103 -501 71 -35 51 27
3924 27 -63 422 -207 19 -289 100 25 -99 -58 38 134 -104 -36 84 146 74 -99 -103 321 285 -217 -544 191 370
3948 370 1 -224 285 -487 -279 129 -57 -246 -61 -218 -97 -29 -137 -15 94 166 11 21 -209 -121 44
3969 44 -12 -411 178 171 142 57 107 -120 119 -483 -26 -117 151 32 103 185 -133 125 -101 287 -121 -170 164 -80
3993 -80 371 -120 31 -162 191 -122 -133 -110 -141 -236 -5 227 75 179 -263 152 -41 343 -43 -189 91 49
4015 49 9 169 23 46 198 -117 394 -71 137 -179 -198 6 -243 -73 138 -169 -14 352 215 29 73 -101
4037 -101 -360 -54 -16 2 -249 145 -137 -146 -33 -162 203 109 27 82 69 -385 -75 -53 80 111 -207 150 41
4060D1N3K78n63L34n2k82J3K25N7m49K10l9lK48q2l34N61J27m12k82J98K30k96
4083b19j50M23l31L31k28J15o1o0K99k26k09J60K81J62n57L49K2K09j6j89k43
4104a38R3k01j45M63j89L86l78J16j22k70K30J81m1L95l25M8j72J93M64p25J49
4125A2Oj03K42j6K29j87j73Q8p6J22j63r9J66l27J75J79n9k23jL5M43j92j49J37
4149F6m2k16K45K62k69j69L17J48k19m13O48l91m8J63j2k67R6P5J08L4J71m94
4171b07K89k24J46L1n5J65j72J49j61Q7m04M70k97M57j79m15L09m01O24k00j56
4192a44pJ01K83j31j06q1L33m17K81p1k58J22Mj03J88jk4J85N3k2l25K97k14J0
4216d7J48j52M11l20P0m43J15M63m36J19J01N2j08k5L5q2J22j8N7Pk4q9l04M14
$$ plain form
4060 41 94 372 -191 143 91 -191 -178 47 104 -345 -135 -174 -177 71 -11 -345 216 343 -69 -351 -153 77 -219
4083 -219 -369 54 -277 54 -174 -59 -120 -180 119 -107 -316 -156 125 287 -270 79 101 310 294 105 -138
4104 -138 -45 -246 -391 72 -117 269 -109 7 -115 -385 -155 26 -15 380 55 103 -69 124 588 -137 12
4125 12 18 -85 157 141 370 183 10 98 22 144 -19 -118 48 -279 -104 75 16 -207 -208 -173 270 78 -71 66
4149 66 24 -192 53 315 46 -123 194 342 123 -290 358 -33 -81 82 70 -197 -101 -26 82 116 287 -207
4171 -207 82 -142 4 35 -20 145 -27 122 -39 48 -356 114 -183 274 95 -320 -11 -412 212 12 -144
4192 -144 -151 -50 233 102 -4 -85 248 -169 112 41 -217 -95 -91 -194 -6 -7 -31 154 207 185 -140 157 -57 -47
4216 -47 101 -51 360 40 110 -333 -218 245 -191 -72 29 81 -27 -52 -17 -99 23 5 62 69 45 -44 -348 66
4240F6m9l2j5K4l37M07j51J89n0J92l71N3J49j28k97K27J66m2P8k85K14m0r6j72
4264c00M78j55q4p0J86J27l34J46j31J03J8J68j40j1k89L67K7m4j07j30J54M08
4286C87o52J65M04k22l2N5j70J33j83K00k03O3J22N0k09j02M90j80Q6m39p5K78
4308c4j80J08O1j05r3J83l71R53l81K83m20Q9j18j60L33r8Q5l18M0K48k46J01
4330d0J58k73R0L32p65N89J46m5q4j90P6k23J52K11K65n61K60jK5J03o89P18j95
4353E9J25k69J03J02m06K48l24J95J27Q4J45k92P1L72l11j29N41o57N1j2qK24
4375C9o4K6j81j37j01M88K22j75O8k13L4K70l48J80m4N8m33J8O10j84O8k51J84
4398A34q3r1k7J52N6J3j0n90M46J14l97L36j77n3n97R80j54k24M16r6M0jn73J57
$$ plain form
4240 66 17 -15 -30 -6 -343 64 -87 102 52 244 -127 -74 75 -53 -350 -123 43 1 79 -206 8 -32 -128 -300
4264 -300 178 23 -61 -131 55 182 -152 -6 -137 -34 -16 152 12 1 -288 79 106 62 -45 -175 -21 387
4286 387 -265 -100 304 82 50 105 -65 68 -115 85 -118 -55 67 117 -92 -194 296 116 202 -237 -312 -34
4308 -34 -214 -106 -45 -150 -243 -60 -431 522 141 424 4 93 -25 -185 148 50 135 -183 -143 105 -141 -40
4330 -40 118 -155 -65 267 -498 91 237 192 108 -82 -6 -229 -77 134 399 -162 98 97 122 225 -464 254 59
4353 59 184 -85 18 120 -286 -38 -362 -167 -40 44 189 -103 -32 340 29 -100 441 -216 -165 -177 -185 39
4375 39 -25 1 -180 -317 -418 70 292 117 185 -28 6 276 -72 108 64 122 -311 -293 317 133 201 -50 134
4398 134 51 -40 -67 85 141 154 144 -446 0 114 -283 53 -124 -177 -774 206 52 -172 244 148 188 187 -386 -229
4422b29K61pR4j72Q0j21K15j42k87L17N6n17M91k2p2%l4lN1k26K76M6J37l55K29
4447F6K06M26n50k23R7J87k44Kp7l44M76j60l32Q63l01l24K58n16N24K3K11l47
4469g9L80j27l35K06P4K2j04J08M4j30j0j4K13l07P2JJ10q3k26J04JJ24R6l66
4493b26J26J71k44l81O53n4j98N1o0k2K87l02J32RK24j51r4P8O1j02K46l81K61
4516H4m6p2j48J42J66J39p96L85K71k22o0J43L4p2p5LM18j53l23L53k52K4J62
4539A05j09J74K16n00J32n9K6k16J40J07J28l71k0n2N40l16J4K41j90pj62J32
4561d7JK96k42j28j40L74l14K66j72j01K71k38J94n3J14k65L29P6p4K9j85k00
4583b09R0k22P58k64l62K46J41K8l91J81j91J78q1Q7j06k84M89Q2j15o6K43l58
$$ plain form
4422 -229 32 25 119 -53 27 -94 121 -21 -308 9 65 -452 39 17 -55 -55 -89 -92 -41 -267 9 55 192 -163 66
4447 66 272 698 148 -75 22 209 -35 -33 -110 -454 22 -138 -470 393 92 -232 26 -490 34 57 268 -79
4469 -79 301 174 -161 45 119 141 37 145 189 59 49 35 248 -59 13 14 124 41 -185 -81 -80 44 140 -226
4493 -226 -100 71 -173 -554 99 45 -153 -102 -162 -184 103 -199 -67 -58 166 15 -79 -1 60 -42 204 -177 84
4516 84 38 -34 -182 -40 126 265 -531 -146 125 -97 -157 -14 20 -52 -127 -124 294 141 -182 171 -81 -57 105
4539 105 -4 170 386 -114 18 -41 -15 -231 -91 16 144 -227 -247 -299 241 -75 -61 180 -10 -17 -179 -47
4561 -47 -46 250 8 -120 -260 114 -200 66 -106 -207 64 -174 20 -33 81 -184 145 221 147 176 -9 -209
4583 -209 -119 -341 417 153 -209 37 178 206 -185 -4 -195 -17 -98 -11 -117 -401 88 170 55 -11 232 -126
4605a26J57j76J00K59j26q9j73k4J22J55M7j31N1q4J12O3r8J27j42K5j51o3J22
4628d3k23N62l74J71j06J51k37J7m0j23J86k58O83l27n72M68L7J34q3k26J91J50
4650A38k04L01p43J97N95l36J45L5n17M36j0q2NK05n63N24k04Q3l06N49Ll08J66
4673A09J93l95j83K88Rj95P2P3j99j78M90j03Q2jJ00n4Q7k48J6k91N26j06k3j40
4697g1M8J53p4j67J55N7j32M0j94O2K5J10Q5M6n5k34K62k06n4L62j67k49j71L01
4721f8J10J13k14J89M4k8k20K03oK43n42R2K72k03M14j33j41k36j3K68N8j34l50
4744b82M31j63Q1k7k36K15NrNj44j5Pk3J59J2L6J75l35n8J10l65N4K57j51K24
4769c7k4j86K61L94k48l04K98J16l06k07K90jj32K26k46L83l43P9Ml23J92r4J33
$$ plain form
4605 -126 31 -145 -45 214 88 -1 -174 -198 -76 79 126 -5 46 -38 74 137 39 166 24 49 -102 -165 -43
4628 -43 -266 296 -78 93 -13 138 -99 -82 -122 -245 -59 -317 366 39 -533 -65 -28 106 23 -203 -12 138
4650 138 -66 235 -508 -311 284 -52 93 128 -389 47 37 -45 -40 165 -398 126 -78 5 -301 248 251 -57 109
4673 109 302 -93 -276 12 21 -174 -102 -29 -228 -406 84 -19 63 62 162 108 195 -53 -37 -328 198 92 69 -71
4697 -71 -23 130 56 -111 44 101 -31 9 -185 -123 -98 12 97 143 88 -146 116 -90 -144 218 51 -198 -369 -68
4721 -68 42 155 -59 130 174 146 -74 129 123 366 -176 -84 188 -15 399 266 125 -111 -124 144 202 68 -282
4744 -282 149 -14 67 40 -196 19 24 15 20 -124 -139 -132 -155 4 16 52 227 -108 -166 -56 -421 -367 -110 -261 -37
4769 -37 -61 -247 14 408 160 -144 154 270 -36 -243 47 46 -86 140 -106 277 -66 13 17 -306 -114 -208 -75
4792g5o3j36K84r0l52M43K83k98k21K59O8l39L25K38l03J74m63M28Q0m15M38j38
4814A27j4k63J85j38J94L23k98R4j37P7q0L8L6n31N54j50N5l40J37J58M4k95O6
4837a58N9k97N37j85N7r1MK79n0R1m34rL55K90n07L0J87k95J53l29L16M9k38K80
4861I4l2l2K8k16J11j15K05K42j30k33jJ18K06j77J8Mr0J2O8n7k61L17m4j29k58
4886c52RL34j50J87P6K25k11k07n2P8k4J64k11K06j10j28J61O3J80k66k2J20k30
4909a60J48Rk5j84K35p0K86j00J40m28j82M75q2k5k8K9j26P1k21L32n4k64M15
4932A91k00K04k56j6l3L46r8k14J5M26m34j03R7M71m79J97l87L47Kj51n5M30l40
4955d0J44Q6l55M84l49l8J15K4l28J98K48n96N37j26j76J28L95m92M62j88r1R8
$$ plain form
4792 -75 -138 -274 10 -80 -432 11 294 -4 -225 34 102 -237 88 326 23 197 -266 162 242 -173 265 127
4814 127 113 -150 35 -103 91 414 116 210 73 150 70 108 144 -387 167 17 72 -268 -131 27 71 -224 -158
4837 -158 -99 -396 141 -44 13 -78 -74 205 155 246 -188 -197 158 448 -59 -29 158 -137 16 -313 3 52 -186 94
4861 94 62 30 58 -158 -47 -162 43 285 155 -78 -79 39 245 68 86 90 0 12 80 23 -238 79 35 -94 -352
4886 -352 -343 -9 -159 28 104 329 118 -89 -141 -63 -87 77 -134 72 -38 -166 -5 58 238 -28 -50 70 -160
4909 -160 -12 -3 -28 -212 23 -47 239 139 279 -149 -331 144 62 37 9 38 -88 -17 -238 94 40 -224 191
4932 191 -9 195 -61 -77 -110 236 138 -76 -61 365 -69 -172 -75 396 -83 114 -273 74 76 -75 -130 300 -40
4955 -40 104 190 -165 319 -30 -68 47 71 -257 -59 189 -407 130 4 -172 -44 351 -141 321 133 42 140
4977A40N2r7j35L9k84M16k11K3K87k36k22L00k8j08r2r1J62J55R1q1ML7M2j45
5001A8M3L8L0k67J85k04L24k4k13L07k71L31o68K54m8K79j46o7L97m45K35l12
5023b24J61K33j22J51l54L18m74J15J93j9N8j5j54K04k01L23j91j04N10n75J68
5044AN9m3K43l22m5j27J55j82K92j67J09K64k50l65K70JM6j12L90k08J10k65P6
5067g0j11K53K37j83j56j17L78k58k85L84j67R4L09l16k43L20R6J37m33J07L09
5088B85k76P1J32J32l77J3j11L9l18J004o86K2K23j34m02M08o5K20k70j9j93N29
5110B27j86j10j06Q5K47l73q0M58p6k87J21O5j35j70lK35L33j24k07j66J72j37
5132b17o3N09j26p5j06L2j04Q3k4j67K02K42o8L4q7J53k78p4M66j68l99L81j97
$$ plain form
4977 140 192 95 -40 -1 -285 131 -80 -57 230 -6 -228 72 44 -64 -156 -247 -85 70 161 80 84 121 163 18
5001 18 61 99 129 -138 47 -157 167 143 -70 237 -34 297 -371 -117 -165 114 -32 -99 298 -147 88 -224
5023 -224 -63 170 48 199 -155 163 -311 -196 -3 -22 36 21 -133 71 -130 193 2 -102 408 -167 1
5044 1 60 17 260 -62 -107 -234 -79 -261 31 -136 -27 237 -13 -378 -108 -107 -61 -173 217 9 119 -146 -70
5067 -70 -181 72 309 126 -30 -147 231 -27 -312 72 -95 -1 308 -8 -251 69 165 302 -131 -24 285
5088 285 9 80 212 344 -33 -20 -131 -92 -410 594 -92 -70 153 19 -383 25 -40 180 -90 -109 -302 227
5110 227 41 -69 -175 -90 157 -216 -296 162 86 -201 -80 -15 -150 -320 -323 -88 245 121 -86 -252 -80 -217
5132 -217 -280 229 103 28 -78 -46 -150 -67 -91 -258 -56 186 118 152 65 218 -60 -134 332 164 -235 146 -51
5155e1J02J72M0l80k9j89J1M41j70j08j9M04m40L70L6Pm37K25l7J94M9O5m44J46
5179d2K0j02K60k78L05k29Q7O4M2j78J48j64J14L1l47P0J05K43j20j1k8O2Rn5
5203Fj40R4j03J78L2k72M91k11k49l5K50L6j33J84M50p14m1q3L14K85k67J47n21
5226c02L11j02N23l60l25M59k87Pj44j16K57p5Q7j0p1J55Q8j63L87k33l56J29
5248a41k35J33%M00O1k28j39j48L85K68l61o3J23k32K03q1R6o7l94P19n94K16
5270g9J3L8Q3K9k35M52k53K2j17n3M1K22m34K48j11j4O6k01L58K77k58O6m7j02
5294A1L12l15j1j87N35l36j30J55N0j31L75m11J37mk12J03K70k99M8J0kM4l1P
5318a2O4n5N1o9M7L12k44J32k29k6QK89o54L74Q1Q0j74K19k80j10J88j66J75l0
$$ plain form
5155 -51 51 223 263 -117 -146 -335 -324 117 -53 -161 -180 224 -216 154 190 197 -240 -15 -52 142 191 256 -188 -42
5179 -42 -22 -124 136 -142 163 -66 21 85 127 -51 97 -67 47 78 -269 -199 -94 149 29 18 -10 52 61 6
5203 6 -134 -40 -143 35 67 -205 286 75 -174 -209 41 77 -56 128 578 -136 -177 -260 54 339 72 219 -302
5226 -302 9 -93 430 70 -255 204 -83 -76 -220 -336 -79 -154 -67 -77 -148 7 95 -68 319 86 -270 -141
5248 -141 -376 -243 -243 157 218 -10 -149 -297 88 356 -5 -68 55 -177 26 -55 41 -26 -420 299 -295 -79
5270 -79 -66 -28 55 84 -151 301 48 70 -47 -100 -59 163 -271 -23 -134 -148 -82 -283 75 352 94 160 113 11
5294 11 323 8 -3 -190 345 9 -121 34 84 -47 328 -83 54 50 -162 -59 211 -88 -40 -30 -32 12 -19 -12
5318 -12 52 -3 48 -21 26 338 94 226 -3 -29 -21 268 -386 -12 69 149 -25 194 -86 -196 -8 -174 1 -29
5342b9J5J9l10J7M5L8N1M32m97L02j05K22l74K91j15%j81K39J0j59o9L68p18N82
5366G4n9J8M0m99N13j3L34m93m0j53J00M75l43K53O4m82nK02K96n49J04N7J48
5389D2j55J96k57K43j32J12j82L7L9J76j1J6k38K92m82L77k59L92k94k4K90k56
5411g8J96q4n8Mj89O0R2L6L3j41L12j41K8k25M1K08L49n09P6K01k7j69L73m11
5435b3l7n3L8J68k66J14K2K87l14k4j65J21K80j1J80o74J83K69J94m07jJ47J17
5458A45j24m4J16j05J52l16J72J15O4Kn32J41P42n87J3l10M70j04K22j58K1p7
5480A8l03M46k99K77n00L63n50O06j91L67k75J0J81k80J84l33J73J04M5l7R6j18
5502a6K62K02o86K26l17L20M58l20m17L80K19l15J67J42k37lq1J2J71R8l10l27
$$ plain form
5342 -29 -14 5 -305 -288 -243 -205 -154 278 -219 83 -22 200 -174 117 2 2 -179 60 70 -89 -158 210 -508 74
5366 74 15 33 73 -426 87 74 408 -85 -125 -278 -178 297 -46 207 271 -211 -216 -14 282 -267 -163 -106 42
5389 42 -113 83 -174 69 -63 49 -133 -96 -57 119 108 124 -114 178 -304 73 -186 206 -88 -112 178 -78
5411 -78 118 34 -24 -20 -209 -149 -57 -21 12 -129 183 42 70 -155 -114 94 443 -66 10 211 184 15 388 -23
5435 -23 -60 -113 -75 93 -173 -59 -37 250 -64 -88 -253 -132 148 137 317 -357 -174 95 289 -118 -119 28 145
5458 145 21 -23 93 -12 140 -176 -4 111 175 177 -355 -214 528 -59 -46 -356 114 10 232 74 95 18
5480 18 -285 161 -138 139 -361 2 -548 58 -133 234 -41 -31 150 -130 54 -279 -106 -2 43 6 102 -16
5502 -16 246 448 -238 -12 -329 -9 449 129 -288 92 311 -4 163 305 68 65 -16 -4 167 265 -45 -372
5524c72M68l84K40j65J52P3l22M53J07r1k53M47m34k10L00L1P4k9j2j02k00K90
$$ plain form
5524 -372 96 -288 -48 -213 -61 12 -310 143 250 159 -94 353 -81 -291 9 40 114 85 73 -29 -229 61
$$ [...]
8191B17
##END NTUPLES=NMR FID
##END=
