##TITLE=1H ikalashn
Dep
22.10.2024
##JCAMPDX= 6.0         $$ Bruker NMR JCAMP-DX V2.0
##DATA TYPE= NMR FID
##DATA CLASS= NTUPLES
##ORIGIN= UXNMR, Bruker Analytische Messtechnik GmbH
##OWNER= root
$$ TOPSPIN		Version 1.3
$$ 2024-10-22 13:56:46.234 +0400  Irina@DPX200
$$ Compression mode = diff/dup
##.OBSERVE FREQUENCY= 200.131300845
##.OBSERVE NUCLEUS= ^1H
##.DELAY= (6, 6)
##.ACQUISITION MODE= SIMULTANEOUS
##.ACQUISITION SCHEME= undefined
##.AVERAGES= 64
##.DIGITISER RES= 18
##SPECTROMETER/DATA SYSTEM= spect
##.PULSE SEQUENCE= zg
##.SOLVENT NAME= D2O
##.SHIFT REFERENCE= INTERNAL, D2O, 1, 17.49637
##AUDIT TRAIL= $$ (NUMBER, WHEN, WHO, WHERE, WHAT)
$$ ##TITLE= Audit trail, TOPSPIN		Version 1.3
$$ ##JCAMPDX= 5.01
$$ ##ORIGIN= Bruker BioSpin GmbH
$$ ##OWNER= Irina
$$ $$ F:/spectra/data/iren/nmr/1H/4/audita.txt
$$ ##AUDIT TRAIL=  $$ (NUMBER, WHEN, WHO, WHERE, VERSION, WHAT)
(   1,<2024-10-22 13:56:10.484 +0400>,<Irina>,<DPX200>,<TOPSPIN 1.3>,
      <created by zg
	started at 2024-10-22 13:51:57.250 +0400,
	POWCHK disabled, PULCHK disabled
       configuration hash MD5:
       BE 6D 3F 07 2A EA 11 49 91 17 2B D3 AF B3 58 0D
       data hash MD5: 16K
       FF 78 E0 53 68 E4 40 F8 D4 DC 99 5A B2 92 49 FB>)
$$ ##END=
$$ 
$$ $$ hash MD5
$$ $$ D7 9F 59 A3 08 29 28 BE F1 87 58 D5 BF B6 C7 A7
##$RELAX= 
##$RELAX= 
##$RELAX= 
##$RELAX= 
##$RELAX= 
##$RELAX= 
##$RELAX= 
##$RELAX= 
##$RELAX= 
$$ Bruker specific parameters
$$ --------------------------
##$DU= <F:/spectra>
##$EXPNO= 4
##$NAME= <1H>
##$PROCNO= 1
##$TYPE= <nmr>
##$USER= <iren>
##$AMP= (0..31)
100 100 100 100 100 100 100 100 100 100 100 100 100 100 100 100 100 100 
100 100 100 100 100 100 100 100 100 100 100 100 100 100 
##$ANAVPT= -1
##$AQSEQ= 0
##$AQ_mod= 1
##$AUNM= <au_zg>
##$AUTOPOS= <>
##$BF1= 200.13
##$BF2= 200.13
##$BF3= 200.13
##$BF4= 200.13
##$BF5= 200.13
##$BF6= 200.13
##$BF7= 200.13
##$BF8= 200.13
##$BYTORDA= 1
##$CFDGTYP= 0
##$CFRGTYP= 5
##$CHEMSTR= <none>
##$CNST= (0..63)
1 1 145 1 1 1 1 1 1 1 1 1 1 1 1 1 1 1 1 1 1 1 1 1 1 1 1 1 1 1 1 1 1 1 
1 1 1 1 1 1 1 1 1 1 1 1 1 1 1 1 1 1 1 1 1 1 1 1 1 1 1 1 1 1 
##$CPDPRG= <>
##$CPDPRG1= <>
##$CPDPRG2= <>
##$CPDPRG3= <>
##$CPDPRG4= <mlev>
##$CPDPRG5= <mlev>
##$CPDPRG6= <mlev>
##$CPDPRG7= <mlev>
##$CPDPRG8= <mlev>
##$CPDPRGB= <>
##$CPDPRGT= <>
##$D= (0..63)
0 2 0 0 0 0 0 0 0 0.06 0 0.03 0 0 0 0 0.0002 0 0 0 0 0 0 0 0 0 0 0 0 0 
0 0 0 0 0 0 0 0 0 0 0 0 0 0 0 0 0 0 0 0 0 0 0 0 0 0 0 0 0 0 0 0 0 0 
##$DATE= 1729590969
##$DBL= (0..7)
120 120 120 120 120 120 120 120 
##$DBP= (0..7)
150 150 150 150 150 150 150 150 
##$DBP07= 0
##$DBPNAM0= <>
##$DBPNAM1= <>
##$DBPNAM2= <>
##$DBPNAM3= <>
##$DBPNAM4= <>
##$DBPNAM5= <>
##$DBPNAM6= <>
##$DBPNAM7= <>
##$DBPOAL= (0..7)
0.5 0.5 0.5 0.5 0.5 0.5 0.5 0.5 
##$DBPOFFS= (0..7)
0 0 0 0 0 0 0 0 
##$DE= 6
##$DECBNUC= <off>
##$DECIM= 32
##$DECNUC= <off>
##$DECSTAT= 4
##$DIGMOD= 1
##$DIGTYP= 9
##$DL= (0..7)
0 120 120 120 120 120 120 120 
##$DP= (0..7)
150 150 150 150 150 150 150 150 
##$DP07= 0
##$DPNAME0= <>
$$ [...]
##$SW= 21.9926040160658
##$SWIBOX= (0..15)
0 0 2 0 0 0 0 0 0 0 0 0 0 0 0 0 
##$SW_h= 4401.40845070422
##$TD= 16384
##$TD0= 1
##$TE= 300
##$TE2= 300
##$TE3= 300
##$TEG= 300
##$TL= (0..7)
0 120 120 120 120 120 120 120 
##$TP= (0..7)
150 150 150 150 150 150 150 150 
##$TP07= 0
##$TPNAME0= <>
##$TPNAME1= <>
##$TPNAME2= <>
##$TPNAME3= <>
##$TPNAME4= <>
##$TPNAME5= <>
##$TPNAME6= <>
##$TPNAME7= <>
##$TPOAL= (0..7)
0.5 0.5 0.5 0.5 0.5 0.5 0.5 0.5 
##$TPOFFS= (0..7)
0 0 0 0 0 0 0 0 
##$TUNHIN= 0
##$TUNHOUT= 0
##$TUNXOUT= 0
##$USERA1= <user>
##$USERA2= <user>
##$USERA3= <user>
##$USERA4= <user>
##$USERA5= <user>
##$V9= 5
##$VALIST= <valist>
##$VCLIST= <CCCCCCCCCCCCCCC>
##$VD= 0
##$VDLIST= <DDDDDDDDDDDDDDD>
##$VPLIST= <PPPPPPPPPPPPPPP>
##$VTLIST= <TTTTTTTTTTTTTTT>
##$WBST= 1024
##$WBSW= 25
##$XGAIN= (0..3)
0 0 0 0 
##$XL= 0
##$YL= 0
##$YMAX_a= 1422702
##$YMIN_a= -648101
##$ZGOPTNS= <>
##$ZL1= 120
##$ZL2= 120
##$ZL3= 120
##$ZL4= 120
##$ABSF1= 10
##$ABSF2= 0
##$ABSG= 5
##$ABSL= 3
##$ALPHA= 0
##$AQORDER= 0
##$ASSFAC= 0
##$ASSFACI= 0
##$ASSFACX= 0
##$ASSWID= 0
##$AUNMP= <proc_1d>
##$AXLEFT= 0
##$AXRIGHT= 0
##$AXTYPE= 0
##$AXUNIT= <>
##$AZFE= 0.1
##$AZFW= 0.1
##$BCFW= 1
##$BC_mod= 2
##$BYTORDP= 1
##$COROFFS= 0
##$CY= 7568.61572265625
##$DATMOD= 1
##$DC= 2
##$DFILT= <>
##$DTYPP= 0
##$F1P= 17.9538593292236
##$F2P= -4.03888763876832
##$FCOR= 0.5
##$FTSIZE= 32768
##$FT_mod= 4
##$GAMMA= 1
##$GB= 1
##$INTBC= 1
##$INTSCL= 1
##$ISEN= 128
##$LB= 0.1
##$LEV0= 0
##$LPBIN= 0
##$MAXI= 945.577
##$MC2= 0
##$MEAN= 0
##$ME_mod= 0
##$MI= -402.1523
##$NCOEF= 0
##$NC_proc= 0
##$NLEV= 6
##$NOISF1= 8.587773
##$NOISF2= 6.764455
##$NSP= 1
##$NTH_PI= 0
##$NZP= 0
##$OFFSET= 17.49637
##$PC= 1
##$PHC0= 103.3179
##$PHC1= 30.55388
##$PH_mod= 0
##$PKNL= yes
##$PPARMOD= 0
##$PPDIAG= 0
##$PPIPTYP= 0
##$PPMPNUM= 100
##$PPRESOL= 1
##$PSCAL= 0
##$PSIGN= 0
##$REVERSE= no
##$SF= 200.13
##$SI= 32768
##$SIGF1= 18.5376
##$SIGF2= -6.396296
##$SINO= 400
##$SIOLD= 32768
##$SREGLST= <1H.CDCl3>
##$SSB= 3
##$STSI= 0
##$STSR= 0
##$SW_p= 4401.40845070422
##$SYMM= 0
##$S_DEV= 0
##$TDeff= 0
##$TDoff= 0
##$TI= <>
##$TILT= no
##$TM1= 0
##$TM2= 0
##$TOPLEV= 0
##$USERP1= <user>
##$USERP2= <user>
##$USERP3= <user>
##$USERP4= <user>
##$USERP5= <user>
##$WDW= 1
##$XDIM= 8192
##$YMAX_p= 0
##$YMIN_p= 0
$$ End of Bruker specific parameters
$$ ---------------------------------
##NTUPLES= NMR FID
##VAR_NAME=  TIME,          FID/REAL,        FID/IMAG
##SYMBOL=    X,             R,               I
##VAR_TYPE=  INDEPENDENT,   DEPENDENT,       DEPENDENT
##VAR_FORM=  AFFN,          ASDF,            ASDF
##VAR_DIM=   8192,          8192,            8192
##UNITS=     SECONDS,       ARBITRARY UNITS, ARBITRARY UNITS
##FACTOR=    0.0002272,     1,               1
##FIRST=     0,             0,               0
##LAST=      1.8609952,     9,               79
##MIN=       0,             -648101,         -648101
##MAX=       1.8609952,     1422702,         1422702
$$ Real data points
##PAGE= N=1
##DATA TABLE= (X++(R..R)), XYDATA
$$ [...]
2354H7Q31j190O78k23l02M66o29O65o10O36o62j83K24K05K62q00L67O24l76j33
2374f3n95L01j38L81j83M8O41R1r7N0l56K63o6n90J229j079K41n2l10M38l88L71
2396A37n42O87l81k61m9j36j71J032m54K7K07j71N68K42n02J89k55k00o2L1L17
2417B53N6k94L08m09l71J5M24r7k13n89N43J89l31K97j11L44K71q39P78p97N11
2438f2M04k34m38L21M78n57L19j11k07k02J03N39l24P4l97M68k2j33m94l67N56
2459b86k54K33j11J394p75P67j476J523r15L2J0l9P8J17Q0n35K28n45k13J84J79
2480c24Q7o77RN99O6K43l55N71j8O9P61r12k42K34Q7n3m17L68M43R8n15k25k8
2503a31j39R8l07K61J08p4J24j67l01J00M07M65q79J040J52n77K8N62K34n26j23
$$ y = [87, 918, -272, 406, 183, -119, 347, -282, 383, -227, 409, -253, -436, -212, -7, 255, -545, -178, 446, 70, -63, -658, -357, -495, -114, -297, -249, 392, 483, 386, 436, 80, 343, 277, -313, 916, -163, 78, 26, -284, 154, -234, 137, -405, 282, -99, -360, -409, -545, -716, 316, -138, -111, 96, -75, 493, 735, 233, 422, 167, -33, -95, -64, 253, 309, 15, 323, -86, -457, -442, -18, -115, -328, -917, -374, -185, -516, -219, -330, 14, 285, -554, 224, -573, -62, 342, 108, -330, -9, 469, -88, 231, 120, -87, -289, -186, 353, 29, 103, -294, 174, 152, 19, -475, -842, -286, -540, -307, -418, 976, 201, 968, -508, 1015, 100, 132, 142, 103, 181, 298, 378, -157, 71, -474, -687, -503, -324, -237, -914, -905, -306, -240, 3, -352, 219, 201, 270, 1031, 119, -123, 111, 198, 145, -272, 96, 539, 637, 122, -103, -131, -270, -172, -479, -218, -110, -184, -60, -227, -528, -428, -21, 444, -435, 605, 757, 180, 208, 770, 1004, 478, 355]
2524C55K63n64L14j54m26L2l69N56l2l45M10q34J89K64o8q4J36L39O46o68n03
2545e43J146j175Q73P36q55n1M88p47O09o21J41j96j43o0M45j41m94N74m72r7
2565e83Q90n17l4J13P46o71j26L06n07R34r9q49P72J30q28J113o63M60m60o29
2585e02J74J86n21O93jn24n09Q76p1n7P32m93L73j58l5J15k60L98j32k38j29O12
2607E29m84R6m16m4N42m7l85J25j17O55l74q27N44j23K18L91l48J28l55M82J0
2628B00j65K93L68k69l15M6L37n00L18l57k16p1N8L83j31n9j17m17O47q9k10K68
2650BK03k86K52M13l16n09O17N4k46J4J97p32k5L23Mo96L36J27kL8N70m26l86
2673d74l75N00N1K69r85N28Q70K76j60o44Q01l37J86j5n41L06l13k01K36J15K27
$$ y = [355, 618, 54, 368, 214, -212, -180, -549, 7, -25, -370, 40, -794, -605, -341, -409, -493, -357, -18, 628, -40, -543, 603, -572, 301, 1037, 182, 131, 619, -128, 481, -140, 1, -195, -338, -398, 47, -94, -588, -14, -486, -583, 307, -210, -244, -131, 615, -56, -182, 124, -383, 551, 452, -397, 375, 505, -323, 790, 127, 587, 127, -502, -328, -142, -663, 30, 29, -495, -1004, -128, -199, -256, 476, -17, 356, 198, 163, 278, 18, 416, 284, 46, -83, 529, 45, 141, -275, -319, 223, 176, -209, -84, -201, 454, 80, -747, -203, -326, -108, 283, -65, 63, -292, 190, 200, 35, 328, 696, 427, 112, 158, 495, -5, 313, -44, -260, -331, -273, 110, -21, -80, -197, -614, 33, -56, -266, 2, 205, -81, 171, 584, 268, -241, 376, 430, 184, 198, 395, -337, -362, -39, -35, -731, -395, -268, -270, -232, 338, -88, -474, -849, -349, -298, -29, -1014, -486, 384, 660, 500, -144, 657, 320, 506, 491, -50, 256, -57, -258, -22, 93, 320]
2694C20n66O01m70n07N0Q18j86J38k60j01P32j215P22R6M05p00Q70k23n14J5N97
2715F22m75N32n32l68L71n20L39R1l26k41q3L6L07K99J08p02N63k51n02P08qr4
2737a26K41K7k08K81M0K49n6o3k30l17L43N2m38k80K57o87K54Q21l23l70N64j85
2759a54p0l24J163n55J67k31L94K36o25R8Q9J99j86j90k74p2P37r01O05l81k09
2780d84m39M65N14r77R72k32l74J85J9J033p24k37O88o38M99l99K46m46P78l99
2800E0M9o88J033p49J91k22K23n35M42J36J2l32K09J7o4n40P86J42L56n19K85
2821B82k5k13L97l81O83q18M22o75K53M46q75M97k31M43n18l86L45J43P7L1l22
2842d25O59L18k61K1L01j51o85J005m88m97J63K79L5q59P5N69m38R18j131N3L01
$$ y = [320, -246, 355, -115, -622, -572, 246, 60, 198, -62, -163, 569, -646, 76, 172, 577, -123, 747, 524, 10, 25, 622, 147, 679, 147, -221, 150, -370, -31, 60, -266, -507, -590, -554, -247, 52, 160, -542, 21, -230, -732, -24, -32, -126, 115, 142, -66, 215, 255, 504, 448, 385, 155, -162, 181, 233, -205, -485, -228, -915, -661, 160, -163, -533, 31, -154, -224, -548, 615, 60, 227, -4, 390, 626, 1, 99, 188, 387, 201, 11, -263, -335, 402, -499, 106, -275, -484, -923, -458, 56, -921, 51, -181, -555, -370, -351, 682, -42, -279, 409, -229, 270, -129, 117, -329, 449, 50, 99, -589, 444, -305, -114, -336, -113, -648, -206, -70, -58, -390, -181, -164, -228, -768, 18, 160, 516, -3, 282, 257, 44, 441, 60, 743, -75, 347, -328, -75, 371, -504, -7, -238, 205, -313, -699, -354, -211, -134, -103, -425, 234, 552, 291, 312, 613, 462, -223, 782, 294, -203, -40, 239, 274, -585, -510, 59, -379, 539, -592, -539, -238]
2863b38k3L3n7k26L43J26L41n08P65m92j04o1N12l78J6N93n44k28J83k07K65n1
2885F0k8o47J93n1n8l70N38M44o67P13O4j05oL44l00l73j18R17p84N66J13p18
2907b73J152l14q82L57j2M30p02q8N09p20r6O60j14k31r8M72K33l49k31L85p20
2928f32O63M45p8N1j81k29K78M71j310M77O9L1j45l5P3n94K9N6O71l76K99K3L14
2951C70l68rM79q87J046j084O53m07K75K6l03oj4P24o94l39K99J65n48P10o69
2972e81N45p6K89m91N7J92l63R55l64j18l84J076m86m9k28M62j85L90k95n26N57
2993C77P0p21q4M66K58m53L2J29K1n97K93N84o74J31J006l81j41j05K4k10K11
3014B36l74J16K81p6J51j60l27k04K10j66J08L66P0k75N00q24O2P15p21N63L1
$$ y = [-238, -261, -228, -285, -511, -168, -42, 299, -209, 556, 64, -40, -101, 411, 33, 49, 642, 98, -130, 53, -154, 111, 60, 32, -615, -422, -473, -531, -901, -363, 81, -586, 127, 191, 86, 80, 424, 124, -249, -367, 550, -234, 332, 445, -273, 879, 565, -317, 40, 28, 458, -244, -332, 177, -543, -639, 21, -93, -324, -422, 50, 283, -66, -297, 88, -632, 31, 476, 398, 449, 268, 39, 317, 788, -522, -45, 24, 55, -90, -125, -52, -646, -617, -561, 110, -266, 33, 56, 370, 2, -7, 472, -415, 631, -453, 200, -207, 68, 94, -209, -215, -229, 495, -199, -538, -239, -74, -622, 88, -581, -36, -112, 177, -314, -257, -65, -428, 527, 163, 45, -339, 737, 251, 202, -26, 436, 251, 641, 346, -180, 377, 447, -274, -358, 108, 366, -87, -55, 74, 95, -502, -209, 375, -299, -168, 838, 457, 316, 211, 235, 25, 236, -138, -22, 259, 183, 334, 174, -153, -357, -147, -313, -205, 161, 231, -44, 456, -368, -306, 409, -312, 251, 282]
3035B82k33l07R22n63k14J07L1j91k48L60L05r4k83l9j69M03o15O10j99j96l5
3056c66K19O56q9J32o14L89j8q07O57J03o86O04N5l63J214j728J020m51N51n60
3076h2q15O62QN25r46M69o03N50j07J06m28O07j73M73k19K63P0O04n34m97k5J36
3098D4k50L78p02M91L48m04J06l94m54J099n9k94l06N13R61j138K78J93m12j97
3118a99K92J98p2K22j68k69L86Q0k25k5k79k7nK1P5j51k0K49l03J32J9M10J43
3141D84q00N91j02j05N3q0M56o22K67N61Q5p14O1l14K36K18q50N37J47q0n14j65
3163f50P27N39r51M16J92p25K52R55j032M89m99J99K37J42m75M70p46J154o60
3182C4n31O24p93K00j69j93M77j0N5O44r11J93N30J0m32N62r87jP19K33K80k89
$$ y = [282, 49, -258, 664, 101, -113, -6, 25, -166, -414, -54, 251, 157, -126, -165, -334, 69, -546, 64, -135, -331, -366, -147, 509, 420, 552, -62, 327, 309, -498, 159, 262, -424, 180, 235, -128, 1086, -642, 378, -73, 478, -82, -897, -235, -227, 298, -648, -179, -782, -232, -339, -233, -661, -54, -227, 246, 27, 290, 360, 964, 430, -67, -92, 44, -206, 172, -530, -39, 309, -95, 11, -383, -837, 262, 203, -91, -397, 116, 1077, -61, 217, 410, -2, -199, 93, 291, 219, 441, 273, 4, 390, 470, 245, 220, -59, -86, -91, -70, 5, -146, -166, 83, -220, -88, -69, 341, 484, -316, 275, 173, 68, 121, 41, 497, -125, 142, 703, 788, 74, 135, -179, 57, 275, -575, -38, 109, 29, -485, -650, 77, 616, -335, 81, 273, -452, -200, 755, -277, 212, -287, -88, 149, 291, -184, 286, -460, 694, 34, -497, 127, -666, -466, -635, -828, -351, -361, -306, 338, -573, -380, 150, 160, -272, 290, -697, -698, 21, 254, 534, 245]
3204B45q6K65l36P41j106N9L91m20N6m88r6J60L28o94N78R1J76J61L34l57K74
3225B76j20m20O73k18k12M47J01q72L84nJ34l39O50j016M45L00j12n49J51q2k20
3246f04J7M03K5j79K96J4K98o70n7R31j239P79J77j36k26P90l34r3l04m4l29L29
3268a56j56K1jl47L56L72m27o59J134j06L60k98O8l27O81k39O91o9j55k4o60L5
3290I4J81J62n11j06n7j07j00L35j76J9l08J66L55j92k7O30o63N88K9M20j131
3311c99J248r33j79O21l49K69q23O68k99L7l94R2J46K37J73l23j4q4j15L47j77
3332b51M30Q4o68M87N99k7l02K16K26q63L71M5m24k43P60j92m24J04K4m60J14
3353c94K32J97l86J44L93j00K43r83P79O9O0k6l2J0J7l57j14O28o87N71m3m38
$$ y = [245, 159, 424, 88, 829, -277, -218, 173, -247, -191, -679, -775, -615, -287, -981, -403, -312, -136, 25, 359, 2, 276, 156, -264, 409, 191, -21, 426, 527, -345, 39, 34, 168, -171, 479, -537, -92, 208, 96, -453, -302, -384, -604, -587, -184, -159, -338, -42, -28, 270, -400, -457, 474, -765, 14, 191, 55, -171, 619, 285, 192, -112, -156, -485, -156, -312, -291, -292, -639, -283, 89, -338, -997, 137, 31, 391, 93, 161, -166, 515, 276, 967, 898, 743, 719, 59, 94, 275, 437, -74, -180, -237, -344, -444, -109, -285, -266, -574, -408, -53, -245, -272, 358, -305, 283, 312, 732, -399, 849, -84, -263, 358, 9, 278, -545, 123, -176, -139, -533, -441, -295, -58, 115, -208, -222, -306, -421, -74, -251, 179, 263, -405, 82, 681, 654, 352, 568, 794, -69, 302, 347, -77, -320, 440, 248, -176, -72, -48, -508, -394, -162, 35, -351, -207, 186, 86, 329, -654, 125, 194, 254, 228, 196, 206, 223, -134, -248, 380, -307, 264, 221, -217]
3375b17j53L10J89k25j95J95L27o18M2k41Q42m06J70N99m67k3j36O4Q1O2n75J081
3397G06m00R9m75K48l43j57j58M35k18L51q4m08M63L7l77J59P59j112O11K8Q6
3418B50l14m2j70N00k6J91l22p6o1Pm83R3M93m10M41o72J086r74N16K70l80K45
3440A62J5n76O66k7o06Q45P8j86k51l97L71n10R38m72J20L49o83O0K56l82p6N9
3462b47l36N00o88N24l38P97j53J50l35J01J07M55o96J16P53p10k28M6L93L33
3482E44q09J49n4M71o93J48k1q7K11p34J390n89j50J63K84p55L73N63J44k25j21
3503B02p49R47m51j46O11n24Q8L85N91r95O50j075K42J17m33P66o02K34l21O78
3523B15l61M06L53r52N73o45M62N83m82m5M6M42o53k21O73l9j231N71q1Q78r94
$$ y = [-217, -370, -60, 129, -96, -291, -96, 231, -387, -345, -586, 256, -150, 20, 619, 152, 129, -7, 57, 138, 200, -375, 706, 306, 405, -70, 178, -165, -322, -480, -45, -263, 88, 4, -404, 59, 96, -281, -122, 637, -475, 136, 164, 250, -64, -106, -276, 224, 198, 389, 67, -9, -70, -63, -546, -453, 40, -370, 71, -601, 485, -489, 27, 297, -83, 162, 177, -399, 267, 240, -366, 479, 557, 371, 120, -277, 94, -416, 522, 50, 170, 519, -164, -104, 152, -230, -306, -247, -583, -83, -771, -247, -585, 212, 59, 209, -126, -25, 82, 537, -159, -43, 710, 0, -228, -182, 211, 544, -265, -116, -170, 301, -392, -244, -265, -352, -141, -875, 515, -74, -224, -61, 223, -532, -159, 404, 548, 323, 202, -547, 400, -51, -197, 414, -110, -22, 363, 954, -41, 609, -466, -224, -107, -540, 226, -376, -142, -463, 215, -146, 260, 613, -339, 234, -411, 51, 634, 152, 107, 153, 595, -58, -279, 394, 355, -876, -305, -386, 492, -502]
3544e02l12J305r00N63q8m53M12rJ09l13O38m18M46n01R7N1n2N56n79Q3K15j97
3566A51l13K72m79L77M58o15N72p84K83l31P26p13O39Q19q35J65o51Q7L5Q3l40
3587c94L01K72l38j74O15l39P1m55j12J271j112P19K64p26l52M43J11l84Q08o50
3607a61k42N61m82M82p4m6l43N1M74l31n4k13P22k0k67K25Oj042J157K9o4l79
3629a1K40j21JJ30J14k92M5k3L2k82N85k69K25J22j00k69j25L96m33k71l06J294
3651F82q34l6m26N51O4k12L59J40p15M24L17o2j34m03O13N1k89k17M11l50o00
3672f66M04n9P1J11j73J55L6J70r28O07N89m41J4M7J24K80m54o1K88M0j06M54
3694E02m99J9J79m79M03M3n93N66j44Q4n15J17n4K29j00j10j52M59m96L17N26
$$ y = [-502, -814, 491, -409, 154, 66, -387, 25, 16, 125, -188, 450, 32, 478, -23, 74, 125, 73, 629, 50, 133, 348, 151, -162, 110, -369, 8, 466, -149, 423, -361, -78, -409, 317, -396, 243, 1062, 227, 392, -259, -172, -137, -54, -394, -93, 179, -159, -333, 282, -57, 14, -441, -553, 718, -394, 325, 589, -137, -489, -46, 65, -319, 489, -161, -403, 158, -324, 158, 84, 38, -305, -254, 220, -111, -165, -378, 344, 324, 57, 282, 288, -754, 403, 432, 368, -11, 229, 108, 109, 239, 353, 61, 106, 83, 115, -167, 418, 149, 374, 496, 396, 127, 2, 398, -35, -306, -612, 682, -152, -188, -614, -63, 1, -211, 148, 288, -427, -3, 314, 252, 118, -285, 328, 379, 90, -127, 284, -66, -666, -262, -321, -250, -139, -312, -157, -121, 49, -879, -272, 317, -124, -110, -63, 61, 341, -113, -174, 114, 154, 48, 502, 3, 22, 201, -278, 125, 168, -425, 141, -3, 81, -434, -317, -371, -142, -242, -352, -504, -45, -541, -224, 302]
3715C02n34M63j50J45l02L81l12L43m88r1N72n37l10M77M2K6k5r6p2K09m26k80
3737f63M81QK68K48m72J01J34j06L64l72M8K03n38O48m2o89mJ46O04j91q37N66
3759i5K54l29j70K92m31J53l25R2L23M50j05k75P04k20p3l52L08n45N19K13L3
3780D21l28n01R54o70k39L32N7l46L19m94L76j03N06o29J59Q48r29j03M55K30
3800C15j23k06M86n91L41j61L38o45L39j82q6k92L72K46k78j01m70L60l48M63
3820b23L42o05N5R8M90j35M19o72Q38m19j30J85j91k37J3lK65J00l57K61Q5J02
3842B81o91L78j15O05l96k37n63Q90R9k10p48M83P43m90J02r22Q80p7K70n83K83
3863a8J23k28K39k12kl1l60M05j25K78n25J75J40M7J66p5j44Rm79M48J42K31J14
$$ y = [302, -232, 231, 81, 226, -76, 305, -7, 336, -152, -243, 329, -208, -518, -41, 1, 27, 2, -94, -166, 43, -383, -663, -182, -174, 94, 342, -130, -29, 105, -1, 363, -9, 39, 242, -296, 352, 310, -379, -383, -237, 367, 176, -661, -95, 159, -170, -340, -48, -479, -326, -651, -559, -236, 214, 109, -166, 538, 318, 245, -107, 201, -344, 175, 388, 421, 93, -408, 546, -124, -363, -31, 26, -320, -1, -495, -119, -222, 284, -345, -186, 662, -267, -370, 85, 315, 192, -14, 472, -119, 222, 61, 399, -246, 93, -89, -175, -467, -95, 151, -127, -228, -698, -338, -686, -223, 119, -486, -431, -333, 157, 22, 441, -231, 607, 188, 58, 243, 52, -185, -172, -175, 90, 190, -167, 94, 179, 281, -410, -32, -147, 458, 62, -175, -738, 152, 251, 41, -707, -224, 519, 29, 131, -791, 89, 12, 282, -301, -18, 105, -123, 116, -96, -98, -129, -489, -84, -209, 69, -456, -281, -141, -94, 72, -3, -147, -138, -617, -169, -27, 204, 318]
3886C18j88j52J18P22p18L05p60p2L07J39m46Q55o82K48m08R0M8J27k85M08K50
3907B24j81Q88j025J62K12R5j58k34j42l46N42o0l17K36K76nl97l6o96Q11J93
3928D2j39o89O08j20m1N79k89O00l84o23L64J05J83R8k43K61j21o54M22k1l62
3949d24P30p35O5N26J9k69J88K43m3j061L97L70J92l1l02M93k27K46k78J45L28
3970E72n39j98J23J31q51J59M59m35P08M6j56l91R8K50l17k93N83L08j73L3k68
3991a51J22N51J40k7k08l97j9l47M08M23m22J80j28p65K21N99j22n59J02Q31k41
4012A91m19L59n47J268N0q22l13M60P6N5K84n44k69Q4L23L54m51j79n07J93M29
4033G5l44j19k86R17k72l07m68L14N19n26K80q5N38j23q0j15P47Q9n38L53j266
$$ y = [318, 130, -22, 96, 818, 100, 405, -355, -427, -120, 19, -427, 428, -254, -6, -414, -324, -276, -149, -434, -26, 224, 43, 931, -94, 68, 280, 375, 217, -17, -159, -505, 37, -23, -340, -104, 172, 167, -230, -266, -962, -151, 42, -97, -786, -178, -298, -339, 240, -49, 551, 167, -456, -92, 13, 196, 294, 51, 312, 191, -463, -41, -62, -424, 306, -429, -364, 162, 181, -88, 100, 343, 300, -761, -364, 6, 198, 167, -135, 358, 131, 377, 99, 244, 572, 33, -165, -42, 89, -762, -603, -144, -579, 129, 175, 19, -372, -274, -24, -341, -634, -51, 257, 84, 117, -151, -29, 522, 662, 635, 427, 30, 11, -336, 72, 495, 73, 253, 125, -640, -419, 180, 58, -501, -399, 432, 191, -228, 131, -416, 852, 902, 80, -233, 227, 303, 358, 642, 98, -171, -87, 236, 590, 139, -40, -547, -354, 75, -269, -388, -674, 243, -29, -336, -804, -490, 29, -497, -217, -302, 236, 113, 33, -82, 665, 754, 216, 569, -697]
4054f97P25r6M19j07K53p43K54l76K13J74r13L90M37lm22N29M0j95M30M16p39
4075a1m3P77n65K2N58n13l91n75O08O09r88m8j9R60o45l84R75n80M35m61K03O48
4097E72j090O95k17r8J76J98m10N80l36J90n87N73l16O5o13L27K25m6K94p11J01
4118d28l41J057q32J113j021N09M9Q8n73J79K60K95k69j22M1l4Q8Op9K74O5l32
4140gk81k29j67O96K43j60k6j24J09j09l33M21K03j27L18m95l07K21j61k85P10
4161A10K20j0k23Q6N1l37l65O22p96R09p04L95k88K57O99n97j43k7j34M27o2j79
4183h9P46o70J89M22l01m54P18o40j98p8M57j48K66J30r77L91m4J32J47m06P53
4204C46l59L98k96J46m52L16j79L93J48k66P7l43K89q5J04K82n02M26p57J00P
$$ y = [-697, 28, -68, 351, 244, 497, -246, 8, -368, -155, 19, -894, -504, -67, -70, -492, 37, 77, -118, 312, 728, -11, -54, 723, 158, 180, 738, 225, -166, -741, -133, 476, -512, -560, -579, 381, -264, -648, 327, -253, 182, -279, -76, 572, -518, 177, -40, -138, 38, 236, -174, 406, 70, 260, -327, 246, -70, -5, -618, -291, -66, -112, 182, -529, -428, -769, 288, -544, 569, -452, 57, 106, 194, -379, -200, 60, 355, 86, -36, 5, -29, 59, 65, -14, 260, 325, -7, -288, -517, -684, 12, 255, 95, 69, -55, 54, -55, -388, 33, 236, 109, 427, -68, -375, -154, -315, -600, 110, 330, 320, 97, 183, 234, -103, -468, 154, -642, 267, -437, -42, -330, -73, 626, 29, -114, -141, -275, 152, 90, -89, 657, -13, 176, 598, 297, -157, 561, -79, -277, -355, 102, -46, 220, 350, -627, -236, -280, -148, -1, -407, 346, -13, 385, 89, 235, -217, 99, -80, 313, 461, 195, 272, -71, 218, 133, 237, 519, 17, 443, -314, -214, -207]
4225b07j51M13K77l88O66n81n07L39k32M62J32r8j01M50K21r34N17j92l84M2O08
4246C52n33J23n3O3k15K37K77r02J297p67j67N6O98q61K8J35L31n62R94o45L00
4267A86j90k11J66k61M69l71N5k04M00j98O43l03J97J24n14M1n00N39K95k26j46
4288iJ20oj96o1L61K79l16J51J28l07j87j03K73k91M66l38M21l42r6J76k63K81
4310A41r6J06n52M68M04l10o07P79m44K21k12M6R85j035L34p67J678o84k44j7
4330A94o46J55M53k03L50o7k3n26j7L49p4q02J143m27k28J176j397Q49m90L54
4350A23Kn2j75LP0n5K98m1O2K8j80P6m5n94L70j39J65m8k22L32o99R72l26r9j35
4375c09L63j35K91j23K85k12m7K70m11M13p54N55L95p69J21Q03q67j36Rm53Q55
$$ y = [-207, -358, 55, 332, -56, 610, 29, -478, -139, -371, 91, 223, 125, 24, 474, 695, -239, 278, 86, -298, -256, 352, -181, -58, -111, -48, -263, -26, 251, -651, 646, -121, -288, -232, 466, -395, -367, -232, 99, -463, 531, -114, 186, -4, -215, -49, -310, 159, -212, -157, -361, 39, -159, 484, 181, 378, 502, -12, 29, -471, 68, 363, 137, -9, 111, 105, -91, -152, 209, 488, 172, 323, 451, 144, -43, -146, 127, -164, 302, -36, 385, 43, -53, 123, -140, 141, 45, 151, -401, 67, 471, 161, -446, 333, -111, 110, -102, -56, 929, -106, 228, -539, 1139, 455, 211, 194, -452, -297, 156, -47, 303, 236, 213, -313, -330, 19, -55, -857, 286, -141, -369, 807, -590, 259, -231, 123, 125, 73, -102, -99, -29, -84, 214, 173, 235, 263, 83, 159, 114, -480, -110, -249, -84, -132, -354, -22, -721, 251, -75, -174, -309, 54, -81, 210, 87, 372, 160, 113, 383, -28, 385, -369, 186, 581, -188, -67, 736, -131, -267, -258, -711, 144]
4396A44n80K35K77K88j78K52M1j50p2rN5j23m09N34J97o25l43k3K12N9j56O6J49
4419a59p78J396m89j71j9L11k93M72K0k51K96l81L24M68m17M65l95J4k91l45q8
4440c11N63K22q20n43K34O54q5R9l8L34j67J47o35Q7K27K48L46k40m87o2K64K74
4462C11m21J88m56M54O09k42n57M3m66L07K27L73k06o41N60k26M56o56K59j78
4482b62j40L70K11j20K33q31L36N98m85J95n2m73K56L50n32R17o91q1m01L78l97
4503f21N50p21J208p08N37j14M60o19K93K42m42k16O50j92l24Q4K98m97k8O51
4523D91j072Q24m50J75J45j61L81m33j59N53n82M07m46M81J72j031P80P16m88
4542C03j45m77M91M54m74K3n75J07O13n51M35l44J03o05P28j41r8R7N9k51j0L86
$$ y = [144, -436, -201, 76, 364, 186, 438, 479, 329, 257, 248, 303, 180, -229, 305, 502, -123, -466, -489, -277, -218, -374, -308, -159, -937, 459, -30, -201, -220, 91, -202, 270, 290, 39, 335, -46, 278, 746, 329, 794, 399, 413, 122, -223, -311, 252, 474, -346, -889, -655, -1, -86, 13, -25, 309, 142, 289, -346, -259, -32, 216, 562, 322, -165, -227, 37, 311, -110, 78, -378, 76, 685, 443, -114, -71, -537, -230, -3, 370, 164, -477, 83, -143, 313, -343, -84, -262, -402, -32, 179, 59, 292, -539, -203, 395, -90, 105, 53, -420, -164, 186, -346, 571, -120, -201, -602, -224, -621, -71, -792, 416, -292, 245, 131, 591, -28, 265, 507, 65, -151, 499, 307, -17, 67, 365, -132, -160, 491, -581, 243, -207, -32, 113, -48, 333, -100, -259, 294, -288, 119, -327, 154, 326, -705, 75, 791, 303, 158, -319, 172, 626, 152, 175, -400, -293, 320, -231, 204, -140, -37, -642, 86, -55, -153, -56, 3, -248, -258, 128]
4564A28KM6O6K21l03L12K35m94K26k40r91P65J03O5j64K42j66O13j007N40K40
4585D39l89J48j52l00L30k00J07K39o4Jl20Q7K69M9j71N19n23K72L43m32k99M99
4607D52r65J23N32J77m55m08J67N20j55o17M66L74k49K40k08L54j24m08K71k57
4627a70L40j78n0j80M22o18N19l73p9L85l51J07q14P20J7P8J39L7O16p36L46L7
4649B14k89J99k31j15L39k30l51Q61l96n25O14m52M60o4J60m48l04K64K01j06
4669a99o2P23k40n43K37m83R81l17j96L50j66m93J80M16l57N84m08k2l1oj88K51
4691A1N35l72K0l69Q7L96r4M23r18P65j149P17j47N5J02K63j00j89o75R60K0m20
4713g9N15n61l62Q50o81j11O72l23Q4j38j96J147q56j89N46k73k52J18Q10j025
$$ y = [128, 130, 176, 242, 463, 160, 472, 707, 213, 439, 199, -792, -27, 76, 141, -23, 219, 53, 666, -341, 199, 439, 50, 198, 46, -254, 76, -124, -17, 222, 158, 159, -161, -74, 195, 244, 73, 592, 69, 341, 684, 252, -47, 452, -513, -390, 142, 319, -136, -544, -377, 143, -12, -629, -163, 211, -38, 202, -6, 348, 224, -184, 87, -170, 170, -8, -58, -238, 184, -434, 85, -288, -367, 18, -333, -226, -1040, -320, -303, -225, -86, -49, 567, -169, 177, 214, -75, 124, -107, -222, 117, -113, -464, 397, 1, -524, 90, -362, 98, 34, 194, -254, -558, -294, -93, -199, -261, 462, 222, -321, -84, -567, 414, 97, -99, 251, 85, -408, -228, 188, -169, 415, 7, -15, -46, -52, -240, 11, 546, 174, 194, -175, -88, 308, 214, 637, -281, 484, -665, 52, -95, -40, 62, 325, 225, 36, -639, 321, 341, -79, 436, -125, -487, 363, -318, -429, 243, -80, 4, -134, -330, 817, -39, -228, 318, 45, -207, -89, 721, -304]
4733c04O40l47k21N13k20K99m08n0N6J01j90K79K08j22j71p12L6J93o6J64l25
4754f47P97q2Q3m11M15n0k49j46K30k44J264p85l61r5J00k61O91j9k45n84P19
4775A20k08J38o8j6K3MK68m28Q14j233Q36n47k53P9N77R2K16N3N40q16K80k79
4797A92m14N87n23k87K66M15p12N89J86o36K45j74M00k58k31K75k5K39j13j17
4817i6o47R90l59l9K90r00R36l27M14o26O87n74M11l29l74P21m12j80K91N75k25
4838B27p14N3K76P0J50m2J09N61r39O99l47n60J56K44J94k89J95J86j98l52q3
4859d04R1N50n78j60J02K18J31L11l00l78k07O36p31M81J42M59P8l28J28q58L59
4880b58K14m59L55l6j21j38lL07M58m28p6N8K03R0o6m6P37l62p66L42j55M63J02
$$ y = [-304, 336, -11, -232, 281, 61, 360, -48, -98, -42, 59, -131, 148, 356, 234, 63, -649, -613, -420, -486, -322, -647, 150, 68, 151, -260, 155, 105, -144, -290, -60, -304, 960, 175, -186, -281, -181, -442, 249, 230, -15, -599, 120, -88, 50, -18, -34, -11, -7, 261, -167, 647, -586, 250, -297, -550, -471, 106, 198, 414, 467, 1007, 191, 471, 192, -222, 365, -158, -445, -179, 236, -476, 113, 299, -337, -92, -266, 134, -124, -355, -80, -105, 134, 21, -96, -743, 247, -112, -151, 139, -761, 175, -152, 262, -364, 323, -251, 160, -169, -543, 178, -234, -414, -123, 452, 227, -487, -434, -158, -88, 62, 20, 129, 690, -249, 450, 103, -457, -301, -57, 137, -152, 43, 229, 31, -321, -404, -313, 237, -341, -501, -399, -181, -50, 261, -39, -417, -624, 12, -719, -238, -96, 363, 441, 113, 241, -617, -258, -44, -503, -148, -184, -305, -443, -446, -139, 319, -109, -185, -127, 76, 166, 100, 54, 791, 429, -337, 5, -150, 313, 415]
4903D15J04l14m73J021j044K94l76J22p03J016J46k49o52L12M63k11R1k78M67
4922A51m8M00l61k02j85M13k83o7J54k59J85K50o40P63q63Q74o24M08j49k28M35
4943A24l9K65n27n5Q87o60o8k77N50M8K96n86k57K87N32l96l03J26K70l59l38
4964d80N34l19K09j68k7n6L63l81Q6L09o45J055l34k84j4M32m78jL59n37N61n93
4986d09J07M33m17k8L00K10n28K75l4J38K40q03N96k87p3j31O88n24L82j47Q1
5007F9J14PL11p01M55Q0k47j89k57P04p49R3Q83j453R54Q3o4q7r7m05k2L98o59
5030g79R11K8m22N04m34M36l11j2kP07p86R21q33K46m32k19J256m90q15N40m6
5051c2k70j85K10l45O38n50Q98K7o0l44m23O41K32k59M43q70K64k51P3j07r0J70
$$ y = [415, 519, 205, -268, 753, -291, 3, -373, -251, -954, 62, 208, -41, -693, -381, 82, -129, -38, -316, 151, 103, 503, 142, -60, -245, 168, -115, -182, -28, -287, -102, 148, -492, 271, -592, 282, -342, 66, -83, -311, 124, 85, 350, -177, -232, 655, -5, -73, -350, 200, 248, 544, -42, -299, -12, 520, 124, -179, -53, 217, -142, -480, 54, -265, -56, -224, -251, -307, 56, -325, -239, 70, -575, 480, 146, -138, -152, 280, -198, -199, 160, -377, 184, -409, -302, 131, -286, -314, -14, 196, -332, -57, -91, 47, 287, -516, 80, -207, -280, -411, 277, -247, 135, -12, 69, 183, 190, 501, -200, 255, 335, 88, -101, -358, 346, -403, -310, 573, -880, 74, 157, 93, 6, -91, -496, -518, -120, -779, 132, 160, -262, 242, -192, 244, -67, -79, -81, 626, -160, 761, -72, 174, -258, -477, 779, 289, -526, 14, -32, -302, -487, -277, -622, 16, -534, 364, 391, 331, -13, -436, 205, 437, 178, 621, -249, 15, -236, -163, -270, -360, -190]
5073a90J01J82k36P43k52j29n39Q9L81o23M47o10R00o2m13L37K82J2k35m49K72
5094HM99j86k4l82M81p42K97r9k98K56O04p65M10L29l91O38j256R44l39j17J05
5115b8Q40r40m2K46k85m09M56R00p83j44p8M18L06m96M33k85k08J25M73l87K54
5136C66m91L54m73n1R51o16o3k65J55k38N28o18Q74m01k42Q9J31L75l38l30n4
5157c57j5J17k25O14m36M15k86N08l13N49j037O20k57N36l76L11n58j92N86l06
5177a02p2J79J34j48r7j60J79L0j69N77k97o07K60n93R54j50K50q6l00M32j25
5198H9K43m42j47N89m61M01m81K22j236J265L04p34M69p10L05N61M18j050M75
5217H0Kl51P3M16p94Q86J46o91L01m5k10K27k9p5q71M53N37m17M16K93o87J98
$$ y = [-190, -89, 93, -143, 600, 348, 219, -320, -231, 150, -473, -26, -636, 264, 202, -211, 126, 408, 420, 185, -264, 8, 507, 321, 297, -85, 396, -346, -49, -148, -446, -190, 414, -351, 59, 388, -3, 635, -621, 323, -16, -133, -28, 812, -128, -170, 76, -209, -618, -162, 738, -45, -189, -267, 151, 457, -39, 394, 109, -99, 26, 499, 112, 366, -125, 229, -244, -295, 656, 40, -23, -288, -133, -371, 157, -461, 413, 12, -230, -141, -10, 365, 27, -303, -357, -372, -255, -480, 134, -302, 113, -173, 335, 22, 571, -466, 154, -103, 433, 57, 368, -190, -382, 204, -102, -174, 5, 139, -9, -106, -266, -87, -57, -226, 351, 54, -553, -293, -886, 68, -82, 168, 82, -218, 214, 89, 332, -110, -257, 332, -129, 272, -209, 13, -1223, 42, 346, -388, 81, -629, -324, 237, 655, -395, 80, 82, -269, -196, 220, -574, 312, 458, -233, 68, 23, -187, 40, 11, -64, -935, -482, 55, -362, 54, 347, -340, -142]
5239a42L11n98K64m39M92Rq1J36r1K19M8J15K4P5l84R49q62m89M06J25R4j36M72
5262E17n0k01p15O92k74j91k08K73J67M34p74M19n43R4N20j75k9P1L9k52M39j57
5284I6%L84l36k61MlJ89J12j00j10O15k21J76n33O05r62P28l91q9K17P6l29K50
5307A17K71m75N24l60j3K37O9k43k66m14K14M30k47K62m42N81j60M12j85j84K14
5328C42p11n0M79M52q49K94L56j77L11q38M11M88j018L84M16km35r1K74n60O41
5349A17o34O94J3p87Q31l65J59r1k49M14M26n98K7N09k95l64N66kJ42l82M05N6
5371E92k14j34R6k60M5ml46J74m26M17k70K74n94N36J72j12j01n06P02J42j61
5392B2l42P51m34N43o53O92q70M79j99n93P66l59k06L39M31j011O39l14L69N21
$$ y = [-142, 169, -429, -165, -604, -112, -103, -184, -48, -139, 80, 128, 243, 267, 342, -42, 907, 45, -444, -38, 87, 181, 45, 517, 467, 266, -449, 243, -31, -222, -430, -157, 10, 444, -330, 89, -454, -360, 160, -15, -44, 27, 66, -186, 253, 96, 96, 480, 144, -117, -113, -116, 73, 185, 85, -25, 590, 369, 545, 12, 617, -345, 383, -8, -97, 120, 196, -133, 117, 388, -87, 437, 77, 64, 301, 370, 127, -139, -553, -339, 91, -156, 106, -336, 245, 85, 497, 312, 128, 342, -369, -419, 60, 512, -337, -43, 313, 136, 447, -391, 20, 508, -510, -126, 290, 288, -147, -238, 36, -524, 117, -517, 177, 190, -597, 234, -131, 28, -63, -312, 102, 528, -70, -43, 466, 171, -193, 373, 371, 513, 131, 536, 592, 378, 244, 340, 80, 125, 121, -225, -51, -477, -60, -330, -56, -650, -114, 58, -54, -155, -661, 41, 183, 22, -320, 431, -3, 540, -113, 579, -291, 188, -11, -604, 162, -197, -403, -64, 367, -644, -5, -319, 50, 571]
5412E71j023N62N02j060Q38J43l80j49l46M73k28l45J03N20m0k16o5r6L2Q52n6
5433E92j260O60j96N71n84n27Q49r0n76K78P37o95J22K04j80O35q06L63o2J64
5453A99j85k74l84K31l85N71K57m30O74n39r3O86k82m99Q60j44n01p2J42L79M0
5474B51n76O09j00k7l99L77N1o55K28j28N9K03L68j08N3q39k28Q54J38l32j35
5495c36R00k39p27M06M25l21k42j12M72p26N94k2n35J19M31M16o76J07l39K16
5515a89M6K24q1oq9l15k2J08L75l94J97J54r3k78M15k3j76k25L09N70n33l64j3
5538d03j14P76k73m05M7P28o32M3J52j95M03l63K75n10k60N90K60j17n3j58L69
5559A60K59l40j17L40j005R44l92J50q1j41J31j57N10l76j42Q3o54J030k63O34
$$ y = [571, -452, 110, 612, -448, 390, 533, 153, 4, -342, 131, -97, -442, -339, 181, 141, -75, -140, -236, -204, 648, 592, -668, -8, -204, 367, -217, -744, 105, 15, -561, -283, 454, -241, -119, 85, -95, 540, -266, 97, 35, 199, 14, -260, -644, -413, -798, -227, 30, -400, 274, -265, -358, 328, 46, -453, 407, 263, -238, -310, -168, 211, 251, -325, 284, 184, 157, -242, 135, 186, -469, -241, -369, -310, -107, 261, 153, 206, -633, -861, -7, 131, -201, -336, 564, 325, -402, 4, 429, 108, -134, -246, 226, -500, 94, 72, -463, -344, 87, 503, -173, -66, -405, -189, -143, 81, 0, -6, -95, -410, -432, -324, 51, -343, -146, 8, -85, -363, 52, 29, -147, -372, -63, 507, -26, -390, -403, -517, 259, -14, -419, -372, 356, -276, -233, -81, -276, 127, -236, 39, -471, -731, -141, 119, 2, -51, -209, 160, 419, 79, -38, 302, -703, 241, -151, -1, -82, -223, -92, -249, 261, -115, -257, -174, -828, 202, -61, 573]
5579E73l34K2K58l28o05M21L52l56K3N5j079J018O4l4N46p87j32K42N31q8l98
5600c6j78O83p81l93P12P43o71L15p28R77p16M79j73j71K81o40j47Q97q35p9Q37
5621C76m09p00N17k06J95L64l45M53k81l59o44Q20M56P0o52Q83l55R9j16j17q7
5642c8Q5l15R9K03l20J60o3Q77o17o52K03O3M58q9n38M45jj9K65n5k71O0R7l59
5666c22K79j69J54J0P0l60M20M37n05o39N01l29j41Q76k36L00l3o26L64J49K40
5687D40q11K95J68K72k19k35M75k89L3PK32k10o8o8j04n79k61Q07M01j6j1m88
5709b29P10p82L23J48n14Q04p78L23O99o60k4M78p99L22O52j421R90j52l6l77
5729c23k64O07k8o1k63K48l75L58q3K0J91O9Q8j35M57r05r9O41m82l62J288l95
$$ y = [573, 239, 261, 519, 191, -414, 7, 359, 3, 26, 81, -998, 20, 84, 50, 596, -191, -323, -81, 450, 362, -36, -214, 469, -312, -705, 7, 750, 79, 394, -334, 643, -73, 406, 233, 62, 343, -297, -444, 453, -382, -461, 376, -33, -733, -216, -422, -227, 137, -208, 245, -36, -395, -1039, -219, 237, 307, -345, 538, 183, 282, 166, 49, -38, 47, -268, -169, 34, -286, -126, -189, 688, 71, -581, -378, -315, 143, 54, -484, -39, -40, -59, 206, 151, -120, -60, 37, -322, -43, -212, -58, -48, 22, -338, 82, 519, 14, -625, -124, -453, -594, 282, 46, 346, 313, -313, 51, 200, 440, -371, -76, 92, 364, 145, -90, 385, 96, 129, 136, 368, 158, 90, 22, -82, -661, -922, -115, 286, 270, 259, -229, 481, -301, 22, 170, -344, 460, -318, 5, 704, 44, 20, 498, -301, 21, 673, -748, 242, 90, 54, -323, -587, 20, -8, -69, -332, -84, -459, -101, -184, -164, 27, 96, 184, 49, 506, -399, -498, 143, -339, -701, 587, 192]
5751A92l14l19N52K31l42j79M20n26l2K16J21N07k90L12m96K44K68m89k56m5O3
5772a62J28M43k30l19K51n54J22K60k3J69m27K83j16l04N13k53J5J05J26P31r84
5793b26M72K06l52J99m73N62j35j53L05n32L73k86K48L18o93j49m84J105m3q15
5813e53l03J184p09O18Qj051J023j85N06j76j75M27j018K70N29k59L70l81m7J06
5833A84J55p53J08m62Q63J55M3l40J3J92p26M25O40n12K67L11q64M63J14O0m73
5854a37N38k46k80L95l83n11J043q56Q28M73j052P8K53n11N39m51M39q05R03l43
5874h6k52K03P20j050N27j81J25j39O13k85L4m8k91M94q25L42j45J73Q3Jj88l13
5896d88N86J47m5o70K17J34r1L9K43k30n1k62L13K01m37N21Lq8m4m05M64j57K61
$$ y = [192, -122, -441, 111, 342, 0, -179, 241, -285, -317, -101, 20, 527, 237, 549, 53, 297, 565, 76, -180, -225, -162, -34, 409, 179, -140, 111, -443, -321, -61, -84, 85, -342, -59, -175, -479, 34, -219, -204, -99, 27, 758, -226, 246, 452, 100, 299, -174, 388, 253, 100, 405, -127, 246, -40, 208, 526, -167, -316, -800, 305, 262, -553, -856, 328, -381, 237, 245, -806, 217, 32, 538, 362, 187, 614, -404, -134, 395, 136, 506, 125, 78, 184, 339, -414, -306, -768, 95, 250, 293, -47, -34, 158, -568, -143, 497, -15, 252, 563, -301, 162, 276, 336, -137, 401, 155, -125, 270, -113, -624, 419, -437, 391, 864, -188, -110, 143, -368, 171, -280, 159, -646, 257, -86, -338, -135, 585, -465, 62, -119, 6, -133, 480, 195, 229, 181, -110, 384, -441, -99, -244, -71, 12, 13, -175, -488, 98, 245, 200, -470, -253, -119, -210, -171, 72, -158, -209, -471, -158, 43, -394, 127, 130, 42, -2, -407, 57, -100, 161]
5919A61n56L2P08j51R9q6K60n3p10L80m34O53k88O6l53L13M04p71P03l65j53K6
5941a15l43M28R4O4j83L06j97K40k66j08P8q20Q59M40o66L5J83m5k82J72N76k61
5963A89l28J97L05j83l34m83J069n56j8l36J307k24p06m74K2N56L07l84r7K11
5983D0P07r21j25q0M28L86l07k1l55J35K61J033r90o3m24J84O06j24%m76k89n27
6005i22J189o43K90L49p64M26n72K89M50J47p0j91m86O38K85m52K65o52J64L49
6025H9l92K53R5p1lJ63m67J58L72m2k21o28M45Q6N03n60L9L92p29J113j112M84
6047c3J90J17k78m33O16p6J64k95L8l03J65n1m52L19L50k48l10L98K45j52M47
6068D18n92L24%P3m76L38R2q3M96m94J72j79J67k52l02J04N25l73J79p68L24j19
$$ y = [161, -395, -363, 345, 194, 293, 207, 467, 414, -296, 84, -350, 303, 15, 81, -272, 41, 445, -326, 377, 12, -141, -115, -458, -30, 64, 128, -55, 251, 54, 294, 28, -80, -2, -822, 37, 477, -189, -154, 29, -16, -298, -126, 450, 189, -139, 58, 363, 180, -154, -637, 432, -124, -142, -478, 829, 605, -101, -575, -553, 3, 310, -74, -171, 40, 747, -174, -299, -379, 49, 435, 128, 107, -248, -113, 148, 1181, 191, 128, -296, -112, 494, 370, 370, -106, -395, -922, 267, -376, -86, 263, -501, -75, -647, -358, 92, 239, 169, -22, -508, 130, 415, -37, 228, -424, -260, 89, -303, -50, 45, -26, -29, 134, -333, -175, 197, 155, -66, -694, -249, -163, 340, -220, -181, 211, -518, 595, -517, -33, 157, 274, -4, -437, 179, 103, 267, -28, 10, -293, -128, -179, -631, -312, 38, -210, -520, -122, 123, -29, 418, -174, 150, 150, 223, -253, 85, 177, 94, 590, 96, 268, 89, 256, 4, -298, -194, 331, -42, 137, -631, -307, -426]
6090d26L90n11M26J78j67m4L70M24o13L76n32N25k04k13K66K81q22L7L76L07r33
6111e09M09K04N52n41m39M14m57O15M05l26o34m57J161m56J63j29K67P1n63M80
6131B30p25R76o44r45J058M05r87Q39m56J43m87K43N46J5n39K93k42L6N86q32
6151d87K85O14m48k4L06J15l64j49K1J56M1k4j07L03n92q6O48r2R3k90K32M71
6173F22j40k28n52L66p80Q52J04m71L92m52O04R4P8n57L59p26P06k81O85p13L38
6194C00k92O5p26N71P18j27o87L99k15n51J027R6j124O36k9j42j95N17j12J94
6214C23p9K04k08m38l96O21j07m3M21q02K66j25O39o19M67r82J027l51R30j092
6234c44j71P38j202Q25j65O94k02l46L32n41P1N12m33j62N75l6k43J86K31l51
$$ y = [-426, -36, -547, -121, 57, -110, -154, 216, 640, 27, 403, -129, 396, 192, -21, 245, 526, -296, -259, 117, 424, -509, -100, 104, 656, 115, -324, 90, -367, 248, 653, 327, -307, -764, 397, -59, 104, -25, 242, 313, -250, 230, -495, 481, -163, -1108, -50, 355, -632, 207, -249, -106, -593, -350, 196, 211, -328, -35, -277, -241, 345, -487, -202, 412, -36, -60, 246, 361, -3, -152, -131, 25, 66, 42, -65, 238, -354, -440, 208, 116, 209, -81, 151, 622, 482, 254, -298, 68, -712, 140, 244, -227, 165, -287, 317, 411, 489, -68, 291, -435, 271, -10, 675, -38, 300, 8, 73, -653, -82, 636, 509, -178, 221, 6, -545, 482, 578, -546, 90, 61, -81, -276, 241, 129, 323, 244, 448, 240, -198, -594, 27, -80, -123, 298, -504, -238, -363, 276, -343, 124, -858, 169, -182, 748, -344, -515, 223, -979, -154, -319, 375, 173, -173, 159, -382, -311, 201, -232, -394, 181, 145, -98, 88, 319, -32]
6254c2M9m32kN32l52K92o4J49r04N08J53j15K43k0r6R1j21P5l49M02M28n48J17
6277Dm93P58o63K27O2M2N3Q3j90K48p47J004r5k28nk67P9L73k54K00J02l95k82
6300c84M12L18n41r5L56K07K51j222P62R9L54j9p69K45N95q06l7P09o3o49M10
6321A33l72O39j75k95J99p20P86m35M20j73K41o00R35r25J5J94l89L64K13KK28
6342B85m29m44O10K34m11J52j3O1k01K86L75m31L90j06Lq67j31O65L26j285P76
6363a55N4J65l66P95n03P5j21l4K62j08K3l7k20L25M9k04N55m43l90j63M5O80
6385B84P3l63o1r2J67m31K83o7P37j52n76j47K88j47L29q4k4K37n4m97l91M26
6407b62P97o91J31O50o24K94n52k03Q33q17M86k79J21M28J95k11j6n42o0p5O63
$$ y = [-32, 17, -415, -417, 115, -237, 55, -9, 140, -764, -256, -103, -218, 25, 5, -91, 0, -121, -46, -395, 7, 435, -113, 4, -489, 269, -394, -167, -105, -63, -10, 73, -117, 131, -616, 388, 293, 65, 60, -207, -128, 245, -9, 191, 293, -102, -384, 28, 346, -195, -290, 66, 273, 524, -698, 64, 163, 517, 498, -271, -26, 569, -237, -274, 435, 372, -277, 133, -239, 400, 225, -70, 129, -591, 195, -240, 180, 7, 248, -352, 583, -342, -327, -133, -522, -158, 55, 57, 285, -144, -588, 22, 256, -155, -3, -16, 45, -156, 130, 505, 74, 464, 358, 361, -506, -637, 28, 354, -931, -155, -101, 64, -302, 493, -10, 65, -56, -90, 172, 64, 87, 50, -170, 155, 204, 0, 555, 112, -278, -441, -396, 284, 357, -6, -67, -159, 8, -423, -140, -207, 530, 378, -198, -345, -57, -204, 125, 41, 17, 254, 200, -297, -688, -262, 535, -156, -25, 625, 1, 295, -257, -460, 373, -444, 42, -237, -116, 312, 507, 296, 280, -262, -322, -397, 266]
6428B66J39rj82p25P80n43l32Q79n26L50m47kK05J83m74L66Qn0M57j75j91k21
6450b44K25n66M52J04K13l34KN1J48J46l36J52Q0J63n26K87l61N45n75k94P21
6471E3k64R52q67k40N05Kk95J54k10r1L71L42j99m26O03Q6j21r17K93N30q70P35
6493A26m01L65l38m4N30j52J97l15k70M27m0K37q14J072j061P11K18o71L74J0
6513A61j86k3J19J31k51L23l91m29J375j012J65m91N42n2k32j70Kk99N70j75p0
6534c93P00q6j32l53L66j84k74j74P90ll18m40P40j55k46p1Qk08P60l3n72Q35
6556E57o91K06l21K03M29m60l42N32L99o66Kj47Q49m01j85K96o88K8K88J34P7
6577I9l45K88q5q61P90P04k17q52O41n3j75l58M2M19O68k87n78Q0j5l94O57k82
$$ y = [266, 405, 396, 214, -511, 269, -274, -606, 273, -253, 97, -350, -352, -147, 36, -438, -72, -64, -114, 343, 168, -23, -244, -19, -585, -133, -29, 184, -150, -148, -97, 51, 197, -139, 13, 93, 256, -270, 17, -344, 201, -374, -668, 53, -211, 741, -126, -366, 139, 141, -154, 0, -210, -301, 70, 412, 213, -213, 390, 476, 355, -562, -269, 261, -609, 126, -275, 90, -248, -292, 238, 86, 283, -32, -302, 125, 85, 322, -492, 580, -481, 230, 448, -223, 151, 161, -25, -48, 71, 202, -49, 274, -117, -546, 829, -183, -18, -509, 33, -19, -251, -421, -419, -718, -148, -323, -393, 307, 221, 89, -264, 102, -82, -356, -530, 260, 257, -61, -501, 239, 84, -162, -233, -225, -433, 327, 294, -278, 557, -134, 72, -249, -46, 383, -77, -419, 113, 512, -154, -152, -299, 550, 149, -36, 260, -428, -400, -112, 22, 99, -246, 42, -43, -904, -114, 590, 373, -479, 162, 109, -66, -424, -382, 37, 705, 418, -160, -80, -95, -489, 168, -114]
6599a14K50l30K74J02k22J03K35m18Q7k9j13M57o04j47J53J095o88j74k68L31
6619b0j80J88k90M84k62k53o6L39M08n64J33P0J96m2p07L3Q28l01K57j95j5n27
6641d86K88L83l25NM48n48M43l03K38p67M53N62kL79p27k9Mj72j67O76m93M66
6663C26m93M51k7k72J32k09l81P01L45k32k28K44o59K51k12L18J38k70l00K21
6683a56K02k28J12Q2J72k9k66R1M3j11M12j76K25m36N11n77M96j74K87p94j35
6704d49Q23n93K25k67K00L00m83K89k52L33l37N32O04j030P07q37L02J36p73O05
6724C5J53k5N15j252O14J34q61J202j070R51q56Q14n29OJ07k63N52l6k10M71r9
6745C53J65r6m89J77l46r9J123j020j06M57k29k31M85J90k3p56N79j18J3n1k56
$$ y = [-114, 136, -194, 80, 182, -40, 63, 298, -120, -33, -62, -175, 282, -322, -469, -316, 779, 91, -83, -351, -20, -200, -12, -302, 182, -80, -333, -399, -60, 348, -216, -83, -13, 183, 141, -566, -533, 295, -6, 251, 56, 41, -486, -198, 185, -140, -135, 313, -235, 208, -95, 143, -624, -171, 391, 389, 768, 41, 12, 16, -156, -323, 353, -140, 326, -167, 284, 257, -15, 117, -92, -473, 228, 573, 341, 113, 357, -302, -51, -263, 55, 193, -77, -377, -156, 46, -182, -70, 12, 184, 155, -111, -20, 23, -88, 324, 148, 373, -63, 448, -129, 367, 193, 480, -314, -449, 374, -219, 6, -261, -61, 239, -244, 45, -207, 126, -211, 321, 925, -105, 602, -235, 67, 203, -570, 35, 188, 163, 678, -574, 40, 174, -687, 515, -555, 396, -460, 354, -175, -169, -62, -325, 227, 191, -19, 452, 353, 518, 422, -67, 110, -236, -335, 788, -232, -338, 119, -110, -341, 144, 334, 311, -445, 134, 16, 29, -22, -278]
6766b78O41o81O77n10o7K33J5J91o2k47J79j93k6L67J89p50N72q17J006q43N62
6787A58M79j090N78q26J282p98J60l78P44O5J56l72r3P5N16k15o47N85P2m69K7
6808IK73O55o08l66j73J99k7J6K65j16n38K27L29R1l38j55O50m62M80m85m76N86
6830C6j43J09O4k21J14n35M87K07M27n26M74j78j307R75l41J5L8J98R7n64K35
6851c39j22K70n00P76L77o22N12K7l96r4L31P4J11o50Q72o29l94J84J60n39O05
6872A4l58j14N05J5j2j31M6L94l53M23o62N20j03J57n99J6j32L22P72m19K7j92
6894A36K47o39j76J71O28n01M84l31L78l44K05k36J8N92q97M87n2m05K98j78K76
6915A61j06L03p77O95J43l94O2l0M30j346P19j22O93l75O72q73R05j147M7J13
$$ y = [-278, 363, -318, 359, -151, -218, 15, 30, 221, 159, -88, 91, -102, -128, 239, 428, -322, 250, -567, 439, -404, 158, 637, -453, 125, -701, 581, -217, -57, -435, 309, 374, 530, 158, 65, 140, 656, 441, -206, 379, 451, -18, 9, 282, 937, 329, -37, -210, -11, -38, -22, 243, 127, -411, -184, 145, 236, -102, -257, 393, -69, 411, -74, -550, 36, -107, 2, 66, -155, -41, -576, -89, 118, 545, 19, 493, 315, -992, -17, -358, -343, -305, -107, -10, -574, -339, -461, -191, -691, 85, 462, -160, 352, 379, -17, -111, 220, 294, 405, -245, 627, -2, -396, -212, -52, -591, 14, -344, -458, 47, 62, 50, -81, -35, 359, 6, 429, -233, 287, 184, 341, -258, -242, -374, -52, 720, 301, 328, 136, 383, -256, -432, -261, 367, -134, 350, 19, 397, 53, 258, 22, 40, 632, -265, 222, 170, -235, 63, -115, 161, 55, 358, -419, 276, 419, 25, 87, 57, 487, -859, -140, -262, 431, 56, 728, -145, 760, -387, -340, -227]
6935b27K99L27n68K45M0J26k20K18o3M0m37K37o64L77O17o6M1n43M19k00L55p47
6957c94m33M87L47O8j76J86m28P75l79M13q3o67L97P1p38J005m61J64J96k96L08
6978C62j96N4j29j72L81o86Q1K93J32l19K77O1n71K41J76K65j71j4j07K02j78
6999a8O8l90L01o9K2J5q1n14P07J93n93L33K69j66l3p56N12J20K32k27l83K44
7021b14L89n95L0K74K89J57K20m98p47J035m62M0N63n39L3j7K25N4r6m45n6M62
7043A02Mm27N54J14j69l69k99N5N71q6n22J15K01l33O8Q29Q2r95l6P72r31J055
7065C55j49K26j52K9o36Q08J65q48j52O04n61P31m61J83o02M56M86p95L05J39
7085A31J2p2q6m65P00j56J52l68L11k16k19Q50j324P38k2m49O21k81N19n4Oq6
$$ y = [-227, 72, 399, -169, 76, 116, 242, 22, 240, 177, 217, -220, 17, -647, -270, 347, 281, 322, -221, 198, -2, 353, -394, -827, -340, 7, 75, -101, 85, -343, 432, 53, 466, 383, -284, 113, 184, -554, 451, -10, 154, 350, 54, 362, 166, 220, 91, -81, 300, -386, -305, -12, 120, -199, 78, 139, -432, -191, -15, 250, 79, 65, -42, 160, -18, 50, -340, -39, -108, -86, -71, -152, -666, 41, 234, -359, -26, 243, 77, 44, -712, -200, -80, 152, -75, -458, -214, 175, -420, -390, -116, 173, 330, 550, 52, -695, 340, -122, -82, 481, -58, -25, -42, 183, 237, 141, -304, -360, 102, 106, -321, 233, 347, 178, -191, -490, -435, 136, 50, -472, -357, -156, -489, -421, 408, 490, -505, -541, 231, -700, 355, 206, 432, 280, 309, -327, 481, 646, -202, -354, 250, -311, 420, -41, 142, -460, -4, 482, -313, -8, 131, 143, 71, -15, -480, 220, 64, 216, -152, 159, -57, -276, 574, -750, -12, -34, -483, 138, -143, 376, 322, 328, 242]
7107B42l45J31J64j42m52N33K6m18M22k55L00j30J08L8K35m35R6j21J72J97K6
7128C92J20m92q1L61P1q73L60q4m40N15P78p94k72P78l38k78k29M81K01L2j8o24
7150d34R37n02j73J42j22pp5K59p0L28k38R8J67o18Q6J55j2M86j76R26r33m50
7172b26J80r3M21L6k23K50N8n96L47jK78n92L6L11k81M67p14L63J9k60k14M72
7194C8p7K4j06l10O96r1K47m89L99j29KK50m54K59l20K14k25J94J6l97k93M44
7216a08QK49m98P3j23p1P09l43M9L3M53l05M83o1n55N23J43l79l73r5N98k63l82
7239b35K21l34K54R8O2N26p27n91N49K89K57p00n9N2Q21Q9n00m33N41n01J6J82
7261a23J27N97o78O77p55k1R8M41n06K10K20j39m07L37l09k57M45K3M75o64N88
$$ y = [242, -103, 28, 192, 50, -402, 131, 157, -261, 161, -94, 206, 76, 184, 222, 457, 22, 118, -3, 169, 366, 392, 512, 20, -61, 300, 371, -502, -142, -226, -666, -151, 627, -167, -439, 339, 1, -277, -506, -25, 176, 208, 190, -434, 503, 1, -172, -30, -152, -159, -234, 25, -45, 283, 45, 143, 310, -308, -222, -67, -79, 407, 231, 1157, 224, -226, -46, -139, 282, 318, 95, 345, 403, -193, 154, 153, 431, -161, -125, 186, -95, 372, -342, 21, 40, -220, -434, 38, -39, -15, -121, -431, 265, 174, 421, -68, 331, 202, 204, 454, 0, 259, -61, 153, -72, 122, 138, -259, -552, -108, -100, 149, -349, -276, -399, -470, 239, -104, -55, -22, 431, 126, 609, 548, -7, 516, 659, 280, -93, -188, 410, 147, -235, -14, -348, -94, 4, 66, 592, -135, -726, -177, 112, 369, -331, -390, -338, 483, 572, 72, -361, 180, -321, -305, -123, 4, 601, -77, 600, -155, -176, -78, 363, -143, 67, 287, 148, -259, 78, -231, -488, -43, -20, 455, -209, 379]
7282C79l79m02L1L69k09K6O99p9p10N90l47m81O44l27l4J24M67p40R04r1r01M00
7304f7M26n49K5M25k74L9o5J39l65k72Q4M5O45l47l6m40N31Q1L81l75j92P70m90
7327A19l46j30K54L96m41K14m73N05K79o53J12R5N9K38J03j96L43m67l62N2O20
7348C21N8p46K76M2K65l34J53N98j059O84k01J74p69L84J048r52j78Q1p2l7L25
7369F1K53j71j03km88N63m45O92o10M63q42M92l44O96P5O5k7o11L20j83K46k79
7391a79j83K00M48o92L14J07N9L8J70m12N66n56J55N0o84L92K98P22o92l74R4
7412a59j4r8M34m95R8R69j206L59j97K56k44P09k52l43K65m40Q97r26P76m88L28
7433B29J71r60M82J82m8n21J59K30N45p42K80l68K34M32m99K58k25j73N87n17
$$ y = [379, 0, -402, -371, -2, -211, -185, 514, 435, -275, 315, -32, -513, 131, -196, -230, -106, 361, -379, 525, 434, -467, -67, 359, -190, -165, 260, -14, 25, -40, 99, -266, -538, -454, -409, 236, -111, -147, -587, -56, 25, 406, 31, -161, 609, 119, -227, -357, -103, 293, -148, 66, -407, 98, 377, -276, -164, -69, -10, 228, 331, 135, 478, 11, -351, -299, 321, 379, -367, -91, -49, 216, -118, 35, 633, -426, 258, 57, 231, -538, -154, 894, -58, -236, -155, -227, -264, 61, 314, 143, 40, 38, -450, 113, -332, 360, -250, 213, -629, -137, -481, 215, 290, 355, 328, -283, 37, -146, 100, -179, -362, -162, 286, -406, -92, 15, 74, 112, 282, -130, 436, -120, 35, 85, -599, -207, 91, 813, 121, -253, -159, -173, -271, 163, -332, -234, 735, -471, -112, -309, -53, -297, 412, 160, -183, 82, -358, 539, -387, 389, -99, 229, 400, -560, -78, 104, 56, -465, -306, -76, 469, -273, 7, -361, -127, 305, -194, 64, -161, -334, 253, -264]
7453b64nP58l31n09O77n80K59L49m45O82q64M07l76R35r96N3L91J64Q0l62J16
7474A39j2K37n48l75Q74o8p7j68R25n15m61K87n72M32n6J071j523K70m28M80M05
7495C17p65M49l31K99l32m09J272n70J09L85n3q4l46M2J64o43K65l3M37n36L98
7516C5N39o49K51o26M78K41j219J021Jk74N91l84J89l49M95m59n53R20p76O75
7536A47k1p54J235m07k83k07M1Q19o89l70K32P56n55n3o08L69N04j5k4k94n01
7557f78K50K94p7Q72n76l50K44j80M69l39m85N95O6M54p81N12k98pM23j83p82
7578e57L23P02p99K98J50j87P0P8K71q37N20n47k21M16K56j03j2J34J97n05J9
7599c34M15m07O15j65l04J08JJ17m31N62k64j29m26M03M86K60o95M7M40mm13k19
$$ y = [-264, -269, 489, 158, -351, 326, -254, 5, 354, -91, 591, -273, 134, -242, 693, -303, -250, 141, 305, 385, 23, 139, 127, 364, -184, -559, 315, 247, 170, 2, 927, 412, -49, 238, -334, 98, 42, 1113, -410, -140, -568, -88, 317, -448, 1, -330, -31, -363, -772, 500, -70, 39, 424, 371, 287, -59, -17, 147, -496, -231, -264, 173, -363, 35, 574, -75, 176, -450, 28, 269, -950, 71, 72, -202, 389, 5, 194, -155, 340, -119, -672, 248, -528, 147, 126, -628, 607, 200, -83, -290, -249, 570, -119, -489, -257, 499, -56, -109, -717, -348, 156, 141, 117, -177, -678, -428, -134, -211, 661, 85, -265, -21, -201, 268, -71, -556, 39, 105, 559, -222, 290, -8, -15, 408, 225, -557, -234, 468, -331, -33, 117, -70, 0, 78, 349, -488, 32, -515, -736, -320, -64, -167, -179, -45, 152, -353, -334, 81, -326, 289, 124, -180, -72, -71, 46, -385, 177, -87, -216, -642, -239, 247, 507, -188, -141, 299, 295, -118, -337]
7621c37L63l72L06L58l32L62l10r9j85P1N30J81j02l62L37m27l99K07J208j387
7641c89K35k4N15o48N62R0m78K40l40P19r08K9R5L48J41n29M10L5j87j32j34J74
7663a76o5N8P7pL18p14P71l23L3m9L7r0M1j69P36o31M96k29q0k38M38j42k11N85
7687D66l82j89N7O8P0r6n10R75n40l42O18o44Q81l10j95O34j115J085p44J03m2
7708a52N82j072O53l56L0N65n48qj27O46n91P52J17p59N57l93J92j32K29K2L0
7729B37m7m63N69m67j45M95k62j35k11O91n28L77j59k17M84K6m76K98M10j38L
7750C42n01j78L14k67K01M15k54k44N02J79r27L55n16R1J92M22k69J33j52L63
7770B01L82l63m38N83n99N42q08J45k8K85J91k0K0m1J24m0m38J072j444L58M00
$$ y = [-337, 26, -346, -40, 318, -14, 348, 38, -61, -246, -175, 355, 536, 434, 72, 409, -18, -417, -210, 998, -389, -154, -178, 337, -311, 251, 341, -137, 103, -237, 482, -426, -397, -302, 46, 187, -342, 68, 103, -84, -216, -350, -176, -241, -183, -106, -113, 205, -509, 262, -61, -28, -77, -40, -130, -89, -258, 478, -153, 343, 114, 34, -204, 234, 92, -119, 466, 84, -105, -48, 20, 90, -6, -516, 459, -81, -423, 195, -449, 432, 122, -73, 561, -554, 531, -213, -110, -152, 430, -642, 11, -345, -315, 250, -298, -306, -433, 213, -378, 374, 491, -268, 289, -104, 88, -44, 185, 207, 237, 190, -273, 296, -171, -316, 179, -83, -218, -429, 262, -266, 111, -48, -265, 219, 245, -231, 67, 477, 339, 342, -159, -337, -23, -290, -89, 326, 72, -172, 330, 509, -418, -63, -579, -488, -296, 126, -143, -10, -162, 201, 583, 220, -218, 365, -234, 308, -500, -355, -383, -98, 93, 73, 93, 52, 176, 136, -302, 770, -674, -316, 84]
7791H4J32J5r99J208k58K46l89K92l8J19o40J83L15m15L40K04n70j58M91L17l28
7812A51m92Q2M65R7Mo00J12L08n59K10L43J07k33J3q06R09l89J98K47j57k18l8
7834b46l2M76j27o4j81k79L87r5j98O86l73k74M46K49q7j29L34k49m16L19k80
7855a33K59J18m6l76j85J61M58n18M5k81O22K58l62j65K99l29KK97k53l45R34
7876D60k14j073J429l17l61L41q02N18l87l57K67R34m07j36L12l9L12l18M02o6
7896D98m44m79L92L1N4m7L7N15p29J010n00k58J50k00M83m26K16m33J05K34K9
7917B38l31M39k56J34R3K75k36q44m1Q45p04M49J26k53J27M35o63J28L09n64k66
7938e60Q19j3l04M45j16R1N2q4K04k05k06l42q4O70o74N86l71K66l48P80p55j01
$$ y = [84, 216, 231, -768, 440, 182, 428, 39, 331, 293, 412, -228, -45, 270, -145, 195, 399, -171, -329, 162, 479, 151, -341, -259, 206, 303, 307, -293, -181, 127, -432, -222, 121, 228, -5, 8, -798, 111, -278, -80, 167, 10, -208, -246, -278, 198, 71, 7, -174, -453, -66, -161, -359, 327, -46, -320, 126, 375, 288, 159, 493, 244, -172, 147, -133, 126, 244, 198, -178, -363, -202, 256, -262, -217, -498, 124, 382, 20, -145, 154, -175, -173, 124, -129, -474, 460, 246, -827, 602, 285, -76, 265, -537, -19, -406, -763, -496, 438, 31, -105, 207, 168, 480, 162, 564, 498, 54, -425, -33, -2, 52, 5, 42, 557, -172, 838, 338, 80, 230, 30, 513, 87, 303, -130, -25, 209, 238, -93, 346, 90, 224, 317, 592, 356, -488, -529, 316, -388, 61, 187, -66, 61, 496, -167, -39, 270, -294, -560, 259, 246, -58, 387, 271, 362, 414, 330, 534, 329, 123, -219, -303, 367, -307, 279, -92, 174, -174, 606, -149, -250]
7960b50L38j98lM07M27o18k0j69K49j07l73N81j61l94L39K7J48k78J94j07j30
7981i8N06l45J64k11p10N75O39o92RN82o00O3L11n29N17L91m25K60j084L99J32
8002a46P9J70K46j73j52n29Q48o35R35l60j36L9N8m8k22L33p61K7Q2K93K62m92
8024b82L43j57L03o32J126r64Q9J80M18n21K87J10j62j92Q5K26k12K96n31k96
8044d86N25N5j27L73j79m6q8O32j096N48k15J71r77N37K59l88N14K92l54n18R7
8065d71Q16m47J12L6R2KM6o00L80l7j97L58J92j70l30O70j50l99L44k35o9R4l71
8088c34O0P28l7m90p8Q4K99k67m1J91J86o02N9O2P99n71K98j73L43m09l52O18
8110C73j82k42l16K66J68J5m9K95K6m36n2K23O3M5K05m31j08j57k16j6L91K60
$$ y = [-250, 88, -110, -113, 294, 721, 103, 83, -86, 163, 56, -317, 264, 103, -291, 48, 75, 223, -55, 139, 32, -98, 408, 63, 227, 16, -694, -119, 520, -172, -163, 419, -181, -118, 193, -336, 181, 572, 147, 407, -677, -278, -146, -67, 103, 349, 176, 24, -505, 343, -292, 643, 283, 147, 186, 244, 196, -26, 307, -454, -427, -345, -52, 210, -282, 61, -96, 207, -425, 701, -263, -174, 6, 424, -97, 190, 300, 138, -54, 31, 257, 45, 341, -190, -486, 39, 94, -33, 340, 161, 115, 27, 659, -437, 111, -104, 67, -910, -373, -114, -502, 12, 304, -50, -568, -471, 345, -102, 10, 46, 138, 140, 186, -414, -34, -71, -268, 90, 282, 112, -218, 452, 302, -97, 247, 12, -57, 37, -334, -274, 454, 417, -73, -151, -67, 232, -35, -76, 115, 301, -301, -242, -180, 619, 48, 346, 173, 516, 107, -245, 373, 191, -51, -367, -101, 67, 82, 33, 328, 354, -82, -134, 89, 152, 197, 402, -29, -137, -294, -510, -526, -135, 125]
8132A25J56l31l49L9R6P13o31J71M41l03K62j68R7l38k76K36J5l74Q03o97K24
8153h9N15M18m18p36L48l11L91k36j11P14j057N37L16L1l77L8p4K05J3J04j37
8174H4N7Q3m77M21m90o3J11K42K20N66m24K99n70K0N6K78m04
$$ y = [125, 281, -50, -399, -360, -264, 449, -182, -11, 430, 127, 389, 221, 318, -20, -296, -60, -45, -419, 384, -313, -89, 426, 844, 426, -310, 38, -273, 118, -118, -229, 485, -572, -35, 281, 312, -65, -27, -101, 104, 117, 221, 84, 141, 224, -253, 168, -322, -385, -274, -32, 188, 754, 330, 629, 59, 79, 135, 413, 9]
8191I
$$ Imaginary data points
##PAGE= N=2
##DATA TABLE= (X++(I..I)), XYDATA
0@%%%%%%%%%%%%%Ko6J28j28J28j29J93k56K61l25L86m50N75o49P15q34R63j124
31f10J313j475J667j909K151k413K694l011L367l744M161m616N110n660O264o913
47c624P620q394R243j0184J1226j2373J3645j5077J6682j8503K0595k3016K5859
60A3699k9251L3387l8570M5273n4332O7336q7696J24406k11356P82333P77473
71A422702j291980p78823N6919P25296K07585k70822l85054M0905J41631M8298
81h3343n6463J42187R7412j39246k89240K0829L42512L46601n3824l45848k44301
92b62724J63202L07947R6419j45669j01943l253k0686r4709m3327P2139J01678
103F9074m7403j62885l8260J79598J18845j49005k05117N1875K38461J09202j32024
$$ y = [0, 0, 0, 0, 0, 0, 0, 0, 0, 0, 0, 0, 0, 0, 2, -64, 64, -64, 64, -65, 128, -128, 133, -192, 194, -256, 319, -330, 385, -449, 514, -610, 703, -772, 895, -1014, 1137, -1276, 1418, -1593, 1774, -1970, 2191, -2425, 2685, -2975, 3289, -3624, 3996, -4398, 4845, -5339, 5887, -6486, 7159, -7918, 8764, -9739, 10856, -12160, 13699, -15552, 17835, -20735, 24538, -29794, 37542, -50154, 74252, -137104, 645229, 1422702, 130722, -648101, -591182, 134114, 341699, 70877, -314177, -273272, -131641, -83343, -139806, 2381, 99793, -39453, -328693, -307864, 34648, 381249, 327425, -18423, -262724, -99522, 208425, 304844, 159175, 57232, 53979, 33293, -61416, -104743, -32604, 69074, 21671, -141214, -179474, 124, 118969, -30036, -235153, -183278, 55183, 164385, 32361]
114C2361j60555M0578J71799M3079j24241n8617J03449O8650p9319o3556Q6997
125F0625J06505o2427j85791p2233J62517J88212p9841k87377j32454J70300K13813
136H1849o833j57532n6040J30985J27723p2347j74389q619J83657J17420r4721
147G1153j37616K0939J48032R0694o6820j26659l9565M3632Q443m5794j0465K6184
159a7842j9849o6535r896Q7502R4574o140r7759o3663M8494P6897p007n1143J4035
172a8332P3519K7004m7795l8236L7487P0406o523j01614p4316N0205Q9938j0568
184E1175r6526m7599N6146P2320j4202q1571m3396M4362O2954N614k6646j845
196a9214J3545l601J43M0287N6784l62p6421o7719L9584J21780N7315r1353j43895
$$ y = [32361, -128194, -87616, 84183, 127262, 3021, -55596, 47853, 116503, 37184, -26372, 60625, 167130, 104703, -81088, -153321, 9196, 197408, 117567, -169810, -302264, -131964, 81849, 75016, -82516, -138556, -7571, 120152, 47805, -126584, -135203, 48454, 165874, 71153, -66463, -45524, 102508, 193202, 126382, -277, -39842, 3790, 12233, -33561, -44026, -17842, -37691, -104226, -114122, -26620, 67954, 61814, -35945, -99608, -51114, 25783, 18776, -32367, -18332, 55187, 82191, 34396, -3840, 33647, 104053, 97530, -4084, -78400, -28195, 61743, 51175, -45351, -92950, -36804, 35516, 21314, -60257, -103653, -59291, 3663, 9277, -17369, -19214, -5669, -9270, -9127, 31160, 87944, 87582, 11161, -56558, -16974, 104806, 162121, 70768, -73127]
209g3127m4750Q1445R2587m856r1309p6368K305N0588M8322L2933K1249m776l8678
222d435l8325R626N6432M6204j3842m7710k1892K3383L8333K2088p200l3027m8407
235a8772m6966r295M2262N0868j373n5584m0851K3673O5459M4879o131l4615k1647
248h093j056o492j4991Q735M0777L0048j2587l8352k0993K2961L7487L442l7640
261C246l6008R38K0239J9264J5692J948k0440k8756j0312J5791L2004J5894k4734
274D766m0543q417K3569J7014L608N191J0294K843j0279k1181p633L0975M4150
287E4357N343l5547l3983m755J5632J4670n706k8608k1160K997J2777J5871K3988
300A5876J0132k6221l5098n115K1233K6777J5468q757k1076k289J6567J2318J4913
$$ y = [-73127, -117877, -36432, 56155, 51299, -40010, -116378, -114073, -63485, -15163, 17770, 39019, 34243, -4435, -42760, -33134, 23298, 69502, 55660, 7950, -13942, 9441, 47774, 69862, 62662, 29635, -18772, -65738, -75033, -32771, 18097, 16724, -38860, -79711, -56038, 9421, 54300, 48169, 13554, -8093, -9149, -15641, -30632, -21897, 18880, 48928, 36341, -2011, -23004, -43, 37444, 40886, 3246, -32762, -31824, -11585, 7679, 23371, 25319, 4879, -23877, -34189, -18398, 13606, 29500, 4766, -35777, -44194, -20625, -3611, -3, 5188, 15482, 18325, 8046, -13135, -20768, 10207, 54357, 59700, 24153, -9830, -14585, 1047, 15717, 10011, -18597, -39757, -36760, -23983, -8112, 15876, 26008, -213, -35311, -40426, -19193, 7584, 23052, 14295, -6781, -9070, 7497, 19815, 34728]
313C4728J9397m144m1163l9746p917J7535K7242R281k3253k4787J0114K8855J3036
326A9178o795j3541j9388j1485N697J1787J0438J8501J1001j4637j4373J0631
338G014J4912J558l044p404j5867j1347J26L610J4202K0845k192l2006k1046R971
352b0668J5451O703k163j0094j0731O247J2123K148O602J2195m947k1194n875
365a4203J3286J7663J4765K024k2465k2664L236J1699L141L069k775k0865j8414
378c2503P898K2334J9474O171j7865l2061p969J9424J5009j264R73J392n619N675
392A069J6390J0680M373l460k1506k6244j83J6846P797M1r31q768q100O291J0101
407D396j066k084o985k0112j3410J2785K3096J2905O431j633r035k493R023L424
$$ y = [34728, 54125, 49981, 8818, -30928, -38845, -21310, 5932, 15213, -8040, -32827, -22713, 6142, 19178, 12383, -1158, -20546, -32031, -26334, -14547, -4109, 14392, 25393, 10756, -3617, 7014, 21926, 23484, 20440, 13036, -2831, -14178, -14052, -10442, 3760, 24605, 22413, -9593, -30639, -20668, -5217, 1486, -677, -10771, -21502, -15255, -3132, -984, 5618, 17813, 12866, -8328, -14203, -917, 16746, 31511, 33535, 11070, -11594, -8358, 3341, 6482, 9551, 6776, -14089, -32503, -24605, -2271, 17203, 23374, 5509, -26552, -34521, -15097, -88, -1352, -379, 1013, -4606, 1069, 17459, 28139, 32512, 29052, 7546, -18698, -18881, -2035, 5762, 5803, 4872, -3896, -11996, -5705, 4396, 3330, 1246, -5739, -25851, -39261, -26476, -3380, 9525, 15956, 14323, 5288, 2795, 11818, 15242]
421A5242j191M17n381j8277p341J6219J7250M453p450j8721j8370J374J5177O201
435c98k159m913r481q197R152K0837J0891j156q060j4022n811J5325J8506N067
449B5581m051p374j3009q731O258Q996j405o594j3087j3097L548K1806J5790m878
463I753j4629j3344o199Q443J6434Q854k042n019m905K260J5030J5998j730j5603
477A3301j5605j0679k796R159P583n95m404J45J219J860N367J149p465p902n629
492a5292l386O519J3168R252J192l176k455m138p78M810J459l033q058n283n76
507i775R947J1634K424k905n895q835o256J625P243K395n151r105l027P641J1520
522C480L481o759p665k372O042Q110N070n65l52L205O20m476o271k090L380K527
$$ y = [15242, 14051, 14468, 9087, -9190, -16531, -312, 16938, 21391, 13941, -4780, -23150, -21776, -6599, -398, -2557, -7470, -16951, -25148, -15996, 4841, 15732, 14576, 6516, -7506, -13317, 2008, 20514, 25581, 21530, 14156, 1147, -7584, -1326, 7670, 6265, -329, -13416, -26513, -22965, -1159, 14631, 9753, -4876, -18220, -24419, -15976, 458, 9312, 7270, 2251, -2654, -394, 14636, 30634, 28904, 13301, -2304, -12983, -15779, -6620, 963, 368, -4036, -3891, -2672, -812, 4555, 5704, -1761, -9663, -15292, -18678, -12159, 1009, 10261, 11453, 8277, 5822, 1684, 906, 5716, 7175, 4142, -3916, -9199, -9775, 172, 11806, 14230, 11325, 5430, -3405, -9661, -8036, -793, 1602, -3549, -12654, -15681, -8040, 3480, 6961, 202, -7463, -9835, -3793, 4317, 9387, 8822, 8470, 11675, 12295, 7819, 1548, -542, 2838, 5365]
538E365m307r736m505M517P575K693j555n543p094m245J737Q468J1650P584k264
553A0340o218N7O456Q825K781j0550k0357j0814N400J3867Q634k002r282n876
567h739K556P047J555k605k862n679o339J511J0111J0221R149J388r092j0751
581b529r72N455P76j964k673k819j862K137L901M963Q335K744j3116j8426k687
596a8737J3234J6143N148j2767k0881l313J8947J9347K137j3087j8400r294Q915
609a2608J9316Q833j616o907j0984r660N438J4703P384l751j1031j3414j209J7228
623A722J7502j273j5511j3747n760O479J4597M350j0090o125L350J821K429O277
637F021L368m327o016q686q495P571J8015R595n060o472n215p47P795P114o344
$$ y = [5365, 1058, -8678, -13183, -8666, -1091, 1602, 47, -5496, -12590, -16835, -15098, -6630, 5020, 12604, 10340, 4122, 4179, 10635, 19460, 22241, 11691, -8666, -19480, -14080, -213, 8421, 6419, -2863, -8739, -6183, 864, 2419, -186, -3048, -8727, -15066, -13555, -3444, 6777, 15926, 17314, 8222, -2529, -3501, 1954, 2730, 766, -1907, -4726, -6588, -4451, -550, 4413, 12748, 15492, 2376, -16050, -18737, -5503, 10640, 15788, 3021, -17860, -21173, -2226, 17121, 19258, 6171, -12229, -21523, -12608, 6708, 15541, 13925, 7018, -3966, -13626, -8188, 6515, 13899, 10148, -883, -14297, -15506, 1722, 19224, 17951, 2440, -11307, -17067, -10588, 4009, 8359, -1731, -7856, -4506, -2685, -256, 6021, 9389, 5062, -954, -9640, -18135, -10564, 7451, 17046, 11986, 5514, 299, -448, 7347, 14461, 8117]
652H117j4470o960j501K133J0391Q719k265q136m102j698M062J2513L493j3180
666b884j1010N239J1936J3204N978o727j3898j535O999j255p631m712k095Q68
680g523M666J81o511l67P993N17n424R90M656J877K831J707j576J658O841j947
696A0569j1986k975P412M094k683p038q753J377J2469R559q823j1724k707J272
710i937N057P631J796o201j0M692J611QQ44l450o624l81J831j967K608O157K974
727F639l031J355J789l749k372K93k470k254P4j982j920N349Q798q24l893n615
743c813o876j846R558P017l248m957J543L621N991N075K77l963m112m294o457
758f484J830R842K570q903q041o30M245P185K689o715p850j013L986N710M957
$$ y = [8117, -6353, -13313, -14814, -12681, -2290, 6429, 4164, -3972, -8074, -9772, -5710, 6803, 10296, -2884, -13894, -8655, 3281, 16485, 22463, 15736, 1838, 303, 7302, 6047, -1584, -6296, -8391, -7523, -2857, -2676, -9187, -9554, -1561, -1044, -6468, -5478, -822, 1055, 3886, 5593, 4017, 5675, 12516, 10569, -1417, -4392, 3020, 7114, 4431, -2607, -11360, -9983, 2486, 12045, 3222, -8502, -11209, -9937, -4880, 2751, 4547, -1654, -1664, 3028, 4639, 4647, 5491, 2041, -4583, -4964, -3133, -5100, -2492, 3665, 6639, 3608, 4963, 6752, 3003, 631, 924, -1546, -3800, -3726, -5708, -7628, -2279, 6519, 5695, 1802, -3813, -10689, -12535, -2977, 4040, 792, -4165, -2622, 999, 6990, 12065, 12342, 8379, 4267, -27, -6484, -4654, 5188, 7758, -1145, -9186, -9816, -5571, 1614, 4303, -2412, -10262, -11275, -7289, -1579, 3378]
773C378M000k421k810L71m10j89L373L266k866n142j308PK787M411m17o905q558
790i433l517R18P941Q190j515q632j893N074P222K214k086m455l874n18K347N009
806B992O845L139n081o336k004K488R49k276m138n342j411K711L497M263L796
821D092j086m771l631P61K709K704N61j649q81K495M699J958J82j519j071m243
837A310m255l184K491M605K049m079l757o47L100L028Q39j762l686k001O1M130
853a758O248L147l801m534p47K417K294R51k088k385N49J444q91J293K392Q5n137
870e21m782j799J043N144L295j726m018Q93J239J092J791o1j755l225q06J074
886c122M484N058J829l478k437J182j176k377l87p88k256q23J02J137L171M681
$$ y = [3378, 7378, 4957, 2147, 2518, 2108, 1919, 5292, 8558, 5692, 550, -758, -751, 2036, 6447, 6030, -875, -9433, -12950, -12032, -4091, 4099, 2584, -6048, -7941, -2867, 4355, 6569, 4483, 28, -3846, -4364, -2017, 2992, 9837, 12976, 7895, 1559, -445, 2043, 2992, 716, -3422, -8764, -10175, -7464, -3967, 296, 4092, 3006, -1765, -5396, -4635, -1926, 778, 1339, -310, -1191, 1304, 6003, 7961, 8143, 6624, 5553, 1310, -2945, -6129, -3638, 967, 3016, -1063, -4820, -5467, -2367, 661, 1500, -262, -3948, -5949, -5888, -1758, 4490, 7637, 3836, -698, -1445, 972, 3266, 4217, 2129, -256, 293, 1737, 846, 2139, 4531, 4616, -521, -5303, -7102, -6059, -915, 2380, 654, -3364, -2471, -1232, -140, 1651, 1590, -165, -3390, -4196, -3122, 1362, 6420, 8249, 4771, 2334, 3516, 2340, -37, -424, -1212, -3468, -4291, -4189, -3052, 119, 4800]
902D800j067n685l396N07P44K561N57l94n39K918K373k62K606K516l533n229j528
919b051k99O99M034J130l025q78k62p88j177K873J04m220l371J374K758M034L978
936D913j874n647N32K659P90K37J927j248k206J166J190n51K204J008m015n574
952d489j32J361J85K748J733k818k832L262L5j17J665k66m769j515N005L134J190
969C380K696n96l841l13Q77j578j329K561j540l446j14L451N83J696J426m557
985f44n025M17K064j337J821K725q78m14K306K648q23J969j21m775k497K463K102
1002B001m43K270P39m039j985R23R12r16N34k561m487J8L889L139j09K473k361
1019cl256K127K472j31N15J376j726j579L255K218q08j338j102l506k232K342
$$ y = [4800, 3733, -1952, -5348, -4841, -4097, -1536, -979, -1373, -1912, 1006, 3379, 3117, 5723, 8239, 4706, -523, -2051, -2350, -1651, 2383, 3513, 488, -390, -652, -1440, -2617, 256, 360, -3860, -7231, -5857, -3099, 935, 4913, 3039, -2608, -2076, 583, 1373, 1610, 3537, 2289, 83, 1249, 2439, 1888, 4092, 5100, 1085, -4489, -4621, -3260, -3075, -327, 1406, -1412, -4244, -982, -947, -1064, 601, 335, -4434, -5949, -944, 2190, 3380, 6076, 5480, 1639, 1326, 2203, 625, -704, 1857, 317, -3129, -3243, 208, 791, 2487, 3913, -644, -5669, -5252, -3188, -4525, -2704, 21, -857, -1271, 1035, 3683, 2860, 4829, 4708, -67, -2564, -101, 2001, 1558, 3828, 4567, 528, -1457, -534, 378, -538, -4, -2565, -7052, -7034, -3145, -6, -115, 2358, -3, -3259, -1132, 1340, 1209, 1724, 3100, 1374, -205, 3050, 5268, 4460, 3122, 2020, -1486, -3718, -1376]
1035a376Q01Po25R52k538j343K598O44j166l68l96k210J839N285J348L56J249
1052E057k90l116P50O12k234p70Q11o71j677J205K439j234j047o01l441k111R29
1069e389J713J51J439J510q5K61K896J320j242M90m57j930j102K235J227N49K72
1086C858r77l147j006R45j092j144M85k156j620J005K966J830Q42p70j689j064
1102b734K265J726Q00L43k29m42k16J831J233q15k247j166j394j150R20J414m02
1119b63p94r42k230Q66O14Kl67O66j71K00J585L562J763J86n91j351k104J498
1137B129R18k59l36j141j233j340J825L35o62j889l404k046K08J712K362J616
1153a205P9K03R1K636J974R98l62l197j229N53K054J835J36j201j870j975p11
$$ y = [-1376, -575, -568, -1193, -241, -2779, -4122, -1524, -880, -2046, -2414, -2810, -5020, -3181, 2104, 3452, 3808, 5057, 4767, 1651, 2401, 3013, 779, 9, 820, 149, -1528, -323, 2116, 882, -165, -766, -4207, -6318, -5389, -3676, -3525, -2086, -576, -661, -400, 2496, 3816, 2574, 3064, 2607, 677, -425, 1810, 3037, 3586, 3858, 2881, -266, -1272, -327, -1419, -2563, -2078, -4234, -5854, -4849, -1883, -53, 789, 19, -1670, -2734, -469, 1257, 2057, 2400, 2171, 1729, 1513, 3344, 4577, 3762, 1515, 349, -1045, -2195, -1275, 139, -263, -1057, -1999, -4229, -3363, -2749, -2747, -3114, -2448, -2619, -2419, -834, 2728, 4491, 4677, 4086, 2735, 631, 2129, 3047, 2788, 2452, 1311, 78, -1262, 563, 898, 236, -1653, -5057, -7103, -6895, -5183, -2821, -1205, -1126, -923, -832, 1804, 3778, 4776, 4414, 1217, -12, 541, 2595, 4430, 4566, 3365, 1495, -480, -1191]
1170a191l1j399K36n22j960j587K426K427K006m76j26j472M46K844J409l32M30
1187C128M10j631J25K100k59p62j311k584k659P47K553K57q53j545r68k13J857
1204a608M90n95j117L24l67J316L579J534p31L95k1r93q42P18n36j758k03J191
1222G76j069Q80J105r71k780M9j96k148j57J592K21J560K290l37j146P60J943
1239B372m57R1K8j515j225K541J711j209l08O53j314k420O58o85q45r76K54j895
1257d541P08L054k28k93K10J102k76q74J840L69k44J871M87j691J420M38j448
1274A904l62j79j667k725R89J736j188nM66q86j777J944J149j400O41J615m42
1291a87l33L244J022m17j077l2j993n51J948K35j336p75K95j005K87K265k600
$$ y = [-1191, -1222, -2621, -2385, -2907, -4867, -6454, -4028, -1601, 405, -71, -197, -1669, -1223, 1621, 3030, 2698, 3128, 3538, 1907, 2032, 4132, 3873, 3111, 1800, -784, -3443, -2696, -143, 114, -739, -2284, -3252, -3465, -1608, -1118, -1713, -2830, -2506, -2873, -1557, 2022, 3556, 2825, 3220, 3199, 2206, 1364, 2082, 1546, -212, -415, 776, -293, 587, 1692, 721, -2059, -2010, -2206, -4354, -4511, -2919, -2698, -1138, 1152, 815, -331, 429, 2372, 1915, 2006, 2034, 519, -706, 1835, 3546, 2337, 2029, 2682, 1368, -1052, -394, -1079, -1924, -2900, -2646, -4541, -3833, -779, -1007, -1300, -1090, 12, -264, -1138, 702, 1071, 827, 2698, 3185, 1494, 2914, 3352, 1904, 1542, 1363, -304, -3029, -2040, -304, -1492, -1497, -1031, -1917, -3694, -1750, -601, -2001, -1360, 255, -187, -520, 2724, 3746, 3329, 2252, 2220, 227, -324, 1624, 1859, 523, -252, 43, -962, -675, 1590, -1010]
1308a010j293P1K5j645J383J836L7J87J407r2j162K006M97j013j501J330r67p61
1326f65K153J627j629l71m47j602m33J115j05j579M7M10j520J395L081K36k766
1343a053O61K35j190J364J733j133r63J096M27j164J468Q57j895j323J52O20p85
1360h93J170K42J77j389M07p57j9N02k06j152N40N90J38R71J525o0j968O50l16
1379A52n66j14J376L30q98P55l57N63o55R32j345j844p29N03K69N55P12k83p99
1398a443J615n38o3O29P61j354r03J410P67L99J406q22j97p84K29r08n10J32m13
1417e87o81k04P69rL28N44J24j619j23Q3J223K63J3O3j30O75P4k11Q94n39m74
1438D76p26J33M62O97m4l1l17n08n22n13M1N61m86r76o6P94R13K43J064j701j2
$$ y = [-1010, -2303, -2232, -2207, -3852, -2469, -633, -596, -409, 998, 906, -256, 1750, 2247, 1234, -267, 1063, 96, -665, 1488, 3115, 1486, 1115, 668, -934, -1367, -252, -357, -1936, -1889, -1479, -2999, -1604, 1477, 1713, -1053, -392, -157, -1347, 17, 1750, 617, -346, 750, 1177, 13, 1481, 2338, 443, -880, -728, -108, -893, 277, 519, 696, -693, -286, -1043, -1062, -560, -766, -1918, -1378, -788, -650, 321, 1846, 1786, -182, 468, 152, -414, -528, 848, 1178, 280, 1035, 678, 1241, 586, 1518, 173, -1671, -2400, -1897, -1628, -1073, -361, -644, -1443, 172, -366, -429, 200, 961, -393, -1296, 114, 881, 1280, 2686, 1864, 1667, 883, 1112, 204, -306, -174, -587, -1268, -1472, -703, -712, -384, 160, 284, -1335, -1458, -1375, -152, 111, 124, 187, 57, 732, 806, 595, 1489, 950, 476, -250, -117, 345, 1042, 998, 967, 650, 142, -380, -893, -852, -291, -777, -1753, -1819, -1025, -112, 131, 1195, -506, -518]
1459e18k09Q01Q8J056k64j84M97L98j80M7j61q96o40q71K50j33N37J16R4o14R03
1480A17j170j22Q97K87j266J12N88M51P37J851j105L52o3o17p81j01n0K43m62
1499a02n96O59p50O01O6r74j057P82K24j107J239P94J47O6L56j95M70J308p0j551
1519C10O37N59j67L27K20q06p68j41L80j243l78M19r16j4p89R87O0J146N9l70
1539d88l32Q44m33L91Q10P76O35n1j54l38n59O66r66j305l60q7n27j75Q63Q66
1559G6j536m5P52j355O27P05l21n14J642N73K60J067J027p72o08J6n54r56K30
1578C14N95r75p65R99l10p37L70n03j203k68J314r83L19J350J125j158J086J050
1596A620q2K89k45O3j884J089J498j322n5R67j134j479k93O34j071m70R66n45
$$ y = [-518, -727, 74, 162, 1218, 954, 770, 1267, 1665, 1485, 1532, 1371, 475, -165, -1036, -786, -919, -382, -266, -172, -786, 117, -1053, -1175, -278, 9, -1257, -1145, -557, -106, 631, 2482, 1377, 1729, 1666, 1049, 268, 167, 117, 360, -102, -698, -39, -789, -188, -122, -1096, -2153, -1371, -1147, -2254, -1015, -221, -74, -8, 348, 153, 623, 1931, 1861, 310, 947, 1506, 1339, 1666, 1886, 1080, 312, 171, 551, -692, -1070, -651, -1567, -1581, -2370, -1383, -1323, -177, -118, -488, -820, 24, -409, -18, 792, 1568, 2203, 2152, 1998, 1660, 1101, 1767, 801, -504, -864, -951, -1478, -1653, -790, 76, -1460, -1505, -753, -2108, -1481, -776, -1097, -1611, 31, 604, 864, 1931, 2958, 2186, 1578, 1594, 1040, 84, 314, 909, -66, -831, 168, -142, -879, -509, -1012, -2215, -2483, -1169, -2152, -1833, -483, 642, -516, 570, 1620, 1538, 1827, 1582, 1645, -239, 850, 2348, 1026, 971, 1938, 804, -675, -968, -334, -1405, -1875, -909, -1454]
1614a454j139Q84R74m85K31J236k46m71N84J76O69O91L35p13N2Q99o67j324L66
1633E98k24j853j63J105q41J99Q00j163j21L07K65K87j41J092m31r3J553O10l33
1652A453L12N10r06r53n7k10l3J66L61j204l08J043l63o13J19q0j108k65J062
1671a074J167m78O86m20L48P66P92j470M15J25o63l85N08L44K92m17M92r21r12
1690h05R35r68k75o92Q04k17M29L45j2P07l62N66j323O75J042m39M87P76l38K27
1710A562m64J51O21j415k57o36q19Q75o9K33j12M85o57k57L35q12qM54N12L58
1730H0J17O43R70o63n7j81n1n94J61J50p6q09L85k05l43Q5m9o34Q93r68p6J46
1752a076O99O17J33l78j81O36J80o7l91L92l11p1R7N77M83k51j18m00q25jj59
$$ y = [-1454, -2593, -1709, -735, -1220, -989, 247, 1, -470, 114, 290, 959, 1650, 1985, 1272, 1324, 2223, 1556, 232, 598, 374, -1479, -1642, -537, -1378, -1179, -379, -1542, -1663, -1356, -1091, -804, -945, 147, -284, -377, 1176, 1786, 1453, 1765, 2275, 1369, 416, 359, 149, 116, 282, 643, -561, -869, 174, -189, -802, -683, -763, -1871, -2136, -1074, 93, -385, 301, -119, 229, 995, 1787, 317, 732, 857, 194, -191, 317, 661, 953, 536, 1028, 107, -805, 130, -838, -1113, -1805, -1001, -1218, -789, -444, -456, 251, -111, 455, -868, -193, 849, 410, 897, 1673, 1335, 1562, 1098, 1249, 1870, 455, 198, -438, -1257, -382, -451, -218, -330, 155, -502, -759, -424, -1236, -1244, -790, -278, 80, 197, 840, 1810, 1147, 1090, 909, 858, 264, 425, 575, 499, -310, 75, -130, -473, -388, -437, -1071, -178, -1146, -1222, -1076, -377, 240, 373, -5, -186, 450, 630, 563, 172, 564, 253, 182, 279, 856, 1339, 1088, 970, 570, -255, -256, -415]
1773d15l28p2K02J85m26K45O25J80n62j97L28O8k07N06o0J257m35j78P03n89o66
1794A64M11r86r4N51J5k65k41J83O32q35l63L17m60O39n55Q4M63N4Q22p67J199
1815I68J69p72j80J98L07N15j105K31K75p47K14j67M57m54p7p38l65N48N99l21
1835d45N33k72p47o7J288R7n55L94J24j43l4R56n0o3o4o51j80K11M5n81n25M33
1857b96K5j223L40J017l75J04km56K58O25L85m51P57jK00q63J055j35l39m17m70
1878b62P35r90J58N24k54j14j70n6k52j98o5M15K9J70M6O72p9J24J12o6L81q93
1900c3Q06J51n91l46O95J09q66R90l64j251M70K11r96l82J291j13jJ28o60o03
1920a355P68J060q15j11Q21M74m87l48J381m09p48L27L87j483Q15j04J42j166
$$ y = [-415, -743, -815, -613, -428, -854, -609, 16, 196, -366, -563, -235, -167, -374, 132, 72, 1329, 894, 716, 1419, 830, 164, 575, -411, -505, 46, 61, -204, -445, -262, 370, -465, -828, -511, -971, -332, -887, -803, -340, -286, 536, -231, 968, 1137, 365, 185, 383, 690, 1205, 100, 331, 606, -141, 73, -94, 363, -91, -168, -906, -1271, -723, -124, -445, 88, -184, -931, -998, 290, 387, -168, 226, 350, 207, 173, 1129, 1079, 1016, 952, 301, 121, 332, 377, -204, -729, -296, -271, -1494, -1154, -137, -512, -408, -410, -866, -608, 17, 402, -49, 708, 707, 907, 44, 1099, 964, 625, 208, -262, 473, -517, -359, 165, -89, -203, -373, -429, -681, -879, -944, -529, -500, -330, -284, 388, 309, 433, 545, 479, 860, -33, 773, 924, 333, -13, 682, 791, -75, 915, 551, -700, -230, -19, -1015, -1397, -106, -219, -220, -92, -752, -1355, -587, 473, -342, -453, 368, 842, 355, 7, 1388, 979, 231, 558, 945, -538, 277, 173, 315, -851]
1938h51J024j08Pl04L38m45r24P97j071J136J28N84j25R6P96m24r89J075Ln71
1958A72M39l75k70L47J81P2n14O6j92j180M07L27m35k99P17M58j239J464J42L93
1978F81p58K25J30p1J007q43mN33m35j82k86O85q05P2k69q10j5P89J17Q9n13Q2
2000e81N38k90j07N67m28N60K59k08j46J041j10o91n83R87j106p83J427l61%l38
2020c53k5n86O98j74J85o97K19M41k46K0O75N28q56M51J23j37j02k91N09l16l35
2041b69L20r1J07MR02j539nj20n62N18K64KK42o7L04j34p5K11n31P82l47K58J79
2064C53L61M68p70J29m06Q30n46l66R8k95n89J39J33o9Q14p90k4j84Q1K56P38
2085C61p20J31L92J60J00K07j29O53n88k02j67K33m20O4J72q76J06K17n68P03
$$ y = [-851, 173, 65, 72, -232, 106, -339, -1263, -466, -1537, -401, -273, 311, 186, 282, 1078, 654, -335, 740, 743, 172, 611, 236, -34, 313, 494, 566, 52, 118, -74, -1254, -847, -520, -955, -1254, -537, -79, -1318, 146, 288, 681, -77, 148, 278, 207, 1214, 371, 367, 900, 465, 283, -3, 682, -123, -51, -320, -1130, -1145, -356, -239, -150, -663, -581, -43, -333, -440, 127, -301, 259, 518, 310, 164, 1205, 1095, 404, -179, 808, -298, -1081, 346, -15, -15, -353, -378, -964, -266, -440, -255, -952, -733, -292, -538, -518, 157, 685, -171, 280, 403, 266, 164, -127, 382, 66, -269, 51, -40, 67, 71, 973, -566, -571, -691, -1253, -735, -471, -469, -227, -294, 10, -124, -199, 12, -519, 263, -84, 174, 353, 714, 1182, 412, 541, 135, 965, 419, 53, 151, -144, -733, -594, -461, -530, 284, -506, -530, -714, -633, -377, 361, -359, -228, 164, 324, 424, 631, 502, 1155, 567, 365, 198, 431, 11, 75, 247, -629, -523, -306, -874, -171]
2105a71p1n21j17M64p00L90Q97J72j88N58l70r9j65R10j131K67K77j10n59K60
2125gk19J87L84n84R7p97j29L05j61M53O10o63l11P12J69p23L23N27L38j34K13
2146E90M59n21oM39j16p01L95q40J56J79m04K63l46K72O4o83M86j60J55j84N3
2167d50N2l96R67L78p3J81J90m19k68O67o45n02R72k02m87j97m8j24k31P09p84
2188g10K82k42N2j21J427n11n39P91l97L03m63J016p04K74m77Q91l58m50J46K41
2208D51j298O45N53q84M3Q19l25p30n33J537q18k07J083m02Pl60N97P9j81R58
2228A034m82K69j77k06J53k8j92p32m6J34j66L64r6L0k3o05N11j18m45Q77L06
2249C62n13O78m67K78J28L89n91R3R8n13K2J60o1k21j1J18j64j64L16M2n36N58
$$ y = [-171, -242, -763, -880, -416, -1116, -726, 171, 343, 155, 713, 343, 244, 79, 989, -142, 125, 402, 292, -267, -7, -226, -39, 345, -239, -142, -939, -1068, -763, -924, -471, 139, -524, -835, -123, 46, -677, -354, 173, 511, 377, 590, 1049, 528, 522, 961, 845, 144, 539, -301, -145, 34, -370, -107, -453, -181, -117, -800, -314, -474, -319, -503, -450, -398, -794, 173, 551, 478, 659, 849, 430, 162, 829, 184, -318, 654, 452, -35, -232, -280, -404, -635, 74, -710, -428, -670, -618, -739, 688, 177, -362, 429, 32, 335, -128, 888, 184, 458, -19, 872, 514, 64, 210, 451, -847, -202, 351, -533, -490, 329, 4, -726, -1259, 278, -540, -747, 336, -66, -59, -419, 178, 257, 76, 1034, 552, 821, 644, 438, 591, 563, 371, -361, -407, -273, -439, -75, -171, -141, -164, -769, -258, -376, -821, 56, 362, -151, 527, 60, 338, 466, 855, 264, 357, 455, -58, -36, 124, 63, -158, -169, -51, -215, -379, -63, -21, -557, 1]
2271Ar2r38P09l12P25o77J36J364o49o85J078o22K88l12O81l15l30N89l69j77
2291I3m41O73j78p09Q86q24j60P79Q3m88J33k98P51l73K28j95J72J79PK00m67
2312E1K97K37n90N25n24j61L12k45k1K43q48J72j76O60o56O81o27J75J95J94M82
2333C76m76O46J24L93j20p98J83q4l42R6J69o90J81p8m0M15k40pm65K07L38q1
2355b93l1k14L67L17l02L79j68m1j45R1O23j94J11j53k94L85l39j37J015j177
2375b00K19L85m18j77K16m23J53J02j37O49k93J50l69o8J085j288J198m42l81
2394c9K34M75l95l51J89J35J77k40j33Q2l06j27n38j46Q02j14J0J76p7M8O03k39
2416B26l34J79K89O2K39o85L26l26J31n24K97k03L72p1k02L40k87j05K15j76m01
$$ y = [1, -91, -1029, -320, -632, 93, -584, -448, 916, 267, -418, 660, 38, 326, 14, 695, 380, 50, 639, 270, 93, -348, 325, 147, -562, 324, -500, -660, 119, 202, -286, -153, -451, 300, -73, 155, -40, 132, 311, 318, 518, 51, 348, 585, -5, 520, -4, -165, 147, -98, -119, 124, -724, -552, -728, -68, -724, -43, -670, -495, -300, -106, 376, -100, 546, 670, 1063, 943, 145, 328, 244, -98, -2, 167, -523, -342, -420, -460, -45, -285, -292, -757, -550, -212, -293, -324, -538, -171, 146, -156, 223, 55, 14, -131, -40, 583, 389, 500, 347, 53, 438, 99, -38, 977, -200, 19, 404, -14, -191, 25, -398, -245, -143, -280, 369, 76, 226, -143, -211, 874, -414, 784, 342, -39, 195, 670, 275, -76, 113, 248, 425, 185, 52, 134, -172, -299, -837, -983, -181, -295, -285, -109, -186, -138, 465, 226, -108, 71, 360, 422, 661, -24, 302, -24, 107, -417, -120, -323, 49, -22, -224, 116, -171, -276, -61, -237, -638]
2437f38j95L48m18J208j67m37O12n79K51K02K63J48m93Q9j19m55L25L3q4K38q25
2458f93M52l53J61l4Mm18P66K34l15l23Q93J23P3M24j01j071J34N53l26oK88m94
2480b9j60Q39n40m28k99P82n31l35K72O00l18K85j98k35M54L06j34j16p0O66q21
2501a0m32J068k0j379J273k54j14l9n83O13n93k20K79k79K62p1J5kJ78N72j30
2522A34l49L37m21j60O69j20j41L17M99K01m36K33q44k36q7K4J21J42o5j34m22
2543g38N37m69P92m53l63J80Q15m11P25m72q4N26L39j095M75r45P28M99m79l41
2563b34mP84p65J70K79q98L3L97m78O39l80l43N56m24M99O99l68l79R72j67j075
2584d87N28k90O83k22L92r56O6QP0k60K24r1q72O31j8K09M96n3k83k56R74R0n14
$$ y = [-638, -833, -485, -903, 305, 138, -299, 313, -266, -15, 187, 450, 598, 105, 194, 75, -380, -55, -22, -106, 132, -693, -241, -594, -433, -467, -463, -881, -115, 119, -196, -519, 374, 497, 570, 994, 893, -178, -44, 509, 183, 177, 465, -29, -189, 650, 110, -318, -617, 165, -366, -701, -429, 171, -147, 138, -60, -295, 159, 465, 331, 215, 145, 811, -10, -442, 626, 606, -773, 500, 246, 132, 93, -490, 123, -470, -690, -411, -690, -428, -499, -484, -486, -308, 264, 134, -215, 122, -299, -459, 210, 90, -51, 266, 765, 966, 530, 763, -81, -317, -404, -380, -259, -117, -182, -316, -738, -201, -670, 122, -331, -694, -514, 301, -110, 615, 143, 59, 585, 924, -171, 304, -641, 87, 586, 107, -234, -238, 546, -219, -49, 230, -668, -635, -238, -716, -77, -457, -800, -244, -668, -169, 530, 162, -217, 755, 588, -487, 41, -249, 434, 212, 604, -352, -286, -278, -208, -468, -244, -335, -1207, -576, -594, -385, 111, 58, -225, -481, 493, 583, 69]
2607F9K3J64j19j32N26q9m45L20K16l84m19j18N65n74M0Q0j71K00NK11Q2O7p27
2630f10R59n59R51r22O61j92j3l65O23k74r50R55P5R96k240J328o52Q19r37k22
2650e69O17n66L41K65o62L24o3O51k69j22O16q99L84L05o72R69p93k78N94n77
2670d04J043m48m92P0N75o92k45L02M61q41L89K64k43m6K87j70M83o27P42q25
2690d17Q78l32k8O54p16R6o3J43l80O16p78K02k43K81j91J4M70o28k85J18Q58
2711B69k95l9K99l67Q63kJ62l82j057N36K00P9o63K63L15m03k41L46j77M12m0
2732G8j019P49k35M00m37j55K39J42L28k17N30o27K16M26o49L47L22J36l55l88
2752a69L32l48J50L75l88n8J076j190K3l12L0M34O51o75j67M48p04M79L50L30
$$ y = [69, 92, 256, 137, 5, 531, 442, -3, 317, 533, 149, -270, -388, 177, -397, -357, -277, -448, -248, -243, -32, 50, 117, -610, 349, -210, 741, -181, 480, 288, 275, -90, 533, 259, -691, 264, 339, 1335, -905, 423, -229, 590, -347, -569, 48, -518, -177, 88, -574, -250, -313, 338, 69, -53, 563, -336, 48, 353, -319, 650, -143, -421, 173, -404, 639, 191, -301, -231, 344, -348, -593, -291, 170, -671, -282, -18, -261, -307, -20, -190, 293, -334, 408, -417, 461, 129, 101, 755, 39, 135, 72, 215, -165, 451, -327, -125, -368, -87, -278, -264, 206, -422, -707, -589, 269, -26, -65, 234, -133, 730, 728, 890, 508, -549, -13, 187, 266, -397, -134, 181, -222, -463, -117, -294, 118, 78, -941, -192, -427, -27, -464, -619, -380, -238, 90, -127, 403, -224, -8, 418, -231, 116, 438, 574, 219, -169, 163, -185, -35, 340, -48, -106, 970, -220, -197, -509, -479, -45, 606, -69, -236, 212, -492, -13, 337, 667]
2772F67n89j002J521r69N5M12R2m73J70M94n39r2K60K39o99M92J5r49P49m75O80
2793E9j48M08q8l97L91M34p03MP93q20j01p9R84m93o19P18k88Q9o9n37K30k17
2815d49M50k23o03R99j62j27J70L57j19j0m92L09K92m62K79O13l14n13J065j226
2835a66L31N8j020O66J95l85m82P06n02M22q7N94m00l99N58K62l57J77l7K17k40
2856A11O7q2R0J34L21r52O02k82m80j85J95P59l80J15l58K33m12L64J61l70R54
2877F05n17Krk20O11k81K80j73J4mL28r83O91l71q6L05J41j102J126L6p40m4Q
2900c83K71K64o84J020l9k59m07L69k41M0L7K61J17j81r8p46J093r11n3L7PK26
2922b60k52J9N94k92j32J90O3J49J05O6j01K38J92n4j039P62k2j83O8m00j65Q46
$$ y = [667, 78, -924, 597, -372, -317, 95, 187, -286, -116, 378, -161, -253, 7, 246, -453, 39, 54, -895, -146, -621, 59, -89, 319, 231, -166, 225, 659, -44, -40, 753, -67, -168, -247, 737, 244, -375, 343, 55, 144, 75, -462, -232, -449, 1, -222, -825, 174, 12, -115, 55, 412, 293, 283, -209, 100, 392, -70, 209, 822, 508, -5, 1060, -166, 165, 223, -797, -131, 64, -321, -803, -97, -599, -177, -264, 330, -70, -469, 89, 351, -6, 171, 134, 351, 111, 178, 96, 186, 320, 641, -311, 291, 9, -471, -656, -461, 298, -82, 33, -325, -92, -504, -140, 21, -349, 605, 88, 90, 81, -139, 472, 191, 471, 298, 312, 308, 636, -347, 344, -27, -113, 192, 333, -769, 357, 393, -347, -391, -383, -112, 152, -532, 488, 449, 190, -217, 152, -89, -49, -12, 249, 366, 185, 87, -659, 434, -477, -530, -493, -486, -260, -512, -493, 101, -191, -323, -133, -70, 79, 184, 250, 149, 387, 579, 525, -514, 248, 226, 43, 111, -289, -454, 392]
2944C92k69r4j86j02J1N24j46n64m3K75P60n26L58Q2o35O27j39M11L6j144L95
2965B3J1N06j69l00j39k15J79J12m68o2J163j048k01K72J66M41k21m51M78P4L87
2986E38n47j53J411j210N88l3J16N2r34Q83m60k12o4N34p71Ll74J091m39n6ol55
3008c98N06j15m40Lk8J294j030O68m04m67K94K01k3l15O30o51Q16n29m84P95j80
3029A43n30J63L57n2k42K06j94n46K11N73L4j60r0MnK09l41K61J19J43K39m72
3051C0N88p14k48L82k01M56m02J68q4R0j41J35q5N80q33M80J52L30p17M28o57
3072b63M79k47k80J03L56j45l40R83m30L15l93j212J560p00j36M35o70l05J163
3091B73o01l07O62K08P4P8J78k32l18K16L25l92j30l92J99J0p3M1m94P84k98l98
$$ y = [392, 123, 29, -157, -259, -248, 276, 130, -434, -477, -202, 558, 32, 390, 472, -163, 464, 325, 736, 772, -372, 23, 34, 540, 371, 71, -68, -283, -104, 8, -460, -522, 641, -407, -608, -336, -170, 271, 50, -401, 77, 151, 538, -9, -162, 1249, 39, 627, 594, 710, 762, -172, 711, 251, 39, -25, 509, -262, -259, -633, 458, 19, -37, -43, -398, 108, -7, -447, -444, -472, 822, -208, 460, 56, -411, -117, 84, 61, -254, 376, -275, 541, 12, -472, 323, 143, -387, -224, 133, 81, -161, 45, -149, -695, -484, 89, 123, -37, -127, -123, -128, 81, -260, 1, 120, 263, 502, 30, 618, -96, -344, 38, -163, 293, -109, 59, -25, 65, -76, 59, -26, 554, -279, 201, 353, 683, -34, 394, -263, 216, -31, -311, -208, 148, 3, -337, 646, 216, 531, 138, -1074, 486, -214, -350, 85, -585, -890, 273, -328, -635, 27, 235, 309, 387, 565, 333, 15, 231, 556, 164, 34, -358, -159, -149, -222, -181, -675, 109, -189, -587]
3113e87O46j98J10Ml15j7N78m55N06m84L38l00M88r8J69k31j02L78n42O45j011
3134d78N17k57L96n74P6Q3q01J021k34j18L75k04J011j436O37L29m44M66o90Q94
3154E69m59R8n14M57M87j12o15J91K81k88l37r4J98j29k13P38q61k14J172j026
3174f71N36L67n43J109n11J13j67n33J28N15j03j73K00K29p46N3l97O09j12k36
3194c33K07l4n77Q85q49J90J35k9O02K78l63J13n01R17l93k88N42k51J54J08k25
3215B88n45N22k91l42J47L6N02n30k20j47L92J05J19j04j81N23J0k28l28O80l17
3236I1Q6P33m20o07K93j54P7M14k43l11K4O01o05n65L74k28j37j21P74m63k12
3257e99Q12o76O05j65N37q14L56l6J60K3j93N71r36K23k11O2N16o52L98l89l35
$$ y = [-587, 59, -139, -29, -25, -340, -357, 221, -234, 272, -212, 126, -174, 314, 216, 385, 154, 52, 430, -112, 533, -478, 39, -218, 178, -396, -320, -237, -1038, -17, -251, -369, 6, -198, 813, -623, 14, 343, -101, 365, -325, 569, 110, 208, -306, 151, 638, 526, -89, 102, 383, 95, -242, -336, -138, -267, -480, 258, -603, -817, 355, -671, -135, 232, -311, 798, 287, 400, 233, -300, -172, 343, 240, 67, 267, 496, -250, -197, -594, 15, -97, -333, -126, -160, -737, 148, -701, -511, -376, -405, 197, 475, 112, 225, -276, 641, 248, -40, 502, 251, 405, 513, 288, -257, 265, -26, -368, -221, -185, 317, -213, -433, -580, -188, -83, 36, -68, -249, 274, 284, 56, -272, 408, 91, 177, 910, 490, -117, 176, 22, 99, 513, 270, -41, -17, 584, -21, -586, -212, -440, -577, -698, 76, -387, -599, 213, -463, 142, -23, 514, -300, 56, 20, 180, 203, 10, 581, -355, -132, -343, -281, 235, -417, -19, -408, -743]
3278g43N39l41J06J18O66L9mk01K88O2k96J17o11N21J84n89O06p70M04P7j33J98
3300B37J03R8n61o77O38J29j07J74l5K8m00j13L48k55O19J38j5n88L48m83Q95
3321E21K23m29r05J241l45n20J39M41k67M14r89Q56l57N4j16k46L45lkl45R64
3342F74k51q73P49L8k70k03K75m20M57n27M73k24R0J9J8R2m63J53j70q8L01m2
3364a92K50k16k12P6L4M14o41O83J14m8K51l79k20l03J30k61J011o82k28k22P14
3385G3m79N30n35P18m33L37n45P00n90r0P90m83N24o29j48L13j60P3O82l78K15
3406D85l54j49l66Q86p40K42K76p52k86K62L12J89p69RQ68l37J32K16j36J81l65
3427a96M20j44j87K58K99m02K84k07m73N68o57M83m92K51o1Q2l94O93l57j92M08
$$ y = [-743, -204, -545, -439, -321, 345, 384, 380, 179, 467, 529, 233, 350, -261, 260, 444, -145, 461, -309, 95, 172, 39, 237, 340, 438, -123, -800, -162, -33, -140, 34, -1, 27, -373, -486, -138, -393, 226, 364, 349, -239, 109, -374, 521, 744, 315, -590, 651, 306, -214, -75, 366, 99, 513, -476, 380, 23, 77, -39, -285, 60, 57, 55, -290, 674, 423, -450, 299, 337, 67, -136, 139, -281, 176, -351, 122, -102, -12, 7, 25, 117, -346, -193, -363, -451, -150, -192, 58, -158, -370, -294, -260, 154, -487, 196, 310, 262, 513, 134, -86, -389, -259, -520, 491, -191, -419, -641, 73, -406, 124, -411, 307, -126, 211, -334, 366, -224, -314, 476, -7, 517, -112, -260, 53, -107, -34, 648, 270, 485, 131, -18, -384, 502, -238, 4, 280, -472, -758, -496, -184, 5, -764, -755, 113, -224, -92, 124, -12, 169, -196, 224, 80, -107, 151, 450, 48, 332, 125, -348, 220, -437, 46, -446, -195, -256, -174, -568, 125, -232, -424, -16]
3448a6j30k71L36O99n28k47M18m81J67J51L71p01N13o21M81q41j05J041q56Q40
3468B20k3N8n61M03k60l43N14M31q41L55O40p16O95p20N91l91m37L83N16m85m41
3489d12K37J69J04j65m11j93R05n85M62M55m92K05j046N99L85q5K50l39m8Q92
3509H87p45K86j7L3j09k29o9M09l78k05j07N1J80l52L64j85K58k72R8j14L40J15
3531B39k4j30L70j06J18k97j58M8J23J74j24l15r3K65N0o16J16P9PJ023j109K02
3553a58l40R67n88K56j40J7o3Q19n45k22Q72n54k29K5O4l60N94o94J60R8m2l6
3575i9rk74N87l97L04k70M76j24k27l4J85l05L94K46j97J84p0l45M07k07K0L51
3597E96m35m00M60k15l79L26p9m44J51J89l58L28L09L64L0m66k20l67J198j33
$$ y = [-16, -146, -417, -81, 618, 90, -157, 261, -220, -53, 98, 469, -232, 281, -340, 141, -700, -805, 236, -620, 220, 197, 255, -306, 97, -163, -506, 8, 439, -402, -47, 593, -123, 572, -148, 443, 52, -385, -2, 514, 29, -412, -175, -6, 98, -67, -478, -671, 234, -351, 111, 566, 74, 279, -767, -168, 217, 132, 382, 43, -5, 887, 142, 428, 411, 444, 335, 106, 37, 446, 68, -137, -244, -193, -13, -365, -1, -186, 72, -200, -102, -216, 124, 239, 215, 85, 455, 349, 467, 170, 12, 60, 183, 357, 233, -82, -175, 90, 140, -476, -360, -281, -274, 749, -360, -158, -498, 469, -119, 137, -3, 14, -49, 770, 225, 3, 875, 321, 92, 117, 181, -179, 415, -279, -119, -21, -63, -99, -108, -382, 205, -192, 112, -158, 318, 194, -33, -67, 118, -187, 207, 453, 256, 440, 370, 25, 432, 225, 245, 596, 161, -239, 221, 6, -373, -47, -126, -570, -419, -230, -588, -260, 49, 413, 443, -23, -243, -610, 588, 455]
3617D55l54O33j149Q89k93m52J2l6J32P93q15K81k39J19N44o69j20j68O52r73
3637g58P23q32R98l36L36J00j97J99j27k34O04k96k22K35J48O3k51K6m1m80J77
3658a65m28N44p9J52l90m99Q78j69m33O11j65K9j33O54L63o93L04M50q42J41o36
3679e06P4P39p49O57l64n82R01k29m90L97L60l67K1R1j61Q57r33L85O55k93k17
3700B46N3k50J7L31n50M98L36o31rJ07m02j72L74m14K87K03p55J219o28J03k32
3721b69M18l89N22m96o3Q27n11L00m42R28m89j002J034p56k9M37l51N38m23K16
3741@j00K44j47l11Ok6R5M2k19M70k51L59J98l07j07j85K54K3j16k6N9K0p5O1
3765c9j71J16K74K21n15j84j13M09K6K57n50J95O91n20m21N83jk89N56l95K52
$$ y = [455, 101, 734, -415, 474, 181, -271, -259, -295, -163, 630, -185, 96, -143, -24, 520, -149, -269, -437, 215, -758, -35, -867, 131, -205, 131, 231, 34, 233, 106, -128, 476, 180, -42, 193, 341, 404, 153, 179, 138, -342, -165, -593, -49, -128, 24, -366, -865, 13, -156, -589, 22, -143, -114, -247, 407, 770, 77, 381, 831, -11, 130, -506, -432, 307, -442, 215, -149, -731, 170, -59, -549, -152, 208, -159, -138, -47, -208, 649, -284, 101, 756, 463, 246, 299, 49, 66, 397, -153, 345, 681, 50, 41, 148, -254, -426, -52, -466, -179, 24, -731, 488, -140, -37, -269, 149, -240, 282, -214, -277, 550, 39, 339, -103, 825, 336, -666, 368, -388, -417, 20, -331, 207, -216, 0, -100, 144, -3, -314, -308, -334, -239, -197, -416, 54, -197, 162, 360, 53, -54, -239, 15, 38, -78, -104, -45, -25, -100, -39, -210, -94, 180, 401, -114, -298, -411, -2, 24, 281, -269, -74, 617, 97, -324, 259, 258, -31, 525, 130, 382]
3786C82j98K16o5j97l51L7M90p89N27m71L03m58O6J42L49m51L72J34o25J527j007
3807f7K52K8j78l41O88J86j81Lk05r7p9K64M19q63J58j19J65l18L10o21K00K56
3829a40N01j64n13L52K59p92J172l82j92N67o39L52M01k49J04m05k91p40j95O54
3849c40p3J91j91LM11m61m3r4P72m50M09J01n07N95L32k94l21r5J3J76K39l34
3871C9n56J051l26j76j86l05N02R0R9n96M01N12j75M8k41L02n22R0j1Q13n35m7
3893B71O4l44K32m1j17M71k66k49o01K78L64L1k37j4J52M14q55L46q3L44n46N50
3915A64l26L28O27j022N76m70J34O5K91j33K30l57k27kp8P58j0q79L23j45n19
3936f72J41P12J8n6k35L24m64Q83l78r6j69j75K35m68L65Q7K48o00N48j6r5l20
$$ y = [382, 184, 400, 335, 138, -213, -176, 314, -475, 52, -419, -116, -574, -508, -366, -17, -468, -96, 38, -587, 940, -67, 185, 213, 35, -306, 382, 568, 387, 390, 185, 88, 9, 273, 692, -171, -13, -132, 33, -285, 25, -596, -396, -140, 361, 197, -316, 36, 295, -497, 675, 293, 101, 668, 29, 381, 782, 533, 637, 232, -59, -799, -994, -340, -413, -222, -413, -410, 1, -460, -503, -597, 175, -275, 134, 235, -272, 323, 655, 361, 40, -55, -42, 134, 373, 39, -517, 534, 208, 32, -154, -459, 43, 133, 232, -364, 37, 549, 374, 422, 181, 483, -39, 51, 40, 853, 318, 271, 335, -9, 223, 182, 65, 536, 270, 21, -580, -302, 62, 93, -144, -158, -6, 408, -447, -101, -184, 160, -386, 164, -162, 166, 793, -229, 347, -123, 11, 76, 367, 234, 464, 107, -120, -122, -200, 558, 548, -331, -8, -153, -672, -531, 181, 199, 143, -92, 232, -232, 651, 273, 177, 8, -167, 68, -400, -35, 52, 300, -300, 248, 232, 137, -183]
3958a83J35k70L6J33N7n07M87n6M65n09k22K68J88Q6L0k19J75l15L58J21N28l12
3980D74m50j59j64O9k50K78j23M24R3n97R9L98l57K60J17j97K04N37m0k19j012
4001f15O96K77m45K43M4r3l67M7j74k4R19p99j87K50j80j19L12M67q65L43P21
4022D51p96q7N90j12J09J94p50N57L23J85j093R02k33j96j26l13P2P0M28k21m0
4043h6m57K08J021p1o84J71k62L0M48l18J96m67L86L09K04j62m7o03L57K8N7k6
4065B32r69N58o3m07L3Q19k67M7n4O67r39K88Q9p6k32M84M8j70L41k10K34n50
4087i7L39J15l69K60p87P67k45L75q95L71k7l42K45L58j58J27M93k89K87p24K71
4108G5k62N25j88K36k12j16L38P4m13j32j69N94p96M63j68p99P73K15j42K5Q83
$$ y = [-183, -48, -318, -282, -149, -92, -599, -112, -168, 297, -212, -434, -166, 22, 108, 138, -81, 94, -221, 137, 258, 786, 474, 24, -135, -299, -230, -480, -202, -325, 99, 192, -405, -306, 92, -265, -5, 112, -85, 119, 656, 616, 397, -615, 81, 358, -87, 156, 200, 107, -260, -213, -387, -411, 508, -291, -478, -228, -408, -527, -215, 252, -613, -270, 451, -345, -432, 158, 46, 155, 349, -401, 156, 479, 664, -429, 473, 240, 44, -82, -395, -323, -253, 175, -46, -86, -543, -335, 686, 615, -69, 102, -160, -130, 318, 0, 196, -271, 115, 424, 628, 466, 419, -184, 173, 201, 258, 232, -737, -179, -242, -649, -616, 203, -64, -17, -71, 596, -343, -55, 34, -42, -274, 210, 258, 88, 429, 219, 453, -97, 242, 357, -12, 248, -539, 228, -17, 358, -537, -166, -193, -535, -290, 68, -90, 37, 530, 241, 528, -196, 75, -187, 338, 150, 386, 174, 58, 396, 470, 57, -75, -244, 350, -446, 17, -151, -950, -177, 38, -104, -79, 804]
4129H04j352Q40l50j16J49M66J29m85N45k99L1j01mK43l41o70O62r8k28L57m24
4150b42j62M20o5j68j45L08j76n5P7k77O21M1M90l20j61M78M7o90O72p68K49J08
4172B82m13L62m4n78M40j61M81p27M97q5J45j58J23N4k9l9m88K90K28J4n7L73
4194E10lm0L7l38p80P77R2l86l1k3l40M4M76j34k22M88J68r06K26M28J46j010
4216h21O21K97j95J54q7p5L56n3j53q8K29o30J018n93q69P81L9j99M69M35j467
4237h31K40K33L42J35n23r0O64J37L00o86N95j74m11P08p03nL93k27o2l8m18J067
4259F46l53o02j51Q07j19k25K22N9L21m36J44k32M3oL0J62R0n4k32o4r5J57L13
4282D25n19n7L94l00M01o48K16M27n27k08J07N61l45l11O93p04R9J52O10k55m39
$$ y = [804, -548, 292, -58, -174, -25, 441, 570, 85, 630, 331, 362, 261, 257, 500, 159, -511, 151, 53, -175, 182, -242, -404, 16, -49, -217, -362, -54, -230, -285, -208, -485, 136, 177, 667, 347, 186, 664, 711, 21, 693, -75, 174, 282, -131, 231, 187, -391, 49, -112, 369, -358, 139, 54, 199, 41, 164, 218, 189, 150, -338, -48, 180, 194, 137, 510, 507, 467, 504, 166, -614, 163, 255, -131, -162, -185, -525, -481, -5, -139, -361, 127, 295, -611, -385, 43, 189, -821, -200, 97, -98, 56, -31, -106, 250, 197, 44, -44, 185, -445, 573, -20, -889, -108, -69, -268, 201, 636, -831, -591, -358, -16, 119, -404, -494, 170, 307, 607, -79, 516, 342, -69, 639, -64, -69, 324, 97, 35, -3, -421, 646, 293, -309, -460, 347, 228, 3, 225, 284, 605, 169, 313, 81, 124, 118, 148, 310, 400, 346, 114, 50, -45, 112, 425, -94, -151, 243, -57, 344, -304, -88, 339, -188, -396, -289, 272, -73, -384, 309, -395, -296, -144, 466, 211, -228]
4303b28M87k57O96n86P4n25K57J45l34J22L46o78P21n06j34N63m85J47l19L1N03
4324D0N94m03m81J56O38p2n21O2J94K47n24m31L21P27k28m46j52J41k13K43O79
4345E71q28N10R4k04k99K59l8M22o02J09K82J07j20L22k30k75j74K65o4n71N94
4366A30p13L55m35O2M99J34M9Q9k05k09K8p11J189J3m96j0k17L44K57l72L89N54
4388G24k10o87J93J59L37o51j44L38K41k36l60KK39l4l2J26n91R66p38P58r4n89
4410b83O87r5j4p0m10K2K54J1n37K42L8J85O1j83q05K45K75j24J85M81M57r98
4432c76K96L01o5k25j7J38k45L91m3j05k51L29j58J99m42J67k90O52o11N0k82
4453e87J99P6N75o82K62j9J95l6JK67l55O96k57l39K24j75N50n09J17l49M66q15
$$ y = [-228, 259, 2, 698, 112, 186, -339, -82, 63, -271, -149, 197, -481, 240, -266, -400, 163, -322, -175, -494, -463, 40, 634, 231, -250, -94, 544, 472, -49, 13, 207, 454, -70, -501, -180, 547, 319, -127, -279, -138, -351, -108, 571, -257, 253, 347, 143, -156, 103, 65, 487, -115, -6, 276, 383, 263, 585, 355, 80, -94, 171, 107, -464, 130, -583, -228, -663, -601, -102, 32, 81, 170, -35, -244, -216, -927, 262, 275, -221, -231, -448, -104, 153, -219, 170, 724, 514, -173, 20, 179, 516, -135, -279, 59, 300, 64, -296, -294, -55, -89, -121, 5, -586, 380, -358, 400, 306, -283, 404, 309, 295, 225, -185, -163, 91, 102, -435, -193, -155, 30, 91, -92, -897, -652, -377, -501, -316, 165, 622, -376, -80, 221, 156, -69, -86, 52, -193, 198, 155, 50, -201, 128, -30, 169, -273, -106, -396, 256, -355, -305, -587, -388, -312, 263, -419, -157, -176, 19, -17, -16, 251, -104, 592, 335, -4, 220, 45, 595, 86, 203, -146, 320, -495]
4475d95M79K98j143J269o90J5L94l36J32K4M39l25r7o33L44K98L04k82N44l06
4495B33p1N8K61j33l91m54N38m22J66J55j64l29P15l15M17m52p45J057o32Q29
4515C21m20j59L41K56k6k25l7J11n25M43M21J9p77L94L84o76R6k41O14p89N54
4536G9r0K24k64K1K98m45J2J35Nl52l7N05q8j27J42J03J09n17N96n35l2O97q01
4559c62MJ63N0L59n64l04R21l14M07n59R60r17J93j1K40K98o57K26k27j97O35
4580C44J38l51K61q63J85O6L94k72k50J2K4j16Q07l65k86mj24L65J49Q5j06Q7
4602A80Q11p66k44Kn5LN92k23m8j93l30k1K50N75o72m59J083j96j91o36N23n5
4624g0R00j152Q23k77n90O39J63o44J55J09M76o6l67L86j288P58L26j22j32o80
$$ y = [-495, -16, 282, -861, 408, -282, -267, 127, -209, -77, -53, 386, 61, -36, -669, -325, -27, 277, -5, 539, 233, 162, 220, 481, 348, -43, -497, 41, -381, -215, -60, -224, -553, 162, -153, 264, -188, -933, 124, -508, 321, -99, -258, 83, 339, 313, 88, 51, 162, -363, 80, 501, 520, -257, 137, 521, -155, -59, -300, 314, -475, 79, -11, 213, -51, -30, 268, -177, -165, -30, -25, -377, -414, 91, 3, -124, 18, 121, 230, -287, 309, -226, -258, 439, -362, -358, -195, -145, 214, -350, -654, 267, -47, 360, -199, 761, -156, 37, 26, 266, 564, -93, 133, -94, -291, 344, 482, 131, 392, -471, -286, -220, 174, -98, -348, -336, -312, -428, 379, 14, -272, -276, -400, -35, 114, 199, 93, 180, 991, 225, -19, -17, -72, -69, 523, 300, 252, 59, -271, -292, -42, 533, -139, -598, 485, 289, 98, -538, -15, -70, 830, -322, 501, 224, -366, 273, 436, -208, -53, 56, 532, 466, 99, 485, -803, -45, 281, 159, 27, -653]
4644f53P48k01Q1N11o55O15n13j05L78O18j143l01Q28n22O73k96K52L79q26N02
4664C70l20O16j253M93j09M0l02N54m27J29L80n23P4O0j96oO20n0k52K39n98L5
4686d26P64o33Q98J46j141J61M1j58j67O59o19J295m07j233K54Q54q04J56L00
4705f0J98j90l19R89p16J79J94l04O76n65K47k89j75K49l82l08L95J10M01k03
4725A27q95K90N29K72m64l11Q22q51L75j53J69N12k26j64J96o19N34m35J09N27
4745C44o03N36J63l85N07m31J25n31O76j05j62J20r24P24k90K91n6J63n4P62j577
4766g07J171j05j80O32o73K16n46M96p5K19k54o19O14k89J79q6j93K72l42N87
4786C17n69m99R13j36J06r4Q3K8L41n91N29l32p1j11P9M6l56j81L95O98q46n9
$$ y = [-653, 95, -106, -25, 486, -169, 446, -67, -172, 206, 824, -319, -620, 208, -314, 359, 63, 315, 694, -132, 370, 50, 666, -587, -94, -203, -163, -465, 89, -338, -209, 171, -352, -278, -218, -414, -420, 200, 150, -102, 137, -461, -426, 338, -295, 603, 749, -392, -231, -190, -348, -515, 144, -475, 820, 413, -820, -566, 288, -516, -360, -60, 138, -52, -371, 618, -98, 81, 275, -29, 647, 82, 329, 40, -135, 114, -268, -576, -181, -71, 330, 127, -768, -478, 51, 323, -141, -452, 370, -481, -106, -259, -90, 422, 196, 32, 228, -391, 143, -292, -183, 344, -259, 277, 440, 55, 562, 131, 256, -275, 401, 296, 134, 254, -670, 54, -236, 55, -1, 162, 108, 870, -707, 464, 359, 179, 811, 138, 354, -192, 304, 229, 448, 194, -425, 189, -100, 79, -7, -200, 72, -270, 317, -252, -751, 162, 26, 132, 38, 121, 149, 490, -101, 428, 96, 25, -86, -7, 39, -317, -498, -103, 595, -251, -310]
4808c10M8N67ol10l7K71l01Q2j8L69q0k54l83M04l9j56M30p16N60M6j23O8q41
4831g29O81j5L83l63o9N40J1m17K13o45M47l70O46k84k39L43L8L62o17K26k32
4852i0L36L30K60j58r53j0M59j24k05l86K80K77k99K45m72Q73l05k6l42Q11j098
4873e97N51m89O54j97J07m2J78k94l3m39P49l48K42r1l4m18j92J229l07O7j020
4894g24O34L2J43O17q88P43o72m1K18K83n26L36K69r2m28j14K85m15M38k45m93
4915f40N58J54o47L99p2j50k05R69j43l27o12N98L12N72o51k62p1k96O77l16M4
4936a09j36K16m46L77k37J63p13J17N31n2QM37n53k3K66k44M31L85j32k5o9J29
4958C21K31p29L2R7k58m4Q0LO25o0l05r29J419j80l01j96N0L0m85J69K49j68L28
$$ y = [-310, -262, 305, 299, -11, -48, 223, -78, 4, -14, 355, 275, 21, -362, 42, 3, -153, 277, -439, 121, 167, 44, 112, -729, -48, -63, 320, -43, -112, 428, 439, 22, 235, -410, 37, -333, 313, 29, -210, 133, 171, 533, -84, 142, -90, 246, 576, 836, 678, -275, -285, 174, 50, -155, -541, -261, 16, -283, -38, -510, 363, 58, 32, -310, 501, -597, -46, -535, 119, -78, 29, -13, 165, -129, -162, -601, 148, -200, 42, -49, -83, -501, -693, 536, 229, 296, -724, -90, -58, 85, 702, -186, 557, -115, -156, 62, 345, -181, 155, 424, 332, -96, -210, 75, -340, 98, -147, -640, -82, 72, -575, -176, -248, -398, -603, 366, 223, -104, -716, -118, 194, 766, 115, -147, -218, -514, 163, -153, -109, -245, -29, -475, -98, -335, -172, -885, -768, -237, -289, -281, 156, -397, -420, -154, -398, 33, 418, 286, 261, 192, 321, 552, -177, -145, -48, -306, -350, -270, -267, 358, 298, -7, -936, 483, 303, 2, -194, -144, -114, -599, -430, -181, -349, -21]
4981b1L96k55r0K09J7l59J29O2j23j66N2%j18l19Q29j3o78M13O11o87L23n44Q4
5004b48K47L80l18K85n37j53O45m27P0kJ36l91L93r9N67j182N07j25J90l2L42
5025B48n57j46N10n18j12J81P09o94Q08j81O0rl00J93J73m24r6J68K27k20M5J69
5047B34N7k76J63j15O3j37l96L19K86J27p07M28l70L97K89j66J42l28j88j65k8
5068c71R38j22p45K63l3M5k78L5p5l6J38P8L74r49R24j58j19j38J56M6j25O42
5090D90m47j9J24l21K89j76Q86l52p58P40o54K46J01J14l7L2l73K8k39J97Mk67
5112c92J63L3M63k05J04l36N5K01K73J64k79jQ3l71Q3J92n46L65J58J64j036L59
5134c06J21qJ33L13o9Pl66N79J0n28J70M35L16o15J62p20O72N06n27o62L17j91
$$ y = [-21, 375, 120, 30, 239, 256, -103, 26, 88, -35, -201, -149, -149, -267, -586, 243, 230, -448, -35, 576, -111, 212, -332, -248, -1, 379, 61, 346, -191, -344, 301, -126, -56, -58, 78, -313, 80, -19, 548, -634, -127, -252, -62, -94, 248, -309, -455, 55, -463, -575, -394, 315, -379, 429, 248, 308, 299, -1, 192, 365, -59, -155, 13, 240, 20, 65, 234, 291, 15, 178, 63, 126, -11, -407, -88, 198, 325, -382, 46, -324, 73, 362, 196, 338, 10, -178, -343, -371, 567, 445, -300, -37, -70, -25, -303, -268, -343, -379, -241, -163, 211, -738, 186, 28, -91, -229, -73, -27, -152, 490, 43, 24, 148, -173, 116, -60, 826, 474, -284, 456, -198, 48, 149, 263, 226, 258, -115, -87, -326, -129, -125, -392, -229, -196, 267, 62, 166, -170, -115, 86, 359, 523, 244, 243, 326, -45, 38, 230, -316, 49, 207, 371, -665, -306, -185, -193, -60, 253, 184, 191, -175, 404, 414, -114, 56, 491, 807, 192, 354, -366, 306, 812, 285, -377, -60, -251]
5156b51n2K45O98j90o31L42j06j59j99O9L58l78O10j019J221m46R4m04N42K91
5176F35j14n25L60K55k05k09l42L48k28N58oj016N65k89Q0k36Q2K70K07K36j029
5197f03J40N17pl42K41Q9j49P9k45L04J56l57K57o12R04p5j15n80N8O46n83K73
5219dj62M17N0j69q4K44O8m44j03j27O79P6O1l52q3M32r8m22Q1n3J18K27q83L98
5243a33M49m87N19on98N03o72O36p2J48l45JJ7J8J01L8j5M84n79L02o05j90o8
5266e54J17N95n09l68O07J08q9J13j56J40m0o3Q46j108N06k3m11N08n53K90M8
5287DK0o94J887p02k56k11R4O3Q5o89Q9K51J24m02k90K6m3O23K39k30l64K30L23
5310A77o17Q07m84n9j1L79J29O4l60q34P66K35K97p17N02j99p7n2N35j11r73J46
$$ y = [-251, -303, -58, 640, 450, -181, 161, 55, -104, -303, -234, 124, -254, 356, -663, 558, 112, 206, -198, 344, 635, 521, -4, 356, 611, 406, 197, -145, 203, -25, 533, 527, -489, 76, -213, -133, -369, -287, -17, 190, 426, -603, -463, 54, 47, -295, -54, 35, -114, -35, -280, 24, 180, -177, 80, -532, 372, 297, 182, -398, -340, 306, -277, -4, -166, 251, 301, 132, 48, 292, 360, -84, -187, -314, 365, 441, 502, 150, 67, 499, 401, -21, 60, 7, 125, 352, -531, -133, 316, -171, 348, 342, -256, 247, -425, 211, 139, 287, -58, -57, -40, -22, 79, 117, 102, 586, 7, 309, -296, -486, -554, -437, 158, -351, -719, -112, -4, -93, 20, -136, 4, -36, -99, 747, -361, 145, 122, -289, 219, -334, -44, 4, 24, -670, 1217, 515, 259, 48, 142, 205, 290, -399, -310, -59, 65, -337, -627, -601, -644, -21, 218, -12, -376, -146, 177, -440, 367, -117, -176, -187, 192, 321, 385, 25, -809, -43, 192, 489, -228, 274, 75, -2, -54, 481, 370, -603, -457]
5332d57M52j14L00j27n79L32K88l03j15L77n92J216j148N68l54k48K95J84n65
5351e90P9Q0J57P1k53n3M08q5K3R6m04Q54j30l37M37k08l82N66j53p45R73j87
5373B17j03j98N3n32M85K89o26J10O02r11N57J21m39J21K65K78m1l6j13Q3N0L6
5395B68j21o99J010l73K46L5o33O77n18M6j92J40j7nl25L21l4j62P02l79MM10
5417D01j68l73O4k81M21R0m9j70N04J96o01K83j12p68O8P93q35P17j91j8J10m03
5439c22N77p91N8M59k89N03n94N73n09P55k5l31m87L23O7M21q96M80O6L67K18
5460F23r71R43q04R15m92l0J57p19j34M26l34M90j94LJ25J17m08L29k6J56P11
5481H83r23l73L70n12K88J20l91L17O96j59n42O0L18j33n38P00l44mj51L90k92
$$ y = [-457, -5, -119, 181, 54, -525, -193, 95, -208, -323, 54, -538, 678, -470, 98, -256, -504, -209, -25, -590, -511, -431, -274, -203, -456, -509, -101, -186, -163, -67, -471, 383, 253, -84, 353, 145, -237, 329, 176, -569, 404, 217, 114, -84, -31, -563, -78, 211, -415, -305, 297, -614, -57, 64, -375, -254, 11, 289, 248, 212, 99, 182, 232, 268, 147, -552, 458, 85, 331, 366, -267, 410, -108, -62, -254, -114, -131, -136, -461, -140, -174, -336, 366, -13, -9, 401, 233, -140, -76, -357, 64, 154, 105, -65, 439, 635, 34, 317, 205, -563, -495, 298, -537, 180, -11, -29, 81, -322, 255, -536, -478, -19, -308, 195, -399, 174, -335, 420, 395, 64, -423, -100, -33, 388, -508, -28, 38, 405, 623, -348, 595, -209, 706, 214, 184, 341, -378, -512, -86, -420, 70, -124, -121, 4, 121, -287, 42, 16, 172, 883, -40, -413, -43, -555, -267, -147, -538, -221, 475, 316, -226, -166, 152, 19, -519, 181, -163, -167, -318, 72, -220]
$$ [...]
8191G9
##END NTUPLES=NMR FID
##END=
