##TITLE=1H ikalashn
Dep-E
24.10.2024
##JCAMPDX= 6.0         $$ Bruker NMR JCAMP-DX V2.0
##DATA TYPE= NMR FID
##DATA CLASS= NTUPLES
##ORIGIN= UXNMR, Bruker Analytische Messtechnik GmbH
##OWNER= root
$$ TOPSPIN		Version 1.3
$$ 2024-10-24 14:57:57.921 +0400  Irina@DPX200
$$ Compression mode = diff/dup
##.OBSERVE FREQUENCY= 200.131300845
##.OBSERVE NUCLEUS= ^1H
##.DELAY= (6, 6)
##.ACQUISITION MODE= SIMULTANEOUS
##.ACQUISITION SCHEME= undefined
##.AVERAGES= 32
##.DIGITISER RES= 18
##SPECTROMETER/DATA SYSTEM= spect
##.PULSE SEQUENCE= zg
##.SOLVENT NAME= CDCl3
##.SHIFT REFERENCE= INTERNAL, CDCl3, 1, 17.49637
##AUDIT TRAIL= $$ (NUMBER, WHEN, WHO, WHERE, WHAT)
$$ ##TITLE= Audit trail, TOPSPIN		Version 1.3
$$ ##JCAMPDX= 5.01
$$ ##ORIGIN= Bruker BioSpin GmbH
$$ ##OWNER= Irina
$$ $$ F:/spectra/data/iren/nmr/1H/4/audita.txt
$$ ##AUDIT TRAIL=  $$ (NUMBER, WHEN, WHO, WHERE, VERSION, WHAT)
(   1,<2024-10-24 14:57:03.312 +0400>,<Irina>,<DPX200>,<TOPSPIN 1.3>,
      <created by zg
	started at 2024-10-24 14:54:50.687 +0400,
	POWCHK disabled, PULCHK disabled
       configuration hash MD5:
       BE 6D 3F 07 2A EA 11 49 91 17 2B D3 AF B3 58 0D
       data hash MD5: 16K
       CB 09 0B E9 9C 8A 7C F5 36 68 2F 73 2A D2 C6 C5>)
$$ ##END=
$$ 
$$ $$ hash MD5
$$ $$ 35 6E 4F DD C2 8D C6 97 F1 DA 9A 90 1A FE 8A 3F
##$RELAX= 
##$RELAX= 
##$RELAX= 
##$RELAX= 
##$RELAX= 
##$RELAX= 
##$RELAX= 
##$RELAX= 
##$RELAX= 
$$ Bruker specific parameters
$$ --------------------------
##$DU= <F:/spectra>
##$EXPNO= 4
##$NAME= <1H>
##$PROCNO= 1
##$TYPE= <nmr>
##$USER= <iren>
##$AMP= (0..31)
100 100 100 100 100 100 100 100 100 100 100 100 100 100 100 100 100 100 
100 100 100 100 100 100 100 100 100 100 100 100 100 100 
##$ANAVPT= -1
##$AQSEQ= 0
##$AQ_mod= 1
##$AUNM= <au_zg>
##$AUTOPOS= <>
##$BF1= 200.13
##$BF2= 200.13
##$BF3= 200.13
##$BF4= 200.13
##$BF5= 200.13
##$BF6= 200.13
##$BF7= 200.13
##$BF8= 200.13
##$BYTORDA= 1
##$CFDGTYP= 0
##$CFRGTYP= 5
##$CHEMSTR= <none>
##$CNST= (0..63)
1 1 145 1 1 1 1 1 1 1 1 1 1 1 1 1 1 1 1 1 1 1 1 1 1 1 1 1 1 1 1 1 1 1 
1 1 1 1 1 1 1 1 1 1 1 1 1 1 1 1 1 1 1 1 1 1 1 1 1 1 1 1 1 1 
##$CPDPRG= <>
##$CPDPRG1= <>
##$CPDPRG2= <>
##$CPDPRG3= <>
##$CPDPRG4= <mlev>
##$CPDPRG5= <mlev>
##$CPDPRG6= <mlev>
##$CPDPRG7= <mlev>
##$CPDPRG8= <mlev>
##$CPDPRGB= <>
##$CPDPRGT= <>
##$D= (0..63)
0 2 0 0 0 0 0 0 0 0.06 0 0.03 0 0 0 0 0.0002 0 0 0 0 0 0 0 0 0 0 0 0 0 
0 0 0 0 0 0 0 0 0 0 0 0 0 0 0 0 0 0 0 0 0 0 0 0 0 0 0 0 0 0 0 0 0 0 
##$DATE= 1729767418
##$DBL= (0..7)
120 120 120 120 120 120 120 120 
##$DBP= (0..7)
150 150 150 150 150 150 150 150 
##$DBP07= 0
##$DBPNAM0= <>
##$DBPNAM1= <>
##$DBPNAM2= <>
##$DBPNAM3= <>
##$DBPNAM4= <>
##$DBPNAM5= <>
##$DBPNAM6= <>
##$DBPNAM7= <>
##$DBPOAL= (0..7)
0.5 0.5 0.5 0.5 0.5 0.5 0.5 0.5 
##$DBPOFFS= (0..7)
0 0 0 0 0 0 0 0 
##$DE= 6
##$DECBNUC= <off>
##$DECIM= 32
##$DECNUC= <off>
##$DECSTAT= 4
##$DIGMOD= 1
##$DIGTYP= 9
##$DL= (0..7)
0 120 120 120 120 120 120 120 
##$DP= (0..7)
150 150 150 150 150 150 150 150 
##$DP07= 0
##$DPNAME0= <>
$$ [...]
##$SW= 21.9926040160658
##$SWIBOX= (0..15)
0 0 2 0 0 0 0 0 0 0 0 0 0 0 0 0 
##$SW_h= 4401.40845070422
##$TD= 16384
##$TD0= 1
##$TE= 300
##$TE2= 300
##$TE3= 300
##$TEG= 300
##$TL= (0..7)
0 120 120 120 120 120 120 120 
##$TP= (0..7)
150 150 150 150 150 150 150 150 
##$TP07= 0
##$TPNAME0= <>
##$TPNAME1= <>
##$TPNAME2= <>
##$TPNAME3= <>
##$TPNAME4= <>
##$TPNAME5= <>
##$TPNAME6= <>
##$TPNAME7= <>
##$TPOAL= (0..7)
0.5 0.5 0.5 0.5 0.5 0.5 0.5 0.5 
##$TPOFFS= (0..7)
0 0 0 0 0 0 0 0 
##$TUNHIN= 0
##$TUNHOUT= 0
##$TUNXOUT= 0
##$USERA1= <user>
##$USERA2= <user>
##$USERA3= <user>
##$USERA4= <user>
##$USERA5= <user>
##$V9= 5
##$VALIST= <valist>
##$VCLIST= <CCCCCCCCCCCCCCC>
##$VD= 0
##$VDLIST= <DDDDDDDDDDDDDDD>
##$VPLIST= <PPPPPPPPPPPPPPP>
##$VTLIST= <TTTTTTTTTTTTTTT>
##$WBST= 1024
##$WBSW= 25
##$XGAIN= (0..3)
0 0 0 0 
##$XL= 0
##$YL= 0
##$YMAX_a= 539144
##$YMIN_a= -914230
##$ZGOPTNS= <>
##$ZL1= 120
##$ZL2= 120
##$ZL3= 120
##$ZL4= 120
##$ABSF1= 10
##$ABSF2= 0
##$ABSG= 5
##$ABSL= 3
##$ALPHA= 0
##$AQORDER= 0
##$ASSFAC= 0
##$ASSFACI= 0
##$ASSFACX= 0
##$ASSWID= 0
##$AUNMP= <proc_1d>
##$AXLEFT= 0
##$AXRIGHT= 0
##$AXTYPE= 0
##$AXUNIT= <>
##$AZFE= 0.1
##$AZFW= 0.1
##$BCFW= 1
##$BC_mod= 2
##$BYTORDP= 1
##$COROFFS= 0
##$CY= 7568.61572265625
##$DATMOD= 1
##$DC= 2
##$DFILT= <>
##$DTYPP= 0
##$F1P= 17.9538593292236
##$F2P= -4.03888763876832
##$FCOR= 0.5
##$FTSIZE= 32768
##$FT_mod= 4
##$GAMMA= 1
##$GB= 1
##$INTBC= 1
##$INTSCL= 1
##$ISEN= 128
##$LB= 0.02
##$LEV0= 0
##$LPBIN= 0
##$MAXI= 945.577
##$MC2= 0
##$MEAN= 0
##$ME_mod= 0
##$MI= -402.1523
##$NCOEF= 0
##$NC_proc= 0
##$NLEV= 6
##$NOISF1= 8.587773
##$NOISF2= 6.764455
##$NSP= 1
##$NTH_PI= 0
##$NZP= 0
##$OFFSET= 17.49637
##$PC= 1
##$PHC0= -43.30347
##$PHC1= 11.72053
##$PH_mod= 0
##$PKNL= yes
##$PPARMOD= 0
##$PPDIAG= 0
##$PPIPTYP= 0
##$PPMPNUM= 100
##$PPRESOL= 1
##$PSCAL= 0
##$PSIGN= 0
##$REVERSE= no
##$SF= 200.13
##$SI= 32768
##$SIGF1= 18.5376
##$SIGF2= -6.396296
##$SINO= 400
##$SIOLD= 32768
##$SREGLST= <1H.CDCl3>
##$SSB= 3
##$STSI= 0
##$STSR= 0
##$SW_p= 4401.40845070422
##$SYMM= 0
##$S_DEV= 0
##$TDeff= 0
##$TDoff= 0
##$TI= <>
##$TILT= no
##$TM1= 0
##$TM2= 0
##$TOPLEV= 0
##$USERP1= <user>
##$USERP2= <user>
##$USERP3= <user>
##$USERP4= <user>
##$USERP5= <user>
##$WDW= 1
##$XDIM= 8192
##$YMAX_p= 0
##$YMIN_p= 0
$$ End of Bruker specific parameters
$$ ---------------------------------
##NTUPLES= NMR FID
##VAR_NAME=  TIME,          FID/REAL,        FID/IMAG
##SYMBOL=    X,             R,               I
##VAR_TYPE=  INDEPENDENT,   DEPENDENT,       DEPENDENT
##VAR_FORM=  AFFN,          ASDF,            ASDF
##VAR_DIM=   8192,          8192,            8192
##UNITS=     SECONDS,       ARBITRARY UNITS, ARBITRARY UNITS
##FACTOR=    0.0002272,     1,               1
##FIRST=     0,             0,               0
##LAST=      1.8609952,     92,              222
##MIN=       0,             -914230,         -914230
##MAX=       1.8609952,     539144,          539144
$$ Real data points
##PAGE= N=1
##DATA TABLE= (X++(R..R)), XYDATA
0@%%%%%%%%%%%%%L2o4O4o4O4r6J28j28J60j93K25k88L21l54M18m82N68o64P53
$$ 0 0 0 0 0 0 0 0 0 0 0 0 0 0 32 -32 32 -32 32 -64 64 -64 96 -97 128 -160 161 -193 225 -257 311 -353 400
32D00q49R62j090J232j392J565j753J953k176K423k686K976l294L644m027M443
$$ 400 -449 513 -577 655 -737 828 -925 1028 -1148 1275 -1411 1565 -1729 1915 -2112 2331
48B331m899N398n948O548p214P958q788R715j0770J1978j3364J4989j6917J9254
$$ 2331 -2568 2830 -3118 3430 -3784 4174 -4614 5101 -5669 6309 -7055 7934 -8983 10271
62A0271k2158K5875l0837L7819m8462O6893j07625L56666k62222p81876L17086
$$ 10271 -11887 13988 -16849 20970 -27492 39401 -68224 288442 26220 -755656 -438570
73d38570O38382L00623l97156l86451j3761K96604J29059k7481m1592L2512j05011
$$ -438570 199812 500435 103279 -283172 -296933 -329 128730 101249 59657 92169 -12842
84a2842j72115r953K86613K47495j08262m06666k24344K02592L82775R0169k43998
$$ -12842 -184957 -194910 91703 339198 230936 -175730 -400074 -197482 185293 275462 31464
95C1464k36794M7504J96973J08657l6014n2461l1008o5377q7468L5737J76120
$$ 31464 -205330 -157826 39147 147804 111790 59329 28321 -37056 -124524 -88787 87333
106H7333R8876j58306k42314j3163K37569J81483p5529j84019l4646J21021P3013
$$ 87333 186209 27903 -214411 -227574 9995 191478 115949 -68070 -102716 18305 91318
117I1318o3248n7182N0140M2365q9484j15780M2756J70251P1030j29509j52878
$$ 91318 28070 -29112 21028 63393 -26091 -141871 -99115 71136 142166 12657 -140221
128a40221M2197J88704P7868j31774j39799N0562J41742j602j54737p6779J25241
$$ -140221 -98024 90680 168548 36774 -103025 -52463 89279 87677 -67060 -143839 -18598
139a8598J46397o4476k02922m4906K03991J87473p8161k24988o6573J63549J59488
$$ -18598 127799 63323 -139599 -184505 19486 206959 128798 -96190 -162763 786 160274
150A60274m7562j67483o4862Q4840P9557k8457n4387J9509N2860j0103n7070l573
$$ 160274 112712 -54771 -119633 -34793 44764 16307 -38080 -18571 34289 24186 -32884 -36457
162c6457P4586N2446n2772r4792j2922P6310M6369m8018o4975J0701N9230J6630
$$ -36457 38129 90575 37803 -56989 -69911 6399 52768 4750 -60225 -49524 9706 26336
174B6336l8562j5863M7660M3006l3400o4314M413O8783K6000o3466o7416J9365
$$ 26336 -12226 -28089 19571 62577 29177 -35137 -30724 38059 64059 593 -66823 -47458
186d7458O9883J6630n6849l9468M1197O3714l587n8716k2078M5657M3477k4679
$$ -47458 22425 39055 -17794 -57262 -16065 47649 44062 -14654 -36732 8925 52402 27723
198B7723n9594j7072L8735L0600j9487k7891J3716L2392n644l3814N069N6884
$$ 27723 -31871 -48943 -10208 20392 905 -26986 -13270 19122 13478 -20336 -15267 41617
210D1617L1626n4697q2459n07Q9161O0476n3722j02939k3920P8347P9285p251
$$ 41617 73243 18546 -63913 -64420 24741 85217 31495 -71444 -95364 -17017 62268 55017
222E5017o5553l5499K4902M0341J2320r490j0574j5184k2739r330K6429M0452
$$ 55017 -10536 -46035 -21133 19208 31528 22038 11464 -3720 -26459 -35789 -9360 31092
234C1092L764m6013m2177J7905O2293L4962k8171n1005j4449K7201K5821k908
$$ 31092 34856 -11157 -53334 -35429 26864 61826 33655 -17350 -31799 -4598 21223 18315
246A8315j8284j0409p050j1121R72L0706L3098r536m6290k5165L4713N7541R645
$$ 18315 31 -10378 -17428 -28549 -27577 3129 36227 26691 -19599 -44764 -10051 47490 57135
259E7135n1589n0068P868M6109K3794k0180l2734p850J5853J8582P382k54k353
$$ 57135 5546 -44522 -36654 9455 33249 13069 -19665 -27515 -11662 6920 14302 14048 11695
272A1695j0005j3573J808K0502J3367j6987l1027j0349K2921K7695o73k4770j1773
$$ 11695 1690 -11883 -10075 10427 23794 6807 -24220 -34569 -11648 16047 15374 -9396 -21169
285b1169J8279K1681j941j4530k760R381J940j3496j1961P596J6753j361k0781
$$ -21169 -2890 18791 16850 2320 -440 8941 10881 -2615 -14576 -6980 9773 8412 -12369
298a2369j0071J6858K1174L37j5954r684O563J2237M33j0786n483L445m58n850
$$ -12369 -22440 -5582 15592 15929 -25 -9709 -3146 9091 9524 -1262 -6745 -3300 -3758 -9608
312i608L88J0145O296n273q455J997J4060J0506p693j7508l879J2512O732r689
$$ -9608 -9220 925 7221 1948 -6507 -4510 9550 20056 12363 -5145 -9024 3488 10220 531
326E31j2139r84R018O025m384n963N919J0957o64j1078k811R665O169o833j1613
$$ 531 -11608 -12592 -3574 2451 -1933 -7896 -1977 8980 8316 -2762 -5573 4092 10261 3428 -8185
341h185l557Q387R074k698q510M44P872L678k071l4J124j466l995l972O85N259
$$ -8185 -11742 -3355 5719 3021 -5489 -5045 2827 6505 4434 4400 5524 4058 63 -3909 -3224 2035
357B035J217r960q191N727J3035L828o973p156J931J0187O515o004r391nN227
$$ 2035 3252 -6708 -14899 -9172 3863 7691 718 -6438 -4507 5680 12195 6191 -3200 -3205 2022
372B022m63m308k40K885Q17j934j595K205O674J930o888n654L467M415j653n139
$$ 2022 1559 -2749 -2989 -104 713 -1221 -2816 -611 6063 7993 1105 -4549 -1082 3333 1680 -3459
388c459k464P26J894J870j592Q10M399K169l133j523L829L575j880m820l840P97
$$ -3459 -5923 -5197 -3303 -1433 -3025 -2215 2184 4353 1220 -303 3526 7101 5221 401 -3439 -2642
404b642N164R05o306m386L913N879M15k960j128Q91J778O47k577j613R13n51k638
$$ -2642 2522 3427 -2879 -7265 -3352 2527 2942 -18 -1146 -255 1523 2170 -407 -2020 -1107 -1658 -4296
421d296Q10M050J067k262o69K002L371K236j885m473j047L618J036l112l502j206
$$ -4296 -3486 564 1631 -631 -1300 702 4073 6309 4424 -49 -1096 2522 3558 446 -3056 -4262
437d262Q41K138R48j572p21K530P16q90O74J876k60k459j468N47J394J592j401
$$ -4262 -3421 -1283 -335 -1907 -2628 -98 618 -272 402 2278 2018 -441 -1909 -1362 32 1624 223
454B23k773M01L898J612k26p27j105j013l0J270m94j465k375j946K89L708K198
$$ 223 -2550 -2149 1749 3361 3135 2408 1303 290 260 1530 1036 -429 -2804 -4750 -4461 -753 1445
471A445j765k379K34K698K491Q86j868k357K30R85J74k92J06J76r59q87l33J741
$$ 1445 -320 -2699 -2465 233 2724 3610 1742 -615 -385 600 774 482 588 764 -195 -1082 -1415 326
489C26K604P32l326l054J158K738m04j644j465l77O06l85M00K264K423m12l487
$$ 326 2930 3662 336 -2718 -1560 1178 774 -870 -2335 -2712 -2106 -2491 -2091 173 2596 2184 -1303
506a303j798L308N160K162l947p291l293N022Q058J537p260q055m98P740P276
$$ -1303 -3101 207 5367 7529 3582 -3709 -7002 -1980 6078 7615 355 -7700 -8198 -458 6818
521F818j03o559n372q17L199M917K731k075n983l790J451N804N778J610n073p296
$$ 6818 6715 156 -5216 -6033 -2834 2083 4814 2739 -3244 -7034 -5583 221 5999 7609 2536 -4760
537d760k529O184J0497L565r234j3430k387J1535J1431j870j1873q682K292J0569
$$ -4760 -7289 -1105 9392 12957 3723 -9707 -12094 -559 10872 9002 -2871 -11553 -9261 1308
551A308O876k222p518m829J175N280L936n91k479j643k035k091K542P647M191
$$ 1308 8184 5962 -1556 -6385 -5210 70 4006 3415 936 -707 -2742 -4833 -2291 5356 9547
566I547n489r947k765Q911R573j395j0221o258L344N791J264k115j845p51R76
$$ 9547 4058 -5889 -8654 257 9830 8435 -1786 -8044 -4700 1091 2355 240 -1605 -2356 -1380
581a380L30j303L18L896L460k582o831l375O205J0166J262j1044r770L849J1254
$$ -1380 -1050 -2353 -2035 1861 5321 2739 -4092 -7467 -1262 8904 10166 -878 -10648 -6799 4455
596D455N266m727p181l289J752N228L045q90l075m095k959R74M777M729J980l322
$$ 4455 9721 4994 -2187 -5476 -3724 1504 4549 3659 584 -3511 -6470 -5496 -719 4010 5990 2668
612B668q746n634P689J4767M799j1983j5481j899J3853J3889n03j4068j1155K580
$$ 2668 -6078 -11712 -4023 10744 15543 3560 -11921 -13820 33 13922 13419 -649 -11804 -9224
626i224J0661P741j336q948o986J644P000L280k028j237j204l140k256L012P342
$$ -9224 1437 9178 7842 -1106 -8092 -6448 552 3832 1804 567 -637 -3777 -6033 -3021 4321
641D321L655n305j0137k065J0041J0612j079r496o979L34N842O207m14o336l648
$$ 4321 7976 2671 -7466 -9531 510 11122 10043 547 -6432 -6098 -256 5951 5537 -799 -4447
656d447J376J741M67J348J998O23l332o085j794P184Q994o33r429o065K558O780
$$ -4447 -3071 -1330 -863 485 2483 3106 -226 -6311 -8105 -921 8073 7440 -1989 -8054 -5496 1284
672A284N906j80o031o121K38N498M422Q54l691m563k725J588L143L767K098m638
$$ 1284 7190 7010 979 -5142 -4904 594 5016 5870 2179 -2384 -5109 -3521 -378 3389 5487 849
688H49r211k329R326J0499J002r805j0161j427J0132J2005J242j0436j2314j290
$$ 849 -8362 -10691 -1365 9134 10136 331 -9830 -11257 -1125 10880 12122 1686 -10628 -11918
702a1918J1411J2918L18j2181j0157K513Q000N068k01m139n134l037J405N478
$$ -11918 -507 12411 12729 548 -9609 -7096 904 5972 5771 1632 -3502 -6539 -5134 344
716C44M584ro464n710J093O285N862L44n068p007j087Q028Q171k161r053n164
$$ 344 4928 4919 -1545 -7255 -6162 123 5985 6329 1261 -5746 -6833 1195 9366 7205 -1848 -7012
732g012L133O206K892k102l608j325p86j49L620L744k002n835k323K236L606J610
$$ -7012 -3879 2327 5219 3117 -491 -1816 -2602 -2751 869 4613 2611 -3224 -5547 -3311 295 1905
748A905l23j438j944m91J732K484J216j177k228j05Q51m53l80K201R33k602k941
$$ 1905 1582 144 -1800 -2291 -559 1925 3141 1964 -264 -369 482 29 -351 1850 2783 181 -2760
765b760NK834J467n70j540j423k64R50K132K243j462n328j582M475N687n61n531
$$ -2760 -2755 79 1546 976 -564 -1987 -2251 -1301 831 3074 1612 -3716 -5298 -823 4864 4303 -1228
782a228k618K609L977J408j739k633r26N99L17O46K59J17j091j105r09K31K224
$$ -1228 -3846 -1237 2740 4148 2409 -224 -1150 -551 -234 412 671 788 -303 -1408 -2317 -2086 138
799A38K271j471l407r96K905L134r52j823j212J013J150l50l33J046m3j273q7
$$ 138 2409 938 -2469 -3465 -560 2574 1622 -201 -1413 -400 750 400 67 1113 1070 -203 -290
816b90J207R60q12k090l77J123J102q41j889m35J376J265n03q10l58J395J637
$$ -290 917 1877 1065 -1025 -1402 -279 823 -18 -1907 -2342 -966 299 -204 -1014 -1372 23 1660
833A660m37j747r92J621J963l52j510r44L49O74O33q2l3n37j724k12J604J936
$$ 1660 1223 -524 -1516 105 2068 1716 206 -738 -389 285 918 836 803 266 -1458 -1670 -66 1870
851A870n77k879r49R80K108L43j337j518O61J897L70m82k66K12P27q7j110k13
$$ 1870 1293 -1586 -2535 -1555 553 896 -441 -1959 -1298 599 969 487 221 433 1160 1073 -37 -250
869b50J424L84j571j766P85J939O13j646k001L54J683J222j039q62r4j21l9O92
$$ -250 1174 1558 -13 -1779 -994 945 1558 -88 -2089 -1735 -52 1170 131 -731 -825 -946 -985 -293
887b93J240k87r78q91N07J797J655j319j968m97J804J294p22j360j502L66J334
$$ -293 947 660 -318 -1209 -702 1095 2750 1431 -537 -1034 770 2064 1342 -18 -1520 -1154 180
904A80L82j701l26J045M59q46O1O90L27j05r01k61R22J619p41j496L95J055L64
$$ 180 562 -1139 -1465 -420 39 -807 -746 -56 271 166 -735 -996 -74 1545 804 -692 -297 758 1122
923A122n13j99P3j22r2k94k68N71M58j560j221R75R66L81p87j136k07K139J381
$$ 1122 609 410 483 361 269 -25 -293 278 736 -824 -2045 -1070 -104 277 -510 -1646 -1853 286 1667
942A667p11j742K09J184L23j10n23n82L14L63L10n81L02L26j035m27Q77M55o54
$$ 1667 956 -786 -577 607 930 820 297 -285 29 392 702 121 423 749 -286 -713 164 619 -35
961c5o11m09j36O80O14o27p15R19P94n92l36Q22N38k85kl03l04J356k27j265q57
$$ -35 -646 -1055 -1191 -511 103 -524 -1239 -320 474 -118 -454 368 906 621 619 316 12 1368 1141 -124 -981
982i81R98N62m31m66l36l75N50Q79o79p52M67J97k86K35M45k07l36Q98j30J58
$$ -981 17 579 148 -318 -654 -1029 -479 400 -279 -1031 -564 -367 -653 -418 27 -180 -516 382 252 410
1002D10J075p52n61L9Q24M4j116m9j48K15j77j5o13Q2P34n17q16N53O41J19k47
$$ 410 1485 733 172 211 1035 1079 -37 -86 -234 -19 -196 -211 -824 -742 -8 -525 -1341 -788 -147 -28 -275
1023b75l6J14l01J036Jn40J71J46m5k5M95L01o23j53l37j95J95O07n60j359P4
$$ -275 -311 -197 -498 538 539 -1 170 316 271 246 741 1042 419 266 -71 -266 -71 536 -24 -1383 -1309
1044a309J022L8om60m57M19J049m0k61M16J96o93J53R90q7m65k76j94r0K95M09
$$ -1309 -287 -249 -255 -715 -1172 -753 296 256 -5 411 607 -86 67 1057 970 505 229 35 -55 240 649
1065F49p55k70L46J04p30J24N08m33k31l19N4L89N28J75m76rP14N44p7k01n93
$$ 649 -106 -376 -30 74 -656 -532 -24 -457 -688 -1007 -953 -564 -36 139 -337 -346 368 912 835 634 41
1086D1L45P27j58j253MO09N73o73o16k45N00K43j86o62k16O41K57k09L4K35j34
$$ 41 386 1113 955 -298 -294 315 888 215 -401 -646 -146 97 -89 -751 -967 -326 -69 -278 -244 -9 -143
1107a43j88J79L81m7K52LK8P8mLJ89m11n77j7K76L15q21l75L20j08L35J83J75
$$ -143 -331 -152 229 182 434 437 465 543 539 542 731 320 -257 -274 2 317 -504 -879 -559 -667 -332 -149 26
1130B6q02m5M59N55P95r79p79M93J413K46j343l26L47R69k7p61m80J09K66J7M1
$$ 26 -776 -821 -362 193 988 9 -770 -277 1136 1382 39 -287 60 1029 1002 241 -239 -130 136 153 194
1151A94m79k18j83Q2J5j86M53Q36l89j332K24J369J162l80j473n78P83J425K98
$$ 194 -285 -503 -686 -604 -589 -775 -322 514 125 -1207 -983 386 1548 1168 -305 -883 -100 1325 1623
1170A623j752k07N46Q6J53K10q10n70J66M59K06o53O8k39M4L34k77K94M91j93
$$ 1623 -129 -336 210 296 449 659 -151 -721 -555 -96 110 -543 -475 -714 -670 -336 -613 -319 172 -21
1190b1m41J3J042O14n87j53k67l80j57J028L56q48q56k10O03P24l95j428M55J405
$$ -21 -462 -449 593 1207 620 467 200 -180 -337 691 1047 199 -657 -867 -264 460 65 -1363 -908 497
1210D97k48j462l24J187J096k4n38j101K12R09R70l07r31k09M42P66J38q86q40
$$ 497 249 -1213 -1537 -350 746 722 184 -917 -705 204 1174 867 -64 -273 169 935 1073 187 -653
1229f53R39O10j407q02J558M62j235j280M98J828P48j018j554l32J646J187k69
$$ -653 286 896 -511 -1313 245 707 -528 -1808 -1310 518 1266 248 -1306 -1638 8 1195 926
1246I26m02k57j211L14J741J014j281j362j23K75Q47K9q6n43l02n04R2R04M53
$$ 926 524 267 -944 -630 1111 2125 844 -518 -641 -366 481 510 424 -119 -421 -925 -833 71 524
1265E24j340l68R55L5k47L41R94k26j145j92J478N83n96j538l92J779J324j257
$$ 524 -816 -1184 -229 -194 -441 -100 894 668 -477 -669 809 1392 796 -742 -1134 645 1969 712
1283G12j341L66N01k61l33J28L52k99J30q42m61N30J267L67m77j098p02J149J676
$$ 712 -629 -263 238 -23 -356 -228 124 -175 -45 -887 -1348 -818 449 816 339 -759 -1461 -312 1364
1302A364m55j033J69R93m05j127N12R59p9j052p89j3R40O40r59q70Q08K88l56
$$ 1364 909 -124 45 1038 633 -494 18 977 898 -154 -943 -956 -16 624 -335 -1205 -397 -109 -465
1321d65K72M33q82l24O30J174m38j35k70m86L60R06N60j84r64j112j5J479Q36
$$ -465 -193 240 -642 -966 -336 838 400 265 -5 -491 -131 775 1335 1151 187 -925 -940 539 1375
1340A375j353p90M15M20r05j07R98P26j170n94k10J175Q07k84q95N2J057k48l49
$$ 1375 22 -768 -353 67 -838 -945 53 779 -391 -985 -1195 -20 787 503 -392 -340 717 469 120
1359A20j47K57j4L48K20o91l19N65j66l42n98J82N87Q6p81o02J110O74O5j577
$$ 120 -27 230 216 564 784 93 -226 339 173 -169 -767 -585 2 88 -693 -1295 -185 489 554 -1023
1379a023O6J396P2q17K2R38L43m65o80j96Q43M75m59l17P2l98k18L3M59l84k1
$$ -1023 -957 439 511 -306 -284 654 997 532 -148 -344 499 974 515 198 270 -128 -346 -313 146 -238 -259
1400b59L8R6q56J35R97K40m91q88M69R20N36r91l14Q26O62o36j022L92O60J27
$$ -259 -221 -125 -981 -846 151 391 -100 -988 -519 401 937 -54 -368 458 1120 484 -538 -146 514 641
1420F41o25k93L75M06l80r05QP26K1m10k07RL2N71J92q5k38J60K90j88j13J84
$$ 641 16 -277 98 504 124 -781 -773 -47 -26 -436 -643 -634 -602 -31 161 76 -162 -2 288 100 -13 171
1442A71O43L22q20o55K47Q10j33j087N1O40J40q45n40K92Q98l8o69k58N94L60
$$ 171 814 1136 316 -339 -92 718 585 -502 -451 189 329 -516 -1056 -764 134 96 -573 -831 -237 123
1462A23j61l18L49L63Q0q7j29l00O94J00m31j34k33l8N58m88n14j9P53J55r13
$$ 123 -38 -356 -7 356 436 349 220 -80 614 714 283 149 -84 -122 436 -52 -566 -585 168 323 -590
1483e90o40R36O74m66o75M86K82J87j66m47N77O81R7j241K45O86J67n53j41j2
$$ -590 -1230 -294 380 -86 -761 -275 7 194 28 -419 158 839 936 -305 -60 626 793 240 99 87
1503H7j30J89N6o30r7M94P8l40j74M77m7J23k39m20K85N59J87n50m6N47K64m37
$$ 87 -43 146 202 -428 -525 -31 47 -293 -467 10 -37 86 -153 -573 -288 271 458 -92 -138 409 673 236
1525B36r0M2J78J49k55m05K65L42l88q97K98L92k3r7Ll34o1R44j24o92K34O28
$$ 236 146 188 366 515 260 -145 120 462 74 -823 -525 -133 -156 -253 -250 -584 -645 299 175 -517 -283 345
1547C45j37j08j26Q8L8N35m27l06Q9N47l44l02R1J4j04l1r1m72L78K64l74k20
$$ 345 208 100 -26 62 100 635 208 -98 -9 538 194 -108 -17 -3 -107 -138 -229 -701 -323 -59 -433 -653
1569f53L50M02o9k55L37N9%J71p9m30K00P27j43n62J80J16m08J16J13m24L63n8
$$ -653 -303 99 30 -225 112 171 171 342 263 -167 33 760 617 55 235 351 -57 59 172 -252 111 53
1591E3m50k77M47K05k00m29N02j41N53K45l63j59J25K61J13l02K47k11m5q6J28
$$ 53 -397 -674 -227 -22 -222 -651 -149 -290 263 508 145 -14 111 372 485 183 430 219 174 88 216
1612B16j75R6k02k34q5L21J02k15k66NK34J11Jk39p4M74N7j5J2K09j86q5M05l42
$$ 216 41 137 -65 -299 -384 -63 39 -176 -442 -437 -203 -92 -91 -330 -404 70 127 112 124 333 147 62 467 125
1636A25o6K77J48o65j78K88L26l69j01M7r6j83M14n70pL52K86m49J53K00L92L5
$$ 125 59 336 484 -181 -359 -71 255 -114 -215 -168 -264 -447 -33 -603 -610 -258 28 -421 -268 -68 324 359
1658C59j27K7k96O79j36m56J27R7l66K85j58R5k78j29p2k38K89J83P4m34J75L22
$$ 359 232 259 -37 642 506 50 177 274 -92 193 35 130 -148 -277 -349 -587 -298 -115 -41 -475 -300 22
1680B2O0j16j31j02J75K59L16n31M84n3N4j04q7q2K11q8l26j04K1J59k6k30l17
$$ 22 82 -34 -165 -267 -92 167 483 -48 436 383 437 333 246 164 375 287 -39 -143 -122 37 11 -219 -536
1703e36L24j09L20q4k49J70k08N30j8K9K22k10P3rJ03R0Q2k32n44L23J11Nj77
$$ -536 -212 -321 -1 -85 -334 -164 -372 158 140 169 391 181 254 245 348 438 520 288 -256 67 178 183 6
1726Fl8n1k16Q5O1j74l0j96L00K72J50J5k73R9K33K4Pn3J42K0j20k5j63K0K17
$$ 6 -32 -83 -299 -214 -153 -327 -357 -553 -253 19 169 184 -89 10 243 267 274 221 363 383 263 238 75 95 312
1751C12ll2m49l45L30R2K98o22l71N64L70k22j05k6O1J19J44J13q7J23j90R2Q4
$$ 312 309 277 -172 -517 -187 -95 203 -419 -790 -226 144 -78 -183 -209 -148 -29 115 228 141 264 74 166 250
1774B50n6j75L59l3l69n59K98L71J6n55k84N39M33j50o79P6M11M88l62j1M3P6
$$ 250 194 19 378 345 -24 -583 -285 86 102 -453 -737 -198 235 85 -594 -518 -107 381 19 8 51 127
1796A27O0L22j55k02J90j15l3j69j58j00N50J36p87k60J10M45k12k54J0L54j45
$$ 127 187 509 354 152 342 227 194 25 -133 -233 317 453 -334 -594 -484 -39 -251 -505 -495 -141 -286
1817b86R0J50J52J80j57l14L52K59m85O4K80N95p32m02M27P7l77o2k90M47J05
$$ -286 -196 -46 106 286 129 -185 167 426 -59 5 285 880 148 -254 173 250 -127 -189 -479 -32 73
1838G3J21o62o0K81J68M1J85j38n60M31Q13m83k39L89L28l79m32J16J27N72l41
$$ 73 194 -468 -528 -247 -79 -38 147 9 -551 -120 693 210 -29 360 688 309 -123 -7 120 692 351
1859C51n91k73L99M97l32n35K72Q5q3k21lj69K38L95L0l26J85L11j91O5j52K07
$$ 351 -240 -513 -114 383 51 -484 -212 -127 -210 -431 -434 -603 -365 30 60 -266 -81 230 39 104 -48 159
1881A59J56L41l17p85L32R16m69j31k83O8l79j89M72J40J7k15l53K84L13k97J15
$$ 159 315 656 339 -446 -114 802 333 202 -81 -13 -392 -581 -109 31 48 -167 -520 -236 77 -220 -105
1902a05J37L80n71K5K39kr6M53l54J6k67N79l30m26L45j86j9L57k44r62L94J122
$$ -105 32 412 -159 -134 105 103 7 460 106 122 -145 434 104 -322 23 -163 -182 175 -69 -1031 -637 485
1924D85l3p35l09O58n2k32j46L99P99j63n66o54N49M89J3o62Q7K59j85J00P3k60
$$ 485 452 -283 -592 66 14 -218 -364 35 834 671 105 -549 0 489 502 -160 -73 186 1 101 174 -86
1946h6k90L09L2k14l90K51N12L2l08l56N14N96o97l75M53O87k43l10j49K46J73
$$ -86 -376 -67 -35 -249 -639 -388 124 156 -152 -508 6 602 -95 -470 -17 670 427 117 -32 214 387
1967C87l02N5J01J41j86q57L92L06j67j27j21L26q3n2M5K62j48K10k66J8nQ6K99
$$ 387 85 140 241 382 196 -661 -269 37 -130 -257 -378 -52 -135 -187 -142 120 -28 182 -84 -66 -71 15 314
1990C14L52k24q23k8P18j43l82k42P44J76o11n19J69M38O9m68r7L96J02j20m60
$$ 314 666 442 -381 -409 309 166 -216 -458 286 462 -149 -668 -499 -61 8 -460 -557 -161 -59 -179 -639
2011f39N40J02M90k95j11l93L56L13m8j82k44M22j75q2j75r5N5L54m54n91M37
$$ -639 -99 3 493 198 87 -306 50 363 315 133 -111 311 136 54 -121 -216 -161 193 -261 -852 -415
2032d15M65k38k57M3L75K45k94J8R9K88q9j47j24M08M3m00K28j0j15r9J7k31j69
$$ -415 50 -188 -445 -402 -27 218 -76 -58 41 329 240 93 -31 377 420 20 248 238 123 24 41 -190 -359
2055c59K88Q2J50l82J5m1K34j12k99K85M59k23l22r5M42N67l37n60M6M52j21k37
$$ -359 -71 11 161 -221 -206 -247 -13 -125 -424 -139 320 97 -225 -320 122 689 352 -208 -162 290 169 -68
2077f8k41O16R8l26k91K03R7k93K53r0k22j02L26k00m9L50j30K5J30j24j92L83
$$ -68 -309 307 405 79 -212 -9 88 -205 48 -42 -264 -366 -40 -240 -289 61 -69 -44 86 -38 -230 153
2099A53K70n55Q1O8L59r8k27p4J15J4j01m39m4M40Q3l07NK79J0j66k18N52l4M8
$$ 153 423 -132 -51 17 376 278 51 -23 92 106 5 -434 -478 -38 45 -262 -257 22 32 -134 -352 200 166 214
2123B14O3k8l22J57qJ90m15L5N58l0j52n04J37M74n8m61j95O7K36l8n05L04J95
$$ 214 277 249 -73 84 76 266 -149 -114 444 414 262 -242 -105 369 311 -150 -345 -278 -42 -80 -585 -281 -86
2146h6Lk9l5K08K40J42m56NM60l36k6J03j08n7K30j80o9n9J81M5n73K48j61l9
$$ -86 -83 -112 -147 61 301 443 -13 -8 452 116 90 193 85 28 258 78 9 -50 131 176 -397 -149 -310 -349
2170c49O23m51j14K39M84l47n02L83L51K7j22l9K05m90K05O3j41j56M62k69j55
$$ -349 274 -177 -291 -52 432 85 -417 -34 317 344 222 183 388 -102 103 166 25 -131 331 62 -93
2191i3n4q2J23n0n1j20J17K39o3k93J22K13M8J22q3j32J90L06n19j52M00K07j51
$$ -93 -147 -229 -106 -156 -207 -327 -210 29 -34 -327 -205 8 56 178 95 -37 153 459 -60 -212 188 395 244
2214B44j10M0k80P9K34j28m11L85j4m10J06Q7P2jJ56L8j76M12n4m98J40M73K9
$$ 244 134 174 -106 -27 207 79 -332 53 39 -371 -265 -178 -106 -107 49 87 -89 323 269 -229 -89 384 413
2237D13l02j30J29pJ03k00k21l9L69J67q22L89J13j00o4j2R9L8J34p3r6P0J13
$$ 413 111 -19 110 103 206 6 -215 -254 115 282 -540 -151 -38 -138 -202 -214 -115 -77 57 -16 -112 -42 71
2260G1L01k82M14m20j9K55l07R3K3K43m00J3K84l11j60J6j99J06K04l7M2l23j1
$$ 71 372 90 504 84 65 320 13 106 129 372 -28 -15 269 -42 -202 -186 -385 -279 -75 -112 -70 -393 -404
2283d04N08k45j46R0J05L2L14j82K44N2K30n10m4j7J91J5n63L5L95k86J78k49
$$ -404 104 -141 -287 -197 -92 -60 254 72 316 368 598 88 44 27 218 233 -330 -295 100 -186 -8 -257
2305b57K5m6K87j14j8J49K6ml45J07K29L01k28J09j05J05K87l06J82k28l2j05
$$ -257 -232 -278 9 -105 -123 26 52 48 -297 -190 39 340 112 221 116 221 508 202 384 156 124 19
2327A9L3L13k98n6k22ok56N00k19J26j40J93p7R1K07j34j92J34J90R5k44R1Qj28
$$ 19 52 365 67 11 -211 -217 -473 27 -192 -66 -206 -13 -90 1 208 74 -118 16 206 301 57 148 156 28
2351B8j4k02n0M74Oo31J25M48l51l50N12k69K32n8j68J17r0N33j80n5p5K29l7
$$ 28 14 -188 -238 236 242 -389 -264 184 -167 -517 -5 -274 -42 -100 -268 -151 -241 292 112 57 -18 211 174
2374A74j49n2J24jq5K93l48j3K34M2k80J35r1j69P3J4pp5Q7j56L90j57j75K87
$$ 174 25 -27 97 96 11 304 -44 -57 177 219 -61 74 -17 -186 -113 -99 -106 -181 -94 -250 140 -17 -192 95
2398I5O9P8m1j20j26J55J61j15k30k6J62j21j30K6l7N8m1K5o3j4J92J23K39l98
$$ 95 164 242 201 81 -45 110 271 156 -74 -100 62 -59 -189 -163 -200 -142 -183 -158 -221 -235 -43 80 319 -79
2422g9K59m41L78R2j57j66K73K70j94O8k04J40k9k71j13J72J95k25j91Q4M0j82
$$ -79 180 -261 117 209 52 -114 159 429 235 303 99 239 210 -61 -174 -2 193 -32 -223 -139 -99 -281
2444b81j25K62Q4k58j50L90M50j20n00K12L25O7k51p5K07J04O4m32J17l1O2j64
$$ -281 -406 -144 -60 -318 -468 -78 372 252 -248 -36 289 356 105 30 237 341 405 -27 90 59 121 -43
2466d3K56n2n13O5M24K53m96k51J09J39J55k77J6L68L07o82M7L47J98k96J06q6
$$ -43 213 161 -352 -287 137 390 -106 -357 -248 -109 46 -231 -215 153 460 -222 -175 172 370 74 180 94
2488I4j84P3J61k52n0L06j79r8J1P8k97O6L21p5l40R3K91J25j22n0K38R2k17J03
$$ 94 -90 -17 144 -108 -158 148 -31 -129 -118 -40 -337 -271 50 -25 -365 -272 19 144 22 -28 210 302 85 188
2512A88j84R8J86m25J14L25m21r9j7M05O1m02L72n35K93k04j14j49N09K51l86
$$ 188 4 102 288 -137 -23 302 -119 -218 -235 170 231 -171 201 -334 -41 -245 -359 -508 1 252 -134
2533a34k55M90j25M5M81k57k7j54N4p5n9MM5L96m33l70j41K91M93m45k29K49L3
$$ -134 -389 101 -24 21 502 245 218 64 118 43 -16 -12 33 429 -4 -374 -515 -224 269 -176 -405 -156 -123
2556a23o2m8K03L14j39%J01l6p7R5K6Jj27J0q5Pj36k57K26J57N6n20M19n2J7P8
$$ -123 -185 -233 -30 284 145 145 246 210 133 228 254 255 128 138 53 60 -76 -333 -107 50 106 -414 5 -47 -30 48
2582D8k99K10n9j19m0J17L84j11k76J2N51l47N4j61o5K06K4JM0l82J18j18K26
$$ 48 -251 -41 -100 -219 -259 -142 242 131 -145 -133 418 71 125 -36 -101 105 129 130 170 -212 -94 -212 14
2605A4J2j47O7P2M2k09pJ81J36k71k02L29K24j60k9J13j7J08j1j30j49J10kj98
$$ 14 26 -121 -54 18 60 -149 -156 25 161 -110 -312 17 241 81 52 165 148 256 245 115 -34 76 74 -124
2629a24J54k14N6P4j6R3j91j45J19k13K40J93J35K9j41k51N3K62K42k92k1L89
$$ -124 30 -184 -128 -54 -70 23 -168 -313 -194 -407 -167 26 161 190 49 -202 -149 113 355 63 42 431
2651D31J1n71K09j44M89m78k25K37n7K2j89j64O40j47j96j81L15Qj5O5j05P7j39
$$ 431 442 -129 80 -64 425 -53 -278 -41 -98 -76 -265 -429 211 64 -132 -313 2 10 -5 60 -45 32 -107
2674a07J89j40K73J60n25J12M75p59K85K63l49K44k15n9L4r6j1jJ15L26m53q7
$$ -107 82 -58 215 375 -150 -38 437 -322 -37 226 -123 121 -94 -153 -119 -215 -226 -227 -112 214 -239 -326
2696c26L40j42M48j83J16l7k69J37m1K07p9K6j02k29K94q5j66o0K49k66j2K9K1
$$ -326 14 -128 320 137 253 216 -53 84 43 250 171 197 95 -134 160 75 -91 -151 98 -168 -180 -151 -130
2719a30j83J99L75j16n2n31M41K45l33k6P8K32r9r9j97M74l61J49j8J10k53l9
$$ -130 -313 -114 261 145 93 -438 3 248 -85 -111 -33 199 100 1 -196 278 -83 66 48 158 -95 -134
2741a34r6J24oQ4N4k0r9kJ65P9Q4l07k29N05K66l94k47L50k0j60N5j22m2K03j23
$$ -134 -230 -106 -112 -28 26 6 -93 -95 70 149 233 -74 -303 202 468 74 -173 177 157 -3 52 -70 -112 91 -32
2766c2j96J9K50j08j26J27M2j01r3K87j53l6L49l03pK77m6k16L4o4J84%J31m0
$$ -32 -228 -209 41 -67 -193 -66 -24 -125 -218 69 -84 -120 229 -74 -81 196 150 -66 -32 -96 88 88 219 179
2790A79m9o7K7K37k92k17J21p0r4LK29k9O4J06j96k24N48j83j42K69j51o6K46
$$ 179 130 63 90 327 35 -182 -61 -131 -225 -222 7 -22 42 148 -48 -272 276 93 -49 220 69 3 249
2813B49p9q9R8K5k20qj46L74l14J9J80l46R8Q9k03M6R1Q1l04KK56J56j59N3N9
$$ 249 170 81 179 204 -16 -24 -170 204 -110 -91 89 -257 -159 -70 -273 -227 -136 -55 -359 -357 -101 55 -104 -51 8
2838Hj02L18j27M5k22J40K20r2p1j91j38%n8j1J40J4K31l15Q1r1L10o1k48L65
$$ 8 -94 224 97 142 -80 60 280 188 117 -74 -212 -212 -270 -281 -141 -127 104 -211 -130 -221 89 28 -220 145
2862A45K2j06k4j15J36K3K07P5j01M5l63l8K67l91J55L1ll3LR1j44j1O1J04RL3
$$ 145 167 61 37 -78 58 81 288 363 262 307 -56 -94 173 -218 -63 -32 -35 -68 -65 26 -118 -129 -68 36 45 78
2888G8Qj97l4J98J40k62J4L27n6j2r5K3k38J20L8k34J8j1J88j12K04j91L82k89
$$ 78 86 -111 -145 53 193 -69 -55 272 216 204 109 132 -106 14 52 -182 -164 -175 13 -99 105 -86 296 7
2912Gj91J88j84L70N6l25o5J23j24M24Q2k38j79P0K72l94J81q4K11J22m45j40
$$ 7 -184 4 -180 190 246 -79 -144 -21 -145 279 361 123 -56 14 286 -108 73 -11 200 322 -123 -263
2934b63r7K68p5r8R4J66rpQ5r9Q2J11Q0M8k0j4m0k81L56k21L7k57J64j8j68j2
$$ -263 -360 -92 -167 -265 -171 -5 -14 -21 64 -35 47 158 238 286 266 252 212 -69 287 66 103 -154 10 -8 -176 -188
2960a88J37J91j19M4k05L2R6m3J27Jj0lK70m48K61j61J36R0q6k02J7J51Po8k54
$$ -188 -51 140 21 65 -140 -108 -12 -55 72 73 63 60 330 -118 143 -18 118 208 122 -80 -63 88 95 27 -227
2985b27L07l30J00j6K28j21j85l9K86j32j90M53j17m9j45L51j80l4N1J08k71K40
$$ -227 80 -250 -150 -166 62 -59 -244 -283 3 -129 -319 134 17 -32 -177 174 -6 -40 11 119 -152 88
3007H8k10P9K58j70L7j54J78l09L49n34L37k08K54R5k76L78k24R9j54J01K53n35
$$ 88 -122 -43 215 45 82 -72 106 -203 146 -388 -51 -259 -5 90 -186 192 -32 67 -87 14 267 -268
3029b68K42Q7l2M05l66J82l62K08j18k04K94j90j2J62j03J38m04L13J18j83p0
$$ -268 -26 61 29 434 68 250 -112 96 -22 -226 68 -122 -134 28 -75 63 -341 -28 90 -93 -163
3050a63L15k50m1L17J22q0O0j25j14R9j25K60k29LL77k29k74j89L42k54qK04K9
$$ -163 152 -98 -139 178 300 220 280 155 41 140 15 275 46 49 426 197 -77 -266 76 -178 -186 18 47
3073D7j51j39LJ16P1m7PR2J62m4j01K10l15K05n1N8R6Kj54j92K79J33l82j64Q0
$$ 47 -104 -243 -240 -124 -53 -100 -93 -1 161 117 16 226 -89 116 65 123 219 221 67 -125 154 287 -95 -259 -179
3098a79L26j5j43K02m2k18j54K02K13n3k30j7J68j03M40j74l2m1R3p3j71r7K53
$$ -179 147 132 -11 191 149 -69 -223 -21 192 139 -91 -108 60 -43 397 223 191 150 243 170 -1 -98 155
3121A55k4o1J37k07k03J99k33K31j23L8M7rj18O1K17Kj00l8J8J34k55J52n7J24
$$ 155 131 70 207 0 -203 -4 -237 -6 -129 -91 -44 -53 -171 -110 107 109 9 -29 -11 123 -132 20 -37 87
3145H7k47n5M18l49j27K97O1J32n33L72q1k02K19K0K06J35l40j55L3J08K7K35
$$ 87 -160 -215 203 -146 -273 24 85 217 -316 56 -25 -227 -8 12 218 353 13 -142 -109 -1 26 261
3167B61k03J68k3j87J77j17J59o8q7j41k57L05R6Ll40M42l01j96J62K16o8K26
$$ 261 58 226 203 16 193 76 235 167 80 -61 -318 -13 83 86 -254 188 -113 -309 -147 69 1 227
3189B27j70J2j78K25k99L95l13L52K1j85k26NJ42K32j11m66K17J08Q6j79O1N8
$$ 227 57 69 -109 116 -183 212 -101 251 272 87 -139 -134 8 240 129 -337 -120 -12 74 -105 -44 14
3211A4L21m57j84J60J27M2P2k44K92J7k82L2K12N0Q4m3L5lm99K66J69j35l00K75
$$ 14 335 -122 -306 -146 -19 23 95 -149 143 160 -122 -90 122 172 256 213 248 245 -254 12 181 46 -254 21
3235B1j06J59N0n00L97K1K15l13j12K08m0n5K10K0k9M4n5k29K24p3j49P9r4n1
$$ 21 -85 74 124 -376 21 42 257 -56 -168 40 0 -55 155 175 146 190 135 -94 130 57 -92 -13 -107 -158
3259a58K07J05k27j71R8J47J0o8j6L03k21Rp1J9J71k37J35m5J36N8o5k71K65J82
$$ -158 49 154 -73 -244 -146 1 11 -57 -73 230 9 18 -53 -34 137 -100 35 -10 126 184 119 -152 113 295
3283B95j16j97J56m04J66K4j38J14lJ57j30Np3Q5P9J2L7j01R1N5q0k33M59L7j88
$$ 295 179 -18 138 -266 -100 -76 -214 -100 -103 54 -76 -71 -144 -59 20 32 69 -32 59 114 34 -199 260 297 109
3308A09K1l67K99k47K68k34R7o4K9j5J44P2k24J66j83J11J20j21J16p6j42J10
$$ 109 130 -237 62 -185 83 -151 -54 -118 -89 -104 40 112 -112 54 -129 -18 102 -19 97 21 -121 -11
3330a1k9NK70k15p2K81n2l99J81J51j0J64l03j2L9N1n7J21r0K54j42m35L72k21
$$ -11 -40 -35 235 20 -52 229 177 -222 -41 110 100 264 -39 -51 -12 39 -18 103 13 267 125 -310 62 -159
3354a59R1J65O5n9l0j39K28r8j15J14J0P2r8N6l43J17J1j2J35J28Q4n57L98j17
$$ -159 -68 97 162 103 73 -66 162 64 -51 63 73 145 47 103 -240 -123 -112 -124 11 139 223 -334 64 -53
3378e3J3k44K53NJ17k23J79R4j24P1p3%L8k8l5J03k04j02J50J85m4Q2l14K09p6
$$ -53 -40 -284 -31 -26 91 -132 47 141 17 88 15 15 53 25 -10 93 -111 -213 -63 122 78 160 -154 55 -21
3403b1J41j81R7k9K16j03k71M0K41j88J87j83L02j01j24L02m31k2K45j93j9O0
$$ -21 120 -61 36 7 223 120 -151 -111 130 -58 129 -54 248 147 23 325 -106 -128 117 -76 -95 -35
3425c5K51l52JK9R6J10k71K18k02R3k8R7p8J21K29j43k86L07l00L85j21J7k76
$$ -35 216 -136 -135 -106 -10 100 -171 47 -155 -62 -90 7 -71 50 279 136 -150 157 -143 242 121 138 -138
3448a38L13M3k24j28rLO3K0j00J70M5r2j58O2K81k86J56J55l9J57j81q5j51L81
$$ -138 175 218 -6 -134 -143 -140 -77 -57 -157 13 58 -34 -192 -130 151 -135 21 176 137 294 113 28 -123 258
3472B58k32k23M18j81m2K15k40j55P5K23p0j14o4J18J61q3p5PN4K6m6k2j4r9K09
$$ 258 26 -197 221 40 -2 213 -27 -182 -107 116 46 -68 -132 -14 147 64 -11 -4 50 76 30 8 -6 -105 104
3497A04q2R4L7j93J30k81J32j78K84m5J26k33L61K7m56J34m2J10K0k8p8K49J8
$$ 104 22 116 153 -40 90 -191 -59 -237 47 2 128 -105 256 283 -173 -39 -81 29 49 21 -57 192 210
3520B10n46N62p4o0j51K44l41K49n5J64o5k35R5J10q1q1R5M4k89j4J8RL71j56
$$ 210 -336 226 152 92 -59 185 -156 93 38 202 137 -98 -3 107 26 -55 40 84 -205 -219 -201 -192 179 23
3544B3K24l99L7J90j63L60l36p8K05j23K04k04k02N41k81J35r8%r2J14q3m7k80
$$ 23 247 -152 -115 75 -88 272 -64 -142 63 -60 144 -60 -262 279 -2 133 35 35 -57 57 -26 -73 -353
3567c53K77L8J3J38k46J59k78K85L2l6O8j65K70j59o2R9j67K45k70K41J99k91
$$ -353 -76 -38 -25 113 -133 26 -252 33 65 29 97 -68 202 43 -19 80 -87 158 -112 129 328 37
3589C7k98J44K5l35L58K8L2j15N8k6J07n4Q4p1r6O0L04j89J38p7k3k09K03j22
$$ 37 -261 -117 -92 -427 -69 -41 -9 -124 -66 -92 15 -39 45 -26 -122 -62 242 53 191 114 91 -118 85 -37
3613c7j74J51J65j32J05p2j37M7L85l14j77j10M34p4J59k6n6l3N8j69N3p3R8q1
$$ -37 -211 -60 105 -27 78 6 -131 -84 301 -13 -190 -300 134 60 219 193 137 104 162 -7 46 -27 71 -10
3637a0p2K78k33J91p4n4N2l05K82k07J39m6j24J22r1J22j50K4J7J59P0J72l19
$$ -10 -82 196 -37 154 80 26 78 -227 55 -152 -13 -59 -183 -61 -152 -30 -180 -156 -139 20 90 262 -57
3660e7J85k00K93l36J54Q4p0j22K5l3j9%r1O9J12J09l9l3L3r1K09J32l31K26l90
$$ -57 128 -72 221 -115 39 123 53 -69 -44 -77 -96 -96 -187 -118 -6 103 64 31 64 -27 182 314 -17 209 -181
3685a81J11L17j90k69N30l71J43J3mq4q7Q0j0Rl6k8j89K95r0M4l1j38J61j31M7
$$ -181 -70 247 57 -212 318 -53 90 103 99 15 -72 8 -2 7 -29 -57 -246 49 -41 3 -28 -166 -5 -136 -89
3710h9l2MK9K8P0J8j3J61k29K68l28L7O1j25K10l39K77j55j5J22J03k06Q1q7J03
$$ -89 -121 -117 -88 -60 10 28 15 176 -53 215 -113 -76 -15 -140 70 -269 8 -147 -162 -40 63 -143 -62 -149 -46
3735d6j8J08j5k8J00J94j38k15J31o8k18J93J26m2K52M3o11K24j2P1M2l28L25
$$ -46 -64 44 29 1 101 295 157 -58 73 5 -213 -20 106 64 316 359 -252 -28 -40 31 73 -255 70
3758G0j84lJ7q4L8L50j51j07k22L23j33J62O5O3l7l81M20r3l03R6P4j86N6mm7
$$ 70 -114 -117 -100 -184 -146 204 53 -54 -276 47 -86 76 141 204 167 -214 206 113 -190 -94 -20 -206 -150 -154 -201
3783b01K38j00j81J66n6K65l92M84l77J6J96l2K07k6l45K90j18O0LQ5M1k37j24
$$ -201 37 -63 -244 -78 -134 131 -261 223 -154 -138 58 26 233 207 -138 152 34 94 97 182 223 -14 -138
3806a38r6J71j6O0k35L66p0p3M5r5r9M29l22K40J5l08J59r0J31L05k58Pl5k5p1
$$ -138 -234 -63 -79 -19 -254 112 42 -31 14 -81 -180 249 -73 167 182 -126 33 -57 74 379 121 128 93 68 -3
3831cm9R8J27k7n6j13p8K57k14j60L26l74L52k25R4K65k18J5j63N2q2J36J40R0
$$ -3 -52 46 173 146 90 -23 -101 156 -58 -218 108 -266 86 -139 -45 220 2 17 -146 -94 -176 -40 100 190
3855A90pj92J23K55l95J30q3L06m27N3K61k46K00n4j69K13l54j6J51K75q5m6k99
$$ 190 183 -9 114 369 -26 104 21 327 -100 -47 214 -32 168 114 -55 158 -196 -212 -61 214 129 83 -216
3878b16j2L39n0mj05K57l2j00J87k49o5m1Q8J1J86j71k71J48J70k08j49J78R0
$$ -216 -228 111 61 57 -48 209 177 77 264 15 -50 -91 -3 8 194 23 -248 -100 70 -138 -287 -109 -19
3901a9j41J79o2K15k18RK7o1K79l14L22o1j51n8r9j38M39j88k43L23j39j06j3
$$ -19 -160 19 -43 172 -46 -37 -10 -71 208 -106 216 155 4 -54 -153 -291 148 -40 -283 40 -99 -205 -218
3924b18k6J30K06Lp3J01j51j59L64l53M06m3o1M4Mn9o8p6k25J83M0J05K15o8k50
$$ -218 -244 -114 92 95 22 123 -28 -187 177 -176 230 187 126 170 174 115 47 -29 -254 -71 -31 74 289 221 -29
3949b9j18K94m4j21m5J51j18k18L21j10n0k7L08j22O1j2o9j99M02k29j11P3K7
$$ -29 -147 147 103 -18 -63 88 -30 -248 73 -37 -87 -114 194 72 133 121 52 -147 255 26 -85 -12 15
3972A5j3k6K5k9j16K32k0p7N2j69J27o9J85k86Q6L34j64j40J05j81L60K4lm03
$$ 15 2 -24 1 -28 -144 88 68 -9 43 -126 1 -68 117 -169 -83 251 87 -53 52 -129 231 255 252 -151
3996a51L76j35q2nr9l7K90l01P8n8Mj51K25J43l03K3K51k24J19J18J25j21n3N1
$$ -151 225 90 8 3 -96 -133 157 -144 -66 -124 -120 -271 -46 97 -206 -183 68 -156 -37 81 206 85 32 83
4020H3p9M0o4L8n1L02l75k9K6K1n0M18j63m9j82j03J24J0L2Q3j73j1K31j04m1
$$ 83 4 44 -20 18 -33 269 -106 -135 -109 -88 -138 280 117 68 -114 -217 -93 -83 -51 32 -141 -152 79 -25 -66
4045f6N2J37J8O6j40j34J75k7l53N05j96J91k78O0K3q2%j64j78K36L22k19l6L
$$ -66 -14 123 141 207 67 -67 108 81 -272 233 37 228 -50 10 33 -49 -49 -213 -391 -155 167 -52 -88 -85
4069h5L25l46K69J65m31Q0o0L57m18R2K02j17k12J67P6m88M98M1k10KK33j99o7
$$ -85 240 -106 163 328 -103 -23 -83 274 -144 -52 150 33 -179 -12 64 -424 74 115 -95 -93 140 -59 -126
4092a26J18L5k67N65m29J18j13n3J70pM6K6j44K68R7k34j36j39J92M0l02K03J0
$$ -126 -8 27 -240 325 -104 14 -99 -152 18 11 57 83 -61 207 304 70 -66 -205 -13 27 -275 -72 -62
4115f2j38M6J45j18K84j00k3m6k33N44m55J90m42M92jK05k76Jm3Lj54K30K34l55
$$ -62 -200 -154 -9 -127 157 57 34 -12 -245 299 -156 34 -408 84 83 288 12 13 -30 -27 -181 49 283 -72
4139g2m4j35J16K24l7j32Q3j02J90j15l26j2L13J16M9j17J2N0n6n9n4J48r2R9
$$ -72 -116 -251 -135 89 52 -80 3 -99 91 -24 -350 -362 -49 67 116 -1 11 61 5 -54 -108 40 -52 47
4163D7j01N8k6j13j7jnM75l35j59J97k53J68j0K8Q8M9k9K2j77J06J8n0J54j20
$$ 47 -54 4 -22 -135 -152 -153 -158 317 -18 -177 20 -233 -65 -75 -47 41 90 61 83 -94 12 30 -20 134 14
4188A4rk3J08Q6j38q2J53j49j58J83J47m4j15n7J09O5j95K56J15j72Mj38Pj23
$$ 14 5 -18 90 176 38 -44 109 -40 -198 -15 132 88 -27 -84 25 90 -105 151 266 94 98 -40 -33 -156
4212a56l6K85O9m6k68K59j08j24n8J39j63J7M9J41j91Q2R7Q3k58OJ42l40J58L41
$$ -156 -192 93 162 116 -152 107 -1 -125 -183 -44 -207 -190 -141 0 -191 -109 -12 71 -187 -181 -39 -379 -221 120
4236A20k43L51l66O8R3M2M5j86K88k14j64l1K32j94O5j23J65rK88j25Qj23N7J8
$$ 120 -123 228 -138 -70 23 65 110 -76 212 -2 -166 -197 35 -159 -94 -217 -52 -61 227 102 110 -13 44 62
4260F2mJ87j47O4j03l93L12JO1k04K66l7n0O2l1l0n0o0o4J50j56QJ48j24J21J35
$$ 62 58 245 98 162 59 -334 -22 -21 40 -164 102 65 15 77 46 16 -34 -94 -158 -8 -164 -156 -8 -132 -11 124
4286A24K5p5j28n2k8K01j63J24L7J24k62j6J59l21M30j31q2Q7k63K16J52k03J76
$$ 124 149 74 -54 -106 -134 67 -96 28 65 189 -73 -89 70 -251 179 48 -34 53 -210 6 158 -45 131
4309A31j24j48L94k29K2o1J16j96R6K38l00P0J93k46J35P9l00K15r6J54k45O1
$$ 131 7 -141 253 24 46 -15 101 -95 1 239 -61 9 202 -44 91 170 -130 85 -11 143 -102 -41
4331d1R4Q0j52j73K71k40J61j81L64m8j35l32N86k56J12j34j40K57Pj14r7Q1Q6
$$ -41 53 133 -19 -192 79 -161 0 -181 183 135 0 -332 254 -2 110 -24 -164 93 100 -14 -111 -30 56
4354E6P8j06m2k19K44r7j13j9K07P5j28Qn6j28L16m5j85M49j94j9mk22j2K31j66
$$ 56 134 28 -14 -233 11 -86 -199 -218 -11 64 -64 -56 -112 -240 76 31 -154 295 101 82 78 -144 -156 75 -91
4379i1R2J1P4l1j80Q2j95J33m4J77J1q9J97lj87k2j99K93LJ15l52K90j45J47j16
$$ -91 1 12 86 55 -125 -43 -238 -105 -149 28 39 -50 147 144 -43 -65 -264 29 32 147 -205 85 -60 87 -29
4404b9J08j47M8J55j48J07j60K1O7j63j6L29m31J60J78j41r1J03mj15P2J20o9
$$ -29 79 -68 -20 135 -13 94 -66 -45 22 -141 -157 172 -259 -99 79 -62 -153 -50 -54 -169 -97 23 -46
4427d6J02j75J95K6j20j13K39o7r7N8j73K83k26o4J29P6J9p1J06k94M57l41O8
$$ -46 56 -119 76 102 -18 -131 108 41 -56 2 -171 112 -114 -178 -49 27 46 -25 81 -213 244 -97 -29
4450b9j13K5J60J2j81K01rq0J63j69M7RJ38o5J98k39q0p5J60l7l8LP9j4o0L7k58
$$ -29 -142 -117 43 55 -126 75 66 -14 149 -20 27 36 174 109 307 68 -12 -87 73 36 -2 1 80 66 6 43 -215
4477b15L75p3j65J67r9k07M45j04j97K10l15L19J2k48j32k3J49j0J06j04K74j76
$$ -215 160 87 -78 89 -10 -217 228 124 -73 137 -178 141 153 -95 -227 -250 -101 -111 -5 -109 165 -11
4499a1Rj54K76Q9k49r2J07m2K77k88n9J52K5j28P8N9j03Q6J70j03o6Q3k01j17
$$ -11 -2 -156 120 209 -40 -132 -25 -67 210 -78 -137 15 40 -88 -10 49 -54 32 202 99 33 116 -85 -202
4523b02J4j16M8r4L67K8j82J81J3r5J66j60J85k10K2K32R6k78r7j66K58o2k34
$$ -202 -188 -304 -256 -350 17 45 -137 44 57 -38 128 -32 153 -57 -35 197 293 15 -82 -248 10 -52 -286
4546b86L48k42J03L16k67n0K36k16j54j22M50%k40J01m8j25J87L6j61J99m0K7
$$ -286 62 -180 -77 239 -28 -78 158 -58 -212 -334 116 116 -124 -23 -71 -196 -9 27 -134 65 25 52
4568E2K5Q9Rq9k44J37j79J21Oj09J99l2j23L44j22m3M4l3M4q1l3j54L55k31J38
$$ 52 77 166 175 86 -158 -21 -200 -79 -73 -182 17 -15 -138 206 84 41 85 52 96 15 -18 -172 183 -48 90
4593I0N8k0k17J81M4j02j31J57q3J0l5n1J57q9K5j03m3K56o7k11Q5O1l6MJ03j5
$$ 90 148 128 -89 92 136 34 -97 60 -23 -13 -48 -99 58 -31 -6 -109 -152 104 37 -174 -89 -28 -64 -60 43 28
4619B8j05P0j89j24M35J31k10k7O9j37Q7K1J39j58m1J09N6r3N0k79Q3J97r0r6
$$ 28 -77 -7 -196 -320 115 246 36 9 78 -59 28 49 188 30 -11 98 154 61 111 -168 -85 112 22 -74
4643g4P2O8k48J22L45L7l67J12k74K88k1mj49J35J47k32l8J24J43k39m1K79j17
$$ -74 -2 66 -182 -60 285 322 -45 67 -207 81 60 56 -93 42 189 -43 -81 43 186 -53 -94 185 68
4666F8n7O7l7J23Q1k58j29J00K67m41R2m3J35O5ql8r5J53m2J46pk32K46j42m8
$$ 68 11 78 41 164 245 -13 -142 -42 225 -216 -124 -167 -32 33 25 -13 -108 45 3 149 142 -90 156 14 -34
4691c4K73k89o5MK6J55k44K80j38L3K2k6O9l0J48j70J61j18j40K35k3k80J73J10
$$ -34 239 -50 -115 -111 -85 70 -174 106 -32 1 23 -3 66 36 184 14 175 57 -83 152 129 -151 22 132
4715A32j48J55p2J54l47L63q3l5J11k29k08K61m8m2J77k02n0K69m4l89K51j19
$$ 132 -16 139 67 221 -126 237 154 119 230 1 -207 54 6 -36 141 -61 -111 158 114 -275 -24 -143
4737a43j01M55k13Rj24m7P1O3K55k89k78L38K8J77k09%o6Jj3K07j04J65N2k89
$$ -143 -244 211 -2 7 -117 -164 -93 -30 225 -64 -342 -4 24 201 -8 -8 -74 -73 -86 121 17 182 234 -55
4761e5l0J17J33k62L28k81o1J54j4MP0Km0k25R9j16J54j31J77J13l73r9M55q2
$$ -55 -85 32 165 -97 231 -50 -111 43 29 33 103 105 65 -160 -61 -177 -23 -154 23 136 -237 -336 119 37
4785C7L6o4j34N8J78q7j38P4O2j05J92o3j96K10J01j06j28R0k3J44j06o3P0J64
$$ 37 73 9 -125 -67 111 24 -114 -40 22 -83 109 46 -150 60 161 55 -73 17 -6 138 32 -31 39 203
4809B03P5k07l3R2j09J54k00N6K18J5k40k8n5j41J68j28K8J4J52j29J38j06K36
$$ 203 278 71 38 130 21 175 -25 31 249 264 24 -4 -59 -200 -32 -160 -132 -118 34 -95 43 -63 173
4832A73l10R2Jj10L6k2L53j75P8K3o4L9Q1j78k71J47L03k20o9J78j51j55Q5j04
$$ 173 -137 -45 -44 -154 -118 -140 213 38 116 139 75 114 195 17 -254 -107 196 -24 -93 85 -66 -221 -136 -240
4856b40M82k95Q9J6j94j92J15L10M4p4l9j09J41k0Q2j64K35j92oR1j62q2K41J42
$$ -240 242 -53 36 52 -142 -334 -219 91 135 61 22 -87 54 34 116 -48 187 -5 -11 80 -82 -164 77 219
4880B19k62k0Q5j35J57l6j81K89j47K40k67K79o4l53P9K5O1mJ99k16J52j92k9
$$ 219 -43 -63 22 -113 44 8 -173 116 -31 209 -58 221 157 -196 -117 -92 -31 -35 164 -52 100 -92 -121
4903a21q0L60r4j3q4j32J66K3J45k73N6jJ0K59k29Pk13K81j56K66l90K63J03j33
$$ -121 -201 159 65 52 -32 -164 2 25 170 -103 -47 -48 -38 221 -8 -1 -214 67 -89 177 -213 50 153 20
4927B0k32J98J26l39J87M2J52k96k3K30n3J43j41K9j85Q5n8K31j45P0K15l30J72
$$ 20 -212 -14 112 -227 -40 2 154 -142 -165 65 12 155 14 43 -142 -57 -115 116 -29 41 256 -74 98
4950I8LN4j27K53j60n4l22L44J2j82j53J57J37j21J59r3l5M0M2n5K1J89m03J83
$$ 98 101 155 28 281 121 67 -255 89 101 -81 -234 -77 60 -61 98 5 -30 10 52 -3 18 207 -196 -13
4974a3L9M1J29l08K47l9j04R3Q2l57K39j65k1j14p7K85o8J92K08k94M4N1j61J85
$$ -13 26 67 196 -112 135 96 -8 85 167 -190 49 -116 -137 -251 -328 -43 -111 81 289 -5 39 90 -71 114
4998A14N4k12J69k3K75k59k9k67K25q8J62k90j66L35Q1R4j37l3K11l10K00k43
$$ 114 168 -44 125 102 377 118 89 -178 47 -41 121 -169 -335 0 81 175 38 5 216 -94 106 -137
5020a37o7L91j31o7j07K27j45j72L42l8k03J10n4K15j68j48R1K14l55L16l43P3
$$ -137 -204 187 56 -11 -118 109 -36 -208 134 96 -107 3 -51 164 -4 -152 -61 153 -202 114 -229 -156
5042a56k8k14K16J62j57K27k9j84J63J73k92P5N0P4j80J02K58l17o6O0O9j35K10
$$ -156 -184 -398 -182 -20 -177 50 21 -163 0 173 -119 -44 6 80 -100 2 260 -57 -123 -63 6 -129 81
5065H1j02J40q9K1j10J06j27j04K31m3j1K94m12K6J68N8q5m6n3j27J11L11k46
$$ 81 -21 119 30 51 -59 47 -80 -184 47 4 -7 287 -125 -99 69 127 42 -4 -57 -184 -73 238 -8
5088hJ9k7J97n5j22nQJ98k77J54k12K2K26j49j75Q4K68Qj22j22K14j53q8R4j44
$$ -8 11 -16 181 126 4 -1 7 205 -72 82 -130 -108 118 -31 -206 -122 146 154 32 -90 124 -29 -117 -23 -167
5113a67J30j34Q5J23k4n2J54j72Q1k33K4L3J04j3K6p0p7k2L16l14M33j85q5L07
$$ -167 -37 -171 -86 37 13 -39 115 -57 24 -209 -185 -152 -48 -61 -35 -105 -182 -204 112 -202 231 46 -39 268
5137B68m74J49K43r9K01k14j18L39n10K72j09J75k14J63r1J8p5n0K11L1k2j7Q7
$$ 268 -206 -57 186 87 288 74 -44 295 -215 57 -52 123 -91 72 -19 -1 -76 -126 85 116 94 77 164
5160A64j10q0n7Q3o7R8j22N6J46M7l49L20j48O7kM1m69J40K4J80N6m7J88r0o7
$$ 164 54 -26 -83 0 -67 31 -91 -35 111 158 -191 129 -19 48 46 87 -382 -242 -218 -38 18 -29 159 69 2
5185BJ5j16k1K72qj2R1k18PJOl5Q7J2J7j54PP5j00L21p7l10K8j13J53m9J26j28
$$ 2 17 -99 -120 152 144 132 223 5 12 13 19 -16 71 83 100 -54 -47 28 -72 249 172 -138 -110 -223 -70 -119 7 -121
5213a21J40n1o5J1K8J64q7o6J73Pn03J70K09J92j69l4O3n9J32j90N5j07K56p9
$$ -121 19 -32 -97 -86 -58 106 19 -47 126 133 -370 -200 9 201 32 -2 61 2 134 -56 -1 -108 148 69
5237F9k72j1K01rj31K47J18k89K30k0k8j99rM0N6n6K65J17j33m08K87K07l53P0
$$ 69 -203 -214 -13 -22 -153 94 212 -77 153 133 105 -94 -103 -63 -7 -63 202 319 186 -222 65 272 -81 -11
5261a1N2m2j9R7j79p2K06j05J37k91J75K13q1L4l23L74j40mM1j32K09m9r5P5J08
$$ -11 41 -1 -20 77 -102 -174 32 -73 64 -227 -52 161 80 114 -209 165 25 21 62 -70 139 90 -5 70 178
5286A78k11J93k61J34L6n3J46O9m69K90k10L8Q3P6j13o0K64N4j38K0j17P6n6O3
$$ 178 -33 160 -101 33 69 16 162 231 -238 52 -158 -120 -37 39 -74 -134 130 184 46 66 -51 25 -31 32
5310C2J88k75O9r6J23k95K30j53L41l47K19k10K75k03K7P2k14J59J41k7j94K13
$$ 32 220 -55 14 -82 41 -254 -24 -177 164 -183 36 -174 101 -102 -75 -3 -217 -58 83 56 -138 75
5332G5K1j45Kq5J03L40k31k08l5K25l5j00J21j33K97k03J27l0l3j67K54j06q4
$$ 75 96 -49 -47 -132 -29 311 80 -128 -163 62 27 -73 48 -85 212 9 136 106 73 -94 160 54 -30
5355c0J8N2j71K54J1k94k9K52j78J97j39J01N8J7m31M06M1r1k61M77l63J96R0
$$ -30 -12 40 -131 123 134 -160 -189 63 -115 82 -57 44 102 119 -312 94 135 44 -217 260 -103 93 183
5378A83j86O2n5O1n4oO5k51L31j19J94k39k8J67N4Rk43j41N2K90k95K43j64J35
$$ 183 -3 59 4 65 11 5 70 -181 150 31 225 -14 -42 125 179 188 -55 -196 -144 146 -149 94 -70 65
5402F5j96P5K7q3L17j72k7l29M26k59J13l0k3Q1J44n7k83K50m6k2j48L36j82P8
$$ 65 -131 -56 -29 -112 205 33 6 -323 103 -156 -43 -73 -96 -15 129 72 -211 39 -7 -29 -177 159 -23 55
5426E5J24m58J61J34k44J31pJ62j4R8j52N4Lj62J6J05n7qJ89Q4j20K30m32K8j41
$$ 55 179 -279 -118 16 -228 -97 -104 58 44 142 -10 44 47 -115 -99 6 -51 -59 130 214 94 324 -108 -80 -221
5451b21L28j90k3J01M6j43j77L61k93J43r5j0K06j52N1K07k13K92j18k44L64j60
$$ -221 107 -83 -106 -5 41 -102 -279 82 -211 -68 -163 -173 33 -119 -68 139 -74 218 100 -144 220 60
5473F0l9j8qj49q2J92j54R5l3J28QN7J36k49J35j02Jk97L72j29K71j36r1J56p4
$$ 60 21 3 -5 -154 -236 -44 -198 -103 -136 -8 0 57 193 -56 79 -23 -22 -319 53 -76 195 59 -32 124 50
5498E0K11k75k04L52q0j57O4L2l9j0J45k70L73j88k12J8K36j22J33K15l01Q1n9
$$ 50 261 -14 -218 134 54 -103 -39 -7 -46 -56 89 -181 192 4 -208 -190 46 -76 57 272 -29 52 -7
5521gJ16l7P6k27L0L00j23k10Pk9J79l57K05pJ54k95M11n4j22p1K68l03P6k8k70
$$ -7 109 72 148 -79 -49 251 128 -82 -75 -104 75 -282 -77 -84 70 -225 186 132 10 -61 207 -96 -20 -48 -318
5546c18N08l73L2K91j28n2L42j42J16m81K08m2q7K04m8m1r9l3L02P9m29J31K07
$$ -318 190 -183 -151 140 12 -40 302 160 276 -205 3 -39 -126 78 30 -11 -110 -143 159 238 -191 -60 147
5569A47j78n9L44j80k8k13Q1K03k10K6K25j86kk86K89J72m3n4PKj14J96j72n4
$$ 147 -31 -90 254 74 46 -167 -86 117 -93 -67 158 -28 -30 -316 -27 145 102 48 55 57 -57 139 -33 -87
5593h7pR3K09k64J55O5k0j1q7P5k59K14o6j4kK1J26j24K30l77K13m2j2K8l17J99
$$ -87 -94 -1 208 -56 99 164 144 133 46 121 -138 76 10 -4 -6 15 141 17 247 -130 83 41 29 57 -260 -61
5619f1K01k93j01K63K8r9q8K41K9k12L7q0N2o9J99j43L0r4J67j64K01j39L52k90
$$ -61 140 -153 -254 9 37 -62 -150 91 120 -92 -55 -135 -83 -152 47 -96 -66 -160 7 -157 44 -95 257 -33
5643c3J2P0nm9P6j76J18k93J23J64J71j31R4ql11K69r6K21j99j27K21l0k57l1
$$ -33 -21 49 44 -5 71 -105 13 -280 -157 7 178 47 141 133 -178 91 -5 216 17 -110 111 81 -176 -207
5667b07k3L72oq2O3l79K76k98L97R9j93r6R0J58j93K02k50K19J09l74K19j31J62
$$ -207 -230 142 136 54 117 -262 14 -284 113 212 19 -77 13 171 -22 180 -70 149 258 -116 103 -28 134
5690A34J05j64lN9j57M0J00j22j31J87J3m7Q6k00P5J53k54j53N18j41rj45L4N8
$$ 134 239 75 72 131 -26 14 114 -8 -139 48 61 14 100 -100 -25 128 -126 -279 239 98 89 -56 -22 36
5714C6l72M19k6k83K02m3O7J81l26L19m10j6L00l77J86JJ61k7L4j6J53K5k0j37
$$ 36 -336 83 57 -226 -24 -67 0 181 -145 174 -236 -252 48 -329 -143 -142 19 -8 26 10 163 188 168 31
5738C1K22k00j6N2M6k49K61MJ6q1r9J48m76L97J9K0l53J93mQ8J94k49R1JP7k20
$$ 31 253 53 37 89 135 -114 147 151 167 86 -13 135 -341 56 75 95 -258 -65 -69 19 213 -36 55 56 133 -87
5764h7J07j3k50Q2J9O7K00j52k4J03J02m4k10J10N2j97K81m58J74QO7J01rp4J00
$$ -87 20 7 -243 -161 -142 -75 125 -27 -51 52 154 110 -100 10 62 -135 146 -312 -138 -130 -63 38 29 -45 55
5789E5o6M7O9J22J06m66O9m3%K75k52K67m5r1q5j96J80o9L30k64J51l13J39J4
$$ 55 -11 36 105 227 333 -133 -64 -107 -107 168 -84 183 138 47 -38 -234 -54 -123 207 -57 94 -219 -80 -66
5813f6o9K06j79kJ19J84k49j44L83j47L2k11L11k52LJ82j50K44m41K19J15k29
$$ -66 -135 71 -108 -110 9 193 -56 -200 183 36 68 -143 168 -84 -81 101 -49 195 -246 -27 88 -141
5835a41K06j05k22M4K85k5l8J15j73J59N5k72J25m1m8K10j98K7K95l72Pj8l3K17
$$ -141 65 -40 -262 -218 67 42 4 119 -54 105 160 -112 13 -28 -76 134 -64 -37 258 -114 -107 -125 -158 59
5859E9R2n06L68j30J85J52l06K87j2m26K47j07J08K1J9J89l19J28l9rk32K86k82
$$ 59 151 -355 13 -117 68 220 -86 201 189 -237 10 -97 11 32 51 240 -79 49 10 1 -231 55 -227
5882b27L59k43n0J44J86l46J57k53nK16JL62j34k65K27p8k55n3L08p2o5J84pk08
$$ -227 132 -111 -161 -17 169 -177 -20 -273 -278 -62 -61 301 167 -98 129 51 -204 -257 51 -21 -86 98 91 -117
5906a17J59K19j79k1J73r4k30q1M02j93n6J19j34Q7L9j79oP0K89j93j2j66J82
$$ -117 42 261 82 61 234 140 -90 -171 231 38 -18 101 -33 54 93 -86 -92 -22 267 74 62 -104 78
5929G8J06l63K60j62J07r8j6K17r0o7o0J28l4o5j23K77j99L13k42L52l49N8pN7
$$ 78 184 -179 81 -81 26 -72 -88 129 39 -28 -88 40 6 -59 -182 95 -104 209 -33 319 -30 28 21 78
5953G8l8j83J97O8k56P4K15k97J38J29j44k07J86J27K3o8k06J94m3K60j50k90
$$ 78 40 -143 54 122 -134 -60 155 -142 -4 125 -19 -226 -40 87 110 42 -164 30 -13 247 97 -193
5975a93J37K9r1K46n7j14Qj4Q2k52K50J03l16J59K36j46K05l69K07r3l2K40l37
$$ -193 -56 -27 -118 128 71 -43 -35 -49 33 -219 31 134 -182 -23 213 67 272 -97 110 17 -15 225 -112
5998a12L19k19Mq9J38k70J53q0R9lJ82J34k92Q9Q9k19r0N9j01J65J10Q7l07L61
$$ -112 207 -12 -8 -97 41 -229 -76 -156 -57 -60 122 256 -36 53 142 -77 -167 -108 -209 -44 66 153 -154 207
6022B07j29k5j60j25L44k6n4j67pJ16j07L03k19J15j54RJ35j55L83k40J8j15J35
$$ 207 78 53 -107 -232 112 86 32 -135 -142 -26 -133 170 -49 66 -88 -79 56 -99 284 44 62 -53 82
6045H2j37M5l1K15l48L98k63n1J96j04J8k10K69j60K7l3n0J94m2K11k54OQ8L1
$$ 82 -55 -10 -41 174 -174 224 -39 -90 106 2 20 -190 79 -81 -54 -87 -137 57 15 226 -28 -22 66 97
6069I7j07j75K95O2p7J06l37R1l6K08r3l6j31j39M75j89J15j14M9M2j75R7Rl22
$$ 97 -10 -185 110 172 95 201 -136 -45 -81 127 34 -2 -133 -272 203 14 129 15 64 106 -69 28 37 -285
6093b85L8K59k08R8L57r2j64o0n1L61l48L7K1J3m6R0j8j50L46k9m3m5p0k76L03
$$ -285 -247 12 -196 -98 259 167 3 -57 -108 253 -95 -58 -37 -24 -70 20 2 -148 198 169 126 81 11 -265 38
6118C8J40j72l9jL7L13l04J63j58o1J16r7J39l16Q9J70r5q0j30m7J31M40n15J75
$$ 38 178 6 -33 -34 3 316 12 175 17 -44 72 -25 114 -202 -113 57 -38 -118 -248 -295 -164 276 -239 -64
6142f4JJ90k01j31K16J1M2k72J40K06k51M76k74K8K65m16L59m38J69o6R0K22k98
$$ -64 -63 127 -74 -205 11 22 64 -208 -68 138 -113 363 89 117 382 -34 325 -113 56 -10 80 302 4
6165Do5j2Q2J7p2M8j27J65K30j79o1j46N6r9J83p6K40k60R1J68r2r9K5J03m47
$$ 4 -61 -73 9 26 -46 2 -125 40 270 91 30 -116 -60 -159 24 -52 188 -72 19 187 95 -4 21 124 -323
6190c23M36k79L00p8p6l29J27L00m26M80j85j26k39L47n4J3J47J89J04l48o5P4
$$ -323 113 -166 134 56 -20 -349 -222 78 -348 132 -53 -179 -418 -71 -125 -112 35 224 328 -20 -85 -11
6212a1K39l36J87K40j86l5k63J68k17R1M4j99O5O9J54l6r5k7K98j72j97L96l37
$$ -11 228 -108 79 319 133 98 -165 3 -214 -123 -79 -278 -213 -144 10 -26 -121 -148 150 -22 -219 177 -160
6235a60k0L10l46M4J52j17L7N5KJ69q6p2k30L07q0J55O6j68k48J31J52L7k16N
$$ -160 -180 130 -216 -172 -20 -137 -100 -45 -43 126 40 -32 -262 45 -35 120 186 18 -230 -99 53 90 -126 -121
6259a21N4k42M53k05K08k83O8J11p8l3j85L42%j52J51j99n4M9J5j9K05M6j9j58
$$ -121 -67 -309 144 -61 147 -136 -68 43 -35 -68 -253 89 89 -63 88 -111 -165 -116 -101 -120 85 131 112 -46
6283d6k72K35L12k41M7J85j77j58J54L1j89K6j51L54m5m2J21k7r0j99Jn1J09N8
$$ -46 -318 -83 229 -12 35 220 43 -115 39 70 -119 -93 -244 110 65 23 144 117 27 -172 -171 -222 -113 -55
6307e5P4Q1j01nK6k0k0J43J02m1m78K62K8J76p7k48K7L1%j05K29o0J17N3r4r6
$$ -55 19 100 -1 -6 20 0 -20 123 225 184 -294 -32 -4 172 95 -153 -126 -95 -95 -200 29 -31 86 139 45 -51
6333e1J91k8j57J05oj95J71j47P7j12J59Q0K1J9k99J00J05j18J84k9m12M79j74
$$ -51 140 112 -45 60 54 -141 30 -117 -40 -152 7 87 108 127 -172 -72 33 -85 99 70 -342 137 -37
6356c7j06K59Ojk28J57j3J3p1O4k52O14k99k06P8O7j75K29k30R0k0L7j0K8j74
$$ -37 -143 116 122 121 -107 50 37 50 -21 43 -209 405 106 -100 -22 45 -130 99 -131 -41 -61 -24 -34 -6 -180
6381a80J56k18K17O0J32O3p6k19J7k15j8J73n6J79M00k99j30O1j69K08O5j68K3
$$ -180 -24 -242 -25 35 167 230 154 -65 -48 -263 -281 -108 -164 15 415 116 -14 47 -122 86 151 -17 6
6404Fk5j3q3K63j28j18J68l0O5k20J62M8k67J66K2jj04M1n0J4J55k37P3Q8J55
$$ 6 -19 -32 -115 148 20 -98 70 40 105 -115 47 95 -172 -6 16 15 -89 -48 -98 -84 71 -166 -93 -5 150
6429A50k10P4p1Q8Q5j80kM3m9%J86j02j20q5J83l7J4J57M1m86M51j53j35J10K99
$$ 150 -60 14 -57 31 116 -64 -66 -23 -72 -72 114 12 -108 -193 -10 -47 -33 124 165 -321 130 -23 -158 -48 251
6454B51k58P4n6M90n47N0r4L04j94r2K34k11M8O3m2P8K9jq1R5M4n1p6l43L65J85
$$ 251 -7 67 11 501 -46 4 -90 214 20 -72 162 -49 -1 62 20 98 127 126 45 140 184 133 57 -286 79 264
6480B64k02j93M03k01J00J8J95o37N12Q9l87J96k79K84k53RR4J37l87K60l5j17
$$ 264 62 -131 272 71 171 189 384 -253 259 348 -39 157 -122 162 -91 -82 12 149 -238 22 -13 -130
6502a30J94k63J65K4J6j9K03Q1l27K56j06j7j98J5J95o9RJ55p2l11P8J43N4j19
$$ -130 64 -199 -34 -10 6 -13 190 271 -56 200 94 77 -121 -106 89 20 29 184 112 -199 -121 22 76 -43
6526d3n3K78j27k7j71J08M8nn2J22r3M7J36j16K0R4k36p3M9k71M73j57K13m21
$$ -43 -96 182 55 28 -143 -35 13 8 -44 78 -15 32 168 52 72 166 -70 -143 -94 -365 108 -49 164 -257
6550b57K96m2l9J43l69Q1M4N0k79L67J51j60J27o0j00K8O0j96L16k62r6J05K92
$$ -257 39 -3 -42 101 -268 -187 -143 -93 -372 -5 146 -14 113 53 -47 -19 41 -155 161 -101 -197 -92 200
6573B00n6j6m2k45N6K3P0n0J44k82K6K52j35K38m0q8L8k11J45r5P5l5O3k31m0
$$ 200 144 128 86 -159 -103 -80 -10 -60 84 -198 -172 80 -55 183 143 55 93 -118 27 -68 7 -28 35 -196 -236
6598b36L27k4j16j10J93k85L11l42K27O9J96k09l15L24M7p2r7J09K95j20K2J72
$$ -236 91 67 -49 -159 34 -251 60 -282 -55 14 210 1 -314 10 57 -15 -112 -3 292 172 194 366
6620C66m27m2N5j22J01J9J33P2L3j31k20P1K58m16L8J07R6k1o0j20L72n0o2LO8
$$ 366 -61 -103 -48 -170 -69 -50 83 155 188 57 -163 -92 166 -250 -212 -105 -9 -30 -90 -210 162 112 50 53 121
6645A21j01p7K00nk55J73R4r2j76K62l63K92q1j62M66j84r6j03m4K4L69l72QP5
$$ 121 20 -57 143 138 -117 56 150 58 -118 144 -219 73 -8 -170 296 112 16 -87 -131 -107 262 -110 -102 -27
6669b7J11l5K98k71O6k92J58rj84M47k86j41J47mj03O6M3J77j40kJj37M64m81
$$ -27 84 49 347 76 142 -150 8 -1 -185 262 -24 -165 -18 -22 -125 -59 -16 161 21 19 20 -117 347 -134
6693a34pj5L73o9m6k08J31j0j41O1R3j84P2j6p8M44k26l07K24j57K26j02J28q3
$$ -134 -141 -156 217 148 102 -106 25 15 -126 -65 28 -156 -84 -100 -178 266 40 -267 -43 -200 26 -76 52 -31
6717c1P7m12L22J95k27m0R6M7q7K56j82j21K62J24k49j01L3qOj6q9J83R3l50J14
$$ -31 46 -366 -44 151 -76 -116 -20 27 -60 196 14 -107 155 279 30 -71 -38 -46 -40 -56 -145 38 131 -219 -105
6742a05N7R4j43q7J73r0j3j73K70J17j30j19R6K07j48p8j41L94k67M86m42q2K32
$$ -105 -48 46 -97 -184 -11 -101 -114 -287 -17 100 -30 -149 -53 154 6 -72 -213 181 -86 400 -42 -124 108
6765A08N2k41M1j0J01R6j72qR2N4N4Q2l39R6J85k38j6R6M7Pj04O2j01N6J91k46
$$ 108 160 -81 -40 -50 51 147 -25 -33 59 113 167 249 -90 6 191 -47 -63 33 80 87 -17 45 -56 0 191 -55
6791e5j59J44K9m17N33j50o0J21K13k12m1J39k2p7J80j75j80J86J38K6k1l44K30
$$ -55 -214 -70 -41 -458 75 -75 -135 -14 199 -13 -54 85 63 -14 166 -9 -189 -3 135 161 140 -204 26
6814B6R1q2J01p6K40k34j57K40p5j83J46J10pN8k33J12k29J6l7NJ00j28J06L62
$$ 26 117 35 136 60 300 66 -91 149 74 -109 37 147 140 198 -35 77 -152 -136 -173 -168 -68 -196 -90 272
6838B72k90J03n8m8j5j52Q3j10K34j29Q1j08J15k1o0k2j86K35J18j63l7nN1J96
$$ 272 -18 85 27 -21 -36 -188 -105 -215 19 -110 -29 -137 -22 -43 -103 -125 -311 -76 42 -121 -158 -163 -112 84
6862H4J93m55M68l51r7L32j05k2LJ15j17k71K44J96k34J24p6M5kmJ71m14K83k59
$$ 84 277 -178 290 -61 -158 174 69 47 50 165 48 -223 21 217 -17 107 31 76 74 70 241 -173 110 -149
6886a49J5J05q9J75j62K22o2k60M46m01K24k27L99n28K79o7Q5j28J70K75l54J
$$ -149 -134 -29 -118 57 -105 117 55 -205 241 -160 64 -163 236 -292 -13 -80 5 -123 47 322 -32 -31
6908c1P9QR4j29j08q1K32j99K63j28o9NN5M1J85j89j27o9j0J70L25l68k2K78k98
$$ -31 48 56 150 21 -87 -168 64 -135 128 0 -69 -64 -9 32 217 28 -99 -168 -178 -8 317 -51 -73 205 -93
6933i3r3L19%O5l32J09J3J90j69N5k23j6K49m04K37L83k90l7J12J50l73Q1L02
$$ -93 -186 133 133 198 -134 -25 -12 178 9 64 -159 -175 74 -330 -93 290 0 -37 75 225 -148 -67 235
6956B35N8n62L12R1j32L2n4J64m41L79M9j29R9k98K75J00j34j80K47j22K13l01
$$ 235 293 -269 43 134 2 34 -20 144 -297 82 131 2 101 -197 78 178 44 -136 111 -11 202 -99
6978i9m9K35j1J47l4l74L8L37j45j76J80L3k09N1J14r8j61K60k71p1J33j7N53
$$ -99 -148 87 76 223 189 -185 -147 190 45 -131 49 82 -127 -76 38 -60 -221 39 -232 -303 -170 -187 366
7001C66m02m1J57j38J59k18J61j61P2M9k0J7k91M01p8k67K25j40J75k3J66l13
$$ 366 -36 -77 80 -58 101 -117 44 -117 -45 4 -16 1 -290 111 33 -234 -9 -149 26 3 169 -144
7023a44K27k45l6K93O8j24L1r0O7K03m71J83j5J34k92J60J43j77K34l05O4lJJ77
$$ -144 83 -162 -198 95 163 39 70 -20 47 250 -221 -38 -53 81 -211 -51 92 -85 149 -156 -92 -95 -94 83
7047H3j56p5MJ74j20j29L45k52J73K97m09j38PL05j7Q1j78N6r2K4q8R3O3M5j55
$$ 83 -73 -148 -144 30 -90 -219 126 -126 47 344 -65 -203 -196 109 92 173 -5 51 -41 -17 -105 -12 51 96 -59
7072e9l3j80J94p7L25j86N5l5J40o9J10j55jJ32Q6j74K05M5m84k1L08k70K05Q1
$$ -59 -92 -272 -78 -155 170 -16 39 4 144 75 185 30 29 161 247 73 278 323 -161 -182 126 -144 61 142
7096A42PMj30k25M22l28J22l01K59K31q8p4n1O2qO3j05k0J32m3j89K74k33M58
$$ 142 149 153 23 -202 220 -108 14 -287 -28 203 115 41 -10 52 44 107 2 -18 114 71 -118 156 -77 381
7120C81l38K70l46J73j84K2J12J70m81M22K4j80O1o6j20J82m98M99q1K5j84P3
$$ 381 43 313 -33 140 -44 -22 90 260 -221 201 225 45 106 40 -80 102 -396 103 22 47 -137 -64
7142f4M4m8J90P1l36Q0J8j42P9N8r1J6K24o0J24l47R0Q0o1J93k15j51K03q4q5
$$ -64 -20 -68 122 193 -143 -63 -45 -187 -108 -50 -141 -125 99 39 163 -184 -94 -14 -75 118 -97 -248 -45 -129 -214
7167b14M21Jl39K69j62K24J3r5J33k79l24N14j38n7l7nK12j72K89k01P2j62o7
$$ -214 207 208 -131 138 -24 200 213 118 251 -28 -352 162 24 -33 -70 -75 137 -35 254 53 125 -37 -104
7190a04J17K4J31k60P1j07K67L9k94J80R8j45J61j1o6p2J13l9k1J1m4P7l29J89
$$ -104 13 37 168 -92 -21 -128 139 178 -116 64 162 17 178 167 101 29 142 103 82 93 49 126 -203 -14
7214a4j02K3J15j0j41RO1Q6L5L7j77K16j9J25k12J1j12j35M24l40K1J06j5rQ2
$$ -14 -116 -93 22 12 -129 -120 -59 27 62 99 -78 138 119 244 32 43 -69 -204 220 -120 -99 7 -8 -17 65
7239F5j81K23p8k65K67r1L15k52J16j14j10J63j97M5K94l15J00J89n2m4l1J98
$$ 65 -116 107 29 -236 31 -60 255 3 119 5 -105 58 -139 -94 200 -115 -15 174 122 78 47 245
7261B45j61j15j42J58O0j59L19k02l5p7L0J90J30j76l4n4J61k51J56j8J64k20
$$ 245 84 -31 -173 -15 45 -114 205 3 -32 -109 -79 111 241 65 31 -23 138 -113 43 25 189 -31
7283c1R3m0J3L1j11K47k39J1L8o3J13k15J87O1m04N61j56j26J07j17N9J70k82
$$ -31 62 22 35 66 -45 202 -37 -26 12 -51 62 -153 34 95 -309 252 96 -30 77 -40 19 189 -93
7306i3M5mL37j88n3J73j93j4j12M19k40l79M72j85l2J9K4J54j00j39p1L03l05
$$ -93 -48 -52 285 97 44 217 24 10 -102 317 77 -302 170 -15 -47 -28 -4 150 50 -89 -160 143 -162
7329a62R2j02J13j31K05o3K95k17k64J87o2r5J90J28m3r4O1N8ok5RJ3j44m6J43
$$ -162 -70 -172 -59 -190 15 -48 247 30 -234 -47 -109 -204 -14 114 71 -23 38 96 90 65 74 87 -57 -103 40
7354D0l11j50M18j07P2L7J10J34J56l33M8r5j19Q3K0j00K80k43o9o0K14N4j72
$$ 40 -271 -421 -3 -110 -38 -1 109 243 399 66 114 19 -100 -17 3 -97 183 -60 -129 -189 25 79 -93
7377i3K43j30j18R0j78J61l26M18K44k41M3k35K3J00r5K7o7O1p4j92N88j56qk3
$$ -93 150 20 -98 -8 -186 -25 -351 67 311 70 113 -122 -99 1 -94 -67 -134 -73 -147 -339 249 93 85 62
7401F2M6j64L0k0j54K34k7J95j98m4j01k8M8O5J33K11n20R2J78k1o7L4q5J25l7
$$ 62 108 -56 -26 -46 -200 34 7 202 4 -40 -141 -169 -121 -56 77 288 -232 -140 38 17 -50 -16 -101 24 -13
7426a3J04q3J59k39l0K49j59p5k0L00K6j38k15J79j94K28QL43m49qj43K65j08
$$ -13 91 8 167 -72 -102 147 -12 -87 -107 193 219 81 -134 45 -149 79 87 430 -19 -27 -170 95 -13
7449a3Q5K26m01J9Q2L3k70M31j11P8l6j12J66k20Q5K41j90j40J65n7K07m60J07
$$ -13 72 298 -103 -84 -2 31 -239 192 81 159 123 11 177 -43 42 283 93 -47 118 61 268 -192 -85
7472h5J71n5n7K07k17K47k76K50l12j20N1L17j07k39L67k44P9J37k38L02k47q1
$$ -85 86 31 -26 181 -36 211 -65 185 -127 -247 -196 121 14 -225 142 -102 -23 114 -124 178 -69 -150
7494a50l7M05k56q2K09N2k45J7j3K64n9o6j52J96k23K17Q4Rj5j50p4l0R3j42L2
$$ -150 -187 218 -38 -120 89 141 -104 -87 -100 164 105 39 -113 83 -140 77 161 170 155 5 -69 -99 -6 -148 -116
7519a16k9J75j55K82j73J43k16O2J12j51j77M21k70L72m33n6K43No9K63m10J54
$$ -116 -145 30 -125 157 -16 127 -89 -27 85 -66 -243 178 -92 280 -153 -209 34 39 -30 233 -177 -23
7541b3P6k4K31m97j71M03j44L55j86m4j1J65q9J15k86L5R2J35l29J50j87J76K12
$$ -23 53 29 260 -237 -408 -5 -149 206 20 -24 -35 130 41 156 -130 -95 -3 132 -197 -47 -234 -58 154
7564A54k09J30r2o5K26j41j78K19j63j82J34L34l4j66p3o3K60N9j89j85K06j02
$$ 154 -55 75 -17 -82 144 3 -175 44 -119 -301 -167 167 133 -33 -106 -169 91 150 -39 -224 -18 -120
7586a20J51j75K35K8k40K1L26j96O9j5o4n2K08l03J69j45M63k93k87J58m7N4j27
$$ -120 31 -144 91 119 -121 -100 226 30 99 84 20 -32 176 -127 42 -103 360 67 -220 -62 -109 -55 -182
7609a82J45j3J30N3k20KM1q2Q2R1N8q4M3m8Q5j13j00o8J64m4O8j18l4L45r1J10
$$ -182 -37 -50 80 133 -87 -85 -44 -126 -44 47 105 21 64 16 101 -12 -112 -180 -16 -60 8 -110 -144 201 110 220
7635B20k14j22K17q2M6j49J0J77j4j40K29j07o6J46K65k32k58o6m8K83m3N5N3
$$ 220 6 -116 101 19 65 -84 -74 103 89 -51 178 71 5 151 416 184 -74 -140 -188 95 52 107 160
7658A60J16k35J40j39n6qk15L36j58K97k88O3R1k53K0r8K68K5j04M1j62OJ38k0
$$ 160 276 41 181 42 -14 -22 -237 99 -59 238 -50 13 104 -149 -129 -227 41 66 -38 3 -159 -153 -15 -35
7682c5Q5J17j69Q9J36j93k45K24r2K13J30k08J62j87J97r9q5j6O4j94K76n5kk14
$$ -35 50 167 -2 87 223 30 -215 9 -83 130 260 52 214 27 224 125 40 24 88 -106 170 115 113 -101
7706a01n5K52k05j12J81J13j69k4K38j62K2K57j00j71K63J3k39o9j28M00k17Q2
$$ -101 -156 96 -109 -221 -40 73 -96 -120 118 -44 -22 235 135 -36 227 240 1 -68 -196 204 -13 69
7728F9j07J94r8k26J94J30q7j1k80J55K14Q1k45Pj67k3N01k69k99J28J91O7R9
$$ 69 -38 156 58 -168 26 156 69 58 -222 -67 147 228 -17 -10 -177 -200 301 32 -267 -139 52 119 218
7751B18k29n9J25j4k20K23q8l5n3R9J00M7j27%o4M3k98M69l26L28k08J29L21j34
$$ 218 -11 -70 55 41 -179 44 -44 -79 -132 -33 67 114 -13 -13 -77 -34 -332 137 -189 139 -69 60 381 247
7775B47j26k53k5M49l44L7M3l1p8J35k19j29L44Q8j46M3p9O9j03K23l11J38r3
$$ 247 121 -132 -157 292 -52 -15 28 -3 -81 54 -165 -294 50 138 -8 35 -44 25 -78 145 -166 -28 -121
7798a21K13n8j3M4K61k63j11Q5k29J02J1K1j35L23o7j38M3J12q6O5pln1ON5P7
$$ -121 92 34 21 65 326 63 -48 37 -192 -90 -79 -58 -193 130 63 -75 -32 80 -6 59 52 49 -2 4 59 136
7824A36k37K12j22J47l6k14L8K03j17p2R9K5j56J84j00Q0o6M9p3k75Q3L90j1j59
$$ 136 -101 111 -11 136 100 -114 -76 127 10 -62 37 62 -94 90 -10 70 4 53 -20 -295 -212 178 167 8
7848HK80k22l3l51Q0J54J89j60K4mn5Q8M5J18l05J8r8O5Q6K32l63K14J13k05K06
$$ 8 288 66 33 -318 -238 -84 105 -55 -31 -35 -90 -2 43 161 -144 -126 -224 -159 -73 159 -204 10 123 -82 124
7873A24q3r1J8j1Rl2R8l2l18N35j12j59K29l4L9m30J26J24R2N8j96n9%J54k30
$$ 124 41 -50 -32 -43 -34 -66 32 0 -318 217 105 -54 175 141 180 -250 -124 0 92 150 -46 -105 -105 49 -181
7898a81Q9J42qj57J74J47p6K20k2l49l8K6r7K11l12R9J92M9j54Lj71J16k80K60
$$ -181 -92 50 42 -115 59 206 130 350 328 -21 -59 -33 -130 81 -231 -132 60 109 -45 -42 -213 -97 -377 -117
7922a17mN0N7J42k66j00J63J54j66J30qk8j1j06k7p9L89k06J7MJ61nm6j47Q6k01
$$ -117 -121 -71 -14 128 -138 -238 -75 79 -87 43 35 7 -4 -110 -137 -216 173 -33 -16 -12 149 144 98 -49 37 -164
7948a64K93q0N6j74J45r7k4k19M19k18J80j99K79r9M1j78l9J29Q0j82p3KJ41q
$$ -164 129 49 105 -69 76 -21 -45 -264 155 -63 117 -82 197 98 139 -39 -78 51 131 -51 -124 -122 19 11
7972A1J22j4j27j13n1L10k99K75RJ77l89J00k15L4J27M4j86J00J5m7J20k9Nj29
$$ 11 133 119 -8 -121 -172 138 -161 114 123 300 -89 11 -204 -170 -43 1 -185 -85 -70 -117 3 -26 -21 -150
7996a50p9L68j61j93K92j07K40j56m4j78K71J45l30J22k55L83k15J77j00j3K2
$$ -150 -229 139 -22 -215 77 -30 210 54 10 -168 103 248 -82 40 -215 168 -47 130 30 17 39
8017C9j17N5k7J75l77J08P9O3J32l19O6Q4K71j08j73nj06KQK44l95K08K24j6R9
$$ 39 -78 -23 -50 125 -252 -144 -65 -2 130 -189 -123 -39 232 124 -49 -54 -160 -158 -150 94 -301 -93 131 115 214
8042B14j03J81m96L22k89j8j8J26L62j9l48K73k02j85k6J78j37K96k52L67k73
$$ 214 111 292 -204 118 -171 -189 -207 -81 281 262 -86 187 -15 -200 -226 -48 -185 111 -141 226 -47
8063d7J16k01l8qO5K9JL94m9l72K77r5j58M1j08J36k76J37J51j44K30j37J57N
$$ -47 69 -132 -170 -178 -113 -84 -83 311 262 -110 167 72 -86 -45 -153 -17 -293 -156 -5 -149 81 -56 101 106
8087A06j82j00J94K09l14m0O1k51M64j49j91N17j83k9n5R6r3q2o1K68j55j05j29
$$ 106 -76 -176 18 227 -87 -127 -66 -317 147 -2 -193 324 141 112 57 153 60 -22 -83 185 30 -75 -204
8110b04L00J43j90K4l91L29K8M4q4r0P4r5P7K9O6q5K70k16k38J40n5j86L06j73
$$ -204 96 239 49 73 -318 11 39 83 -1 -91 -17 -112 -35 -6 60 -25 245 29 -209 -69 -124 -310 -4 -177
8134a77K40j3K47k95m5m19N77j83j28K21M0Q0k12K35j31n2M9J69j80j18K62j39
$$ -177 63 50 297 2 -43 -462 115 -68 -196 25 65 145 -67 168 37 -15 34 203 23 -95 167 28
8156B8J12j00N9K6j53J45j39R6o7L37j69k91R5mJ47o1n4O9J64m47M27m23L32O3
$$ 28 140 40 99 125 -28 117 -22 74 7 344 175 -116 -21 -25 122 61 7 76 240 -207 220 -203 129 192
8180A92m95O13l05p7N3J92l5l3k69K33K3
$$ 192 -303 310 5 -72 -19 173 138 105 -164 69 92
8191I2
$$ Imaginary data points
##PAGE= N=2
##DATA TABLE= (X++(I..I)), XYDATA
0@%%%%%%%%%%%%%%Kl4O4o4O4o4R6j28J29j61J93k25K82l15L53m16M80n44O09o92
$$ 0 0 0 0 0 0 0 0 0 0 0 0 0 0 0 2 -32 32 -32 32 -32 64 -64 65 -96 97 -128 154 -161 192 -224 256 -288 321 -371
34c71P88q89R91j099J235j389J542j709J900k107K331k574K841l136L458l807
$$ -371 417 -472 519 -580 655 -734 808 -901 999 -1108 1223 -1351 1490 -1646 1812 -1995
50a995M193m621N095n619O207o873P629q494R501j0692J2117j3856J6052j8909
$$ -1995 2198 -2423 2672 -2947 3260 -3613 4016 -4478 5023 -5669 6448 -7408 8644 -10265
64a0265K2801k8461L7460n4024R4516l68061o08196O56267P12044Q5063n72258
$$ -10265 12536 -15925 21535 -32489 62027 -306034 -914230 -257963 454081 539144 -33114
75c3114l59136J59600L91443R6014j37621j19759M166o3753q9281O4651K55435
$$ -33114 -392250 -232650 158793 254807 117186 -2573 1593 -62160 -151441 -86790 168645
86A68645J11507k32503l69057n4147L39650L50195m7951l30906j88862J50464
$$ 168645 280152 47649 -321408 -375555 -35905 314290 266339 -64567 -253429 -102965
96a02965K37680N2081j21659j02474k4967j5177j8461P1377J41855K5195j85948
$$ -102965 134715 186796 65137 -37337 -62304 -77481 -95942 -24565 117290 142485 -43463
107d3463j77055Q7308K68118J12265j62730k03809N620J50749N8062r2052p1784
$$ -43463 -220518 -133210 134908 247173 84443 -119366 -113746 37003 95065 3013 -68771
118f8771M6763M2005p0772p0417Q2601J55684J5578j56418j15465R3027J81429
$$ -68771 -22008 19997 -50775 -121192 -38591 117093 132671 -23747 -139212 -46185 135244
129A35244J8922j70735j21354Q6003J40328k6863j49770l4813J46706J14626r8357
$$ 135244 154166 -16569 -137923 -51920 88408 61545 -88225 -123038 23668 138294 39937
140C9937j76607J7633K16790J19576j53875k23921P98K02753J20211j10540j76649
$$ 39937 -136670 -119037 97753 217329 63454 -160467 -159669 43084 163295 52755 -123894
151a23894j6438J31910Q6007m6176o3212K4244N3542j4213n2952M860O5400K1883
$$ -123894 -140332 -8422 77585 31409 -31803 -7559 45983 31770 -21182 -16322 49078 70961
163G0961p3589q1627J8598Q9844L3159o2742n7540L0271O6030P734m6352j4870
$$ 70961 -2628 -84255 -65657 24187 57346 -5396 -62936 -32665 33365 41099 -5253 -20123
175b0123M2297K6587m4718n6477J8424O7044R535o9889m7505M5716P5753K836
$$ -20123 22174 48761 4043 -52434 -34010 33034 42569 -27320 -74825 -29109 46644 49480
187D9480o2242k7269N1115N2725k4539o5562j2742N0537L0379l9343n6047K789
$$ 49480 -12762 -40031 11084 63809 39270 -26292 -39034 11503 41882 2539 -53508 -50719
199e0719N2222K8399k6145k7441J7269L1854p922l0763P214M4111P115o2719n9952
$$ -50719 1503 29902 3757 -23684 -6415 25439 17517 -13246 -6032 38079 45194 -17525 -77477
212g7477L1738R2128L1606p6734q6979J7896J00044N9604m3849p9683j9939M5392
$$ -77477 -45739 46389 77995 1261 -85718 -67822 32222 91826 47977 -31706 -51645 -6253
224f253M1513m589k8856j8868q659o469P944L1116K7905j2804m5352k1967L7991
$$ -6253 35260 30671 1815 -17053 -25712 -32181 -24237 6879 34784 21980 -23372 -45339 -7348
237g348N8139R470n0895m9590L714M0997K3477j4837k5336p593M952L067R488
$$ -7348 50791 60261 9366 -40224 -36510 4487 27964 13127 -12209 -19802 -14850 -11783 -2295
250b295K5330J5535k4130m3373q261M3809M3092j6131o1384l4265L1602N4167
$$ -2295 23035 38570 14440 -28933 -37194 6615 49707 33576 -27808 -62073 -30471 23696
262B3696J1768l3645k9968O509K7782J8078k204j0391q129q598o597O239J7649
$$ 23696 35464 1819 -28149 -21640 6142 24220 22016 11625 3496 -5102 -11699 -5460 12189
275A2189L974k2157k4812M566L0445K2510j1127k7344o669K2425J8059j0454j9757
$$ 12189 16163 -5994 -30806 -26240 4205 26715 15588 -11756 -18425 4000 22059 11605 -8152
288h152k695J0655J557j1029n855J1890J6066l826j8263l218K1201J7107q422
$$ -8152 -10847 -192 1365 -9664 -15519 -3629 12437 8611 -9652 -12870 8331 25438 17016
301A7016k0995p330J0651R950m532j3018m291O097L344l177J980R279L463p915
$$ 17016 -3979 -11309 -658 9292 4760 -8258 -12549 -6452 -3108 -6285 -4305 4974 8437 522
315E22o942N128J1961L786j2715j5649J706J5643N700j1339r183N053J2061M779
$$ 522 -6420 -1292 10669 14455 1740 -13909 -12203 3440 9140 -2199 -11382 -6329 5732 10511
329A0511n937o000M967P722m914j2927j976R587L618r231r530K165J1442Q083
$$ 10511 4574 -1426 3541 11263 6349 -6578 -8554 1033 4651 -4580 -14110 -11945 -503 7580
343G580m462q429K268R707K138m418k524Q75k068l552j256K418M850o83p804l907
$$ 7580 3118 -5311 -3043 6664 8802 4384 1860 2735 667 -2885 -4141 -1723 3127 2444 -5360 -9267
359i267R006J1469j038j1111o227M011Q477K017q928r358K479Q112L23m302J328
$$ -9267 -261 11208 10170 -941 -7168 -3157 5320 7337 -1591 -10949 -8470 -358 -35 -4337 -3009
374c009M633J490j306m52K812L915n54p795m889M147M927l118n568p37K633L172
$$ -3009 1624 3114 1808 1356 4168 8083 7529 -266 -5155 -1008 3919 801 -4767 -5504 -2871 301
390C01R88j347o42L101O47m069j700L337K224l464m921n23L627N554M15n076k113
$$ 301 1289 -58 -700 2401 3048 -1021 -2721 616 2840 -624 -5545 -6068 -2441 3113 3528 -1548 -3661
407c661O202N583j941m548j284M16J121p94l133k124J327K78j667J284M137K78
$$ -3661 2541 8124 6183 1635 351 767 1888 1094 -2039 -4163 -2836 -2558 -4225 -2941 1196 1474
423A474k793m15K711K186O47k923m226O35M227J160l482j949J514K445J815K91
$$ 1474 -1319 -1734 977 3163 3810 887 -3339 -2704 1523 2683 -799 -2748 -1234 1211 3026 3317
439C317k004q41J321P96k230j098Q08j381k645o42J272J821J593j363j545J866
$$ 3317 1313 472 1793 2589 359 -739 69 -1312 -3957 -4599 -3327 -1506 87 -1276 -2821 -955
455i55L911J343j669j560m01m67N16Q83n81j787j174k09J438L269Q47k876k727
$$ -955 2956 4299 2630 1070 669 202 718 1601 1020 -767 -1941 -2150 -712 2557 3404 528 -2199
472b199Q33K562R49j272l041k121R88K375N09o06K76N86J17j98J233J758J468
$$ -2199 -1366 1196 2145 873 -2168 -4289 -3301 -926 -417 -1023 -747 -161 -44 -242 991 2749 4217
489D217q31l566j878K109K494o21k902j325K68Q45O27J86J173J144j697l261o54
$$ 4217 3386 -180 -2058 51 2545 1924 -978 -2303 -2035 -1190 -563 -377 796 1940 243 -3018 -3672
506c672M265L561r74n203n284R08P812O574j927p924n344M109R138M224m662q029
$$ -3672 593 4154 3180 -2023 -7307 -6399 1413 7987 6060 -1864 -7208 -3099 6039 10263 5601 -2428
522b428l856K620M770K981n37m567n378m26L917O006L220k864o424m917K208Q045
$$ -2428 -6284 -3664 1106 4087 3550 -1017 -6395 -6821 -2904 3102 6322 3458 -2966 -7883 -5675 2370
538B370P452j245j1604r410M452J4323P475p190j2947m369P855J1007K647p374
$$ 2370 9822 8577 -3027 -12437 -7985 6338 13813 6623 -6324 -10693 -2838 8169 10816 3442
552C442q643k592M397N854J590l331m017r63M24M38L362N850Q65p275p826K029
$$ 3442 -5201 -7793 -3396 2458 4048 717 -3300 -4263 -3839 -3401 -39 5811 6676 -599 -8425 -6396
568f396J0614P145n407j1070l404P274O593j78m167k896M82J367L18j171L71K645
$$ -6396 4218 11363 5956 -5114 -8518 -1244 5349 5171 1004 -1892 -1410 -43 275 -896 -525 2120
584B120R32m340n534J36P643O543k574j1056n890Q469J2406J311q389p200M55
$$ 2120 3052 -1288 -6822 -6686 957 7500 4926 -6130 -12020 -3551 8855 10166 1777 -5423 -4968
599d968N179M989Q06l627l952k686K54L161M404K216k498n419n917p26R413J1172
$$ -4968 211 5200 6006 2379 -1573 -4259 -4005 -844 3560 5776 3278 -2141 -8058 -8784 629 11801
615A1801k373j4963j1011O028J6618R553p622j5371o409R282J3056L183o307r589
$$ 11801 9428 -5535 -16546 -10518 6100 15653 8031 -7340 -13749 -4467 8589 11772 5465 -4124
629d124l942N346Q195P69m700l041q51j498o08M486M894j9p501o958J905J1578
$$ -4124 -8066 -2720 5475 6244 1544 -1497 -2348 -3846 -4454 32 4926 4907 -2594 -9552 -7647 3931
645C931P224n872j1035l797N594P743L981l213o778k451L547L878K18r5L48k003
$$ 3931 11155 5283 -5752 -9549 -3955 3788 7769 4556 -2222 -4673 -1126 2752 2970 2875 3223 1220
661A220l690l459J438P295N433m706j0426l085O480P971K363l987o719l630M274
$$ 1220 -2470 -5929 -4491 2804 8237 3531 -6895 -9980 -3500 4471 6834 2847 -3872 -7502 -3228
676c228O843K820k099n062l595P79L707L411J652j176n589n945J741J0081O690
$$ -3228 3615 6435 4336 -726 -4321 -3542 165 3576 5228 4052 -1537 -7482 -5741 4340 11030
691A1030n501j1298o648M346J1975P343m993j2948p114N725J3588Q569o002j4201
$$ 11030 5529 -5769 -12417 -8071 3904 11247 6254 -6694 -13808 -8083 5505 14074 8072 -6129
705f129o327Q725J0151K219m121n744l565L7M677M726J416l630o744l297M332
$$ -6129 -12456 -3731 6420 8639 4518 -1226 -4791 -4754 -77 4649 6065 2435 -4309 -7606 -3274
720c274O848K568l399o285m439K452Q799N159n509r272j940P193O762K86m138
$$ -3274 3574 6142 2743 -3542 -7981 -5529 3270 8429 2920 -6352 -8292 -1099 5663 5949 1811
735A811l725k2J552J187K043J835l344n621p45M417L174Q1k228k387j170J002
$$ 1811 -1914 -1936 -384 803 2846 4681 1337 -4284 -5029 -612 2562 2643 415 -1972 -3142 -2140
751b140K230J671k43k363j515N52J852O52k81J254P85k582k425J908L442M24j887
$$ -2140 90 1761 1518 -845 -2360 -1808 44 696 415 1669 2454 -128 -2553 -645 2797 3221 1334
768A334k054p04M46J569R93J31k241l995k57N278M120k748n701r79M232L980j80
$$ 1334 -720 -1424 -978 591 1584 1715 -526 -4521 -4778 500 4620 1872 -3829 -4808 -576 3404 3224
785C224l153k011M50J640Q75N07L0m94j098m14k14O80J682J013k466l292J27L156
$$ 3224 71 -1940 -1490 150 1025 1532 1562 1068 -30 -444 -658 22 1704 2717 251 -3041 -2914 242
803B42J976j702k660q09J782J383j89n09P71J55q57K52J399Q12r95j424j58J691
$$ 242 2218 516 -2144 -2953 -1171 212 23 -486 285 440 -417 -165 1234 2046 1051 -373 -531 1160
821A160M08j035j580J36J565P10p75j815Q4J201P46r13k153j14K079J597r18j619
$$ 1160 1568 533 -1047 -911 654 1364 589 -1226 -1142 59 805 -108 -2261 -2375 -296 1301 383 -1236
839a236l02J580R22N71m92k10m28r11K62J675J308j710k603m26J463J660m7k042
$$ -1236 -1538 42 964 1535 1043 833 405 -506 -244 1431 2739 1029 -1574 -2000 -537 1123 1076 -966
857i66j397J609J310%j109l61J93O49L3p83K46J338J88j246p89J496K083l16j982
$$ -966 -2363 -754 556 556 -553 -914 -721 -72 -39 -822 -576 762 950 -296 -1085 411 2494 2178 196
876A96j125N53J557P82j818j161j27O42j94L20P63l67j802J76Q38J653N66j490
$$ 196 -929 -376 1181 1963 145 -1016 -1143 -501 -695 -375 388 21 -1781 -1605 -767 886 1452 -38
894c8j531J81K388Q89q98j583m17J108J614k86j335m91J064L79r50o99M82J2m54
$$ -38 -1569 -1388 1000 1889 991 -592 -1009 99 1713 1427 92 -399 665 1044 94 -605 -123 -111 -565
913e65n30n43R33J143m66j398K91J666J56m53J94N0j81K3J92o7K67L85j232o61
$$ -565 -1095 -1638 -705 438 -28 -1426 -1135 531 687 234 428 478 297 320 512 445 712 1097 -135 -796
933g96P83J230l84j150o36K12J207R08j165j991M6J508L42p21O6l07M05R30L37
$$ -796 -13 1217 833 -317 -953 -741 466 1374 209 -1782 -1736 -228 114 -607 -541 -848 -443 487 824
952H24k40P6L78p25o61J327M75j003n75l34K41L00L95q93p21N85R84r45k55N03
$$ 824 584 660 1038 313 -348 979 1454 451 -124 -458 -217 83 478 -415 -1136 -551 433 -512 -767 -264
972b64J22p2k94Q4O3J245m8j296l05J385R96r36k15j13oM09N01j001r19M14J52
$$ -264 -142 -214 -508 -424 -361 884 836 -460 -765 620 1616 680 465 352 346 755 1256 255 -664 -250 -98
993i8o31n4J69l8k80K46K07L91J21Lj026N33J035P0p42J36L39K08m6q6n31K65
$$ -98 -729 -783 -614 -652 -932 -686 -479 -88 33 36 -990 -457 578 648 -94 42 381 589 543 457 -74 191
1015A91P28q4j304M32N92m00o51k41k29J43N87jo60j41Q06L57j17M95L55o44K62
$$ 191 919 835 -469 -37 555 155 -496 -737 -966 -823 -236 -237 -897 -1038 -232 125 8 503 858 214 476
1036D76Q4j30M31J74n97j036M57R81j15n30l75l96o6P37M2p03j25L76m08k78R75
$$ 476 560 430 861 1035 438 -598 -141 840 725 195 -180 -576 -642 95 137 -566 -691 -315 -723 -1001 -26
1057b6M1k91j75L18K75P33J26m06n20N39K83m50j43L44l48q58J23K80l2R1l67
$$ -26 15 -276 -451 -133 142 875 1001 595 75 614 897 447 304 648 300 -558 -435 -155 -187 -96 -463
1078d63l17J57L93O38r21k26J62L45O27l5r78K7J547N38p66q33L57M84J34k74
$$ -463 -780 -623 -230 408 -513 -739 -577 -232 395 360 -618 -591 956 1494 728 -105 252 736 870 596
1098E96p45l41O92k16l68k57K87l52j16M29O8P6j14L06r5J54R9j18O8P7K21j59
$$ 596 -149 -490 202 -14 -382 -639 -352 -704 -820 -391 -323 -247 -361 -55 -150 4 103 -15 53 130 351 192
1120A92M25ml11m58K47N27j64j77j18m42m44L15Q80m66j034m52Q13J277p4j229
$$ 192 617 613 302 -156 91 618 454 277 159 -283 -727 -412 468 2 -1032 -1484 -671 606 532 -697
1140f97o25J281J009j01p78O4p4O45Jo78j45L67j25J06l90k19M94L35p10j031
$$ -697 -1322 -41 968 867 89 153 79 724 725 47 -98 269 144 250 -140 -359 135 470 -240 -1271
1160a271o1J329J020j390j375M14J123J217m80j262K8R30N67j72R4j60m58p0P88
$$ -1271 -1332 -3 1017 -373 -1748 -1334 -211 1006 526 -736 -708 222 789 617 711 551 93 23 811
1179H11L1o49m57J05J52k5j94m14L79j34m30J88P75O1k65l38j23mK64O85P13r12
$$ 811 842 193 -264 -159 -7 -32 -226 -640 -261 -395 -825 -637 138 199 -66 -404 -527 -531 -267 418 1131 219
1201B19n73K77J058N43j053q14N07P75l64j725k45J602P42p07j174n29N65J109
$$ 219 -354 -77 981 1524 471 -343 164 939 575 -1150 -1395 207 949 242 -932 -1461 -896 213
1219B13N86q81r06l3J144R08j24o02p17J057K93p70o78J284M11r24j315J210J192
$$ 213 799 -82 -988 -1021 123 1031 907 305 -412 645 938 168 -510 774 1185 261 -1054 156 1348
1238A348j78j569j710O51J778O05p59n91p20o27J273J661L81j834p54N02Q53Q22
$$ 1348 1170 -399 -2109 -1458 320 925 166 -425 -1145 -1772 -499 1162 1543 -291 -1045 -543 310 1132
1256A132J17l95m15l72l11L19P41l5j370l37N72N81q19J69Q95o02r46L12Q27P12
$$ 1132 1249 854 439 67 -244 75 816 781 -589 -926 -354 227 -592 -423 472 -130 -1076 -764 63 775
1276G75j257p60J24K127J069j692j381J120Q52k52q10L27J55l15k3k94l03L45
$$ 775 -482 -1242 -1118 1009 2078 386 -995 125 977 725 -85 242 397 82 59 -235 -538 -193
1294a93J105l16r28j251K24J059J561q09j554kJ474j19q44K14J323k0j119p00
$$ -193 912 596 -332 -1583 -1359 -300 1261 452 -1102 -1104 370 251 -593 -379 944 924 -195 -895
1312h95P31J309J14r96j161R56N20q63J75J86q42l06R79M82p88k57k50M96J58
$$ -895 -164 1145 1259 263 -898 58 578 -285 -110 76 -766 -1072 -93 389 -399 -656 -906 -410 -252
1331b52Q24J52l59q36m58N98J521N48j485p56N25N94n03k34R16j43q07j136P06
$$ -252 572 724 365 -471 -929 -331 1190 1738 253 -503 22 616 113 -121 795 652 -155 -1291 -585
1350e85Q94O05j058j103L32J080k80m90J65K60L83K30K07n33l72M99O60o47k65
$$ -585 309 914 -144 -1247 -915 165 -115 -605 -440 -180 203 433 640 107 -265 234 894 247 -18
1369a8L55J48m2r36j74P32Q48o07j353j03J306K02r69J07O45K03p35n87J94J172
$$ -18 337 485 443 -493 -667 65 913 306 -1047 -1150 156 358 -611 -504 141 344 -391 -978 -784 388
1389C88L19p9q72N05l4K0L14L75p00k39M50j11p45K77M67J23r31p58O42O67J65
$$ 388 707 628 -244 261 227 247 561 936 236 -3 447 336 -409 -132 335 458 -473 -1231 -589 78 243
1410B43q40p01J218Q29r95p61R85R11k46n58K6K51M89m96n63K15Q84k44r63j20
$$ 243 -597 -1298 -80 749 -246 -1007 -22 889 643 85 111 362 851 355 -208 7 891 647 -316 -436
1430d36K94j9O9J99l93m24L70J32J03l39J04M47L03n93n01R09M71Q2j034L83Q84
$$ -436 -142 -161 -92 107 -286 -710 -340 -208 -105 -444 -340 107 410 -183 -684 225 696 778 -256 127 1011
1451A011q4q97j57O24K42l82p21k82K09N53n52j31m5K82Q5k39J31L4M49J69q0
$$ 1011 927 30 -127 497 739 357 -364 -646 -437 116 -436 -567 -612 -330 -245 -484 -353 -319 130 299 219
1472B19o01M11L96J95k69l71QN51L96j055m16P86N48r45l13J28N55k58n76Q8O7
$$ 219 -382 29 425 620 351 -20 -12 539 935 -120 -536 250 798 -147 -460 -332 223 -35 -611 -523 -456
1493d56O27k22n09j97Q42L89l24k80K50j55M44J23l39j39N19J01p30Kk11M67k20
$$ -456 171 -51 -560 -757 85 474 150 -130 120 -35 409 532 193 54 573 674 -56 -54 -265 202 -18
1514a8l23n88L82O54j06r51K09Q03J99m58k4K12K30m4J80m10L15N62k45p31K39
$$ -18 -341 -929 -547 107 1 -950 -741 62 261 -197 -221 -9 221 177 357 -53 262 824 579 -152 87
1535H7J83J23j96Q2n46Q8L49l2m10j94L29L0l88j27K96M81K18l08l53M39L06J24
$$ 87 270 393 197 279 -267 -179 170 138 -272 -466 -137 -107 -495 -622 -326 155 373 65 -288 151 457 581
1557E81n51K59N00m38l71J62Rn2M91o07n46L66K53l07l98K13o0J63J20j09l41
$$ 581 30 289 789 351 -20 142 151 99 590 -17 -563 -197 56 -251 -649 -436 -496 -333 -213 -322 -663
1578f63M94N26m27j9L27R4m2o1j16K9K07K47m87l53K67N07o47m40L90J56M0n0
$$ -663 -169 357 -70 -89 238 332 290 229 113 142 349 596 109 -244 23 530 -117 -557 -167 -11 29 -21
1600b1l25k58L24M18n0m66N39r7n6K7L27k98L23P4l14L2R9L79o89L8J26k03o6
$$ -21 -346 -604 -280 138 88 -378 161 64 8 35 362 64 387 461 147 179 278 657 -32 6 132 -71 -137
1623a37K55m25k31M75r6q9l86N16k13k93N46K06p5K08p5m02L69K34n1n2j98J52
$$ -137 118 -307 -538 -63 -159 -248 -634 -118 -331 -624 -78 128 53 261 186 -216 153 387 336 284 86 238
1645B38r6J36j39k02k2p1J43m44J85J14j95O8L9o6J36L86j74o4j58L90K31k44
$$ 238 142 278 139 -63 -85 -156 -13 -457 -272 -158 -353 -285 -246 -312 -176 210 36 -28 -186 204 435 191
1667A91K11k84L50k53L4j92P9L51o22j55j54N89k25J25n19n6l5M54k9J2n6K87
$$ 191 402 118 468 215 249 57 136 487 -135 -290 -444 145 -80 45 -474 -530 -565 -111 -140 -128 -184 103
1689A03o8r9O2L70J7j78p7q3J74L57j97k30k29K73k7p7M3m72p4J35K09o9j74k1
$$ 103 35 -64 -2 368 385 207 130 47 221 578 381 151 -78 195 168 91 134 -338 -412 -277 -68 -137 -311 -332
1713c32J71M7q6K6K22l3P7o7RL68Q7j76j04J20m74L76j35m8k01n5j10L43L0k40
$$ -332 -161 -114 -200 -174 48 15 92 25 34 402 489 313 209 329 -145 231 96 48 -153 -208 -318 25 55 -185
1737a85k02R4J18J14k14J18J61r0K16L43m67J05K8K56j46o2k05J16O01k32r05
$$ -185 -387 -293 -175 -61 -275 -157 4 -86 130 473 6 111 139 395 249 187 -18 98 699 467 -438
1758d38P9O13j60k26k28o1O0K23k03K84q1O3J01k05L19k57J08K64K52m76n66R50
$$ -438 -359 254 94 -132 -360 -421 -361 -138 -341 -57 -138 -75 26 -179 140 -117 -9 255 507 31 -535 415
1780D15J00j17o36JK26M31l05o28L02K18J10k81j17J24j11l39L01L50k22K46j30
$$ 415 515 398 -238 -237 -11 420 115 -513 -211 7 117 -164 -281 -157 -268 -607 -306 44 -178 68 -62
1801f2j2M8L3L31K97L3k86q80O21L97l59m68J13J93q4k11j7j66L90k00j81N4L38
$$ -62 -74 -26 7 338 635 668 382 -498 123 520 161 -307 -194 -1 -85 -296 -313 -479 -89 -289 -470 -416 -78
1824g8m7j52L24K09l07j16M37K74o17n9J24J58L62m21j17n3J95K11l21j61n2j79
$$ -78 -125 -277 47 256 -51 -167 270 544 -73 -132 -8 150 512 91 -26 -79 116 327 6 -155 -207 -386
1846c86N3O01j68n06N18J9J9n64J49N78K09l54n55j35Q32M29p58mP0O8n2k57l8
$$ -386 -333 268 100 -406 112 131 150 -414 -265 313 522 168 -387 -522 310 739 -19 -23 47 115 63 -194 -232
1869b32j32K29O08l61m44O8r7q1L01k88J49L90K92n98j72N60L55r1m92R9K76l99
$$ -232 -364 -135 473 112 -332 -264 -361 -442 -141 -429 -280 110 402 -196 -368 192 547 456 -36 63 339 -60
1891f0J69K62n3K14n89m40M87J48l60l6K00M08n57k86M72L85m04J97J95m10K3
$$ -60 109 371 318 532 -57 -497 -10 138 -222 -258 -58 350 -207 -493 -21 364 -40 157 352 -58 -35
1912c5J53J93l4q1K47K4J40l98r44O27O62q3j196J2N67L90o66j71K19O38l04p39
$$ -35 118 311 277 196 443 467 607 209 -735 -108 554 471 -725 -713 -146 244 -422 -593 -374 264 -40 -779
1934g79p1J016L44l57k32K12k08J94r9M83P4m13j24K15m15k9J26M16k76m46o5
$$ -779 -850 166 510 153 -79 133 -75 119 20 503 577 164 40 255 -160 -189 -63 353 77 -369 -434
1955d34O6M54l73l16M80L86j12n85j6P54J97m29k03M40k9k17l44J45J079m57l22
$$ -434 -368 86 -287 -603 -123 263 151 -434 -450 304 501 72 -131 309 280 63 -281 -136 943 486 164
1976A64m25L96n70K11K31p5o83L59j68N05j92O4K50%M3n45K07N23K87o91M0M68
$$ 164 -261 135 -435 -224 7 -68 -751 -392 -560 -55 -247 -183 67 67 110 -435 -228 295 582 -109 -69 399
1998C99M73q32k09L40L20J00o00n32N09J35j50k86J22K59j76l28j24K17J61L93
$$ 399 872 40 -169 171 491 591 -9 -541 -32 103 -47 -333 -211 48 -128 -456 -580 -363 -202 191
2018A91k44M4j98L52K20k6k50M8J18J88m37n56P16K92mp06j10L77k2m42k6K89
$$ 191 -53 -9 -207 145 365 339 89 137 255 443 6 -550 166 458 454 -252 -362 15 -7 -449 -475 -186
2040a86K40j17q0j16K78J88k07q5L06l1M5j60J69l1l1K32k98r7k1o9M22l05l52
$$ -186 54 -63 -143 -259 19 207 0 -85 221 190 235 75 244 213 182 414 116 19 -2 -71 351 46 -306
2063c06P0M36k77m31P5M37L80m13m86L68K82N8k01l2K03L28l86k57R8K37k7K71
$$ -306 -236 200 -77 -508 -433 4 384 -29 -515 -147 135 193 -8 -40 163 491 105 -152 -54 183 156 427
2085D27m82l0M4p3M01m39k50K88J82q3k88M0Q2P7l1j27K28M75j97n12L90J45L98
$$ 427 -55 -85 -41 -114 287 -152 -402 -114 68 -15 -303 -263 -181 -104 -135 -262 -34 441 244 -268 122 267 665
2108F65l64l65J05K14O0l02k68K30O4j96j73K85q8m8j80O9J73J4J39M4j82l1J17
$$ 665 301 -64 41 255 315 13 -255 -25 39 -157 -330 -45 -133 -181 -361 -292 -119 -105 34 78 -104 -135 -18
2131a8L74k02j35M7K15K22n50k16N20J73n66J59O0l7J0l35j64J61K67P1m49L81
$$ -18 356 154 19 66 281 503 -47 -263 257 430 -136 23 83 46 56 -279 -443 -282 -15 56 -393 -12
2153a2J03q2k26L05j06oL74q2j84j26M81Ok02k71J08J16qj03k39k4L64l16k53
$$ -12 91 9 -217 88 -18 -24 350 268 84 -42 439 445 243 -28 80 196 188 85 -154 -178 186 -130 -383
2176c83K20M19n34K19k47K08J1J35or9J45L63j87m25L10L6N7K0k45J3q3K38j85
$$ -383 -163 256 -278 -59 -306 -98 -87 48 42 -57 88 451 264 -161 149 185 242 262 17 30 -53 185 0
2199@l53L18J83l02P4j25k27L27J96l8l24L66J03j03j84L83J15k43q3N0k8M14
$$ 0 -353 -35 148 -154 -80 -205 -432 -105 91 53 -271 95 198 95 -89 294 409 166 83 133 105 519
2221E19j81k54k15N28l10pr0k14J16j54%J91k88L92k4j02M2M6J58k34nR6R3K32
$$ 519 338 84 -131 397 87 80 -10 -224 -108 -262 -262 -71 -359 33 9 -93 -51 -5 153 -81 -86 10 103 335
2245C35j89k74K6L1L86l73Q5J53l33J46q8q0p9m1L02n13K3L83K05N7p7l0k28L70
$$ 335 146 -128 -102 -71 315 -58 27 180 -153 -7 -95 -175 -254 -295 7 -506 -483 -100 105 162 85 55 -173 197
2269A97K64n39J70L28m05n9p7J44J03o8o0j81K09o7n7k5j90J40K61m70K32J63
$$ 197 461 -78 92 420 15 -44 -121 23 126 58 -2 -183 26 -41 -98 -123 -313 -173 88 -382 -150 13
2291A3lJ3k31K23J77J34l15j11K75J36K14k26k76L1o4jj19q5J6J25L1Q2m61M46
$$ 13 10 23 -208 15 192 326 11 -100 175 311 525 299 23 54 -10 -11 -130 -215 -199 -74 -43 39 -422 24
2315B4l0J43j3l75N75k31R3j57J64M1j05K13k49J47l07J97J89k59J52l07J32p3
$$ 24 -6 137 124 -251 324 93 186 29 193 234 129 342 93 240 -67 130 319 60 212 -95 37 -36
2337c6k22J22P3o3J0k14O2J57N1LN2l1mJ81n49N16J0n7j66K91k26L45l27M8q7
$$ -36 -258 -136 -63 -126 -116 -330 -268 -111 -60 -57 -5 -36 -40 141 -408 108 118 61 -105 186 -40 305 -22 26 -61
2362f1j8j21K64N2l84j4o1K20k85M80l62L13j35k2J81J51j2j35j12J43j22K54
$$ -61 -79 -200 64 116 -268 -282 -343 -123 -408 72 -290 23 -112 -134 47 198 186 51 -61 82 -40 214
2384B14r7p7l71O69k06k57J08j91N5m6J94k98j57L86K44l51J25k68O16q6l4k43
$$ 214 117 40 -331 338 132 -125 -17 -208 -153 -199 -5 -303 -460 -74 170 -181 -56 -324 292 206 172 -71
2406g1J00K24L4n51J36L87l04R2J25o2j14j21Q4p2N0k93K03j3K25k38l16N50K30
$$ -71 29 253 287 -264 -128 259 -45 47 172 110 -4 -125 -41 -113 -63 -356 -153 -166 59 -179 -495 55 285
2429B85k56n2P5q1L04k42O1K14oj07j76J91j40M7j53K65l08k52q6M24O1k21l48
$$ 285 29 -23 52 -29 275 33 94 308 302 195 19 210 70 117 -36 229 -79 -331 -417 7 68 -153 -501
2452e01K94N00l52j14r4L5M25L0p01N88J09kl1J24L3m38M8K69J36k29J63l82m3
$$ -501 -207 293 -59 -173 -267 -232 193 223 -478 110 219 217 186 310 343 -95 -47 222 358 129 292 -90 -133
2475a33K73m80k1L31J23k55k00R9M95Q2n96K25J35m8n6K4K54j30K59n81K37p0
$$ -133 140 -340 -361 -30 93 -162 -362 -263 232 314 -282 -57 78 30 -26 -2 252 122 381 -200 37 -33
2497c3j82J07n7P6l61N2L11J9l58M37l7K54k36Jj97K91j57k74K84L01m1k98K63
$$ -33 -215 -108 -165 -89 -450 -398 -87 -68 -426 11 -26 228 -8 -7 -204 87 -70 -344 -60 241 200 -98 165
2520A65J54P9l74J00o6k41l8O7M4p5L17m01o2L48j57J76k7J35o01K66J86K62j43
$$ 165 319 398 24 124 58 -183 -221 -154 -110 -185 132 -269 -331 17 -140 36 9 144 -457 -191 -5 257 114
2543A14j17N4K73j69k99o0J69M08o93n8K23N20l70k81J20J3J15Mj43m23L68L83
$$ 114 -3 51 324 155 -144 -204 -35 373 -320 -378 -155 365 -5 -286 -166 -153 -38 -34 -177 -600 -232 151
2565A51j88J06k14m6J66K82o0k14J23K16r1l59J80K12o8l44L4j33K23j68n4J9
$$ 151 -37 69 -145 -191 -25 257 197 -17 106 322 231 -128 52 264 196 -148 -114 -247 -24 -192 -246 -227
2587b27L92k30k89K26J67j3k42J14J05L31m10lJ04K6L34k18p6n7j53J65J52l42
$$ -227 165 -65 -354 -128 39 26 -216 -102 3 334 -76 -79 25 51 385 167 91 34 -119 46 198 -144
2609a44K21j54L83j03p14J66L49L59k38o31M00K33J34l24R2M66l37J32k41p1J82
$$ -144 77 -77 306 203 -511 -345 4 363 125 -506 -106 127 261 -63 29 495 158 290 49 -22 160
2630A60o6L8o2J25j77K0K1k4Qk49j08J89n9j62l7M59n3j58Q7M94j92l87J85J32
$$ 160 94 132 70 195 18 38 59 35 43 -206 -314 -125 -184 -346 -383 76 23 -135 -48 446 254 -133 52 184
2654A84Nk08j72K06K99j3m74J18J94k6k96j74O0L59p4l77K22J55q4L5Q2kJ3J74
$$ 184 189 -19 -191 15 314 301 -173 -55 139 113 -183 -357 -297 62 -12 -389 -167 -12 -96 -61 21 19 32 206
2678B06j46J4Lj9J18J28j95m2L0R1j50j5j45K00j05P0j64j48K53K86l61O7j10
$$ 206 60 74 77 58 176 304 109 67 97 188 38 23 -122 78 -27 43 -121 -269 -16 270 -91 -24 -134
2701a34L2j30P5J20R7P8k63J14P0j14K49m3j16J17M2j86K71k51n9J37m3j89j58
$$ -134 -102 -232 -157 -37 60 138 -125 -11 59 -55 194 151 35 152 194 8 279 28 -31 106 63 -126 -284
2724b84J37n4l6kJ48K54j54r9J5L25R9k61M0mn2N3p1K31k31j7P0j88j50J30J88
$$ -284 -147 -201 -237 -239 -91 163 9 -90 -75 250 349 88 128 124 72 125 54 285 54 37 107 -81 -231 -101 87
2749H7k65J77o6N0k94N34m22K3J17k5L09k32K12O6m06L35j82K6J32k49J17J35
$$ 87 -178 -1 -67 -17 -311 223 -199 -176 -59 -84 225 -7 205 271 -135 200 18 44 176 -73 44 179
2771A79j5j54l5k5J53j17j09J5M5r0K15j24J28j37J8o0k1N1J5r3L32L2m48K24
$$ 179 164 10 -25 -50 103 -14 -123 -108 -63 -153 62 -62 66 -71 -53 -113 -134 -83 -68 -161 171 203 -245 -21
2795b1J61j03k39n4J09J41M9Q4l33J45K5J34n10M75j05l2J70L0p2l21N90j21j12
$$ -21 140 37 -202 -256 -147 -6 43 127 -206 -61 -36 98 -412 63 -42 -74 96 126 54 -267 323 202 90
2818I0l7L57l58J25l41M41m3M4k46k4KJ13n3NmJ05l57j03M22k75M2KR0K7J67l6
$$ 90 53 410 52 177 -164 277 234 278 32 8 10 123 70 75 71 176 -181 -284 138 -137 -95 -93 -3 24 191 155
2844A55j55K8K94l68J41J86j33j91J64N0k54j56J82rL8q8k59L47l0M1L1k6O5q9
$$ 155 0 28 322 -46 95 281 148 -43 121 171 -83 -239 -57 -66 -28 -116 -375 -28 -58 -17 14 -12 53 -36
2868c6NK32k7l83K80J41j66j13M00j58j30p5J39N7m25M30j66j12j63L01o4k05
$$ -36 -31 201 174 -209 71 212 46 -67 333 175 45 -30 109 166 -259 171 5 -107 -270 31 -33 -238
2890b38k7K61k73K47N2M2J09l09K8K93l9R7j89Mm3L51l29q8J67k76J36J39j64
$$ -238 -265 -4 -277 -30 22 64 173 -136 -108 185 146 243 54 58 15 366 37 -51 116 -160 -24 115 -49
2913d9P2J19j56q7j94P4K92r8q5j33J86J33p6M5j51M18q3k35J82mk06K82k25l37
$$ -49 23 142 -14 -101 -295 -221 71 -27 -112 -245 -59 74 -2 43 -108 310 227 -8 174 170 -36 246 21 -316
2937c16M46o9Pj84k45q2K25J86J58K9m67M05l62K01J18l60L58J68l9j29k7J05
$$ -316 130 61 68 -116 -361 -443 -218 -32 126 155 -312 93 -269 -68 50 -310 48 216 177 48 21 126
2959A26j42J2j6K0J09j12J67p1l36J42o0P3q7K15j33R0l3L5P8l15K91J54J32j85
$$ 126 -16 -4 -20 0 109 -3 164 93 -243 -101 -161 -88 -175 40 -93 -3 -36 -1 77 -238 53 207 339 154
2983A54L6l56M10l71J7K42j42j59J74M5j83O5N5o4n3l9J81l7Jq4p1K38j22J22
$$ 154 190 -166 244 -127 -110 132 -10 -169 5 50 -133 -68 -13 -77 -130 -169 12 -25 -24 -108 -179 59 -63 59
3007E9m9k20P0M37m21L60P4m11l2kM05l85j76J46l7J42k60L21j11J27l2k14K57
$$ 59 10 -210 -140 297 -124 236 310 -101 -133 -135 270 -115 -291 -145 -182 -40 -300 21 -90 37 5 -209 48
3030D8o9j69K27J41l11L00l63J62K05J9m5JL07p9l84q4M4J63m59L62ln9J7r8j27
$$ 48 -21 -190 37 178 -133 167 -196 -34 171 190 145 146 453 374 -10 -94 -50 113 -346 16 13 -46 -29 -127 -254
3055b54j9J68K30j84K0on5J83N4p6m2j9K39k48K30m18L40l01J19L22l83K10j27
$$ -254 -273 -105 125 -59 -39 -45 -100 83 137 61 19 0 239 -9 221 -197 143 -158 -39 283 -100 110 -17
3078a7r1nJ97r9J78j36J47o6l66L44r0K6O4l5J91k11r9j5J44M5j59m8j37N57j95
$$ -17 -108 -113 84 -15 163 27 174 108 -258 86 -4 22 86 51 242 31 -68 -83 61 106 -53 -101 -238 319 124
3103A24j21k42O19l95K1k38L5J80j03o1K18j52j49K34R9p8M1k0L32k12J2m3O0
$$ 124 3 -239 380 -15 6 -232 -197 -17 -120 -181 37 -115 -264 -30 69 -9 32 12 344 132 144 101 161
3126A61j50J30j22k74K57q1K09l55K20J53o04K93L30O1k16k89N45j98J46j00j55
$$ 161 11 141 19 -255 2 -79 130 -225 -5 148 -456 -163 167 228 12 -277 268 70 216 116 -39
3147c9k1L41k2k60r2o3J1K95j5k24j38O9J80K1k31J05Q5n3P4k68K40r9M0m4P6
$$ -39 -60 281 259 -1 -93 -156 -145 150 135 -89 -227 -158 22 43 -188 -83 2 -51 23 -245 -5 -104 -64 -108 -32
3172c2J55N0k38m9L59j47j22J45J26l04L10m39r9K22O8L9j10r7K00k86L44k87
$$ -32 123 173 -65 -114 245 98 -24 121 247 -57 253 -186 -285 -63 5 44 -66 -163 37 -249 95 -192
3194a92K38j18n3k0n4J98J21r7o9Q6k6Q4m0m9O4O8j93J9L6q1J26R9l82n6K11K1
$$ -192 46 -72 -125 -145 -199 -1 120 23 -46 40 14 98 58 9 73 141 -52 -33 3 -78 48 147 -235 -291 -80 -59
3220e9j9N2J0N9j70K66n2j07Q4j4K34j69k35j5K33Pn3r9O8L95o04kJ61P4K81m68
$$ -59 -78 -26 -16 43 -127 139 87 -20 64 50 284 115 -120 -135 98 105 52 -47 21 416 -188 -190 -29 45 326 -142
3246a42k6J51p6k20K63J5J06j08Q7pk15K23o5K4K33k87o9R1j29J6J8N00o67M37
$$ -142 -168 -17 -93 -313 -50 -35 71 -37 50 43 -172 51 -14 10 243 -44 -113 -22 -151 -135 -117 383 -284 153
3270A53k31J49j67Ll9p1K01J30l32N3K72K0N1j36K3l6k9k67K58K75l86K84j48
$$ 153 -78 71 -96 -93 -132 -203 -2 128 -204 -151 121 141 192 56 79 43 14 -253 5 280 -106 178 30
3293C0J43j06m78M74r9O8l18L48j69K7K7m9P8J8r5J5o6K22j98L52k26M57o57M7
$$ 30 173 67 -411 63 -36 32 -286 62 -107 -80 -53 -102 -24 -6 -101 -86 -152 70 -128 224 -2 455 -202 -155
3317a55L05m3J00j79Jj7K01l64K66j01OM8m18K91j97J36J07j88N28l24k44M01
$$ -155 150 107 207 28 29 12 213 -151 115 14 20 68 -350 -59 -256 -120 -13 -201 327 3 -241 160
3339A60n8o8N0J54j39J65l09M3L48K2l33l7J30m40M73k82N7Q9J11J1k85K62l56
$$ 160 102 34 84 238 99 264 -45 -2 346 368 35 -2 128 -312 161 -121 -64 25 136 147 -138 124 -232
3362b32L16k81N1K35j56J58j71J70k14J46J24k14j2K51l4l60J62j18j03L32j00
$$ -232 84 -197 -146 89 -67 91 -80 90 -124 22 146 -68 -80 171 137 -223 -61 -179 -282 50 -50
3383e0M9L3p4m0Q0l83M16K00l50J66r0Mn7J34J40k96J67J68k93J65l13R9J54k95
$$ -50 -1 32 -42 -82 -2 -385 31 231 -119 47 -43 -39 -96 38 178 -118 49 217 -76 89 -224 -125 29 -266
3407b66K71p2k34K63K10j28l81K22M9l4j03M1J97J7lK04l34J32p1L9j5j1J01j86
$$ -266 5 -67 -301 -38 172 44 -337 -115 -66 -100 -203 -162 35 52 49 253 -81 51 -20 19 4 -7 94 -92
3431i2Oq3J5k33J51L55k58J32J40o7r3j77K2J25M6J8m9K48k52K50p9J13k22L5
$$ -92 -86 -169 -154 -387 -236 119 -139 -7 133 66 -27 -204 -182 -57 -11 7 -42 206 -46 204 125 238 16 51
3455E1j67J89Q3j48j70J22M0J39k17O5J16j71L9Q2l46J91K42j83n3r9L65k33K55
$$ 51 -116 73 156 8 -162 -40 0 139 -78 -13 103 -68 -29 53 -293 -102 140 -43 -96 -195 170 -63 192
3478A92j00j98J5O5O0j21r8M75k67l4j74q3J84J18k85K75j19J90j01m7J16K11
$$ 192 92 -106 -91 -26 34 -87 -185 290 23 -11 -185 -268 -84 34 -251 24 -95 95 -6 -53 63 274
3500B74k22m2J76J08j27k14j11pL71j54j15j09L23p7k55M3J38K27j64k79RK7K36
$$ 274 52 10 186 294 167 -47 -158 -165 206 52 -63 -172 151 74 -181 -138 0 227 63 -216 -207 -180 56
3523E6Q3o0k59K48j02K33j00K5r0P7J77m0k04K1J09j62k9j48L11j99M6k07K60
$$ 56 139 79 -180 68 -34 199 99 124 34 111 288 248 44 65 174 12 -17 -165 146 -53 -7 -214 46
3546D6q6NM6M9k14o9J37L82l41M33m95J00j62K24R8l8P6J70l75l5Q7j57j01J33
$$ 46 -40 -35 11 60 -154 -223 -86 296 -45 388 -107 -7 -169 55 153 115 191 361 -14 -49 38 -119 -220 -87
3570h7J54q3k21J04J19J53j60J68m18J57J73k84R4L9L02J02p9l3j27N6O9J72k40
$$ -87 67 -16 -237 -133 -14 139 -21 147 -271 -114 59 -225 -131 -92 210 312 233 200 73 129 198 370 130
3593A30l85M22j04l04J35k1lL2k31J57P6L9k10M40j01n1K7j65J89n5r0P2j48R8
$$ 130 -255 167 63 -241 -106 -127 -130 -98 -329 -172 -96 -57 -267 173 72 21 48 -117 72 17 -73 -1 -149 -51
3617e1J54k16p3K06j08J07J80k04j77l04M78J04j84O7j4l81L87r1J14l2r5J83
$$ -51 103 -113 -186 20 -88 19 199 -5 -182 -486 -8 96 -88 -21 -35 -416 -29 -120 -6 -38 -133 50
3639E0K5K57j78j60j3OQ2J2j27J3K2K03l72K77r3J78j62j42J21j48J08n6n5M09
$$ 50 75 332 154 -6 -19 -13 69 81 -46 -33 -11 192 -180 97 4 182 20 -122 -1 -149 -41 -97 -152 257
$$ [...]
8191B22
##END NTUPLES=NMR FID
##END=
