##TITLE=1H ikalashn
D7E
25.10.2024
##JCAMPDX= 6.0         $$ Bruker NMR JCAMP-DX V2.0
##DATA TYPE= NMR FID
##DATA CLASS= NTUPLES
##ORIGIN= UXNMR, Bruker Analytische Messtechnik GmbH
##OWNER= root
$$ TOPSPIN		Version 1.3
$$ 2024-10-25 16:13:24.093 +0400  Irina@DPX200
$$ Compression mode = diff/dup
##.OBSERVE FREQUENCY= 200.131300845
##.OBSERVE NUCLEUS= ^1H
##.DELAY= (6, 6)
##.ACQUISITION MODE= SIMULTANEOUS
##.ACQUISITION SCHEME= undefined
##.AVERAGES= 32
##.DIGITISER RES= 18
##SPECTROMETER/DATA SYSTEM= spect
##.PULSE SEQUENCE= zg
##.SOLVENT NAME= CDCl3
##.SHIFT REFERENCE= INTERNAL, CDCl3, 1, 17.49637
##AUDIT TRAIL= $$ (NUMBER, WHEN, WHO, WHERE, WHAT)
$$ ##TITLE= Audit trail, TOPSPIN		Version 1.3
$$ ##JCAMPDX= 5.01
$$ ##ORIGIN= Bruker BioSpin GmbH
$$ ##OWNER= Irina
$$ $$ F:/spectra/data/iren/nmr/1H/4/audita.txt
$$ ##AUDIT TRAIL=  $$ (NUMBER, WHEN, WHO, WHERE, VERSION, WHAT)
(   1,<2024-10-25 16:13:04.937 +0400>,<Irina>,<DPX200>,<TOPSPIN 1.3>,
      <created by zg
	started at 2024-10-25 16:10:56.984 +0400,
	POWCHK disabled, PULCHK disabled
       configuration hash MD5:
       BE 6D 3F 07 2A EA 11 49 91 17 2B D3 AF B3 58 0D
       data hash MD5: 16K
       AC 7D 82 74 4C 0E 0E 8C 0A C5 E4 4B 72 19 6F 8E>)
$$ ##END=
$$ 
$$ $$ hash MD5
$$ $$ 8F 44 58 58 B2 A8 B5 DE DE CC 10 82 58 18 E9 2D
##$RELAX= 
##$RELAX= 
##$RELAX= 
##$RELAX= 
##$RELAX= 
##$RELAX= 
##$RELAX= 
##$RELAX= 
##$RELAX= 
$$ Bruker specific parameters
$$ --------------------------
##$DU= <F:/spectra>
##$EXPNO= 4
##$NAME= <1H>
##$PROCNO= 1
##$TYPE= <nmr>
##$USER= <iren>
##$AMP= (0..31)
100 100 100 100 100 100 100 100 100 100 100 100 100 100 100 100 100 100 
100 100 100 100 100 100 100 100 100 100 100 100 100 100 
##$ANAVPT= -1
##$AQSEQ= 0
##$AQ_mod= 1
##$AUNM= <au_zg>
##$AUTOPOS= <>
##$BF1= 200.13
##$BF2= 200.13
##$BF3= 200.13
##$BF4= 200.13
##$BF5= 200.13
##$BF6= 200.13
##$BF7= 200.13
##$BF8= 200.13
##$BYTORDA= 1
##$CFDGTYP= 0
##$CFRGTYP= 5
##$CHEMSTR= <none>
##$CNST= (0..63)
1 1 145 1 1 1 1 1 1 1 1 1 1 1 1 1 1 1 1 1 1 1 1 1 1 1 1 1 1 1 1 1 1 1 
1 1 1 1 1 1 1 1 1 1 1 1 1 1 1 1 1 1 1 1 1 1 1 1 1 1 1 1 1 1 
##$CPDPRG= <>
##$CPDPRG1= <>
##$CPDPRG2= <>
##$CPDPRG3= <>
##$CPDPRG4= <mlev>
##$CPDPRG5= <mlev>
##$CPDPRG6= <mlev>
##$CPDPRG7= <mlev>
##$CPDPRG8= <mlev>
##$CPDPRGB= <>
##$CPDPRGT= <>
##$D= (0..63)
0 2 0 0 0 0 0 0 0 0.06 0 0.03 0 0 0 0 0.0002 0 0 0 0 0 0 0 0 0 0 0 0 0 
0 0 0 0 0 0 0 0 0 0 0 0 0 0 0 0 0 0 0 0 0 0 0 0 0 0 0 0 0 0 0 0 0 0 
##$DATE= 1729858384
##$DBL= (0..7)
120 120 120 120 120 120 120 120 
##$DBP= (0..7)
150 150 150 150 150 150 150 150 
##$DBP07= 0
##$DBPNAM0= <>
##$DBPNAM1= <>
##$DBPNAM2= <>
##$DBPNAM3= <>
##$DBPNAM4= <>
##$DBPNAM5= <>
##$DBPNAM6= <>
##$DBPNAM7= <>
##$DBPOAL= (0..7)
0.5 0.5 0.5 0.5 0.5 0.5 0.5 0.5 
##$DBPOFFS= (0..7)
0 0 0 0 0 0 0 0 
##$DE= 6
##$DECBNUC= <off>
##$DECIM= 32
##$DECNUC= <off>
##$DECSTAT= 4
##$DIGMOD= 1
##$DIGTYP= 9
##$DL= (0..7)
0 120 120 120 120 120 120 120 
##$DP= (0..7)
150 150 150 150 150 150 150 150 
##$DP07= 0
##$DPNAME0= <>
$$ [...]
##$SW= 21.9926040160658
##$SWIBOX= (0..15)
0 0 2 0 0 0 0 0 0 0 0 0 0 0 0 0 
##$SW_h= 4401.40845070422
##$TD= 16384
##$TD0= 1
##$TE= 300
##$TE2= 300
##$TE3= 300
##$TEG= 300
##$TL= (0..7)
0 120 120 120 120 120 120 120 
##$TP= (0..7)
150 150 150 150 150 150 150 150 
##$TP07= 0
##$TPNAME0= <>
##$TPNAME1= <>
##$TPNAME2= <>
##$TPNAME3= <>
##$TPNAME4= <>
##$TPNAME5= <>
##$TPNAME6= <>
##$TPNAME7= <>
##$TPOAL= (0..7)
0.5 0.5 0.5 0.5 0.5 0.5 0.5 0.5 
##$TPOFFS= (0..7)
0 0 0 0 0 0 0 0 
##$TUNHIN= 0
##$TUNHOUT= 0
##$TUNXOUT= 0
##$USERA1= <user>
##$USERA2= <user>
##$USERA3= <user>
##$USERA4= <user>
##$USERA5= <user>
##$V9= 5
##$VALIST= <valist>
##$VCLIST= <CCCCCCCCCCCCCCC>
##$VD= 0
##$VDLIST= <DDDDDDDDDDDDDDD>
##$VPLIST= <PPPPPPPPPPPPPPP>
##$VTLIST= <TTTTTTTTTTTTTTT>
##$WBST= 1024
##$WBSW= 25
##$XGAIN= (0..3)
0 0 0 0 
##$XL= 0
##$YL= 0
##$YMAX_a= 324235
##$YMIN_a= -457744
##$ZGOPTNS= <>
##$ZL1= 120
##$ZL2= 120
##$ZL3= 120
##$ZL4= 120
##$ABSF1= 10
##$ABSF2= 0
##$ABSG= 5
##$ABSL= 3
##$ALPHA= 0
##$AQORDER= 0
##$ASSFAC= 0
##$ASSFACI= 0
##$ASSFACX= 0
##$ASSWID= 0
##$AUNMP= <proc_1d>
##$AXLEFT= 0
##$AXRIGHT= 0
##$AXTYPE= 0
##$AXUNIT= <>
##$AZFE= 0.1
##$AZFW= 0.1
##$BCFW= 1
##$BC_mod= 2
##$BYTORDP= 1
##$COROFFS= 0
##$CY= 7568.61572265625
##$DATMOD= 1
##$DC= 2
##$DFILT= <>
##$DTYPP= 0
##$F1P= 17.9538593292236
##$F2P= -4.03888763876832
##$FCOR= 0.5
##$FTSIZE= 32768
##$FT_mod= 4
##$GAMMA= 1
##$GB= 1
##$INTBC= 1
##$INTSCL= 1
##$ISEN= 128
##$LB= 0.02
##$LEV0= 0
##$LPBIN= 0
##$MAXI= 945.577
##$MC2= 0
##$MEAN= 0
##$ME_mod= 0
##$MI= -402.1523
##$NCOEF= 0
##$NC_proc= 0
##$NLEV= 6
##$NOISF1= 8.587773
##$NOISF2= 6.764455
##$NSP= 1
##$NTH_PI= 0
##$NZP= 0
##$OFFSET= 17.49637
##$PC= 1
##$PHC0= -39.29726
##$PHC1= 3.985996
##$PH_mod= 0
##$PKNL= yes
##$PPARMOD= 0
##$PPDIAG= 0
##$PPIPTYP= 0
##$PPMPNUM= 100
##$PPRESOL= 1
##$PSCAL= 0
##$PSIGN= 0
##$REVERSE= no
##$SF= 200.13
##$SI= 32768
##$SIGF1= 18.5376
##$SIGF2= -6.396296
##$SINO= 400
##$SIOLD= 32768
##$SREGLST= <1H.CDCl3>
##$SSB= 3
##$STSI= 0
##$STSR= 0
##$SW_p= 4401.40845070422
##$SYMM= 0
##$S_DEV= 0
##$TDeff= 0
##$TDoff= 0
##$TI= <>
##$TILT= no
##$TM1= 0
##$TM2= 0
##$TOPLEV= 0
##$USERP1= <user>
##$USERP2= <user>
##$USERP3= <user>
##$USERP4= <user>
##$USERP5= <user>
##$WDW= 1
##$XDIM= 8192
##$YMAX_p= 0
##$YMIN_p= 0
$$ End of Bruker specific parameters
$$ ---------------------------------
##NTUPLES= NMR FID
##VAR_NAME=  TIME,          FID/REAL,        FID/IMAG
##SYMBOL=    X,             R,               I
##VAR_TYPE=  INDEPENDENT,   DEPENDENT,       DEPENDENT
##VAR_FORM=  AFFN,          ASDF,            ASDF
##VAR_DIM=   8192,          8192,            8192
##UNITS=     SECONDS,       ARBITRARY UNITS, ARBITRARY UNITS
##FACTOR=    0.0002272,     1,               1
##FIRST=     0,             0,               0
##LAST=      1.8609952,     30,              -61
##MIN=       0,             -457744,         -457744
##MAX=       1.8609952,     324235,          324235
$$ Real data points
##PAGE= N=1
##DATA TABLE= (X++(R..R)), XYDATA
$$ [...]
1361G3k51P15O87o42j969L11K539O21k732j940J455K473k2j868j852R52K542L23
$$ 73 -178 537 1224 582 -1387 -1076 1463 2084 -648 -2588 -1133 1340 1318 -550 -2402 -1450 1092 1415
1379A415k448o97K170J308j344j578P57J825N49j558k019N41K692P97k476j599
$$ 1415 -1033 -1730 440 1748 404 -1174 -417 1408 1957 399 -1620 -1079 1613 2410 -66 -1665
1395a665J024J609j88j189r83O88J417k84j888o3K216J054j665j787Q52J913O86
$$ -1665 -641 968 780 -409 -1392 -704 713 429 -1459 -1522 694 1748 83 -1704 -852 1061 1747
1412A747j510j521P05K277K10k158q84J545R93j140j447L83J251O05j320j514
$$ 1747 237 -1284 -579 1698 1908 -250 -1134 411 1404 264 -1183 -800 451 1056 -264 -1778
1428a778O67K006K33j851j026J279J092j0q88m41O69J238m17j480K41J826L12
$$ -1778 -1111 895 1128 -723 -1749 -470 622 612 -276 -717 -48 1190 773 -707 -466 1360 1672
1445A672j627j156Q24J470l6j590j119R49J732m12j960l81J734Q72j277q98L48
$$ 1672 45 -1111 -287 1183 1147 -443 -1562 -613 1119 707 -1253 -1634 100 972 -305 -1203 -855
1462h55J449N97j071j332Q16J845R6k011p79J572J264o35j326n91J074J088p30
$$ -855 594 1191 120 -1212 -396 1449 1545 -466 -1245 327 1591 956 -370 -961 113 1201 471
1479D71j811j09J873N83j624r74R92J019L01r08r44N71J611r6j705k45J709O45
$$ 471 -1340 -1449 424 1007 -617 -1591 -599 420 721 -187 -1131 -560 1051 955 -750 -995 714 1359
1497A359r19q85P2J004N23p98j213K49J450j1j581l99J115N48n04p53k95Q61J023
$$ 1359 440 -445 -373 631 1154 356 -857 -608 842 831 -750 -1149 -34 514 10 -743 -1038 -177 846
1516H46o64j376M51J702O6j226l43P70P13k2q33p31O38J247n01j556J12J250J54
$$ 846 182 -1194 -743 959 1025 -201 -544 226 939 917 84 -647 -9 1238 737 -819 -707 543 697
1535F97r56o23J43N93P77o94j338Q39J424l05j159j30J047O21l28o75m68J011
$$ 697 -259 -882 -739 -146 631 -63 -1401 -562 862 557 -602 -732 315 936 608 -67 -535 476
1553D76Q98q52j318N91J176k29r20n38M45L33M02r37p52O62J129m47j231N28R74
$$ 476 1374 522 -796 -205 971 742 -178 -716 -271 62 464 -473 -1225 -563 566 119 -1112 -584 390
1572C90k20k93j69N4O15P19o84j072O04J121l64r39N7K52R0Q6l37m72L77N38n54
$$ 390 170 -123 -292 -238 377 1096 412 -660 -56 1065 701 -238 -181 71 161 247 -90 -562 -185 353 -201
1593b01o60N99P73n47n21R9J80L60M92m18n51L79R70n58n01N10J34l88l1p2o1
$$ -201 -861 -262 511 -36 -557 -458 -278 82 574 156 -395 -16 954 396 -105 405 539 151 120 48 -13
1614a3M38J36j050m86J005M79o50p02L65K01J45L45m22k97O45M74o77m46J015
$$ -13 425 561 -489 -975 30 509 -141 -843 -478 -277 -132 213 -209 -506 139 613 -64 -510 505
1633E05K51m96k79p6J07N26J53o50p39M94N49l21k03k0k53j41M49N5k70L89J80
$$ 505 756 260 -19 -95 12 538 691 41 -698 -204 345 24 -179 -199 -452 -593 -144 -89 -359 30 210
1654B10o93L1O87K36k56m5M6l13M79K77k39l55L02l22l20J52M61j33n76j75J14
$$ 210 -483 -452 235 471 215 170 216 -97 382 659 420 65 367 45 -275 -123 338 205 -371 -546 -432
1675d32R7L90J27o54k89N41L92p0K5j27j41K32J81Pj8J19J04n55q3M00J49o0l01
$$ -432 -335 55 182 -472 -761 -220 172 102 127 0 -141 91 272 279 261 380 484 -71 -154 246 395 335 34
1698C4m28k54L43O81j22p11k69K25L99M83k28m72k28P25J86j99k2R8J19j81q6
$$ 34 -394 -648 -305 376 254 -457 -726 -501 -102 381 153 -319 -547 178 364 165 143 241 360 179 93
1719I3j29J79N62j06j003m97N87O13ql19p91j71P51Q71l77p40p0L62L10K07k08
$$ 93 -36 143 705 599 -404 -901 -314 299 291 -28 -819 -990 -239 632 255 -485 -555 -193 117 324 116
1740A16j62J00M50k15k12R7L44Km67k59j51L16O31nj052n85M77R45P5n31r57K75
$$ 116 -46 54 504 289 77 174 518 520 53 -206 -357 -41 590 585 -467 -1052 -575 370 445 -86 -1043 -768
1762g68Q17O77m10q30L12M46K52k30j88L5L82K25o39q61N15J137J56j061q18l9
$$ -768 49 726 316 -514 -202 244 496 266 78 113 495 720 81 -780 -265 872 1028 -33 -851 -890
1782h90J095R00q37j566j02J304Q04n43p35J10O38K64q6o39J09R09M7q11m24N93
$$ -890 205 1105 268 -1298 -1400 -96 708 165 -570 -460 178 442 356 -283 -174 735 782 -29 -453 140
1802A40O34J45m91j025m74J358O78o55j087k14N95N69K64n32n73K75P27j62l78
$$ 140 774 919 428 -597 -1071 287 965 310 -777 -991 -396 173 437 -95 -668 -393 334 172 -206
1821b06K14L11q8K11k40l90K12O28K61j056o00M34P26L76n94j058l03J244Q28
$$ -206 8 319 231 442 202 -188 24 652 913 -143 -743 -309 417 793 199 -859 -1162 82 910
1840I10p19j083rO68M34N5o21k09P87O33p44q47P05Q80J15q21p29m2J182R63j116
$$ 910 191 -892 -901 -233 201 256 -365 -574 213 846 102 -745 -40 840 955 134 -595 -637 545 1508 392
1861C92j219L6J103K36n35n83j90N09P32k94p93L08P62j49n54j10L54N27J30l91
$$ 392 -827 -791 312 548 13 -570 -760 -251 481 187 -606 -298 464 315 -239 -349 5 532 662 271
1881B71o71K49J017k21o73j27N1q7L33J39k51o70K60K64j27M19l3n80J34M30M1
$$ 271 -400 -151 866 645 -28 -155 -104 -191 142 281 30 -640 -380 -116 -243 176 143 -437 -303 127 168
1902A68n02K61N55o7l70QJ9R8N41l08p38k20P48N76m64n09l71L14O72j80q46k59
$$ 168 -334 -73 482 415 45 53 72 170 711 403 -335 -555 193 769 305 -204 -575 -261 411 231 -615 -874
1924h74P72N51n55n02N22M79J65l92o98K85J004J91r15o06O48N68j24m06l72l5
$$ -874 -102 449 -106 -608 -86 393 558 166 -532 -247 757 948 33 -573 75 643 519 113 -259 -294
1944b94N08J85o03m08O05L11n98l18J59N65J36j51n10j56Q18K79m30l23N19L40
$$ -294 214 399 -204 -612 -7 304 -294 -612 -453 112 248 97 -413 -569 249 528 98 -225 294 634
1964F34l50j28kr1L22m10l43J40O83k26o37q4M70J48k57o0j52J42K46M9l65K23
$$ 634 284 156 154 63 385 -25 -368 -228 455 229 -408 -492 -22 126 -131 -191 -343 -201 45 94 -271 -48
1986d8N61jo07j66N65K69j23m14l12L10N91k53p61l3O80o2n39k02J17L85L37m80
$$ -48 513 512 -95 -261 304 573 450 36 -276 34 625 372 -389 -422 258 196 -343 -545 -428 -43 294 -186
2008a86m57M97O78m2q08j43M96N31j7o47j33L90M93k19p53O4O23j01m68l88L82
$$ -186 -643 -146 532 490 -318 -461 35 566 549 -98 -231 159 652 433 -320 -256 367 266 -202 -590 -208
2029b08M71O9n72m13K79O29r2n76K0M55N8j83J4Q8J90J13k31j46K30L66j51n53
$$ -208 263 332 -240 -653 -374 255 163 -413 -393 62 120 -63 -49 39 229 342 111 -35 195 561 410 -143
2051a43j72M13J81k39k22j04K79K59l16m08J02O81n7o17J07L48K90j20l32k38
$$ -143 -315 98 279 40 -182 -286 -7 252 -64 -472 -370 311 254 -363 -256 92 382 262 -70 -308
2071c08M35M32l48n89K43N61Kl52l36J66L04M7m21m00K02O83j74m50j63K96M26
$$ -308 127 559 211 -378 -135 426 428 76 -260 -94 210 257 -164 -564 -362 321 147 -303 -466 -170 256
2092B56k04k77j59N33K99k90m43K96M46J33n44q8J58K82j64k66l06J54M92k31
$$ 256 52 -225 -384 149 448 158 -285 11 457 590 46 -42 116 398 234 -32 -338 -184 308 77
2112G7m92P5M29K9k92j99K16K50J09k42l38M19N90j88o60J24M01o6M5l85o1K90
$$ 77 -415 -340 89 118 -174 -373 -157 93 202 -40 -378 41 631 443 -217 -93 308 242 287 -98 -159 131
2134A31L98m48o72M03L67j00m22o3K67J12K55m72r9J84N27k29m22K22M16r5J5
$$ 131 529 81 -591 -188 179 79 -343 -406 -139 -27 228 -244 -343 -159 368 139 -283 -61 355 260 275
2155B75j10k10M38J00m40m28N03M26m48n54L25J50L3p2l72j52O30K61n05m55O20
$$ 275 165 -45 393 493 53 -375 128 554 106 -448 -123 27 60 -12 -384 -536 94 355 -150 -605 15
2176A5L36k07m43K96J39L35q6l74l30M57N77m81o52L64J94m6r1k09j51N04J59
$$ 15 351 144 -299 -3 136 471 385 11 -319 138 715 234 -418 -54 140 94 3 -206 -357 147 306
2197C06n13m95N31M21k01l77J50J28L64m8l44q4M31J07m11j57L97J28j27l13M8
$$ 306 -207 -702 -171 250 49 -328 -178 -50 314 266 -78 -162 269 376 -35 -192 205 333 206 -107 -59
2218e9P0K48k34m48m3O36R5n44l1K75J82k10q2n7J26N08j36o36J63N44K74n58
$$ -59 11 259 25 -423 -466 170 265 -279 -310 -35 147 -63 -145 -202 -76 432 296 -340 -177 367 641 83
2240H3l22K12L19Q2jo65k7N64nm91k93L24J92r7j39j26K49N33k14m22jN44R1q2
$$ 83 -239 -27 292 374 373 -292 -319 245 240 -251 -544 -220 -28 -125 -264 -390 -141 392 178 -244 -245 299 390 308
2264C08j91j2k1K87rm36P9K90j88k65j31M30n8k56p2j47L17K45k22l39J92L69
$$ 308 117 105 84 371 362 -74 5 295 107 -158 -289 141 83 -173 -245 -392 -75 170 -52 -391 -199 170
2286A70M5l38J03K20p1M0j11j19L01K30k69m23N7M44Om42j47j13L26J24r4k31
$$ 170 215 -123 -20 200 129 169 58 -61 240 470 201 -222 -165 279 285 -157 -304 -417 -91 33 -61 -292
2308b92o9M68o2k70J41K15K01j48j29k36K46L53K0m05j55L46jj19j10J5j64oJ97
$$ -292 -361 107 45 -225 -84 131 332 184 55 -181 65 418 438 33 -122 224 223 104 -6 9 -155 -161 36
2331C6q0j02L7q0l6J95n5NmJ51N0j51L8O1P7Q3l8m10J33L18J42k23m48J46Q7J02
$$ 36 -44 -146 -109 -189 -225 -30 -85 -80 -84 67 117 -34 4 65 142 225 187 -223 -90 228 370 147 -301 -155 -68 34
2357C4L5m08j26J78K65j9k10l4J93J45j9k38J30J80J88k3m50J25L35O8p9l78J5
$$ 34 69 -339 -465 -287 -22 -41 -251 -285 -92 53 34 -204 -74 106 294 271 -179 -54 281 349 270 -108 -93
2380i3J78K81j07m42j17J64K42k18m1q2n8J52K15j93k10L57K46p0l18rJ81K69
$$ -93 85 366 259 -183 -300 -136 106 -112 -153 -235 -293 -141 74 -119 -329 28 274 204 -114 -123 58 327
2402C27J73n88j59L07M27k31j58k88j3K62K33l78l29J94J92K16m06NK45J06Mm9
$$ 327 500 -88 -247 60 487 256 98 -190 -203 59 292 -86 -415 -221 -29 187 -219 -214 31 137 141 92
2424I2l43R7M16J81l53k54L00L03j96M6m84KK33J33j62r4J09n9j37J32l6j62M5
$$ 92 -251 -154 262 443 90 -164 136 439 243 289 -195 -193 40 173 11 -83 26 -33 -170 -38 -74 -236 -191
2447a91L33j97j40J04N9K00J12j77k96K58L31p1l34k78M00J4K0p0l24Q5J78J82
$$ -191 142 -55 -195 -91 -32 168 280 103 -193 65 396 325 -9 -287 113 127 147 77 -247 -162 16 198
2469A98l09k29K62J57km4l49P6M81J27m73j87M07L23j77l15N8ML07P5l93k50L49
$$ 198 -111 -340 -78 79 77 33 -316 -240 241 368 -105 -292 115 438 261 -54 4 8 315 390 -3 -253 96
2492I6J42l87r3RJ86%J78l79j11L07L02l92j98K42K30r0N2j2j13N8K88k08j31
$$ 96 238 -149 -242 -233 -47 -47 131 -248 -359 -52 250 -142 -340 -98 132 42 94 82 -31 27 315 107 -24
2515b4J95M3k95R6Q2J1k47lR5n3j3J00j64O2K75k05k07J36L18J11j67j10j93L17
$$ -24 171 214 -81 15 97 108 -139 -142 -47 -100 -113 -13 -177 -115 160 -45 -252 -116 202 313 146 36 -157 160
2539A60K33k28m09L1M61o6j61k68J46J07J39l16k02J10M60j43m66L8L25K15Qj77
$$ 160 393 165 -244 -213 248 182 21 -247 -101 6 145 -171 -373 -263 197 54 -412 -374 -49 166 174 -3
2561cj38Q8L55Rm48n3M92N3l31N1l5P6Q9j92j78J09K74j87k98J56J30N6j52j1
$$ -3 -141 -53 302 311 -137 -190 302 355 24 75 40 116 205 13 -165 -56 218 31 -267 -111 19 75 -77 -88
2585h8R7l0j3O6j10J63K31l26n4J58J75o4k19J07j35O2L34l18l60J96L05j82j23
$$ -88 9 -21 -34 32 -78 85 316 -10 -64 94 269 205 -14 93 -42 20 354 36 -324 -128 177 -5 -128
2608a28j64J20K15O8l70m2L44L10k87l43K46K97R0l73r6J39K84J66m53k42J58
$$ -128 -292 -172 43 111 -259 -301 43 353 66 -277 -31 266 356 -17 -113 26 310 476 23 -219 -61
2629f1K90j24l29o0J52J40O6l32j05K51L20k26j84QK85P9k47J19r2K25P1k17r3
$$ -61 229 105 -224 -284 -132 8 74 -258 -363 -112 208 -18 -202 -194 91 170 -77 42 -50 175 246 29 -64
2652f4K21l4n6j35k8K95j91n4j50O5K30j25m4l26M35O5j64k15Q6L90J03k15j78
$$ -64 157 123 67 -68 -96 199 8 -46 -196 -131 99 -26 -70 -396 39 104 -60 -275 -189 201 304 89 -89
2675h9J11J59J51k73k41K84J90o9l90OJ88K91k72l00NJ75K17j56k46p4M28O0k17
$$ -89 22 181 332 59 -182 102 292 223 -167 -161 27 318 46 -254 -249 -74 143 -13 -259 -333 95 155 -62
2698f2o5J22J57J46k96j86K38J98j05j92q8J58Q4q3k55J90m2J98k32p1M7K32k10
$$ -62 -127 -5 152 298 2 -184 54 252 147 -45 -133 25 109 26 -229 -39 -81 117 -115 -186 -139 93 -117
2721a17K9J15o5J62l9j74K0J53J75j56k86K64J86j23m1k4m5Q1j09j53N6j6J71
$$ -117 -88 27 -38 124 85 -89 -69 84 259 103 -183 81 267 144 103 79 34 115 6 -147 -91 -107 64
2744F4o4l11J22J04N0L6k71J42J64J16p8j60J97K43k28k15K21r9J07O0k50n0K34
$$ 64 0 -311 -189 -85 -35 1 -270 -128 36 152 74 -86 111 354 126 -89 132 33 140 200 -50 -100 134
2767A34l1k93l9J48J3k4Ko6QK23j34o0j06K69J48k64M8J67r5J83p3j14K9Q4J10
$$ 134 103 -190 -229 -81 -68 -92 -90 -156 -148 75 -59 -119 -225 44 192 -72 -24 143 48 231 158 44 73 157 267
2792B67m17O3K26p7m3j42j31L2L32j11j59o0K78J72l72J32J10l8R4m1j67L2J58
$$ 267 -150 -87 139 62 19 -123 -254 -222 110 -1 -160 -220 58 230 -142 -10 100 62 156 115 -52 -20 138
2815A38j3j36j16K57j59o4m7N3N6Q9j44n7n6J61J00k88K08j0o6r9K06j12L51j85
$$ 138 125 -11 -127 130 -29 -93 -140 -87 -31 58 -86 -143 -199 -38 62 -226 -18 -28 -94 -193 13 -99 252 67
2839F7l1j40J51L20k07j50m2J23N1m0k5k95J69Q9n6j85J8K77j13j35j25J83J65
$$ 67 36 -104 47 367 160 10 -32 91 142 102 77 -218 -49 40 -16 -201 -183 94 -19 -154 -279 -96 69
2862F9J20j77q7R7J47j9k22J13J21jm7m3p4N2Q4j33k58J37J46r8m1O3J8l4J33
$$ 69 189 12 -75 22 169 150 -72 41 162 161 114 71 -3 49 133 0 -258 -121 25 -73 -114 -51 -33 -67 66
2887F6J3P7j86J64k6p1R0j02j1L2O4Mp7N2ok02J51Qj53j12J57Rj23K8Q4M6Q7Q8
$$ 66 79 156 -30 134 108 37 127 25 14 46 110 114 37 89 83 -119 32 40 -113 -225 -68 -59 -182 -154 -70 -24 63 151
2915A51k61j34J88J94k7j03rL3J57k1q2j28J46J50j42r2j09NQ5k3j35j3n4K74
$$ 151 -110 -244 -56 138 111 8 -1 32 189 168 86 -42 104 254 112 20 -89 -84 1 -22 -157 -170 -224 50
2939E0j57q3J47J44J4J4r1K2JJ33K9j38l5L2M1q4J50j55o2J0K4p2k13K47j52K2
$$ 50 -107 -190 -43 101 115 129 38 60 61 194 223 85 50 82 123 39 189 34 -28 -18 6 -66 -279 -32 -184 -162
2965a62Q6j35N8R2R6J7j12pO6R3N5j65K5p3J79J17k72m1J42p8J31jj86LK18j27
$$ -162 -76 -211 -153 -61 35 52 -60 -67 -1 92 147 -18 7 -66 113 230 -42 -83 59 -19 112 111 -75 -72 146 19
2991A9k9j04o0K54M4m9j42m4K3K19Lj60Q4N1K2L5j52k0p0J60N2k40r2J52J4J6
$$ 19 -10 -114 -174 80 124 75 -67 -111 -88 131 134 -26 58 109 131 166 14 -6 -76 84 136 -104 -196 -44 -30 -14
3017a4l2j00J04l8L5l3Q5j38J71j17K8pJ8J52Nj42p4J77J89j81q4j16R0M8K6m8
$$ -14 -46 -146 -42 -80 -45 -78 7 -131 40 -77 -49 -56 -38 114 119 -23 -97 80 269 88 4 -112 -22 26 52 4
3043Dm4p8J15j6k45J04J2R0O2k3k3L0J31n1Pp4P7Q2j32J63j88nl6J32n3J9j4j13
$$ 4 -40 -118 -3 -19 -264 -160 -148 -58 4 -19 -42 -12 119 68 75 1 78 160 28 191 3 -2 -38 94 41 60 46 -67
3071f7Q4j1Q0l15K11m6l9O6KNL7J09p0k12P4L18O2k67j16J69p6J61J2l10J30K96
$$ -67 17 6 86 -229 -18 -64 -103 -37 -35 -30 7 116 46 -166 -92 226 288 21 -95 74 -2 159 171 -139 -9 287
3097B87j03l48m1K49n7k9m0RJ25J0Q7j02q0N4j8J01R6j48J10N3j58K1j12N3J23
$$ 287 184 -164 -205 44 -13 -42 -82 -73 52 62 149 47 -33 21 3 104 200 52 162 215 57 78 -34 19 142
3122A42j53o4RK35l35J02J19k88K17M3k69J65J18Q5l27K88l3M8rk49K65k1J9o4
$$ 142 -11 -75 -66 169 -166 -64 55 -233 -16 27 -242 -77 41 126 -201 87 54 102 93 -156 109 88 107 43
3146D3oO1O0j14j35M3J07j8k14O2r4O8K40M5l07L0L76k83J24k39N4R0J99ql80
$$ 43 37 98 158 44 -91 -48 59 41 -173 -111 -205 -137 103 148 -159 -129 247 -36 88 -151 -97 -7 192 184 -196
3171a96J50K22j75M3j14J12L1j5r1p8k0J19qk36R4J57p4N0O8j18J59M0j00L9j35
$$ -196 -46 176 1 44 -70 42 73 58 -33 -111 -131 -12 -20 -256 -162 -5 -79 -29 39 -79 80 120 20 59 -76
3196g6K03M8q5L8q2O8k23J45pL0o3kl2P3J68l20J9L2J11k6j1l3L3J00j8k9j18
$$ -76 127 175 90 128 46 114 -109 36 29 59 -4 -6 -38 35 203 -117 -98 -66 45 19 8 -25 8 108 90 61 -57
3223e7J07J18pj83l5ML16k33p2k81L69J02k20j19k7J92k8R7k25J44J82p4l1p0
$$ -57 50 168 161 -22 -57 -53 263 30 -42 -323 46 148 -72 -191 -218 -26 -54 43 -182 -38 144 70 39 -31
3247c1q4K29j31J10k11J91O4k3j09p4P4K5O2k1r6M2r5K7j40J64N4k6k02J22J65
$$ -31 -115 114 -17 93 -118 73 137 114 5 -69 5 30 92 71 -25 17 -78 -51 -191 -27 27 1 -201 -79 86
3272H6k0o8j65J40J78m1K9j57L2K31j45j07j03K58k9j22j78J17Q8J7p8o1j1M6
$$ 86 66 -2 -167 -27 151 110 139 -18 14 245 100 -7 -110 148 119 -3 -181 -64 24 41 -37 -98 -109 -63
3296f3K22j30m9o6K85o6o1n6J33J57j07k37J4J21M6j34NP3j18J10p8j45K5KO0
$$ -63 159 29 -20 -86 199 133 72 16 149 306 199 -38 -24 97 143 9 14 87 -31 79 1 -144 -119 -117 -57
3321e7p5o6J51J03j20m7J06l3N3J00l0j08J17N0k77L5RK09j47O3p2J11j7L5k00
$$ -57 -132 -198 -47 56 -64 -111 -5 -38 15 115 85 -23 94 144 -133 -98 -89 120 -27 36 -36 75 58 93 -107
3346a07k1K03o1k5n1k2RQ9Lj82K34Q0o8j1j54J97L8m2o7r1J04m3L5r2j31K43r
$$ -107 -128 75 14 -11 -62 -84 -75 14 17 -165 69 149 81 70 -84 113 151 109 42 -49 55 12 47 -45 -176 67 58
3373E8j09m0L8J6N6o6J1K6J19j19L9k1K3j3K4r8J37j9J26j08k47J81O6Q8k42Q3
$$ 58 -51 -91 -53 -37 19 -47 -36 -10 109 -10 29 8 31 18 42 -56 81 62 188 80 -167 14 80 168 -74 9
3399IP4o4j47J8J49J03j23J03k64N3J51j03%q2K05r9J64j30q5N0K16r3j53o4J77
$$ 9 83 19 -128 -110 39 142 19 122 -142 -89 62 -41 -41 -123 82 -17 147 17 -68 -18 198 105 -48 -112 65
3424F5q8r8O5k2J17r4K2j69O4O4Q9j28J01J37m6k5j3K5N1K8Kk72J47R6M1k96J48
$$ 65 -23 -121 -56 -78 39 -55 -33 -202 -138 -74 15 -113 -12 125 79 54 41 66 117 145 147 -125 22 118 159 -137 11
3451A1r8J62k00Jl1J60P3j39j6O2j6J13j24q3O3P9J18j10l6P5J43l3k40M7J46
$$ 11 -87 75 -125 -124 -155 5 78 -61 -77 -15 -31 82 -42 -125 -62 17 135 25 -11 64 207 174 -66 -19 127
3476A27oj0j40j48J69J04r0l06J80J82j41J15j10L0J18or9j13J31J43p7RJ6l3
$$ 127 121 111 -29 -177 -8 96 6 -300 -120 62 -79 36 -74 -44 74 68 -31 -144 -13 130 53 62 78 45
3500D5q0J31j44O1QL8j23J75j24M9P5j58J4pL0L0k4p3J89j28k9l1J54M1q5j34
$$ 45 -35 96 -48 13 21 59 -64 111 -13 36 111 -47 -33 -40 -10 20 -4 -77 112 -16 -45 -76 78 119 34 -100
3526a00J61M9K0j5j58J0J68M1j44r0N1m5J31q9j27J85n1l9p5L7J01lP5j43P5R
$$ -100 61 110 130 115 -43 -33 135 176 32 -58 -7 -52 79 -10 -137 48 -3 -42 -117 -80 21 18 93 -50 25 34
3552C4LP0j33J7r6K60j60J3L2L2j23o2J20n7Q2k2r8j5M5J64j95R6J28K8j04n2
$$ 34 37 107 -26 -9 -105 155 -5 8 40 72 -51 -113 7 -50 32 10 -88 -103 -58 106 -89 7 135 163 59 7
3578GK5l6K4m1K3P0q%m2q7P0j5L1k07Q7j24K36j11R9r2J48m2Qj29N0O3J07m2j34
$$ 7 32 -4 20 -21 2 72 64 64 22 -65 5 -10 21 -186 -99 -223 13 -98 1 -91 57 15 23 -106 -56 7 114 72 -62
3607f2L1J50q4j11J37m2Q0L5r7j54O9R3j3r8p6J16J77k61K8O5J21q2m1R8j35J07
$$ -62 -31 119 35 -76 61 19 99 134 37 -117 -48 45 32 -66 -142 -26 151 -110 -82 -17 104 22 -19 79 -56 51
3633E1k3K8M0R3j78o3P3j34J22L2N7m2j15O0Lj50Q2o3L3Q1o8J51Oo7o1P8l1P4
$$ 51 28 56 96 189 11 -52 21 -113 9 41 98 56 -59 1 4 -146 -64 -127 -94 -13 -81 70 76 9 -52 26 -5 69
3661F9k3j29J90jj36O2L0K6j19j3J98k08p3J82M5o4j13J0mj3R7r5K3R8r2K6J08
$$ 69 46 -83 107 106 -30 32 62 88 -31 -44 154 -54 -127 55 100 36 -77 -67 -71 -84 13 -82 -59 39 -53 -27 81
3688H1q1RL3L9J9k1m7Qj76O2J52j04Q3K3j89n8R3R6m1q0J25j67J91p4J15j40J61
$$ 81 0 9 42 81 100 79 32 40 -136 -74 78 -26 57 80 -109 -167 -74 22 -19 -99 26 -141 50 -24 91 -49 112
3715A12j09Q7j10Q0J2r2J65j50j0J8m8K7p0J9L6%O4k5q1N8k0pLk7J18J1q1N6o0
$$ 112 3 90 -20 60 72 -20 145 -5 -15 3 -45 -18 -88 -69 -33 -33 31 6 -75 -17 -37 -44 -41 -68 50 61 -20 36 -24
3744b4k9P1no5M0R7p7m0M2%o0j75K09J02n8k09K24R4q7Q8j01j30J45K0P0j54j1
$$ -24 -53 18 13 -52 -12 85 8 -32 10 10 -50 -225 -16 86 28 -181 43 137 50 138 37 -93 52 72 142 -12 -23
3771b3N0N7rn8N5k02K58m6K4j00q2J76m3j13QJ22O4j79k0JJ50j38P4Pj01K2j2
$$ -23 27 84 75 17 72 -130 128 82 106 6 -76 100 57 -56 -48 74 138 -41 -61 -60 90 -48 26 33 -68 -46 -58
3798e8K14p8k07J31q5K45r3j59J78p3J4o4O9o6M7lM6Nj12j2J5K7N5l7O5%q5P7
$$ -58 156 78 -129 2 -83 162 69 -90 88 15 29 -35 34 -32 15 12 58 63 -49 -61 -46 -19 36 -1 64 64 -21 56
3826E6k8P2n0J31j59L1O6m7L3j83n7K7J34L1k00M4P3O2L1j09qJ25l7o8N2j32J79
$$ 56 28 100 50 181 22 53 119 72 105 -78 -135 -108 26 57 -143 -99 -26 36 67 -42 -50 75 38 -30 22 -110 69
3853F9j21J08k09K52n0L6j07p7Q8O4j06OL7m7N6j5J0j07Q3N3r5J3J10p6L5j8q0
$$ 69 -52 56 -153 99 49 85 -22 -99 -11 53 -53 -47 -10 -57 -1 -16 -6 -113 -30 23 -72 -59 51 -25 10 -8 -88
3880h8J57l6J27o8Np3P9o7j20J6K26k10R4L2n4q8N3J6q6R4M4k12J31j15J39rO0
$$ -88 69 33 160 92 97 24 103 36 -84 -68 158 -52 42 74 20 -68 -15 1 -85 9 53 -159 -28 -143 -4 -13 47
3907D7j42J77j23M6On4N1kO4m4r4k4K23j13l1O1L0j51J54j02P0K5l6o1j6K5J65
$$ 47 -95 82 -41 5 11 -43 8 6 70 26 -68 -92 131 18 -13 48 78 -73 81 -21 49 74 38 -23 -39 -14 151
3934A51j47p3p8K28m3nM9p1P9j52J36p7L5q5m4J59p0j11J68j8j15L3Q3j05o5R8
$$ 151 4 -69 -147 81 38 33 82 11 90 -62 74 -3 32 -53 -97 62 -8 -119 49 31 -84 -51 32 -73 -138 -40
3960d0k2M6k0Q7m9j22J93q7J91j73N1j0K1o0Q6j04j22J62j30J26j40J15m8K5k2
$$ -40 -62 -16 -36 51 2 -120 73 -14 177 4 55 45 66 6 92 -12 -134 28 -102 24 -116 -1 -49 -24 -46
3985d6J55j50L3m3k3l2J99j14J1R0L6j13jM7j35Q7q1K9K4Q6n7j39J12J04p5L8
$$ -46 109 -41 -8 -51 -74 -106 93 -21 -10 80 116 3 2 49 -86 1 -80 -51 -27 59 2 -137 -25 79 4 42
4011D2j64J25q0N9k0O5K4o6J71j83Q8j06J69j04n1j30J57J00j23J7J41m8r0Q9
$$ 42 -122 3 -77 -18 -38 27 51 -15 156 -27 61 -45 124 20 -31 -161 -4 96 -27 -10 131 83 -7 82
4035H2q9j7q0Q5j16R1Q0R2j15n8oJ8M1l2r3J12P5n6K2m2L3o7nJ16j92jJ05j4%
$$ 82 -7 -24 -104 -19 -135 -44 36 128 13 -45 -51 -33 8 -24 -117 -5 70 14 36 -6 27 -40 -45 71 -121 -122 -17 -31 -31
4064c1r1J34J27j90J43j06K09k12QN9K9m8m9J82j69R4L1j57O7q0k5J24n6J23k16
$$ -31 -122 12 139 -51 92 -14 195 -17 -9 50 79 31 -18 164 -5 89 120 -37 30 -50 -75 49 -7 116 -100
4089a00J29j32J12j43J73o1L8J5j58J85M1m8q0k0N7j10J09Mk2p3J75o1j53m0M8
$$ -100 29 -103 9 -134 39 -22 16 31 -127 58 99 51 -29 -49 8 -102 7 11 -11 -84 91 30 -123 -163 -115
4114a15J84j43J89j59l3N5J09k08K8L8J44N5j62j9M4K7j20M8J34j6m7R8j15j21
$$ -115 69 -74 115 -44 -77 -22 87 -121 -93 -55 89 144 -18 -37 7 34 -86 -38 96 80 33 131 16 -105
4138a05J67j17Q8k7o8M1q4J24o1O9k2nJ38o8o0L3j1n7Rk3L9j63J53R8p6O1j68
$$ -105 62 -55 33 6 -62 -21 -105 19 -42 27 5 0 138 70 10 43 32 -25 -16 -39 0 -163 -10 88 12 73 -95
4165i5O4k6r3J03K5Q0j01N7P0q4l8l7J48nl1j24K17p7n8M5j8Q6O1j13q1Q8K2j25
$$ -95 -31 -57 -150 -47 -22 58 -43 14 84 0 -38 -75 73 68 37 -87 130 53 -5 40 22 108 169 56 -25 63 85 -40
4193d0J0k5J22j22J48l7m2N7p3J72j47j52L1Q8oN8j15J12J9j64J16k3j9O3j48
$$ -40 -30 -55 67 -55 93 56 14 71 -2 170 23 -129 -98 -10 -16 42 -73 39 58 -106 10 -13 -32 31 -117
4218a17J48o6M3k3J73m0j03j11J07N4k1j27J20Nj58J53p0l3N5J02J1j10J7Ro5
$$ -117 31 -35 8 -15 158 118 15 -96 11 65 44 -83 37 42 -116 37 -33 -66 -11 91 102 -8 9 18 -47
4243d7J73p0m5r3K5R2j38J27J07j14N7r7L2l7K5J00o2M1j35R8L4k9L%N8n5J2j4
$$ -47 126 56 11 -82 -57 35 -103 24 131 17 74 -23 9 -28 -3 97 35 76 -59 39 73 44 47 47 105 50 62 48
4271D8j40M1P3J6r8J40J00j07J0l7jl2o9M9j1m3p7K28j00J8j5Q7r0M3K2N3k11
$$ 48 -92 -51 22 38 -60 80 180 73 83 46 45 13 -56 -7 -18 -61 -138 90 -10 8 -7 80 -10 33 55 108 -103
4298a03P7M2K8K0j06J9p0J36m9m3O5m6L1N4j09j7j5m5J63L2J5k06J43M9Oo1J38
$$ -103 -26 16 44 64 -42 -23 -93 43 -6 -49 16 -30 1 55 -54 -71 -86 -131 32 64 79 -127 16 65 71 10 148
4325A48j74o3J06j13J66l3qk3M3%j3j1m3M0j89L06q0q2J97j41J33j68Q4m6O1K2
$$ 148 -26 -89 17 -96 70 37 29 6 49 49 36 25 -18 22 -167 139 59 -23 174 33 166 -2 82 36 97 119
4351A19p3p6M3P6Kl08K15P3j27N7l6L1L2q5p0J7J49m3J0nJ07o2j15J62m9K6k7
$$ 119 46 -30 13 89 91 -217 -2 71 -56 1 -35 -4 28 -57 -127 -110 39 -4 6 1 108 46 -69 93 44 70 43
4378D3L4J2l1l0Jj34J0J20j1l6J31j19n8Q2kj19J64o7k4O6J3j10J18rJ3M4oM2
$$ 43 77 89 58 28 29 -105 -95 25 14 -22 109 -10 -68 14 12 -107 57 -10 -34 32 45 -65 53 44 57 101 95 137
4406A37j37P0j07K6O4j33Q9JL8rj29L3o8J13l7m4Q6j1kN9j10O6Km0J16r1P5L3
$$ 137 0 70 -37 -11 53 -80 9 10 48 39 -90 -57 -125 -12 -49 -93 -7 -18 -20 39 -71 -5 -3 -43 73 -18 57 90
4434I0n9O0r8R4n9q0O1l6J23j03j42J54lN3j18J58p9mL4r4J06j26J46o5j5k3k3
$$ 90 31 91 -7 87 28 -52 9 -27 96 -7 -149 5 2 55 -63 95 16 12 46 -48 58 -68 78 13 -2 -25 -48
4461d8J2j0P5r5J30j37J35j84L5j2J38j05P8n7R2l9RL9l7Ln2J1J62k13J30R5j38
$$ -48 -36 -46 29 -66 64 -73 62 -122 -87 -99 39 -66 12 -45 47 8 17 56 19 22 -30 -19 143 -70 60 155 17
4488A7RO8r3o6M0J13m7j4q9K10j02k8ok8j9j0L8n6M2m0P2m5P8j39L2J07q6K1P5
$$ 17 26 94 1 -65 -25 88 41 27 -62 148 46 18 12 -16 -35 -45 -7 -63 -21 -61 11 -34 44 -95 -63 44 -42 -21 54
4517E4q4j4m0P6r0J58l3p9p9J27K4K3n2J11q4j1J47p0j30mM6j2J5m1mR1j6M5r1
$$ 54 -30 -44 -84 -8 -98 60 27 -52 -131 -4 20 43 -9 102 18 7 154 84 -46 -50 -4 -16 -1 -42 -46 45 29 74 -17
4546a7K3J84j44m4k3J87j60J6m6q4R9M0J41j64K6j26kJ75j36K5pJ2N3q3o0lK6
$$ -17 6 190 46 2 -21 166 6 22 -24 -108 -9 31 172 8 34 -92 -94 81 -55 -30 -37 -25 28 -55 -115 -118 -92
4573i2P7j7N8J8p9L2J45p7oj01L8PnQ7j03R0j82J27M2j07J45q1J2p1J87j29j14
$$ -92 -15 -32 26 44 -35 -3 142 65 59 -42 -4 3 -2 85 -18 72 -110 17 59 -48 97 16 28 -43 144 15 -99
4600i9R0P4q7J44n6p0Q0k1mj22M9l1KL1Qj21K35p8p3J34p4m6O9N6l4j24J30q9
$$ -99 -9 65 -22 122 66 -4 76 55 51 -71 -22 -53 -51 -20 -12 -133 102 24 -49 85 11 -35 34 90 56 -68 62 -27
4628b7J02o9J56k18N9Mj45J22j2J81j52M4j01J40j08J05q8Lo1J11n5P1q9q9J27
$$ -27 75 6 162 -56 3 7 -138 -16 -28 153 1 45 -56 84 -24 81 -7 -4 -65 46 -9 62 -27 -116 11
4653A1M3l7r1j6P9m6J17N3r2n7NP6j21J04K00k71M9m8p0J17m2O4J2L5j83K43k66
$$ 11 54 17 -74 -90 -11 -57 60 113 21 -36 -31 45 -76 28 228 -43 6 -42 -112 5 -37 27 39 74 -109 134 -132
4680a32K12K4k02K12m5m5r0K4PNj4J85k23J38j22J81p7l9o0Q3rJ22j31k3J7ML9
$$ -132 80 104 -98 114 69 24 -66 -42 -35 -30 -44 141 -82 56 -66 115 38 -1 -61 22 13 135 4 -19 -2 2 41
4707D1rK8j44J28M4m0J2l7jO5r9n8P0j2M8k5l2P6k13R4L3J41j03J8Mj2o8M3M3
$$ 41 32 60 -84 44 88 48 60 23 22 87 -12 -70 0 -12 36 11 -21 55 -158 -64 -31 110 7 25 29 17 -51 -8 35
4736C5Jj27J96p9q0L3PK6l4r0J81o9r5J80J5k5j36J58q8K2o8O4m1L4l5J9o2J37
$$ 35 36 -91 105 26 -54 -21 -14 12 -22 -112 69 0 -95 85 100 75 -61 97 9 31 -37 27 -14 20 -15 4 -58 79
4764G9o6l6R1n3O1j02J5K7N8o9p5P2p6l4j9J88j10j01O9J13L9m4r4k3J51j36J39
$$ 79 13 -23 68 15 76 -26 -11 16 74 5 -70 2 -74 -108 -127 61 -49 -150 -81 32 71 27 -67 -90 61 -75 64
4791F4j46O2J9N3j31K8J01k8j17J20j8J16p0l8P1rl5K4l3o8K2N3O5%k36J97m4
$$ 64 -82 -20 -1 52 -79 -51 50 22 -95 25 7 123 53 15 86 77 42 66 33 -35 -13 40 105 105 -131 66 22
4818B2j7m3Q9l8j6N1l0K3j6o5O0Jj40N4j43K79m0L4k4j15O9l5M5J16j08Q8k3k63
$$ 22 5 -38 51 13 -3 48 18 41 25 -40 20 21 -119 -65 -208 71 31 65 41 -74 -5 -40 5 121 13 101 78 -185
4846a85M4R0M4kL1J9k6O6o5M7p4j22O5J02m0Qj2L5p7mQ1M7n0j66K06Rj29J29M
$$ -185 -141 -51 -7 -9 22 41 15 81 16 63 -11 -133 -68 34 -6 2 -10 25 -52 -56 25 72 22 -144 62 71 -58 71 75
4875G5j75J03J21M6j63J5Rj1m9P5m9p2N1m4L1L5MjJ1m3J08k22Q7J33o4R5o1r8
$$ 75 -100 3 124 170 7 22 31 20 -29 46 -3 -75 -24 -68 -37 -2 2 1 12 -31 77 -145 -58 75 11 106 45 -53
4903e3NJ01n2k1p4N4N7q2K5j15J93L1n3L6j59K36r4L1J04l8k5j90O0M3r8L2J55
$$ -53 -48 53 1 -20 -94 -40 17 -65 -40 -155 38 69 16 52 -107 129 35 66 170 132 107 -83 -23 20 -78 -46 109
4930A09p2K9o6R5j10j50K2J13L1Kjqj8J03k67K69J7J3o3N5k03J10J4j2Q6n3L2
$$ 109 37 66 0 95 -15 -165 -143 -30 1 3 2 -6 -24 79 -188 81 98 111 48 103 -100 10 24 12 98 45 77
4957G7j09K2P5j46L6P3L9p1P7r8r0J18q4J3q8J94j62M6M7P5n5N1j44l9L05o1j05
$$ 77 -32 -10 65 -81 -45 28 67 -4 73 -25 -115 3 -81 -68 -156 38 -124 -78 -31 44 -11 40 -104 -143 162 101 -4
4984dN1p6J22Op6RKL2j64J3K06j52j19J20K8O8l7O0kKr8O1j3o4J71j96N5RJ13
$$ -4 47 -29 93 99 23 32 34 66 -98 -85 121 -31 -150 -30 -2 66 29 89 87 89 -9 52 39 -25 146 -50 5 14 127
5013A27Rm5p5L1oNJ39j38n9J06q9rj9J47j49P8k4j4Q4m6N7j96Q8k3Jm1k8J48r8
$$ 127 136 91 16 47 41 46 185 47 -12 94 5 -4 -23 124 -25 53 29 15 99 53 110 -86 2 -21 -20 -61 -89 59 -39
5042c9LR9q7JR8o0J2M4k4OL6m5L1k3%k07K84r0q1O9Q9r3j09J73k3k8q1J95k21
$$ -39 -36 63 -24 -23 75 15 27 71 47 53 89 44 75 52 52 -155 129 39 -42 27 116 23 -86 87 64 36 -45 150 -71
5071g1Q5L0j28n0J44p3j3Q2j0%JRn5o7P6N2j6j13J66j03J5r2J65j5j18P1k9%l
$$ -71 14 44 -84 -134 10 -63 -76 6 -4 -4 -3 6 -49 -116 -40 12 -4 -117 49 -54 -39 -131 34 19 -99 -28 -57 -57 -60
5100f0R6o3R2p3M6Q4m8j4Ko0N4p0m0R8kM6j24J50j12Nk1jr9K06j15J8kj07P8P7
$$ -60 36 -27 65 -8 38 122 74 60 62 2 56 -14 -54 44 42 88 -36 114 2 7 -14 -15 -114 92 -23 -5 -7 -114 -36 41
5130D1k7m7O1N2j7p5r9J04P6o2N8N3l16J51J0N5K5j7o5O2rp3J00p3M7j65K51K7
$$ 41 14 -33 28 80 63 -12 -111 -7 69 7 65 118 -198 -47 -37 18 43 26 -39 23 14 -59 41 -32 15 -150 101 128
5158A28n6o8j0j53J77n7J8q5J37o1P4j13J25o1k4J2rK7j1K9r8L4r6J25Q5l9j11
$$ 128 72 4 -6 -159 18 -39 -21 -106 31 -30 44 -69 56 -5 -29 -17 -26 1 -10 19 -79 -45 -141 -16 69 30 -81
5185h1J21L3j1mj28l5M2%J47j26p7J7O2M7Ql7J6j12Q7n2K01j60K6n5l8J12n0J35
$$ -81 40 73 62 58 -70 -105 -63 -63 84 -42 -119 -102 -40 7 15 -22 -6 -118 -31 -83 118 -42 -16 -71 -109 3 -47 88
5213H8r9Q9n5K8m0N5j01N4j31J12q2P2lN1n5m8J5O3o6J2l3J43p2J2o8N6l0J63
$$ 88 -11 78 23 51 11 66 -35 19 -112 0 -82 -10 -13 38 -17 -65 -50 13 -53 -41 -74 69 -3 9 -59 -3 -33 130
5241A30j71j15P9J48o9r9K09j8l0K9L9k02J1Q0N4j90O9M6M1j04J24o4J9o3R4K3
$$ 130 -41 -156 -77 71 2 -97 112 94 64 93 132 -70 -59 21 75 -115 -46 0 41 -63 61 -3 16 -47 47 70
5267G0j93R2l9o7K07n8p5J02nL4j47J97o8m4Qj42J65L6j15j7k2J3J9J32q6M7m9
$$ 70 -123 -31 -70 -137 70 12 -63 39 34 68 -79 118 50 6 14 -128 37 73 -42 -59 -81 -68 -49 83 -3 44 -5
5294eJK0J16o0r1K5o3J42k7j17J35j13n6J20j19J24j59J92j43J75m7n2O9q9J30
$$ -5 -4 16 132 72 -19 6 -57 85 58 -59 76 -37 -93 27 -92 32 -127 65 -78 97 50 -2 67 -22 108
5319A08k20P3M7Or6N3j2N4R0p9p8O1K4m2j10J99j94J68q2P0o0O6rj32K39j10M6
$$ 108 -112 -39 8 14 -82 -29 -41 13 103 24 -54 7 31 -11 -121 78 -116 52 -30 40 -20 46 37 -95 144 34 80
5346H0m4o8M6o4L5M4r5R0J0j34J57m1K6j04j6J14j49L6J84Rj41Q3j5QQ2k12J47
$$ 80 36 -32 14 -50 -15 29 -66 24 34 -100 57 16 42 -62 -78 36 -113 -77 107 116 -25 58 43 51 133 -79 68
5373F8k47Q1J98n7j19J08j09K0J28n9K5J48j74L5j52O3K24j75M9k5N8j06k1J2
$$ 68 -179 -98 100 43 -76 32 -77 -57 71 12 37 185 11 46 -106 -43 181 6 55 30 88 -18 -39 -27
5397b7j9J1J31o6k7j03j5J83o3L5n8P7J0j59j8J37j8j18K4J13j22O8Q4p2O1Ko5
$$ -27 -46 -35 96 30 3 -100 -115 68 5 40 -18 59 69 -90 -108 29 11 -107 -83 30 -92 -24 60 -12 49 51 -14
5424a4j8Q1jm0l0j1L8o9j0J71j51M4J0l9j18M2J37o6m5K9J08KJ1jn8J9j01J85
$$ -14 -32 49 48 8 -22 -33 5 -64 -74 97 -54 -10 0 -39 -157 -115 22 -44 -89 -60 48 50 61 60 2 21 -80 105
5452A05n8j3o0N5k6Q4r5j20J64r2P4j21J00J5O7p1qn7P5lLM8r4J22m2o4J3O0N7
$$ 105 47 34 -26 29 3 87 -8 -128 36 -56 18 -103 -3 12 79 8 0 -57 18 15 18 66 -28 94 52 -12 1 61 118
5481A18p3l0k8kN0l6N2p0L2N6Rj00jN0l8p8J95m9n4l3J15p9n4L3O7j54Q1N0m9
$$ 118 45 15 -13 -15 35 -1 51 -19 13 69 78 -22 -23 27 -11 -89 106 57 3 -30 85 6 -48 -15 52 -102 -21 29 -20
5510b0J9J28j40MM4j51L6P8M1j09P7J2j12R0l8P4j77J45Q0R0k93Q5kj0L7K7j45
$$ -20 -1 127 -13 -9 35 -116 -80 -2 39 -70 7 19 -93 -3 -41 33 -144 1 81 171 -122 -37 -39 -49 -12 15 -130
5537a30J34J03j48k2J9P8Rmj4j3nq2J76o1r0J6k4J89j27j55KJ16J34j03j10J91
$$ -130 4 107 -41 -63 -44 34 43 39 25 12 7 -75 101 40 -50 -34 -58 131 4 -151 -149 -33 101 -2 -112 79
5563G9j0j07L8J8m2N7Lk3mj3Q8n7J17r4m1j5j31J32M1R6k04J53Pj66o4J45P0J4
$$ 79 69 -38 0 18 -24 33 36 13 9 -4 84 27 144 50 9 -6 -137 -5 36 132 -72 81 88 -78 -142 3 73 87
5591H7o7l4N4K9q1L0q2QR2j3r3R7n6M8M3l3lK11l44J31K3K2N9j31O2M4j94J00
$$ 87 20 -14 40 69 -12 18 -64 -56 36 23 -70 27 -29 19 62 29 26 237 -107 24 47 69 128 -3 59 103 -91 9
5619IJ35j33J8J1j08K5P0j6J04pjo2j28J05j35M6J76j06N4p2J08q3m3o0J83P9
$$ 9 144 11 29 40 -68 -43 27 11 115 108 107 45 -83 22 -113 -67 109 3 57 -15 93 10 -33 -93 90 169
5645A69k53J17r4J31k24J89r5J06oQ0p9P6j08P0r9M5q8nJ87j93J86k05J41n9M9
$$ 169 -84 33 -61 70 -154 35 -60 46 40 120 41 117 9 79 -20 25 -63 -68 119 -74 112 -93 48 -11 38
5670C8k8n3O0L0j58Q7n3R9n1q3K03k0p0jP7j75K38j21R1o2K3Kj16J11n6No2R7
$$ 38 10 -43 17 47 -111 -24 -77 22 -29 -112 91 71 1 0 77 -98 140 19 110 48 71 73 -43 68 12 17 -45 52
5698E2o6M4ln3n7N6p2J34k21K82r4j03M2L6M7m6m1k9J43Q2r2L5j57N8K1J24jj66
$$ 52 -14 30 27 -26 -83 -27 -99 35 -186 96 2 -101 -59 -23 24 -22 -63 -92 51 133 41 76 -81 -23 -2 122 121 -45
5726d5J26K9n7q7jP3p3K1P2l3k0k3K3kOL8l7N7q3JJ6M8nqo5mJ40l9o7L0o7J02
$$ -45 81 110 53 -34 -35 38 -35 -14 58 25 5 -18 5 3 9 47 10 67 -16 -15 1 49 44 36 -29 -33 107 68 1 31 -36 66
5758F6o8j06P7jk2Q4j4N4j15R7K4n7o4Q5j39P5l6K0J06j67J08L5P6j06l9JO6j06
$$ 66 -2 -108 -31 -32 -54 30 16 70 -45 52 76 19 -45 40 -99 -24 -60 -40 66 -101 7 42 118 12 -27 -26 40 -66
5786f6M6J12j93J56j69J06o1J16j16L9N2M5j12J7j10K06l4q8Q3j9L7O3q2n0j2
$$ -66 -20 92 -101 55 -114 -8 -69 47 -69 -30 22 67 -45 -28 -138 68 34 -54 29 10 47 110 28 -22 -34
5811c4Jj04J87r6M1l0L3M8k3L8J7j9oj36J43k9mo9NJ0K3K3l6q8M6O7j8N9J6q8
$$ -34 -33 -137 50 -46 -5 -35 -2 46 23 61 78 59 53 -83 60 31 27 -42 -37 -27 -4 19 -17 -105 -59 8 -10 49 65 -23
5841b3N6p5J08k2K4j35J5m2J14m2N0l1n9J30o0K8n8Q4K0j39J44j53R3o4P6j3m0
$$ -23 33 -42 66 44 68 -67 -52 -94 20 -22 28 -3 -62 68 8 36 -22 62 82 -57 87 -66 27 -37 39 26 -14
5868a4rJ65j15n9P5n0N1J05r4q8J30L3q2NLr3J2J19j56R2Ol1J4L9Q4r5M7q8K7
$$ -14 -23 142 27 -32 43 -7 44 149 55 -33 97 130 48 53 56 -37 -25 94 -62 30 36 5 19 58 142 47 94 6 33
5897C3N5q0K6o6j20J44j73K20K6N1n5J21k29jN2j46Q3J9LJ10l7r2J64p9mJ9r9
$$ 33 88 8 34 -32 -152 -8 -181 39 65 116 61 182 -47 -48 4 -142 -59 -40 -37 73 36 -56 108 29 25 44 -55
5924e5L4M3L1j6l4J8M0j19m4J0J5M3lK52j25j04QQ2j07J94j68j17R4L8j0L4n7
$$ -55 -21 22 53 37 3 21 61 -58 -102 -92 -77 -34 -37 215 90 -14 -6 76 -31 163 -5 -122 -28 10 0 34 -23
5951b3j3O5p6K3nK6J9k8j3m1J30j03J57j59J2J5LN1j8r2K8J16l8j80K70j30j8
$$ -23 -36 29 -47 -24 -29 -3 16 -12 -25 -66 64 -39 118 -41 -29 -14 -11 40 22 -70 -42 74 36 -144 126 -4 -22
5978b2N1n7Q3m5R0L1j58P2j58J37l8kM6j20M4j9J93j86J9M2K7K0N7j09N7m5o5
$$ -22 29 -28 55 10 100 131 -27 45 -113 24 -14 -16 30 -90 -46 -65 128 -58 -39 3 30 50 107 -2 55 10 -55
6005e5q2M8P7J12j24J4q8J6O4QM7r0J43j47J63q9n0rJ27j30P9qrj08J72j28j3
$$ -55 -137 -89 -12 100 -24 -10 -98 -82 -18 -10 37 -53 90 -57 106 17 -33 -42 85 -45 34 26 17 -91 81 -47 -60
6032f0J06l0r6M4N5lj8k8R9j40J99m7m3K3k8K7o5j13J45p7L4M0nj4q2j7J52p7
$$ -60 46 16 -80 -36 19 16 -2 -30 69 -71 128 81 38 61 33 60 -5 -118 27 -50 -16 24 19 5 -77 -94 58 -19
6060a9R8nm3J3k3o0o3J48r1Q9j04J05q6j67K46q0K9j13J42N2j58Q8ML8n4R5l6
$$ -19 79 74 31 44 21 -39 -102 46 -45 44 -60 45 -41 -208 38 -42 -13 -126 16 68 -90 -2 2 40 -14 81 45
6087D5r8K0J09m5n4K7N0j34J24M4j49R9q4J29Pl8n3j4L7%p8Q9L4n0oR8j81J34
$$ 45 -53 -33 76 31 -23 4 54 -80 44 88 -61 38 -46 83 90 52 -1 -15 22 22 -56 33 67 17 11 109 -72 62
6115F2n2nO2j33J20j29K6J32j41k7J43Qj58K0J37q7j0R2j29J69j25k6R3j8qK0
$$ 62 10 5 67 -66 54 -75 -49 83 -58 -85 58 66 -92 -72 65 -22 -32 60 -69 100 -25 -51 42 24 16 36
6141C6j0L5q2O3ll6j4P0K5r1RR4l0j07J02l3Ro3KP5k1q0O1j03l9K34r4p5M3J3
$$ 36 26 61 -21 42 39 3 -11 59 84 -7 2 96 66 -41 61 28 37 -26 -24 51 30 -50 11 -92 -131 103 9 -66 -23 -10
6171a0Jkn6K2K3j01J58lj01LL7K5L5l7m6o7k1J89lj29K05l5j26j58K39Q0j76K5
$$ -10 -9 -11 -67 -45 -22 -123 35 32 -69 -66 -29 -4 31 -6 -52 -119 -140 49 46 -83 122 87 -39 -197 42 122 -54 -29
6199b9l9K1J85j52Nj76R6K7l2p4K54j03j1P9p9jQJ2J5N2L1j59J70q1p9M8J5o0
$$ -29 -68 -47 138 -14 -9 -185 -89 -62 -94 -168 86 -17 -28 51 -28 -29 -21 -9 6 58 89 -70 100 19 -60 -12 3 -57
6227e7N1n4J40m5j45K23j96O4j8J14n8j63Q9J9j56K16K5l0P1j44J66j51R5k7L4
$$ -57 -6 -60 80 35 -110 113 -83 -19 -37 77 19 -144 -55 -36 -192 24 49 19 90 -54 112 -39 56 29 63
6252F3jj01K8J78j14n6j49J85J34j60r6Q7R8p6Q7o9K7j30J64j23j3J00l4q7R8
$$ 63 62 -39 -11 167 53 -3 -152 33 167 7 -89 -2 96 20 107 38 65 -65 99 -24 -37 63 29 -58 40
6277D0P2j01M9Qj01N0p0JM0L3NM8n0n3j3K5J7j02J70j85K08n9k2l4n2J01j17K20
$$ 40 112 11 60 68 -33 17 -53 -52 -12 21 26 74 24 -29 -42 -17 0 -102 68 -117 91 32 10 -24 -76 25 -92 128
6305A28o9M1j27q9R5L0R0j07K5L2P3j71P2K0L2j14J35j5j99J40k7P3o3r6K1J1
$$ 128 59 100 -27 -116 -21 9 99 -8 17 49 122 -49 23 43 75 -39 96 81 -118 22 -5 68 5 -91 -70 -59
6331e9J25j56k2J13j0l8J55j92J03QO5l8n2r8J66n6o3J08%k1J5k02J13J4K5K8
$$ -59 66 -90 -112 1 -9 -47 108 -84 19 27 92 54 2 -96 70 14 -49 59 59 38 53 -149 -36 -22 3 31
6357C1k2J11k4j61k4PM5P8M5m6l7NO0N3Kl9j38k4J40m5j04O4j22K10j60M1J58
$$ 31 9 120 96 -65 -89 -82 -37 41 86 40 3 8 68 121 123 84 -54 -78 62 17 -87 -23 -145 65 -95 -54 104
6384A04J2o9J0p0j24J21j2m8n7J17M2J12j62P9M0j11K3p2P8K3o6LJ33o2MK3j1
$$ 104 116 47 57 -13 -137 -16 -28 -76 -133 -16 26 138 -24 55 95 -16 7 -65 13 36 -30 -27 106 44 48 71 60
6411F0kr1l5L5Q8j09R2P8j00j00KO7M6Ol6j29R2j4O0j9k5j17P4J08p3K5K7M3%
$$ 60 58 -33 -68 -33 55 -54 38 116 16 -84 -82 -15 31 37 1 -128 -36 -50 10 -9 -34 -151 -77 31 -42 -17 10 53 53
6440E3M2q0j44L8n6P3R2j06J42J2l9j43K39r1k6j16J07L7M2j37LKJ07j43K30j09
$$ 53 95 15 -129 -91 -147 -74 18 -88 54 66 27 -116 123 32 6 -110 -3 34 76 -61 -58 -56 51 -92 138 29
6466B9j71J63J22j31q5M7o3J25jqJ0m2m6QJ29k4J5p3j12K42j03k9o8m4J43m7R2
$$ 29 -142 21 143 12 -73 -26 -89 36 35 27 37 -5 -51 -43 86 62 77 4 -108 134 31 2 -66 -110 33 -14 78
6493G8k8K1o8j26K50j18m2l4J14M8p2j16J05p4O8R6q8K9n4M0m8J5J15j14kjK0
$$ 78 50 71 3 -123 127 9 -33 -67 47 95 23 -93 12 -62 6 102 14 43 -11 29 -19 -4 111 -3 -5 -6 14
6520A4P7j32M0Nl0Mm9R8Mp5kM2Q2j34J04M0q0m7P9J4Mm3nk1J7J8j31k9N0J39n7
$$ 14 91 -41 -1 4 -26 -22 -71 27 31 -44 -46 -4 78 -56 48 88 8 -39 40 54 58 15 10 -11 6 24 -107 -136 -86 53 -4
6551dj02J3J49N4q8Q1n7j28Q3l2K5K1L8r1J55j9j21q4N6P4l5J66k84L2J49m6k0
$$ -4 -106 -93 56 110 22 103 46 -82 1 -31 -6 15 53 -38 117 98 -23 -107 -51 23 -12 154 -130 -98 51 5 -15
6578a5om8l6Q9J22p7o7j4J52j03R0j33j9J6N1Q0Q4j76K8r4J39r8N8l8p6J09L7
$$ -15 -21 -69 -105 -16 106 29 -38 -52 100 -3 87 -46 -65 -49 2 82 166 -10 18 -76 63 -35 23 -15 -91 18 55
6605E5Lj8k2J9m3N1n0l6O9J15K8p7m2n4R8p0j2qJ58j98J25j00rJ84k23o0R5R8
$$ 55 58 40 18 37 -6 45 -5 -41 28 143 171 94 52 -2 96 26 14 6 164 -34 91 -9 -18 166 -57 -117 -22 76
6633G6j27K9J05m9k07K10j0qj60Q5J29j50J01p8L8J15j05m1P1K0o6nN0J7Q6k01
$$ 76 -51 -22 83 34 -173 37 27 19 -141 -56 73 -77 24 -54 -16 99 -6 -47 24 44 -22 -27 23 40 126 -75
6659g5Q9l9QJ1K7q5M1R4p1N6o2Q4K4k35J17M1j25L8J0j6O3k7J00o4J51j27P7p4
$$ -75 14 -25 -17 -6 21 -64 -23 71 0 56 -6 78 102 -133 -16 25 -100 -62 -52 -68 -5 -32 68 4 155 28 105 31
6687C1j35J37N9j23m5R5J3q6K9M0M0k8k1j4M2j3O1J9k41J18M1o9R8l6m6q5K64
$$ 31 -104 33 92 -31 -76 19 32 -54 -25 15 55 27 6 -8 34 21 82 101 -140 -22 19 -50 48 12 -34 -119 145
6714A45j98J35r6q5J43j26K18k12J6J79j10p3L8m6J39j06R0r0l4J79q5r8j5P5
$$ 145 -53 82 -14 -99 44 -82 136 -76 -60 119 9 -64 -26 -72 67 -39 51 -39 -73 106 21 -77 -92 -17
6738a7Kl1pP2l9k2L3l2j8K0m7P0J1j7M6m3oj27J50K1j8J6K4j54J38kM6k0O9k05
$$ -17 -15 -46 -53 19 -20 -42 -9 -41 -59 -39 -86 -16 -5 -22 24 -19 -25 -152 -2 19 1 17 41 -113 25 23 69 49 118 -87
6768h7O8NJ33j14m3J01Lp2P3k6j49K28o0j43J13m4qL5j10RPJ63K5j18M8m9N1r0
$$ -87 -19 -14 119 5 -38 63 66 -6 67 41 -108 120 60 -83 30 -14 -22 13 -97 -88 -81 82 107 -11 37 -12 39 -51
6796e1kJ64p2o7l3J71j09O9o0rL1P3j07K21k25K4j2n3J66k1nk02L6N0P7o3jP8
$$ -51 -53 111 39 -28 -61 110 1 70 10 1 32 105 -2 219 -6 18 6 -47 119 98 93 -109 -73 -23 54 -9 -10 68
6824F8q7K5j51J32j1j8J06j57QN0P3r7N9J07j70K3l9R2p3J57r7j00N8O5n5K8L
$$ 68 -19 6 -145 -13 -24 -42 64 -93 -85 -35 38 -59 0 107 -63 -40 -79 13 -60 97 0 -100 -42 23 -32 -4 -1
6851aK6k0O9j42R6o8M6L7k6N7j3pj5O6r6K4jm0K1k7P3P7j02J9l2%J33j26n1K4
$$ -1 25 5 74 -68 28 -40 6 43 17 74 61 54 39 105 9 33 32 -8 13 -14 59 136 34 53 21 21 154 28 -23 1
6881AQ0Jj01lo3O7J22j55N8k4M5k0K7N1k2q5M0M7o8rQ8k51K84k21N9R4j17J82
$$ 1 81 82 -19 -22 -85 -18 104 -51 7 -17 28 8 35 86 64 -21 19 66 -2 -11 77 -174 110 -111 -52 42 -75 107
6909A07j72J47j07R4q4J34q9m7J56k07P2QQ8j46J80j97O8J4o9N6K4j93J40M1N1
$$ 107 -65 82 -25 69 -15 119 30 -17 139 -68 4 12 100 -46 134 -63 5 19 -50 6 30 -163 -23 18 69
6934F9Jk3p2oJ17j51J01rr9J62k5j3j25j1J29j21J13q0P7j08J18k9M4j46L7J21
$$ 69 70 47 -25 -31 86 -65 36 27 -72 90 65 52 -73 -84 45 -76 37 -43 34 -74 44 15 59 -87 -50 71
6960G1L4j96R2q2K4J06j49L3R9Q1j18J47j95R4r0N8j01J95m0l4n2p3K25l2p1N9
$$ 71 105 -91 1 -81 -57 49 -100 -67 32 113 -5 142 -53 41 -49 9 -92 103 63 29 -23 -96 129 97 26 85
6986H5p7q4J52r3J05j23K7PJ3J0l9R0j5K2p8p9P6n1N6j46O5Q8r6J93j66J2NN1
$$ 85 8 -76 76 -17 88 -35 -8 -1 12 22 -17 73 58 80 2 -77 -1 -52 4 -142 -77 11 -85 108 -58 -46 -41 10
7014A0j06JJ47m6j11R9N5j14J84j77Q8j51R7k1O9L8j26P5n1J41j20M9q2Q2J6p7
$$ 10 -96 -95 52 6 -105 -6 49 -65 119 -58 30 -121 -24 -45 24 62 -64 11 -40 101 -19 30 -52 30 46 -31
7040c1L5L5o8m5J02J04o1l3l8J2Q9m9p4K9m5J05Jj10O8l0k2J6m5J50l5q4J0n8
$$ -31 4 39 -29 -74 28 132 71 38 0 12 101 52 -22 7 -38 67 68 -42 26 -4 -26 -10 -55 95 60 -24 -14 -72
7068g2qL5m6J3J31l3p0O0m0K6o9J68Qj83K4O9k2J7N5jkj16J44l5qj69J22P5j79
$$ -72 -80 -45 -91 -78 53 20 -50 10 -30 -4 -73 95 103 -80 -56 13 -9 8 63 62 60 -56 88 53 45 -124 -2 73 -106
7097a06K48j82M2m3M2O2l0P1j44n7K18k59Q9J05J7l6o4Q4p0M8j53Q6p0J22n8k5
$$ -106 142 -40 2 -41 1 63 33 104 -40 -97 121 -138 -49 56 73 37 -27 57 -13 35 -118 -32 -102 20 -38 -63
7123f3J39j75n6J81m2p4J37j56J31m1J6J5P4J40k75J99j94j1N7Qn4Q3o9m1olN4
$$ -63 76 -99 -155 26 -16 -90 47 -109 22 -19 -3 12 86 226 -49 150 -44 -55 2 10 -44 39 -30 -71 -77 -80 -26
7150b6Rj77J97p1L5Q7l3k0nJ8l2m2O4N1l6q9Q5K16l40J80m0J83k36m2L2Pl0R7
$$ -26 -17 -194 3 -68 -33 54 21 1 -4 14 -18 -60 4 55 19 -70 15 231 -109 71 31 214 -22 -64 -32 -25 -55 42
7178D2j47J73j38O0J04o7J9j00qJ43NR7j58q8J93k22J08j9L6m8j02J18M4m2O2
$$ 42 -105 68 -70 -10 94 27 46 -54 -62 81 86 183 25 -63 130 -92 16 -3 33 -15 -117 1 45 3 65
7203F5q0lP1q5J08q4m0J15j4j31J35o3j7J38k21M9P7n7J21l1j5L6o0m1k3L3j5
$$ 65 -15 -18 53 -32 76 -8 -48 67 53 -78 57 -6 -23 115 -106 -57 20 -37 84 53 38 74 14 -27 -50 -17 -32
7230c2Q6r0o1J39j47J84m2K4o7l4QK6M4J19k05J14r7j6P8m1K6rP1R6j71k8r4N2
$$ -32 54 -36 -97 42 -105 79 37 61 -6 -40 -32 -6 38 157 -48 66 -31 -47 31 -10 16 7 78 174 3 -25 -119 -67
7258f7QR2j3m4n2L4L8k3K1l8Q9m7l0n9M4M3J16j02N5lj02N9O1J1l1k10K51j16
$$ -67 -59 33 20 -24 -76 -42 -4 -27 -6 -44 45 -2 -32 -91 -47 -4 112 10 65 62 -40 19 80 91 60 -150 101 -15
7286a5n8J20j08K8N4mk9J08n4kj59L19k01l4m7L4K2m2K0P1o5oP4pn9n3J68K4o9
$$ -15 -73 47 -61 -33 21 17 -12 96 42 40 -119 200 -1 -35 -82 -48 -26 -68 -48 23 -42 -48 26 19 -40 -93 75 99 30
7315C0n7n2Q0J4R7j06Q3q7m5J1L5kp4J54j38P4n1J66Oj77J45j02q1J16j05J5J03
$$ 30 -27 -79 1 15 112 6 89 2 -43 -32 3 1 -73 81 -57 17 -34 132 138 -39 106 4 -77 39 -66 -51 52
7342E2O1M5j01j51J44j47R6L4N0o0Q9o7qL5m5q6J5J23q2k8pQ0O8n4k3j33J26L9
$$ 52 113 158 57 -94 50 -97 -1 33 83 23 112 45 37 72 27 -59 -44 79 -3 -31 -38 42 110 56 33 -100 26 65
7370F5l1L0r4J8J38j59j8K7O6R1r9l1j75K47l9k6K9J14j30%m6R9o8N1r0M9%r5
$$ 65 34 64 -30 -12 126 -33 -51 -24 42 133 34 3 -172 75 36 10 39 153 23 23 -23 76 8 59 -31 18 18 -77
7398g7J78j63j0J35j6jJ1m9L6j92J58j16J46P9m5k02Q3L8LKkN7r3Q5l4J1M1k08
$$ -77 101 -62 -72 63 47 46 57 8 44 -148 10 -106 40 119 74 -128 -45 -7 -4 -2 -4 53 -40 45 11 22 63 -145
7426a45L04k03k4n5J57r9k8J05K6r1L1k9J68k78J16J68j72J4MM7p3J18J5j5j95
$$ -145 159 -44 -68 -123 34 -65 -93 12 38 -53 -22 -51 117 -161 -45 123 -49 -35 -31 16 -57 61 76 61 -134
7451a34L7J10m7K4k6O6j42J0R3qM9j72M2J07l0J7o8N9k9r4K08j24J7j5p1J57o9
$$ -134 -97 13 -34 -10 -36 30 -112 -102 -9 -17 32 -140 -98 9 -21 -4 -72 -13 -42 -136 72 -52 -35 -50 -121 36 -33
7478c3J7j05J71r7L5J6m3J1j0q7K90k21r4K48p1K5N9q8mn4O0j2Q0j14L8Oo0L9
$$ -33 -16 -121 50 -47 -12 4 -39 -28 -38 -125 165 -56 -150 98 27 52 111 23 19 -35 25 13 93 -21 17 23 -37 2
7506Bm6J8L8O1n2j2p1J09o2J6J28j37j2N0r3nM2pM8L6r4P4m7r4k5J14K1o8O1J11
$$ 2 -44 -26 12 73 21 9 -62 47 -15 1 129 -8 -20 30 -63 -68 -26 -33 15 51 -43 31 -16 -110 -135 -21 0 -68 -7 104
7536A04k28R5L1m2J10r2J59n4O2j79L2k8J18l2p3Q6n2n7jO3j05J30n4j50J08m5
$$ 104 -124 -29 2 -40 70 -22 137 83 145 -34 -2 -30 88 56 -17 69 17 -40 -41 22 -83 47 -7 -157 -49 -94
7562i4O9NqJ00r1j7R4n3Q3j92J23N4k27J58N3n5NJ3k3l5rk6Q8N9j50J46j40Q7
$$ -94 -25 -20 -28 72 -19 -36 58 5 88 -104 19 73 -154 4 57 2 7 20 -3 -38 -47 -73 15 74 -76 70 -70 17
7590A7mm2p0J77j19j4J3O9J6k5l9o4K2J43l1j06j02J42nJ05r7M1mj07R6m5O4q9
$$ 17 13 -29 -99 78 -41 -55 -42 27 43 18 -21 -85 -63 80 49 -57 -159 -17 -22 83 -14 27 23 -84 12 -33 31 -58
7618e8O6k4j52J48j8J31l5m4j52J32RO3r2k9J44p4J44p9k5m1m7K8J1Rj42J61k8
$$ -58 8 -16 -168 -20 -38 93 58 14 -138 -6 3 66 -26 -55 89 15 159 80 55 14 -33 -5 6 15 -127 34 6
7645Fp4p2J31m8K1J47r1nP5J3j11J06j71J46o6K7j98K96l19J55j6l2j08j0P1J29
$$ 6 -68 -140 -9 -57 -36 111 20 15 90 103 -8 98 -73 73 7 34 -164 132 -187 -32 -48 -80 -188 -198 -127 2
7671Bk6o5K7M6p8J82r8l5m3L8j2J40j22L7J8n2j5J15k4j09J40k15r0K54ko7o8
$$ 2 -24 -89 -62 -16 -94 88 -10 -45 -88 -50 -62 78 -44 -7 11 -41 -56 59 35 -74 66 -149 -239 15 13 -54 -122
7698a22J18Q5j38PL9J08j05n8N3k2J47k8j74J39q4K5ol6J46j57O1L3J17j00On6
$$ -122 -4 81 -57 -50 -11 97 -8 -66 -13 -35 112 84 -90 49 -35 -10 -16 -52 94 -63 -2 31 148 48 54 -2
7724bJ10j47J48o5j26J23k0m3l1J29j03l5R8j06m7J41R4j53Q3k4J09j55lrO2r2
$$ -2 108 -39 109 44 -82 41 21 -22 -53 76 -27 -62 36 -70 -117 24 118 -35 48 24 133 -22 -25 -34 28 -64
7750f4P6q1M1j5Q0n2M0p5k5J19m1k3K9J42j39rQ8j0n5J02j41K55j91K3j17j66
$$ -64 12 -69 -28 -43 37 -15 25 -50 -75 44 3 -20 9 151 12 3 91 81 26 128 -13 242 51 74 -43 -209
7776b09L3K54p9N4L1j79P5K0o6J76k40K93j19m5ol5N6M9l7J9J0P5o6k18J56n8
$$ -209 -176 78 -1 53 84 -95 -20 0 -66 110 -130 163 44 -1 -7 -42 14 63 26 45 55 130 64 -154 2 -56
7802e6N2j24N5L7N4j7l4m2Lm0J47p2jN5J10n0n2N3j43j0J13mOj08N2J20j69J39
$$ -56 -4 -128 -73 -36 18 1 -33 -75 -72 -112 35 -37 -38 17 127 77 25 78 -65 -75 38 34 40 -68 -16 104 -65 74
7830G4o6N9k7m1kM7L5j20n6R1m6J17r2N5k7j20O6M3L6nJ7q5%R7nj99J1R9k0P6
$$ 74 8 67 40 -1 -3 44 79 -41 -97 -6 -52 65 -27 28 1 -119 -53 -10 26 21 38 -47 -47 50 45 -154 -143 -44 -64 12
7860A2q1J51k9n1j18J52PM0p7n6J40j81P9K2p3m4K47j44Pn7P0L2q3L5j2m3J8o4
$$ 12 -69 82 53 2 -116 36 43 83 6 -50 90 -91 -12 10 -63 -107 140 -4 3 -54 16 48 -35 0 -12 -55 -37 -101
7888a01N4O2q8m2P0P9q5J59k16J72j8j5M4o2m8M5L2r7MJ73j83J82j53J9M2j22
$$ -101 -47 15 -73 -115 -45 34 -51 108 -108 64 46 31 75 13 -35 10 42 -55 -51 122 -61 121 -32 -13 29 -93
7914i3J45J2m4j0M6J25j90o0J40r2J56j38p5J15Qq7J41j17N8P2j08R9r2J8q5K1
$$ -93 52 64 20 10 56 181 -9 -69 71 -21 135 -3 -78 37 45 -42 99 -18 40 112 4 103 11 29 -56 -35
7940c5N9j32J96j15Rj2q8Q6P3Nn4k2J17k13J87j08K15k35M2N7j09J27o7l0L9J02
$$ -35 24 -108 88 -27 -18 -30 -118 -32 41 46 -8 -30 87 -126 61 -47 168 -67 -25 32 -77 50 -17 -47 -8 94
7966I4j50k3p5J02K3J14j29K2M7n7Q8Oj34R6q5P5l7l2J13k7j00J25o8qQ6j4PL1
$$ 94 -56 -79 -154 -52 -29 85 -44 -22 25 -32 56 62 -72 24 -61 14 -23 -55 58 31 -69 56 -12 -20 66 52 59 90
7994I0j57J02j16J40p9j59K09j22J47l1K3J2p2J59k11RJ02j35J14J1ok8J11j40
$$ 90 -67 35 -81 59 -20 -179 30 -92 55 24 47 59 -13 146 -65 -56 46 -89 25 36 30 2 113 -27
8018b7L8J13j09ll8p4K51j22j94J22l8M0L0JQ2k8j4j96J37l4qMJ3%J54K7m2m2
$$ -27 11 124 15 12 -26 -100 151 29 -165 -43 -81 -41 -11 -10 72 44 30 -166 -29 -63 -71 -67 -54 -54 100 127 85 43
8046D3mj7J42j71j10J38p8J53j08jP0o1K7J00o2r1Q6q4L8jl8J25j59K15j23n5
$$ 43 39 22 164 -7 -117 21 -57 96 -12 -13 57 -4 23 123 61 -30 56 -28 10 9 -29 96 -63 152 29 -26
8072b6J46j09lj00m0J35P3j15K3Q2r3l9L5JP0O4j08o6O5j38J67j46J00J4l0P5
$$ -26 120 11 8 -92 -132 3 76 -39 -16 66 -27 -66 -31 -30 40 104 -4 -70 -5 -143 24 -122 -22 -8 -38 37
8098C7Q4j00q6qNJ52j3q4j3J7Q3r8m8J33j49J34J0O3j73N6Por1J01j6R0r2l8N9
$$ 37 121 21 -65 -73 -68 84 71 -13 -26 -9 74 -24 -72 61 -88 46 56 119 -54 2 9 3 -88 13 -3 87 -5 -43 16
8127A6j69J47M4%J8j18L5jq9J62j35R6L4J1n4rk6L1M1K1m7o3l7J10LL9O6j64J06
$$ 16 -153 -6 38 38 56 -62 -27 -28 -117 45 -90 6 40 51 -3 -12 -38 -7 34 55 8 -55 -92 18 21 60 126 -38 68
8156F8j07J63p4P3k06l7J40n5J28n8q0J13m6m2q3K09L2J3J1j47L2n5M9K9l6K39
$$ 68 -39 124 50 123 -83 -120 20 -35 93 35 -45 68 22 -20 -103 106 138 151 162 15 47 -8 41 70 34 273
8182B73j95j31J76J2j44j8J24j93J26
$$ 273 78 -53 123 135 -9 -27 97 -96 30
8191C0
$$ Imaginary data points
##PAGE= N=2
##DATA TABLE= (X++(I..I)), XYDATA
0@%%%%%%%%%%%%%%%%%jL3o4O4o4O4o4R6j28J28j60J92j93K25k57K89l52L85m18
$$ 0 0 0 0 0 0 0 0 0 0 0 0 0 0 0 0 0 0 -1 32 -32 32 -32 32 -32 64 -64 64 -96 96 -97 128 -129 160 -192 193 -225
36b25M81n44O09o74P46q42R30j026J153j278J406j537J695j873K058k265K497
$$ -225 256 -288 321 -353 393 -449 481 -545 608 -670 736 -801 894 -979 1079 -1186 1311
53A311k759L049l372L741m167M665n250N947o809P895r303J1226j4027J8481k6713
$$ 1311 -1448 1601 -1771 1970 -2197 2468 -2782 3165 -3644 4251 -5052 6174 -7853 10628 -16085
68a6085M6912j84158l04413L62240L90105K8260l32243k26172O3994K18657Q2783
$$ -16085 30827 -153331 -457744 -95504 294601 322861 -9382 -235554 -171560 47097 129880
79A29880n2113n6488n612o6658q2426M8975J96227J06411j37995k58169p4200
$$ 129880 77767 21279 15667 -50991 -133417 -84442 111785 218196 80201 -177968 -252168
90b52168K11410K63801o955k55488j85104Q3735J98340Q3829p0068r8951l6424
$$ -252168 -40758 223043 216088 -39400 -224504 -140769 57571 141400 71332 -27619 -64043
101f4043J5705K1574L7576O7068K0420j02138j23898K6906J58436Q6433q5325
$$ -64043 -48338 -26764 10812 77880 98300 -3838 -127736 -100830 57606 144039 58714
112E8714j34140k0167Q9644O2250l7144m7304L0287L8933n3084p7167L7077J24643
$$ 58714 -75426 -95593 -5949 56301 19157 -28147 2140 41073 -12011 -89178 -52101 72542
124G2542M3467j04881j26627J2667J41455Q9962p7251j29019k886J03394M5620
$$ 72542 116009 11128 -115499 -102832 38623 128585 51334 -77685 -80571 22823 68443
135F8443o1393n0348M4206O3399l5290j07031j9242J28038J09480p6647j71494
$$ 68443 7050 -43298 908 64307 29017 -78014 -97256 30782 140262 63615 -107879
146a07879l5753J42925J30317l9147j42195o2644P8518R7335n995o5497j3093
$$ -107879 -143632 -707 129610 90463 -51732 -114376 -35858 61477 55482 -10015 -23108
157b3108L4598j895m0757J432O1743M0438m7746q8509j5605Q6666P9681l1481
$$ -23108 11490 9595 -31162 -29730 32013 72451 24705 -63804 -79409 7257 86938 55457
169E5457r4279l3202N3344N5599l598l7369j7337J2008O993j2024L233L5169J5341
$$ 55457 -38822 -72024 -18680 36919 33321 -4048 -21385 -9377 -2384 -14408 -11175 23994 39335
182C9335m2734m6466K0432O1592J8843m5545m5147J4489M9939J1727m2581k8075
$$ 39335 -3399 -49865 -29433 32159 51002 5457 -39690 -25201 24738 36465 -6116 -34191
194c4191L2299L9653k0369n1740o170M8790L6311k5484n3406q525M6808L3045
$$ -34191 -1892 37761 17392 -34348 -40518 8272 44583 19099 -34307 -42832 3976 37021
206C7021k5536l6703J0681L2406n080l4452m170M2617L3677k9844o4253j1197
$$ 37021 11485 -25218 -14537 17869 12789 -21663 -25833 16784 50461 20617 -43636 -54833
218e4833O5810N7982k8626p5246k5417M6377N2197K51l9437k6685P846J6679K443
$$ -54833 10977 68959 40333 -34913 -60330 -13953 38244 38495 -942 -27627 -19781 -3102 -659
231f59L793J6100j73l4428k9375K2099N4541K3037l9495n8609p577N4814M8933
$$ -659 3134 19234 19061 -15367 -44742 -22643 31898 54935 15440 -43169 -50746 4068 53001
244E3001j5265n1754k2235K0710K6588P219n516p530r563j4536o343K1484L5352
$$ 53001 37736 -14018 -36253 -15543 11045 18264 12748 5218 -4345 -18881 -25224 -3740 31612
257C1612P84m5766l6101K2636N2415J8055l3397m1181j617L5781K5491j2383k3422
$$ 31612 32396 -13370 -49471 -26835 25580 43635 10238 -30943 -32560 3221 28712 16329 -7093
270g093j850R980q87m073Q273J1097m381k0160j4435J2820K9628O393k9901k5507
$$ -7093 -8943 1037 150 -3923 4350 15447 11066 -9094 -23529 -10709 18919 25312 -4589 -30096
284c0096J3536L0029O060j9978j7236O135J8992M601j5466p633J5123J1118j3243
$$ -30096 -16560 13469 19529 -449 -17685 -11550 7442 12043 -3423 -11056 4067 15185 1942
297A942j4871Q029J7528K004j5059j2922O151J7772K626j8284r885J3352J2278
$$ 1942 -12929 -4900 12628 14632 -427 -13349 -7198 10574 13200 -5084 -14969 -1617 10661
310A0661q054j2803Q00J1096O756o682j3419R60J7974P806j4820j2857P700J3965
$$ 10661 2607 -10196 -9396 1700 8456 1774 -11645 -10685 7289 15095 275 -12582 -4882 9083
324I083J518r383p730L661J0530O53j2556l418J2044M905j2377q679P927J1366
$$ 9083 10601 1218 -6512 -2851 7679 8332 -4224 -7642 4402 9307 -3070 -11749 -3822 7544
338G544j07j1708r948O533J7205K431j6116q897J0025J0499j170n640l188J212
$$ 7544 7437 -4271 -14219 -7686 9519 11950 -4166 -13063 -3038 7461 6291 651 -2537 -1325
352a325M630N72m783Q47P163k328j1602j856J1248P188n093j1077o350P544J4102
$$ -1325 3305 3877 -906 -59 7104 4776 -6826 -8682 2566 9754 4661 -6416 -12766 -5222 8880
367H880N02j5091o603R422P798k123l322k22M47R46o06j254M385N466n630j0809
$$ 8880 9382 -5709 -12312 -2890 4908 2785 -537 -759 -312 634 28 -1226 3159 8625 2995 -7814
383g814K063J1618L434p081p458j717N068P985j175r863k854O510L055k538l65
$$ -7814 -5751 5867 9301 2220 -5238 -6955 -1887 6098 4923 -4940 -7794 -1284 1771 -767 -1132
398a132J049n92k70J21n30L190M354m295p521K828R202R84o994m346R71M700L914
$$ -1132 -83 -675 -945 -824 -1354 1836 6190 1895 -5626 -2798 6404 7388 394 -3952 -2981 1719 5633
415E633l065p252q8N365M33l348J314J752k550j736J675K003J917Q39l898m168
$$ 5633 2568 -4684 -4772 593 1026 -2322 -1008 744 -1806 -3542 -1867 136 2053 2892 -1006 -5174
431e174L915P202k80n150k436M20K096L562k76m337j357K142j388j964L372L541
$$ -5174 -1259 5943 5663 513 -1923 -1503 593 4155 3879 -458 -1815 327 -1061 -3025 347 3888
447C888l518m911r99K760M742K877m038o486P90N540K677J17k26k970l724J294
$$ 3888 370 -4541 -5540 -2780 1962 4839 801 -5685 -4895 645 3322 3439 3213 243 -3481 -2187
463b187M794K434m14k786n623k479N565O196l57m991n044k736L268P750L115m939
$$ -2187 2607 5041 4627 1841 -3782 -6261 -696 5500 5143 152 -4892 -7628 -4360 3390 6505 1566
479A566o536k318J781O801P441j131r685o761K938R123P092j350r527p747K625
$$ 1566 -4970 -7288 -5507 1294 8735 7604 -2081 -8842 -5904 3219 10311 8961 -566 -8313 -5688
494e688Q016M392l57l926p088m664L911Q853M738k953r074q381J894J2794J0117
$$ -5688 2328 6720 6363 2437 -4651 -9315 -5404 3449 8187 5234 -3840 -12221 -10327 2467 12584
509A2584l661j2584q681L169J3061R926l987j2914o404M140P818N254N94n028
$$ 12584 8923 -3661 -12342 -9173 3888 13814 9827 -3087 -9491 -5351 2467 7721 8315 3287
523C287q385l907L504Q034O798j279j1389j0241K548J2601R778j240j1514j2237
$$ 3287 -5098 -9005 -5501 2533 9331 8052 -3337 -13578 -11030 1571 11349 10109 -1405 -13642
537a3642M01J4555J3046k464j2974r353J906R997Q648o27p799o263j498J700N572
$$ -13642 -13241 1314 14360 11896 -1078 -10431 -8525 1472 10120 9493 1694 -4569 -6067 -4367 1205
552A205O644r2q090q383j808O198J1011N691q270j5620m898J1822J5872L868j1660
$$ 1205 7849 7757 -333 -8716 -10524 -4326 6685 12376 4106 -11514 -16412 -4590 11282 15150 3490
567C490j5042j327J3324J0769k303p732m055r56J11K953N011L622j707q967j0206
$$ 3490 -11552 -12879 445 11214 8911 1179 -2876 -3832 -3721 -768 4243 7865 6158 -2809 -13015
582a3015J838J5095J1385n898j7137j0806O770J9394J1290j0547j9360m811J1616
$$ -13015 -11177 3918 15303 9405 -7732 -18538 -11768 7626 18916 8369 -10991 -15802 -4186
595d186J2244K482m964p260l673R02L024M765O283o3j1630j1694K369J3988J1723
$$ -4186 8058 10540 5576 -1684 -5357 -4455 -1431 3334 9617 9554 -2076 -13770 -11401 2587 14310
610A4310j364j5665j6122K226K0232J5022n945j8814j1977N190J7654J1552o129
$$ 14310 12946 -2719 -18841 -16615 3617 18639 12694 -6120 -18097 -12907 4747 16299 10170
623A0170j4034n637L832O228N521K540l381o923n573j403N983J2615N283j2268
$$ 10170 -3864 -9501 -5669 559 6080 8620 5239 -1684 -7257 -8660 -2677 9938 15221 2953
637B953j7542l042J4923J7532K056j7804j8627K879K0576J2716o703j3858o136
$$ 2953 -14589 -17631 -2708 14824 16880 -924 -19551 -16672 3904 16620 9917 -3941 -10077
650a0077L885Q115M151k035r31J14n327p302L758J3628P465q704j6878q581J0694
$$ -10077 -6192 1923 6074 4039 3108 3222 -2105 -9407 -5649 7979 15444 6740 -10138 -18719 -8025
665h025K0452O220j6001j8227l79J3692J2866J560j0102j1236n67P597O425K050
$$ -8025 12427 18647 2646 -15581 -15960 -2268 10598 12158 2056 -9180 -9747 -2150 4275 6325
679F325L16m120p547l140N067Q978O276l624j4378j0409P597J7194O946q627j5329
$$ 6325 6641 2521 -5026 -8166 -3099 5879 12155 8531 -5847 -16256 -8659 8535 15481 6854 -8475
694h475q332P737J7235P497j0513j4892m129Q237J2047N156o494r327j914L763
$$ -8475 -16807 -9070 8165 15662 5149 -9743 -13872 -5635 6412 11568 5074 -4253 -6167 -2404
708b404K615K998M410j132q998p349K376J1157R731l683j5607j0077Q063J5108
$$ -2404 211 3209 7619 6487 -2511 -9860 -7484 3673 13404 9721 -5886 -15963 -7900 7208
722G208M911q327j1644m011P752J1005J275p686n042J607K305P79J523K119K73
$$ 7208 12119 3792 -7852 -11863 -4111 6894 8169 483 -4559 -2952 -647 132 1655 3774 4047
737D047k912n343j744P069Q079k571r953m947L773O536L450j789o405l566K644
$$ 4047 1135 -4208 -5952 1117 9196 6625 -3328 -8275 -4502 2034 5484 3695 -2710 -6276 -3632
752c632M465J666l46j985k553n51K309J420N08K025j38l946l146K480M480K000
$$ -3632 833 2499 2153 168 -2385 -2936 -627 793 1301 3326 3188 -758 -3904 -1424 3056 5056
768E056k035m993l550K267O111K516l110m874l022J336N528L349l325m648l09
$$ 5056 3021 -1972 -5522 -3255 2856 5372 2262 -2612 -5634 -4298 1230 4579 1254 -3394 -3703
783c703K497J362J505J280o39k922k505K43M336M895j162p079m064L505N872J815
$$ -3703 -1206 156 1661 2941 2302 -620 -3125 -2882 1454 6349 5187 -1892 -5956 -2451 3421 5236
799E236k652n032l203K408M860J664k378k659j320L53K280K531L20j928j707j073
$$ 5236 2584 -2448 -5651 -3243 1617 3281 903 -1756 -3076 -2723 -443 2088 2408 480 -1227 -2300
815b300Q10L406K615k034l819j037K046K344J099j476l127j010J292J393M64L35
$$ -2300 -1490 1916 4531 2497 -1322 -2359 -313 2031 3130 1654 -1473 -2483 -1191 202 666 1001
831A001j081k456k78K292J341l08p77n37o45O52J772O00k29k50j082j110J045
$$ 1001 -80 -2536 -2814 -522 819 511 -266 -803 -1448 -796 976 1576 1347 1097 15 -1095 -50
848e0K030J32j329j066q81K2J698J128j161k035m10L89O83J516L77j773j152O01
$$ -50 1980 2112 783 -283 -1164 -1142 556 1684 523 -1512 -1922 -1533 -850 666 1043 -730 -1882 -1281
866a281J079R89J097n28k489m98K275J623j39j027j666j015J345K076j88j791
$$ -1281 -202 787 1884 1356 -1133 -1631 644 2267 2128 1101 -565 -1580 -235 1841 1653 -138
882a38r33o38J43J820J424j762k109L05Q48J043J319j37k171q75J758J500K86
$$ -138 -1071 -1709 -1566 254 1678 -84 -2193 -1888 -1040 3 1322 1185 -986 -1861 -103 1397 1683
899A683k76j200j540J192K137j39j581o57l83j44J406J014j629j579J92P16M03
$$ 1683 1407 207 -1333 -141 1996 1857 276 -381 -764 -908 498 1512 -117 -1696 -1504 -788 -385
916c85R17j69j785m09J691J008m31K63l62j331P30K112j01j377k41p9m03J049
$$ -385 532 363 -1422 -1831 -140 868 437 700 338 -993 -263 1849 1748 371 130 51 -352 697
934F97Q24j413j445N29M25o9O87M0j753k95J568M75o71L46J00j147N92J696j1
$$ 697 1521 108 -1337 -808 -383 -452 235 275 -1478 -1773 -205 270 -401 -55 45 -1102 -510 1186 1175
953A175r45R7Q4m13R63Q58j338j149O54K42m74N21J69j560l49J655n1j028L74
$$ 1175 230 327 411 -2 961 1819 481 -668 -14 228 -246 275 444 -1116 -1465 190 139 -889 -515
972e15K28p71N39R83l33l82P13j7q65P81J319r49j159P14M02m71N64P5j365m62
$$ -515 -287 -1058 -519 464 131 -251 462 445 -420 361 1680 731 -428 286 688 217 781 856 -509 -971
992i71J166j19r75N03K82j083Q2J074j93l39P75k14r03N91J609k67q76K07R6l46
$$ -971 195 76 -899 -396 -114 -1197 -1115 -41 -234 -573 202 -12 -915 -324 1285 1018 142 349 445 99
1012I9Q77M73j232l27L99n01p63J507O89j748j214N88P58L53O21p12j709P34J577
$$ 99 976 1449 217 -110 289 -212 -975 532 1221 -527 -1741 -1153 -395 -42 579 -133 -1842 -1108 469
1031D69L4l14N57m20j027M93J362L4m1k94j545q10K045J696j236j969n61J86Q43
$$ 469 503 189 746 326 -701 -208 1154 1188 1147 853 -692 -1502 543 2239 1003 -966 -1527 -1341 -498
1050d98J495m44j716m02P17K3O02J687k42k128q96J445J535R66m43k147j203J594
$$ -498 997 553 -1163 -1565 -848 -825 -223 1464 1222 -906 -1802 -357 1178 2144 1701 -446 -1649 -55
1068e5J883l99q58j83j028q13P52J276K61l19j294k075M77L341J742k167k870
$$ -55 1828 1429 571 388 -640 -1453 -701 575 836 517 -777 -2852 -2375 966 2708 541 -2329
1085b329j76J936K284N96j941j684J117J171o51k31J389N23k082j618K2K038K403
$$ -2329 -2505 -569 1715 2311 370 -1314 -197 974 323 92 1481 2004 -78 -1696 -1674 364 2767
1102B767o95l829k304K269L349N64j951j854q74J435K209P03j090p43l51n28N72
$$ 2767 2072 -1757 -4061 -1792 1557 2121 170 -1684 -2558 -1123 1086 1789 699 -44 -395 -923 -351
1119c51K044P80j191j747r50L91K029J678j062k428j425J53J476K200Q43k581
$$ -351 1693 2473 1282 -465 -1415 -1024 1005 2683 1621 -807 -2232 -2079 -603 1597 2440 -141
1135a41l633J32L690L008m87l242k881J461L722J303k299j272Q45M10p05l44J212
$$ -141 -3774 -3642 48 3056 2569 -673 -3554 -2093 1629 2932 633 -639 206 616 -89 -433 779
1152G79J462L1l385l373K128N519J752m814n044K49N066L868j561n110j797L446
$$ 779 2241 2272 -1113 -4486 -2358 3161 4913 99 -4945 -4696 370 4238 2677 -2433 -4230 -784
1168g84L100r50j919N58J253m79j645l86J932K845o22m450k831L112M591M61l384
$$ -784 2316 1366 -553 5 1258 779 -866 -1252 680 3525 2903 -1547 -4378 -1266 3325 3786 402
1185D02l697n95L385L419r08l290j173Q01J185J181Q71o01j704j96N54M29J012
$$ 402 -3295 -3890 -505 2914 2006 -1284 -2457 -1656 -471 710 1581 980 -724 -920 -366 63 1075
1202A075O94o58j173p32k61R85K731Q70m013m122J352M434K865j911m783k263
$$ 1075 1769 1111 -62 -794 -1055 -70 2661 3531 -482 -4604 -3252 1182 4047 2136 -2647 -4910
1218d910L309M968l38m068j818J903J999J9j454m33K357J542k767m064J899N771
$$ -4910 -1601 3367 3029 -1039 -2857 -954 1045 1064 -390 -823 1534 3076 309 -3755 -1856 3915
1234C915J241n240m982J138N676L605l223o323p53N188K715k145k564J36J351
$$ 3915 5156 -84 -5066 -3928 1748 5353 2130 -4193 -4946 242 2957 812 -1752 -1616 -265
1249b65O43m48j081J222K550q31l637q58L117K794l83k753k734M37L436J971j961
$$ -265 378 -70 -1151 71 2621 1790 -1847 -2705 412 3206 2823 70 -2664 -2227 1209 3180 1219
1266A219k494k71L39L99J581N20j647j418J60J324J211K88j145j299J078R66j008
$$ 1219 -1275 -1546 -1207 -808 773 1293 -354 -1772 -1612 -288 923 1211 66 -1233 -155 811 -197
1283a97m68K143R52k011k084L15K294K461j169m580k041L562M226j106l789j510
$$ -197 -665 1478 2430 419 -1665 -1350 944 3405 2236 -2344 -4385 -823 3403 2297 -1492 -3002
1299c002J617K455O53k496j402K261J867k193k437J924L633K99l202k871P55M332
$$ -3002 -1385 1070 1723 -773 -2175 86 1953 -240 -2677 -753 2880 3179 -23 -2894 -2139 2193
1315B193K307l663m098J042L659P99j978j518K35R92N24j261p51J547J423j874
$$ 2193 4500 837 -3261 -2219 1440 2239 261 -1257 -1022 -30 494 -767 -1518 29 1452 -422
1331d22k037J495K576M45j561j651l18J897J687j162j517N90Q44j046m65J414
$$ -422 -2459 -964 1612 2057 496 -1155 -1473 424 2111 949 -568 22 866 -180 -645 769
1347G69N11j178j454o24J064K159J57k373j361J901J642r11j105K41Q41N33p20
$$ 769 1280 102 -1352 -1976 -912 1247 1404 -969 -2330 -429 1213 302 -803 -562 279 812 92
1364I2j053O93K238J59k933j190K187K207q29k361j230J502K079q3k820n37K147
$$ 92 -961 -268 1970 2129 -804 -1994 193 2400 1571 -790 -2020 -518 1561 1478 -1342 -1879 268
1381B68J104j884j412J112J800j6j775r88J158K655R3k540j371J937J572o05j405
$$ 268 1372 -512 -1924 -812 988 972 -803 -1791 -633 2022 2115 -425 -1796 141 1713 1108 -297
1398b97m76P72J196o69j821J8K118N44k263j445J306K024nj600j303J207K178
$$ -297 -773 -1 1195 526 -1295 -1277 841 1385 -878 -2323 -1017 1007 1002 -598 -1901 -694 1484
1415A484j19k131o76J869J127j323j043P02J368J35j381j054Q21J608j82k194
$$ 1484 1365 -766 -1442 427 1554 231 -812 -110 1258 1393 12 -1042 -221 1387 1205 -989
1431i89o57J488J035o13j227j34R28O03k72j275K05J736K43j594p28J341J444
$$ -989 -1646 -158 877 264 -963 -1097 -169 434 162 -1113 -908 828 1071 -523 -1251 90 1534
1448A534n08j415n08J292J191p40j815k35J876O77j647j203Q71J239l9j328q85
$$ 1534 1026 -389 -897 395 1586 846 -969 -1204 672 1349 -298 -1501 -630 609 570 -758 -1643
1465a643J043J693l58j976l31K001J065r08j312K54R74R53q91j490L41J755M00
$$ -1643 -600 1093 735 -1241 -1572 429 1494 586 -726 -472 502 1455 564 -926 -585 1170 1570
1482A570k040p07J043J012m06r82q57Q34J236l94j552j91J804N37j071p62M78
$$ 1570 -470 -1177 -134 878 472 -510 -1367 -533 703 309 -1243 -1434 370 907 -164 -926 -448
1499d48J135J60o00j006N59J564k97j685k13J497N52r94r00m7Q24N60p68j217
$$ -448 687 847 247 -759 -200 1364 1067 -618 -831 666 1218 224 -676 -723 101 661 -107 -1324
1517a324M37J578j09j634j26J336M63l68n52l27Q37R15m96j152J78J360M9j200
$$ -1324 -887 691 582 -1052 -1178 158 621 253 -299 -626 211 1126 630 -522 -344 1016 1065 -135
1535a35k83M83M19K32q65r70O54J327n00j502l6J294L05o77n34J80P34P34q38
$$ -135 -418 65 484 716 -149 -1119 -465 862 362 -1140 -1176 118 423 -254 -788 -608 126 860 22
1554B2q77P22J292l18j281J06P49L31j9p36o54O66R39p03j209M04R07k59o03k79
$$ 22 -855 -133 1159 841 -440 -334 415 746 727 -9 -663 3 942 239 -970 -566 341 82 -521 -800
1574h00K35N43N71q88q18Q57J352m55r33J20P49m7L8k46m36L12P15p64p29P00
$$ -800 -565 -22 549 -339 -1157 -300 1052 597 -336 -216 533 486 524 278 -158 154 869 105 -624 76
1594G6P10q95o40L13K51O6M6l68m68N18Q12n43m21M29N19m69Q9L76o6L22Nq38
$$ 76 786 -109 -749 -436 -185 -119 -73 -441 -909 -391 421 -122 -543 -114 405 -64 25 401 335 657 662 -176
1616a76k78R07O76j023o59K84L62k1Q0l90n42O32M24n89l42P21L67o12k65K99
$$ -176 -454 453 1129 106 -553 -269 93 72 152 -238 -780 -148 276 -313 -655 66 433 -179 -444 -145
1636a45J92N01K49p87m10P76N39m49m53J78R6l35L14j53k80N9J21n87o2O27K01
$$ -145 47 548 797 10 -400 376 915 466 13 191 287 -48 266 113 -167 -108 13 -574 -636 -9 192
1657A92n86k52L83J11j3N77k38l51L01J8j03L07M61n21l82M9J95J05J91p2q30
$$ 192 -394 -646 -263 -152 -165 412 174 -177 124 142 39 346 807 286 -96 -47 148 253 444 372 -458
1678d58l26P36K65k73k92M7j33J37M23q7j72Q3J92k68j2N89J62k68j19l91K6N08
$$ -458 -784 -48 217 -56 -348 -301 -434 -297 126 39 -133 -50 142 -126 -138 451 613 345 226 -165 -139 369
1700C69N19m56q64J5K36L48J17l23o56j71P76K64n49k3K25J71m3R1L7R3L58r7
$$ 369 888 432 -432 -417 -181 167 284 -39 -695 -866 -90 174 -375 -398 -173 -2 -45 46 83 176 534 437
1722D37o03j99O91N03j97n74n03p0P98O21q26q22j22P99L18k94k95j22K14M37
$$ 437 -166 -365 326 829 632 58 -445 -515 283 904 78 -744 -866 -67 251 -43 -338 -460 -246 191
1742A91k71k20K96K79L4m94J29M7L25N01o3j087k57P48P89k11j066m21k3R33M25
$$ 191 -80 -300 -4 275 309 -185 -56 -9 316 817 754 -333 -590 158 947 736 -330 -751 -774 159 584
1763E84p17p33K78O53O0m12p1K14L32J52n21l05N05R86r9j073p00P95R31L97r07
$$ 584 -133 -866 -588 65 125 -287 -358 -144 188 340 -181 -486 19 1005 906 -167 -867 -72 859 1256 349
1784C49j517L31J495K72r84p35K44M51L15l51o89L13Q82q7p45l14P95P44k08o05
$$ 349 -1168 -837 658 930 -54 -789 -545 -94 221 -130 -819 -506 376 289 -456 -770 25 769 561 -44
1804d4n38K28J021N92p10j270K32Q04K84k37o38n58L72M81n0n61J35M64j03j4
$$ -44 -582 -354 667 1259 549 -721 -489 315 599 362 -276 -834 -462 19 -31 -592 -457 7 -96 -110
1824a10j24j01K65O87r8r14l25Q55P89%p23p38k9J342N26j228j012L49Q88J31
$$ -110 -234 -335 -70 617 519 -395 -720 135 924 924 201 -537 -566 776 1302 74 -938 -589 299 430
1844D30l25o53k14P27M87q23o85P36R70j83r38k81M58J091M87j154j113M75J261
$$ 430 105 -548 -762 -35 452 -371 -1056 -320 650 467 -471 -752 -294 797 1284 130 -983 -508 753
1863G53J93q54m27M9M75L01l74q46K93Q77l33q32K1O91J32O0m10l56M83O42L5
$$ 753 946 92 -335 -286 189 490 116 -730 -437 440 107 -725 -704 -13 119 179 -231 -587 -104 538 573
1884E73p78j48M84O6L28J42l81m80J61L78j02j40j32l12r8N12N9n41m4N19k0l82
$$ 573 -205 -353 131 197 525 667 286 -194 -33 345 243 103 -29 -341 -439 73 132 -409 -453 66 46 -336
1906c36J8J64J57M29j77p94R0R05M70n54n65lM37L92j25r80k37R56L43q81l98
$$ -336 -318 -154 3 432 255 -539 -449 456 926 372 -193 -196 241 633 508 -472 -709 247 590 -291 -689
1927f89M78L44j6n03m21L68Q90M1j100l4R48M10k99m82o0J82M28J48o27k23O02
$$ -689 -211 133 117 -386 -807 -439 451 492 -608 -642 306 716 417 -65 -125 57 485 633 6 -217 385
1948C85K02p02k94K29L52m7l38l19m7P45J75o74k67N25K93k83j41K42P8J79j72
$$ 385 587 -115 -409 -180 172 125 -213 -532 -579 166 341 -333 -600 -75 218 -65 -206 36 114 293 121
1969A21j85K93L84q3o94o9L95K45m34l47J67P1J55o9m80L66L66j88o25J59N39
$$ 121 -64 229 613 530 -164 -233 162 407 -27 -374 -207 -136 19 -50 -530 -164 202 14 -611 -452 87
1990H7L24l07l17k4N56N31m54o78J19P58j85m69k90M05L67Mn74m30M27O66l61
$$ 87 411 104 -213 -237 319 850 396 -282 -163 595 410 -59 -349 56 423 427 -147 -577 -150 516 155
2011A55p48k41P27L70l20l64l8N44L83j67p28J80P01M1n16j54M70K90j51m92l83
$$ 155 -593 -834 -107 263 -57 -421 -459 85 468 301 -427 -247 454 495 -21 -175 295 585 434 -58 -441
2032d41L56M68k05o42j8N56M2m00j29K99J58K9l01k12M86M04j69m20J68L68K45
$$ -441 -85 383 178 -464 -482 74 116 -284 -413 -114 44 73 -228 -440 46 450 281 -139 29 397 642
2053F42m30k16l7K01K01k16m64J54O09l60n97nN24J52l27j84k01N39L77m33m67
$$ 642 212 -4 -41 160 361 145 -319 -165 444 84 -513 -518 6 158 -169 -353 -554 -15 362 -71 -538
2074e38K89P79j40l65k65L80K86j18k97k95K90N77k95o65j08N50K45m58j76j19
$$ -538 -249 530 390 25 -240 140 426 308 11 -284 6 583 288 -377 -485 65 310 -148 -324 -443
2094d43L88K81l58l63K49N78p1m17n0M60Q8q3k68q2L28L57l84m78J32N28j71m87
$$ -443 -55 226 -132 -495 -246 332 261 -156 -206 254 342 259 -9 -91 237 594 210 -268 -136 392 221 -266
2116b66J2P7J30J23k88l44L09N27l52m33J57M22J69l45J9m9L67K07m14l36L75
$$ -266 -254 -177 -47 76 -212 -556 -247 280 -72 -505 -348 74 243 -102 -83 -132 235 442 28 -308 67
2137F7N02k81n39K68Q8Q7l8l66k15L92L81n70k77L57L89j63l22NJ33J97L09m84
$$ 67 569 288 -251 17 105 192 154 -212 -427 -35 346 -224 -501 -144 245 82 -240 -235 -102 95 404 -80
2159h0k19O50L77m58n84K55L94L7m26j38n8L91J55n91k91M13M89m01l57J36L16
$$ -80 -299 351 728 270 -314 -59 335 372 -54 -192 -250 141 296 -295 -586 -173 316 -85 -442 -306 10
2180A0J73L4o17p0O68L16m56m48M11M64k11k4l39j01M49J51m89l61M10M03m62
$$ 10 183 217 -400 -470 198 514 58 -390 21 485 274 250 -89 -190 259 410 -79 -440 -30 373 -89
2201h9m19K18J77K12k10k66J2M66K80m91j37L56J59k36j30J34J79J00q4l72j3
$$ -89 -508 -290 -113 99 -111 -377 -365 101 381 -110 -247 109 268 32 -98 36 215 315 231 -141 -154
2222a54M87L0o28j56K79L07l73j0j00M0M01j9o65L30N08J28m68l77L72K87J09
$$ -154 333 363 -265 -421 -142 165 -208 -218 -318 -278 123 104 -561 -231 277 405 -63 -440 -68 219 328
2243C28k7m71J26M92Po38kK62J68k54k61K9J18K28p0n59J04N90J33l98j59N5K77
$$ 328 301 -170 -44 448 455 -183 -185 77 245 -9 -270 -241 -123 105 35 -524 -420 170 303 -95 -254 -199 78
2266G8O3Q3k13o3L43o3l32k9O11j67k80k18P7J16O8j41l84J64M32j6m68QL50N6
$$ 78 141 224 11 -52 291 228 -104 -133 478 311 31 -187 -110 6 74 -67 -451 -287 145 129 -339 -331 19 75
2290G5k86lJ55J71K19k41l49L03N05p6n01j51L35J00K40m19l12L4M18n7l36j06
$$ 75 -211 -214 -59 112 331 90 -259 44 549 473 -28 -179 156 256 496 77 -235 -201 217 160 -176 -282
2312b82K47P7k26j15P7L11Q4j63l40M6M39R2j89K9m3j7LJ53j21j08J8M2n1j6r6
$$ -282 -35 42 -184 -299 -222 89 173 10 -330 -284 155 247 58 87 44 27 30 183 62 -46 -28 14 -37 -53 -149
2337a49%M1J01m7k98J08J48K3j7N9j51N0M04P5l55r1o4L99K01k65j43J9l7J88
$$ -149 -149 -108 -7 -54 -352 -244 -96 -73 -90 -31 -182 -132 272 347 -8 -99 -163 236 437 172 29 48 11 199
2361A99j19m12k0M23j38p3j44J06K24k1r7m46K53N95l8l18j18l4L91K22j60l51
$$ 199 80 -332 -352 71 -67 -140 -284 -178 46 25 -72 -518 -265 330 292 -26 -144 -178 213 435 275 -76
2383g6p7L95R2k68j15p5Q7qP8k15l5M1K11j46j61J00M3K28J36m30j42M11L56p
$$ -76 -153 242 334 66 -49 -124 -37 -45 33 -182 -217 -176 35 -111 -272 -172 -129 99 235 -195 -337 74 430 423
2407D23n60M5P2K76J1n3l18M2L15j11k90m5J43J0k5j35k26J18N44j40m64N9L08
$$ 423 -137 -92 -20 256 267 214 -104 -62 253 142 -148 -193 -50 -40 -65 -200 -426 -308 236 96 -368 -309 -1
2430aK11p4j76m4N6K45K70m74j61L20p2j00K1oQj99J88R9m00J42P9O7Oj30j84
$$ -1 210 136 -40 -84 -28 217 487 13 -148 172 100 0 21 15 23 -176 12 111 -289 -147 -68 -1 5 -125 -309
2455c09J40N32p5m42n2M16J25k44M0p0r8L89N9n52j38L52K22k14k28j82J52L67
$$ -309 -169 363 288 -154 -206 210 335 91 131 61 -37 352 411 -141 -279 73 295 81 -147 -329 -177 190
2477A90m4m33k56N00L76m14k70L5K99M85j62m31k43M71K63k35k49J39P6N7o0j84
$$ 190 146 -287 -543 -43 333 -81 -351 -316 -17 468 306 -125 -368 103 366 131 -118 21 97 154 94 -90
2499i0m1K54J06m63j34J37J55Q5m4P2n2j1M2Jj42J27K47l22NM36j21k71J20M6
$$ -90 -131 123 229 -234 -368 -231 -76 9 -35 37 -15 -26 16 17 -125 2 249 -73 -68 368 247 -24 96 142
2523A42k03K2J16j58n7L02j27l79J12M42r9m30K2M2L22R0j68k94J98M18o8k27
$$ 142 -61 -39 77 -81 -138 164 37 -342 -230 212 113 -317 -295 -253 69 159 -9 -303 -105 313 245 18
2545A8k35L88J37k1k59k44K60L65j80m29q7L50P9l78m5r0L61L62k16l69jL13K21
$$ 18 -217 171 308 287 28 -216 44 409 229 -200 -287 63 142 -236 -281 -371 -10 352 136 -233 -234 79 300
2568C00k75j86P1J46P9m8j96J40K65m8l10oJ40m9n6j99K07o8N4l9j41J79J11k10
$$ 300 25 -161 -90 56 135 87 -109 31 296 248 -62 -68 72 23 -33 -232 -25 -93 -39 -78 -219 -40 71 -139
2592a39k5J31J66m9j14p4N5J84pl1k29K18K22j64l49J1K07L6j60M4j70K83K80
$$ -139 -164 -33 133 84 -30 -104 -49 135 128 97 -132 86 308 144 -205 -194 13 49 -111 -67 -237 46 326
2615C26m88l57L28K61J37m24l1K30J91J45l35j47L32J34k60j18m8L08r4j23n1
$$ 326 -162 -519 -191 70 207 -217 -248 -18 173 318 -17 -164 168 302 42 -76 -124 184 90 -33 -84
2636h4j40J35J45Ql92J62K13o7j67j15K50J7J8p4n4J58K08k15j74K16J86j07j46
$$ -84 -224 -89 56 64 -328 -166 47 -20 -187 -302 -52 -35 -17 -91 -145 13 221 6 -168 48 234 127 -19
2659a9M5Q2L3n8k39J7J06K49k40j61jK75j90q2K4J73J33k1k37j90M44J82j52l35
$$ -19 26 108 141 83 -156 -139 -33 216 -24 -185 -186 89 -101 -183 -159 14 147 126 -111 -301 143 325 173 -162
2683a62N0K92j0j07j19k98L91K17l18l31K01L50j06k08j50J15J64J7m8o1j4K95
$$ -162 -112 180 170 63 -56 -354 37 254 -64 -395 -194 156 50 -158 -308 -193 -29 -12 -60 -121 -135 160
2705A60l0k43J9L02%j41j09k9K67L7k48j22J45K16j34l63Q0K58j0j5k19K6J16
$$ 160 130 -113 -94 208 208 67 -42 -71 196 233 -15 -137 8 224 90 -273 -193 65 55 40 -179 -153 -37
2728c7J30k31q7L75J91k56j62K51m3P8j07j7j91K65J38m35j65J63K43J1k77pj57
$$ -37 93 -138 -225 150 341 85 -77 174 131 209 102 85 -106 159 297 -138 -303 -140 103 114 -163 -170 -327
2751c27L14O0j76k69K48K92k25oJ11K7J07jj67j1K30J63n14k1K67L9n4l6n3j76
$$ -327 -13 47 -129 -398 -150 142 -83 -89 22 49 156 155 -12 -23 207 370 -144 -165 102 141 87 51 -2 -178
2775a78N0J75j63l5J91m8q7j64K45J07m1o5L7j10K85L1l93M6L38l6k10k2J18L
$$ -178 -128 47 -116 -151 40 -8 -95 -259 -14 93 52 -13 24 -86 199 230 -163 -117 221 185 -25 -47 71 74
2799G4N7j21k28Q3J66J67l84q0J62L9J3j0m7K3J75Q8k67J36K01k6j38k9M1r2K12
$$ 74 131 10 -218 -135 31 198 -186 -266 -104 -65 -52 -62 -109 -86 89 177 -90 46 247 221 83 54 95 3 215
2824B15j02k09j0K61j14j87J03M2m1j55K4J98j26J36q1k59K13K42k11j6L2J42
$$ 215 113 -96 -106 155 41 -146 -43 -1 -42 -197 -173 25 -101 35 -46 -305 -92 150 -61 -77 -45 97
2846I7j0O4n1j10pQ2j92J5K29o1M3k63N4r5J39Rq0j42J17J26Q7k87Q7K32j05J85
$$ 97 87 151 100 -10 -17 65 -127 -112 117 56 99 -164 -110 -205 -66 -57 -137 -279 -162 -36 51 -236 -149 83 -22 163
2872A63m9j83k7K40jj09rJ51m6k17J46k7k8M9q8lJ35j13j33l4J38rj48J27R7j0
$$ 163 114 -69 -96 144 143 34 25 176 130 -87 59 32 4 53 -35 -38 97 -16 -149 -183 -45 -54 -202 -75 22 12
2898A2O0o5q5J03J48o5q3m5lK82k60q1J9j2J58o3j95j0N8J85j53k2j8J63J16j33
$$ 12 72 7 -78 25 173 108 25 -20 -23 259 -1 -82 -63 -75 83 20 -175 -185 -127 58 -95 -117 -135 28 144 11
2924A1m0j4L3K49o4j22o5K78j67O6n1j06J12K9j71k49J13K05j05M7q4R1p6JJ30
$$ 11 -29 -43 -10 239 175 53 -12 266 99 165 114 8 120 149 -22 -271 -158 47 -58 -11 -95 -4 -80 -79 51
2949E1j62R0j26K13K4N2r1n6l1K39n7j87j1R8Q2L4k16j10j8J52M9j33Q5o3Q3j01
$$ 51 -111 -21 -147 66 90 142 51 -5 -36 203 146 -41 -52 46 128 162 -54 -164 -182 -30 19 -114 -29 -92 -9 -110
2975a10J7M2J7J57ok17J27RJ90j11j03n4K2O8J2pj38J31O9j0k87Q6j40J44J06
$$ -110 -93 -51 -34 123 117 -100 27 36 226 115 12 -42 -20 48 60 53 -85 46 115 105 -182 -96 -236 -92 14
3000A4j17o1l2J58J58k52N2P5O1J57J4j93q0K00Kj76m8J04K9n2L7r5n7J68Nm3
$$ 14 -103 -164 -196 -38 120 -132 -80 -5 56 213 227 34 -46 154 156 -20 -68 36 65 13 50 -45 -102 66 71 28
3026B8j45K4J13K4K0j38o1M5J79j5j21J5M2J28n3P5k19R2N3q0j30J32M6M6j59
$$ 28 -117 -93 20 44 64 -74 -135 -90 89 74 -47 -32 10 138 85 160 -59 33 86 6 -124 8 54 100 -59
3051e9K7j38n5J95mj38N1L8P3J8p1N5j53K45J61r3k02K43n1l8q8p8J07j16M3M8
$$ -59 -32 -170 -225 -30 -34 -172 -121 -83 -10 8 -63 -8 -161 84 245 152 -50 193 142 104 16 -62 45 -71 -28 20
3077B0j53J66K4j19m8N0q2n7J67J31j22j58K55P7J2m7k19J05K24o1j65q9K29n
$$ 20 -133 33 57 -62 -110 -60 -142 -199 -32 99 -23 -181 74 151 163 116 -103 2 226 165 0 -89 140 135
3101A35l2j84kN9J5j1j10j36K97o0j22P2O6j1J0K70k55j04J25no9J26o8R9r2j
$$ 135 103 -81 -83 -24 -9 -20 -130 -266 31 -29 -151 -79 -13 -24 -14 256 1 -103 22 17 -52 74 6 105 13 12
3127A2nn1Q0j0Oj03k7N5j02J08J84j00j42N1O1L9lk8m7P0J37o0j36n1J95j05o1
$$ 12 7 -44 36 26 32 -71 -98 -43 -145 -37 147 47 -95 -44 17 56 53 25 -22 48 185 125 -11 -62 133 28 -33
3154c3J1j14J59%j00j90M4K50m2r2m6j2K67p6O0k76J48L07k51J8j53J70M7m0j58
$$ -33 -22 -136 23 23 -77 -267 -223 27 -15 -107 -153 -165 102 26 86 -190 -42 265 14 32 -121 49 96 56 -102
3179a02O8J00J16q5k8k03J68J6J3j27J18j03j5R2m6M1L6Mo8N0l0l0KK1PM9L8j10
$$ -102 -34 66 182 97 69 -134 34 50 63 -64 54 -49 -64 28 -18 23 59 63 -5 45 15 -15 -13 8 15 64 102 -8
3207hq6J29qn1j07J03L8%j19J6j00L05n0j97n0Q1K11m7j18rK44j09mn1k4J60R2
$$ -8 -94 35 27 -24 -131 -28 10 10 -109 -93 -193 112 62 -135 -185 -104 107 60 -58 -67 177 68 64 13 -11 149 241
3234B41j81j63K3J11J78k16m5J8J78j20j1k80Q9L41j45j11P6l6J29O1j54j54K58
$$ 241 60 -103 -80 31 209 -7 -52 -34 144 24 13 -267 -178 163 18 -93 -17 -53 76 137 -17 -171 87
3257H7on7n5o2K32j1j64J36j80M8m2j35J04Q4J61k05J7J05o1J45l14J20p8J84
$$ 87 81 24 -31 -93 139 128 -36 100 -80 -32 -74 -209 -105 -21 140 -65 -48 57 -4 141 -173 -53 -131 53
3281E3o1M7M2M6J3m6k08O8K15j09j26O5j01J74L4q9k42K07J39j41k39J29Q8N2
$$ 53 -8 39 81 127 140 94 -114 -46 169 60 -66 -1 -102 72 106 17 -225 -18 121 -20 -259 -130 -42 10
3305A0q2o0j10K94J8r6p8J9J79j01r3J26K5J4l2r8orK18j80r2L0J44j43Q6Np1
$$ 10 -72 -132 -242 52 70 -26 -104 -85 94 -7 -100 26 51 65 33 -65 -71 -80 138 -42 -134 -104 40 -103 -17 -12 -83
3332h3o7K21q3j21J98J38j36j45Q9L7L8m4N2q6J16j47m7N1N7P2j25q3o3M5J12
$$ -83 -150 71 -12 -133 65 203 67 -78 11 48 86 42 94 8 124 -23 -70 -19 38 110 -15 -98 -161 -116 -4
3357dj5q6N2R0K0j25l0O0P4J26j82j25K3K31pj03n1Q9K4l9k2Ql7R4L1j84J02j4
$$ -4 -19 -105 -53 37 57 -68 -98 -38 36 162 -20 -145 -122 109 102 -1 -52 37 61 22 0 8 -29 65 96 -88 14 0
3385@J50k63j0J59J10Mk79J79j51K62q7Q7j62J49q9n1r0J37l4Q1j13j35Q7J61
$$ 0 150 -113 -123 36 146 150 -129 50 -101 161 74 161 -1 148 59 8 -82 55 21 102 -11 -146 -59 102
3409A02K8k07n0J08N5n5n5k4K06k7q9j26J12K21r1j64l9K76P0j58j29JJ64p4p6
$$ 102 130 -77 -127 -19 36 -19 -74 -98 108 81 -8 -134 -22 199 108 -56 -95 181 251 93 -36 -35 129 55 -21
3434b1j33R7P1m6J06r6j5L1J1k7jrJ35n7j49J15O2M6N0q3j89J57J2l9j71J65J6
$$ -21 -154 -57 14 -32 74 -22 -37 -6 5 -22 -23 -32 103 46 -103 12 74 120 170 87 -102 55 67 28 -143 22 38
3461C8p5j03M2j9J45N4r3j20J09J78j85j21J90R3p2j37q6J57J81M9k66p2K09N1
$$ 38 -37 -140 -98 -117 28 82 -11 -131 -22 156 -29 -150 40 133 61 -76 -162 -5 176 225 -41 -113 96 147
3485A47lk32L5J39q4n9K1J20j37Jk6O8n8J31m6K4j31J07L1MRr2NL5j6R6j15N9
$$ 147 144 -88 -53 86 2 -57 -36 84 -53 -52 -78 -10 -68 63 17 41 -90 17 48 52 61 -31 -26 9 -7 89 -26 33
3513C3j44N5m7L6J64k40o0KK45j03j06M4J42p5N2r8N4M0J52O5j91o7J35L0q1q4
$$ 33 -111 -56 -103 -67 97 -143 -203 -201 44 -59 -165 -121 21 -54 -2 -100 -46 -6 146 211 20 -47 88 118 37 -47
3539d7J23j69K48j92j76J49O9M4m5p4K5M5J09p7r8Q4L3K0j6q3QJ1J61p7J0j23
$$ -47 76 -93 155 -37 -213 -64 5 49 4 -70 -45 0 109 32 -66 18 51 71 55 -28 -20 -9 152 75 85 -38
3565c8O0k0j0p6LJ25j25K2KJ14j85j5L0Q9n0N2O4mr0J10n6m8K44j04j05N4J9j1
$$ -38 22 2 -8 -84 -81 44 -81 -59 -57 57 -128 -143 -113 -24 -74 -22 42 38 -52 58 2 -46 198 94 -11 43 62 51
3593E1m0M7p7j43K41k6p8j35R4O9L0j23J7n9J73L3q4q3J35O3j24O4k0L3L3N7k00
$$ 51 11 58 -19 -162 79 53 -25 -160 -66 3 33 -90 -73 -132 41 74 -10 -93 42 105 -19 45 25 58 91 148 -52
3620e2Jk9J21j01j4k3K2R4n9k1P2Ol2rq4J14o2j3J05q2M3J05K2k5j9Mq2R8k08
$$ -52 -51 -80 41 -60 -74 -97 -75 19 -40 -61 11 17 -15 -24 -108 6 -56 -69 36 -46 -3 102 124 99 80 84 2 100 -108
3649a08J06kk2J6l8P0j7j03N9%k0N6nP1pj03J06l6q0J07l1J2Q3j93J60k8j02M3
$$ -108 -2 -4 -26 -10 -48 22 5 -98 -39 -39 -59 -3 -8 63 56 -47 59 23 -57 50 19 31 114 -79 81 53 -49 -6
3677fq4M4J36j16m2JM6P9r3M3O5q6p6J09m5nJ01N3j33J14m5n0J25j27Q5r9k2J05
$$ -6 -90 -46 90 -26 -68 -67 -21 58 -35 8 73 -13 -89 20 -25 -30 71 124 -9 105 60 10 135 8 93 -6 -28 77
3705G7j93N8n1K25j41K9p9P0j00R6r0O8L6o9O3j21J65j28K8J03R4j49m1l4J37
$$ 77 -116 -58 -109 116 -25 4 -75 -5 -105 -9 -99 -31 5 -64 -1 -122 43 -85 -57 46 140 -9 -50 -84 53
3730E3r3n9Kq3K22P5l2r5L9r9N4R4r1o6K0J49q2l2R5q6L2P5j3l3N1J9p6Q3j28
$$ 53 -40 -99 -97 -180 42 117 85 -10 29 -70 -16 78 -13 -79 -59 90 8 -24 71 -15 17 92 79 46 97 116 40 123 -5
3759eRK0K2j24n7J05m9K14j17L%l9j08K25j13j94K29Q4j25N0j08J09L0kL3l9k2
$$ -5 4 24 46 -78 -135 -30 -79 135 18 21 21 -18 -126 99 -14 -208 21 105 -20 30 -78 31 61 59 92 53 31
3786C1J44j27q4J07r9Pr5J03nj8j2J85k04j19K67j16J34l0j76J74J00Qj75j5J70
$$ 31 175 48 -36 71 -28 -21 -116 -13 -18 -36 -48 137 -67 -186 81 -35 99 69 -107 67 167 175 0 -15 155
3811A55k7j99J70j65LJ11K0lm8n0j21P0N4q3l2J36j09Q0j09J36J31j29J04p5m3
$$ 155 128 -71 99 -66 -63 48 68 65 17 -33 -154 -84 -30 -113 -145 -9 -118 -38 -147 -11 120 -9 95 20 -23
3836b3qO5L3r9m2M7p3J17q9M2n7m1J99j39j5L3qR3j22L8K02r4o2p2j0K22l8j09
$$ -23 -31 34 67 -32 -74 -27 -100 17 -72 -30 -87 -128 71 -68 -83 -50 -58 35 -87 -49 153 59 -3 -75 -85 137 99 -10
3864a0L2q7R3R6j41q7P2K4mo0l0lP6p5L2MJ48j0Qj27J02o6O3l5Q5m6M0j24m7K5
$$ -10 22 -65 28 124 -17 -104 -32 -8 -12 -72 -102 -105 -29 -104 -72 -68 80 70 78 -49 53 -13 50 15 100 54 94 -30 -77 -52
3894e2K34j26r6J05Kl0k3l4J48q3rKj13K05k62K30j67N1l0K26j04n7K0n6J30j43
$$ -52 182 56 -40 65 67 37 14 -20 128 45 36 38 -75 130 -132 98 -69 -18 -48 178 74 17 37 -19 111 -32
3920c2n0l6J18N2J8q7j4P8n6L0j13K3K12m8o5j97M9J74j23J41j11L6mL8M4M1j21
$$ -32 -82 -118 0 52 70 -17 -31 47 -9 21 -92 -69 143 95 30 -167 -118 56 -67 74 -37 -1 -5 33 77 118 -3
3947cP6ljJ6p6n6P9q3P9oj7P1Qj36J20k0n5J7K5J13l8n8m9J28j58J49j14k9P7
$$ -3 73 70 69 85 9 -47 32 -51 28 22 5 76 84 -52 68 48 -7 10 35 148 110 52 3 131 -27 122 8 -21 56
3976E6N3k39O1M8rO4j3K0l2J88k77l8N5P7l7o4RJ55Ko6J46j26j1O6o9N8m3LO8
$$ 56 109 -130 -69 -21 -30 34 21 41 9 197 -80 -118 -63 14 -23 -87 -78 77 79 13 159 33 22 88 19 77 34 37 105
4005A05j90KJ05j11N5O1r7J47k0q1L5L0Rj69J7k0J03J09n8On8M5R6m9l0Ll1M2
$$ 105 -85 -83 22 -89 -34 27 -70 77 57 -24 11 41 50 -119 -102 -122 -19 90 32 38 -20 25 121 72 42 45 14 56
4033E6J1j07J9N4pr1N5o0M7N1l2j60J8K05k5r3n9J73m8r9N3J3J14LQr2m3L8p3
$$ 56 67 -40 -21 33 26 -65 -10 -70 -23 28 -4 -164 -146 59 34 -59 -118 55 7 -92 -39 -26 88 91 99 7 -36 2 -71
4062g1J23L1k12J11r6J27J0m2L1q6j9l5J28n0K1Q8l8m9L3N5p7M7Q4j40Q2j08K0
$$ -71 52 83 -129 -18 -114 13 23 -19 12 -74 -93 -128 0 -50 -29 59 21 -28 5 60 -17 30 114 -26 56 -52 -32
4089c2q2J49k4J5O5j62om8J7J21K8n7J2J29j20K7%Nm4m3O1N7j47Q9M1RN8o1K2
$$ -32 -114 35 11 26 91 -71 -77 -125 -108 13 41 -16 -4 125 5 32 32 37 -7 -50 11 68 -79 10 51 60 118 57 79
4118G9k6q6m4J93j87N7N4j19L1P4j49J67j21J53p8m0N5K1kj01k6J50q5P8n2Rq7
$$ 79 53 -33 -77 116 -71 -14 40 -79 -48 26 -123 44 -77 76 -2 -42 13 34 32 -69 -95 55 -30 48 -4 5 -82
4145h2O6q8J45K0j26K1L5o8J26j31o9J10O9o8Q6o7rKk7J93o5q0L8J20r0m8k1n5
$$ -82 -16 -104 41 61 -65 -44 -9 -77 49 -82 -151 -41 28 -40 46 -21 -30 -28 -55 138 73 -7 31 151 61 13 -8 -63
4173f3M4R3k4j28m2J25r3L4p0J02J9j14Q5jq5J56k9m0J15l9N5j21J2l2J37o0n3
$$ -63 -19 74 50 -78 -120 5 -88 -54 -124 -22 -3 -117 -32 -33 -118 38 9 -31 84 45 100 -21 -9 -41 96 36 -17
4200a7o4J07m5k6N2j41J70m8mj2J15q5pj10J32Q1K4j24J13o2l7J7Qk4lj12N8J8
$$ -17 -81 26 -19 -45 7 -134 36 -12 -16 -28 87 2 -5 -115 17 98 122 -2 111 49 12 29 37 13 10 -102 -44 -26
4228b6K4M9k4m6N9j8o0N1j26R9n6mK9m1P2K6N1m7m8J65j33P8m7m7J5r2J56k1l9
$$ -26 -2 47 23 -23 36 18 -42 9 -117 -18 -74 -78 -49 -90 -18 8 59 12 -36 129 -4 74 27 -20 -5 -97 59 38 -1
4257aK5P0j6j6r6k7J00J5K2j11J7J14q5l9n6J34j30Q4l6l7J83o1r3J02q6R6K0
$$ -1 24 94 78 62 -34 -61 39 54 76 -35 -18 96 11 -28 -84 50 -80 4 -32 -69 114 53 -40 62 -24 72 92
4284I2oj55P1j04L7J2m5K34j69n9pJ64o1RK0O6j58K23p5k1l0o9M5n9o0O9jj7J02
$$ 92 86 -69 2 -102 -65 -53 -98 136 -33 -92 -99 65 4 13 33 99 -59 164 89 68 38 -31 14 -45 -105 -36 -37 -54 48
4313D8J5j21J02n7j7no3M8K0J17j65J58r6R4j10N4j28J04p8R0o7P5jj9J5P4p8
$$ 48 63 -58 44 -13 -30 -35 -98 -50 -30 87 -78 80 -16 78 -32 22 -106 -2 -80 10 -57 18 17 -2 13 87 9
4340IM2j44P8o4q2J71P0k12J31l0j5K2j9LR3q1O1q5J57m4n4L1l8O2O7j01P9j07
$$ 9 51 -93 -15 -79 -161 10 80 -132 -1 -31 -46 -24 -43 -40 53 -28 33 -52 105 61 7 38 0 62 129 28 107 0
4368@K9k7L7J10k57R8k2K0Ml7J7r5R0K01k34J42q3Q5n0Prp7k0j0N1r6J39Q9j86
$$ 0 29 2 39 149 -108 -10 -32 -12 -8 -45 -28 -123 -33 168 -66 76 -7 78 28 35 26 -51 -71 -81 -30 -126 13 102 -84
4397h4J3M3J5m2oJ22o0J2j8L1n8j5J62r1Q4p2o9K57k40Ll6P3o5N0O8j03K2n8P5
$$ -84 -71 -28 -13 -55 -61 61 1 13 -5 26 -32 -47 115 24 108 36 -33 224 -16 -13 -49 24 -41 9 77 -26 -4 -62 13
4426A3n1K3M9L3l9o9k7J05k5j15J11K5Qq6P7K4r0J9OLj06M6j11J82J6l9M7j73
$$ 13 -38 -15 34 67 28 -41 -68 37 12 -103 8 33 41 -45 32 56 -34 -15 -9 -6 -112 -66 -177 5 21 -18 29 -144
4454a44O3K0n5M7J37q4j7l2Q0J10o3oj4k0K7P8j11m0O3O7j73L9q8J24r0P2l1J45
$$ -144 -81 -61 -116 -69 68 -16 -33 -65 15 125 62 56 42 22 49 127 16 -24 39 106 -67 -28 -116 8 -82 -10 -41 104
4482A04j78Q4N5q7n9P2M9nO5j26l2J88j57jN2N0j40pO5J5j22J79K6k38l5K10l7
$$ 104 -74 10 65 -22 -81 -9 40 35 100 -26 -58 130 -27 -28 24 74 -66 -73 -8 7 -115 64 90 -148 -183 27 -10
4509a0Om9L7M7j04l1J88j8q9n9L6J17j24R1o0Q1r6R9q3J42j77M7j01P5j29J73
$$ -10 -4 -53 -16 31 -73 -104 84 66 -23 -82 -46 71 -53 38 -22 59 -37 62 -21 121 -56 -9 -110 -35 -164 9
4535Iq3O9q3J47r1P4n5P7Pj8J0l4j22nK16k1j13J05j22%L1Qj49J14Q3mj51J0R5
$$ 9 -74 -5 -88 59 -32 42 -13 64 71 53 63 29 -93 -98 118 97 -16 89 -33 -33 -2 6 -143 -29 54 50 -101 -91 4
4564Dj15N1q2J44N5j21K9K6n3O4J0L4n2kK4k6n8jQ0M9n0m8J01j57J23o8O8k8j74
$$ 4 -111 -60 -142 2 57 -64 -35 -9 -62 2 12 46 -6 -8 16 -10 -68 -69 11 60 10 -38 63 -94 29 -39 29 1 -173
4593a73K32p0L2l6P9k9%j5o4J36j21j7j0J25p2l6R4l9j8l2J44j77L8j4M9j06J06
$$ -173 59 -11 21 -15 64 35 35 20 -44 92 -29 -46 -56 69 -3 -39 55 16 -2 -34 110 -67 -29 -43 6 -100 6
4620FN0n4J51m7j00J13j48Q6Rj20oJ35lm3N1j19OP3pmm1pR7j21j8R4L9j10J39
$$ 6 56 2 153 106 6 119 -29 57 66 -54 -60 75 72 29 80 -39 -33 40 33 29 -12 -19 78 -43 -61 33 72 -38 101
4649A01k03J15j7r7P9j2Q5J2k6k6lr1J77j29Q9r4%O2r9J88j13j9k9M7j44M2O1
$$ 101 -102 13 -4 -101 -22 -34 51 63 37 11 8 -83 94 -35 54 -40 -40 22 -77 111 -2 -21 -50 -3 -147 -105 -44
4676d4N2Qm3K2K7mj5J16k01M0J32j45J59j28N8J0J7O9j54%P7k8M8k4r5M1j12P1
$$ -44 8 16 -27 -5 22 18 3 119 -82 -42 90 -55 104 -24 34 44 61 130 -24 -24 53 25 73 49 -46 -5 -117 -46
4704d6K9J6Kj0j75K54l0Ql6j80J23J19k2p7P3j8l5j18J68j16J56j63L4JR7k1r6
$$ -46 -17 -1 1 -9 -184 70 40 48 12 -168 -45 74 52 -25 48 30 -5 -123 45 -71 85 -78 -44 -43 54 33 -63
4731f3J27M1m7m4m8o3J63m2P6K6p9O7j67K9M2J2m9J24j84K3j49J86l2n9K53k28
$$ -63 64 105 58 14 -34 -97 66 24 100 126 47 114 -53 -24 18 30 -19 105 -79 -56 -205 -19 -51 -110 143 -85
4757h5J24k3l3N8j40J18j6j9K9m6p1j8J24P4j11L2kK4n9M5j11Q9j7Ol4J12m2O9
$$ -85 39 16 -17 41 -99 19 3 -16 13 -33 -104 -122 2 76 -35 -3 -5 19 -40 5 -106 -17 -34 -28 -62 50 8 77
4785G7Lj84J1J33r3J27j83J07O0N6j66mL8P1j03P2%j09J31k4k4j45J43N1Mr9n2
$$ 77 80 -104 -93 40 -53 74 -109 -2 58 114 -52 -56 -18 53 -50 22 22 -87 44 20 -4 -149 -6 45 49 -50 -102
4812a02Q1n9Q2q4J06L1j37nK42j16j5l7l7M8K0j50J59j03P2J3k6j6M4k9j05J88
$$ -102 -21 -80 2 -82 24 55 -82 -87 155 39 24 -13 -50 -2 18 -132 27 -76 -4 9 -17 -33 11 -18 -123 65
4838F5j7O4k39J70Oj20R5k8n0lO2J4m7OO4r7J21j72J48J0L3n7km8k7j5M1L7j11
$$ 65 48 112 -127 43 49 -71 24 -4 -54 -57 5 19 -28 -22 42 -55 66 -106 42 52 85 28 26 -22 -49 -64 -23 14 -97
4867i7L8J22j58KP5J02j09J1L7O4o0q6Q3J0j17k7R5p6J23j15L9N1L6M6p7J8J9
$$ -97 -59 63 -95 -93 -18 84 -25 -14 23 87 27 -59 24 34 -83 -110 -15 -91 32 -83 -44 7 43 89 12 30 49
4894D9K5j10M7Pl8J5l2j1K8J40o3l1p3k8P7M3J0M8r4p7Q3J77k65J20k4K5j02m
$$ 49 74 -36 11 18 -20 -5 -37 -48 -20 120 57 26 -47 -75 2 45 55 103 9 -68 15 192 -73 47 23 48 -54 -58
4922e8n3J57k6j91J17M3P9j21J15n3N6p5Q4l8j5L1m0K7N4r3j6n4jK3j17J40J19
$$ -58 -111 46 20 -171 -54 -11 68 -53 62 9 65 -10 74 36 21 52 12 39 93 0 -16 -70 -71 -48 -165 -25 94
4949I4j54j0O3n3P1n5K8J8Q0m2m9J82j81r7J41M1j98J94j53m8P1j6p4R0O3j3j1
$$ 94 -60 -70 -7 -60 11 -44 -16 2 82 40 -9 173 -8 -105 36 77 -121 73 -80 -128 -57 -73 -147 -57 6 -7 -18
4976a8mp3L4J14j24J20j2K6j75J33J01M7j30J4KK9k05R1o4J53m5m7M5J08p3k2
$$ -18 -22 -95 -61 53 -71 49 37 63 -112 21 122 169 39 53 55 84 -121 -30 -94 59 14 -33 12 120 47 25
5002B5j03Q5q7m1L2P4k8M3l0J08n8k54R6J32l6no5J25l2Q8j0L3pn2m1j48J09L2
$$ 25 -78 7 -80 -121 -89 -15 -43 0 -30 78 20 -234 -138 -6 -42 -47 -112 13 -19 69 59 92 85 33 -8 -156 -47 -15
5030a5MR9R9j22n4r7J25q0O7M9r1K8q1L3M7O1p8m1P0M1L7j33Nj6P8j23J31j16
$$ -15 -11 88 187 65 11 -86 39 -41 26 75 -16 12 -69 -36 11 72 -6 -47 23 64 101 -32 -27 -43 35 -88 43 -73
5058g3L6K9o3O9j8J5mL5k8l5m5J39l4Jk9n6P0q8M1rK6j07J07k5J29pj05Q0J0j48
$$ -73 -37 -8 -71 -2 -20 -5 -9 26 -2 -37 -82 57 23 24 -5 -61 9 -79 -38 -47 -21 -128 -21 -46 83 76 -29 51 61 -87
5088h7P4P2j2n4M7L0j01l4J18j04l1J32j64J15l4q9J15q5K15m6N3j45m0l4R8M7
$$ -87 -13 59 47 -7 40 70 -31 -65 53 -51 -82 50 -114 1 -33 -122 -7 -92 123 77 130 -15 -55 -89 9 56
5114E6K3j36L3Q4j35n7J18L6l7p9r6K55p5m1J9oL4N8Rj91J65p5P3Oq1J09j25J25
$$ 56 79 -57 -24 60 -75 -132 -14 22 -15 -94 -190 65 -10 -51 -32 -38 -4 54 63 -128 37 -38 35 41 -40 69 -56 69
5142F9P2j68N9j68J95j2M7n7j17J06Qr4j9J21j43J51n2KJ18j36p8N8PJ38j37m4
$$ 69 141 -27 32 -136 59 47 94 37 -80 26 34 -60 -79 42 -101 50 -2 0 118 -18 -96 -38 -31 107 -30 -74
5168g4j12J1J68M3r9j5L5O7n7j9J6lo7J6N8L5q4L3n7j9P4J19N5k39L10k03j4J16
$$ -74 -186 -175 -7 36 -63 -78 -43 24 -33 -52 -36 -39 -106 -90 -32 3 -81 -48 -105 -124 -50 69 124 -115 195 -8 -22 94
5196I4r9j5l5O0j1J7k8O9n3R5k08J67j45K39j63n7Q5j23l6N1o9J73j8j14K31k0
$$ 94 -5 -20 -55 5 -6 11 -17 52 -1 94 -114 53 -92 147 -16 -73 12 -111 -147 -96 -165 8 -10 -124 107 87
5222H7j06N6n3K2m8r8J37P3j22P0L0j69J71Qj70N9O5p9O7o1L9j7Rj09J29l9qL6
$$ 87 -19 37 -16 6 -42 -140 -3 70 -52 18 48 -121 50 58 -112 -53 12 -67 0 -61 -22 -39 -30 -139 -10 -49 -57 -21
5250b1mJ08o0r8O9JP3K2k12J77L2j33Q6k3p6K5OJ0j8k8Kq5J62J2j82R6k1J06n1
$$ -21 -25 83 23 -75 -6 -5 68 90 -122 55 87 -46 40 17 -59 -34 -28 -18 -36 -64 -62 -147 15 27 -155 -59 -80 26 -25
5279b5k5J40j71R6j5q2P8M2q7J50p7p5jJ2L2M4n1N6P1rN4j93N4K12k58R1o3l5
$$ -25 -50 90 -81 15 0 -82 -4 38 -49 101 24 -51 -52 -40 -8 36 -15 41 112 103 157 -36 18 230 -28 63 0 -35
5307c5N0k8J3kpn5J86k31J10J6nk3k3N0j02MJJ44l9k0J9q7M7j0Km1j1P0P1j73
$$ -35 15 -13 0 -2 -9 -64 122 -109 1 17 12 -11 -34 16 -86 -82 -81 63 24 4 23 -64 -17 -27 -25 -66 -77 -7 64 -109
5337a09J40m8P3m8O7l8j93K44j01J72r1K8n7l2J4Rm8P7j00L2L0M5l3lm7j2q7O7
$$ -109 31 -17 56 8 75 37 -156 88 -13 159 68 96 39 7 21 30 -18 59 -41 -9 21 66 33 30 -17 -29 -116 -49
5365d9n9J48J23j20q3R0j3m6j8O7o8n3J5p0J69n3K9P1M8j42p2N3JQ4m1o0P5P1
$$ -49 -108 40 163 43 -40 50 37 -9 -27 40 -28 -81 -66 -136 33 -20 9 80 128 -14 -86 -33 -32 52 11 -49 26 97
5393I7j49j0L5J31k0l7r0n6J83p2Jm2O6K8m8l7l0k2J6j1L4J4k9J28j68J26K0k9
$$ 97 -52 -62 -27 104 84 47 -43 -99 84 12 13 -29 37 65 17 -20 -50 -72 -56 -67 -33 -19 -48 80 -88 38 58 29
5421B9nk0M0OO6j04j58J32Km0K05j44JO2j61J44j6j20JlJ33k0o1J5l6o2N2R9j33
$$ 29 24 4 44 50 116 12 -146 -14 -12 -52 153 9 10 72 -89 55 39 -81 -80 -83 50 30 -31 -16 -52 -114 -62 37 -96
5450i6kJ44n7k9q2P5N7l4r9J80j6j1Qj10R6q0J22p9m8K28p0j96J67q5j3J9L3j61
$$ -96 -98 46 -11 -40 -122 -47 10 -24 -123 57 41 30 38 -72 24 -56 66 -13 -61 167 97 -99 68 -17 -30 -11 22 -139
5478a39N7K12j96P7m5J2J03k44Q3M0j9R1k23K28K2j21r9K76j58K1J37m0k81K31
$$ -139 -82 130 -66 11 -34 -22 81 -163 -80 -40 -59 32 -191 37 59 -62 -161 115 -43 -22 115 75 -206 25
5502B5q9J14J6n3n5P1L1l4M6r3o1J05n1o0m5N2JJ63n0m6K5r1Q7q7O0k2M3m4n6
$$ 25 -64 50 66 13 -42 29 60 26 72 -21 -82 23 -28 -88 -133 -81 -80 83 33 -13 12 -79 8 -79 -19 -41 2 -42 -98
5531i8J44M2j72P9J04Nj5k7j5k8j01R2j1J75r8o8j1q8k1K86j97k1j9J71k33K18
$$ -98 46 88 -84 -5 99 104 89 62 47 19 -82 10 -1 174 76 8 -3 -91 -112 174 -23 -44 -63 108 -125 93
5557I3k04K10j82k6k9J12L4r2J05M8p8Q8M9j11Pj8L5l2m2M6P6q2J02j56qK9L3
$$ 93 -111 99 -83 -109 -138 -26 8 -84 21 69 -9 79 128 17 24 6 41 9 -33 13 89 7 109 -47 -55 -26 7
5584Gp0j5Q8M2q2o0O2L7L0k3m7oJ46j46l3o5J66ljRkK1r4J14J00j95J09R9k25
$$ 7 -63 -78 10 52 -30 -90 -28 9 39 16 -31 -37 109 -37 -70 -135 31 28 27 36 34 55 -39 75 175 -20 89 188 -37
5613c7PK9m6K7P1o5qK7n4K2J16j87O6M0J4q4L3j20J31K5J7j29N8J0N9L7r1R0k00
$$ -37 -30 -1 -47 -20 51 -14 -22 5 -49 -27 89 -98 -32 8 22 -62 -29 -149 -18 7 24 -105 -47 -37 22 59 -32 58 -142
5642a42m9J44R0r5K9N3l1O5r2j85J83Q0m9J6j27J67j0n1m7K04j73n8M4o1Q6n7
$$ -142 -191 -47 43 -52 -23 30 -1 64 -28 -213 -30 50 1 17 -110 57 47 -4 -51 153 -20 -78 -34 -95 -9 -66
5668f6l9J00j11J85J40j77j6J7p6N8j07K3J25r6M7k1l5J26q8l7Q3%p3Q7j5K9p7
$$ -66 -105 -5 -116 69 209 32 16 33 -43 15 -92 -69 56 -40 7 -14 -49 77 -11 -48 35 35 -38 49 34 63 -14
5695a4LJ05r0J33k69K21p1j19L5rM6qmn6R1%Q6Oj09P5p8L6m0m8J14MLp4MN4m3
$$ -14 -11 94 4 137 -132 89 18 -101 -66 -75 -29 -37 -41 -97 -6 -6 80 86 -23 52 -26 10 -30 -78 36 40 43 -31 -27 27 -16
5726a6j00J24J0J8j74R4J12j38M9M3r3K47j21p8O0j19Q7o6J00k7l9m5P6k3R4j52
$$ -16 -116 8 18 36 -138 -44 68 -70 -21 22 -71 176 55 -23 37 -82 5 -61 39 12 -27 -72 4 -19 75 -77
5752g7J49j07m2J66m0q0N9J06j31j13J10L2M1Nj73K28nk41J44L7l2m8Nl0j6J7
$$ -77 72 -35 -77 89 49 -31 28 134 3 -110 0 32 73 78 -95 133 128 -113 31 68 36 -12 -7 -37 -53 -36
5778c6PJ3L3j29J76r1o7K6L5LJ47j27j93J71K9k5l4Q1M0r8K9j86K38J53k09n0
$$ -36 -29 -16 17 -112 64 -27 -94 -68 -33 -30 117 -10 -203 -32 -3 -28 -62 19 59 -39 -10 -196 42 195 -14 -64
5804f4j1L0P3n4kK5qK7Rp1k0N7j19R3j9J29o8j32NR5j6N6j9j5j0j16N5j1J18m9
$$ -64 -75 -45 28 -26 -28 -3 -11 16 25 -46 -66 -9 -128 -35 -54 75 7 -125 -120 -25 -41 15 -4 -19 -29 -145 -90 -101 17 -32
5834c2L9jq2J45o9K6q9K4N5j16K7M7j7K0q4J79j42m4J39J3M5p3m0n7N7l5O6Q0
$$ -32 7 6 -76 69 0 26 -63 -39 16 -100 -73 -26 -43 -23 -107 72 -70 -114 25 38 83 10 -30 -87 -30 -65 1 81
5862H1O5j56J9o8o3J45j9j3J8j0l2O8j15R9Q2m9p6k9J16lj7K8p8R9l8K1j1j47
$$ 81 146 -10 9 -59 -122 23 4 -9 9 -1 -33 35 -80 19 101 52 -24 -53 63 60 43 71 -7 92 54 75 64 -83
5890h3J49j6q0nK8k9N1j05L4J05Pl5J04j15o5K3P5j7ml7PL1r0J21r5O4qJ1J3n5
$$ -83 66 50 -30 -35 -7 -36 15 -90 -56 49 56 21 125 10 -55 -32 43 26 22 -15 -8 23 -67 54 -41 23 15 26 39 -16
5920a6M6l9M5n4K0J04m4j8j04mM6m3P2j6Jj3l9M5m5L7L4J9q5P5j28m6K3J86j05
$$ -16 30 -9 36 -18 2 106 62 44 -60 -64 -18 -61 11 -5 -4 -17 -56 -11 -56 -19 15 34 -51 24 -104 -150 -127 59 -46
5949d6M6m1n9J17P5j51j03J70M4j0j20P7L9m7M1l0J06q7nk5L0K5k7Jm7L4O5l4
$$ -46 0 -41 -100 17 92 -59 -162 8 52 42 -78 -1 38 -9 32 2 108 21 16 -9 21 46 19 20 -27 7 72 38
5977C8J9p3p9J22p5M3lj16R6Q5o4L3j1Q1j51j6L7L0j66J32O4k4o1R9J59k13m5
$$ 38 57 -16 -95 27 -48 -5 -8 -124 -28 57 -7 26 15 96 -55 -71 -34 -4 -170 -38 26 2 -59 40 199 -14 -59
6004e9M4L9o3r2R5N9n3P5L0q8J19r4lM2q5l9J22nq8KN6Pj19O9L3J02l9n3ml5P
$$ -59 -15 24 -39 -131 -36 23 -30 45 75 -13 106 12 9 51 -34 -73 49 44 -44 -42 14 21 -98 -29 4 106 67 14 10 -25 -18
6035a8N5rK9o0K1j03J27j10J20o3p9J16J13oj09J4j01O9m6J41Oj43L0Q6j19K09
$$ -18 37 28 57 -3 18 -85 42 -68 52 -11 -90 26 139 133 24 38 -63 6 -40 101 107 -36 -6 80 -39 170
6061A70j64m2J33j15O7K5M0k27J10N6O7k42J46j4K2qm9K9O7p2K8q4l0l1Q1M0J9
$$ 170 6 -36 97 -18 49 74 114 -113 -3 53 120 -122 24 10 32 24 -25 4 71 -1 27 -57 -87 -118 -37 3 22
6088B2j66Q0m6J6J65j77J34p0R6p6Qm4M1J8j4Nko1k5k2N9R0j25K24j42p0n2J84
$$ 22 -144 -64 -110 -94 71 -106 28 -42 54 -22 -14 -58 -17 1 -13 -8 -10 -71 -96 -118 -59 31 -94 130 -12 -82 -134 50
6116E0r2n9Q1M3M0j73Q1N8j49R4m9J00m6Q4n6O4j18L9N7k0m7P6J15k72J15no4
$$ 50 -42 -101 -20 23 63 -110 -29 29 -120 -26 -75 25 -21 63 7 71 -47 -8 49 29 -18 58 173 -99 16 11 -53
6143e3o8J35j29R7J9p4M3p2K61k35l0Q4K5N9r4K6J4J9rj23N9mJ52j32nJ18p6M1
$$ -53 -121 14 -115 -18 1 -73 -30 -102 159 -76 -106 -22 3 62 -32 -6 8 27 18 -105 -46 -50 102 -30 -35 83 7 48
6171D8j5L1j37k9J9m2J41j4l6RO4p9OK7J05n3q2q9J03M3p6P3r2O1o5J9N6n5J44
$$ 48 33 64 -73 -102 -83 -125 16 2 -34 -25 39 -40 -34 -7 98 45 -37 -126 -23 20 -56 17 -75 -14 -79 -60 -4 -59 85
6200H5j72p9J86J8r9M5J16k06L9J0Qn8m9J39O7j15Q6rl8l2jn2r3J64J44m8M4q3
$$ 85 -87 -166 20 38 -61 -16 100 -106 -67 -57 -49 -107 -156 -17 50 -65 21 12 -26 -58 -59 -111 -204 -40 104 56 100 17
6228A7J06k3q5J30pk7j59J14k66K00k3O9j1R6q5J2o5r4L4J16J4j25J00j08r4J70
$$ 17 123 100 15 145 138 111 -48 66 -200 0 -23 46 35 131 46 58 -7 -101 -67 49 63 -62 38 -70 -164 6
6254FQ8j63j3q9J55R5r6J07q5l8k4M1pJ36l1j2o8lm6j0J76j42o9P4M4j09L1K4
$$ 6 94 -69 -82 -171 -16 79 -17 90 5 -33 -57 -16 -23 113 82 70 2 -1 -47 -57 119 -23 -92 -18 26 -83 -52 -28
$$ [...]
8191f1
##END NTUPLES=NMR FID
##END=
