##TITLE=1H ikalashn
D7-2
23.10.2024
##JCAMPDX= 6.0         $$ Bruker NMR JCAMP-DX V2.0
##DATA TYPE= NMR FID
##DATA CLASS= NTUPLES
##ORIGIN= UXNMR, Bruker Analytische Messtechnik GmbH
##OWNER= root
$$ TOPSPIN		Version 1.3
$$ 2024-10-23 16:15:12.203 +0400  Irina@DPX200
$$ Compression mode = diff/dup
##.OBSERVE FREQUENCY= 200.131300845
##.OBSERVE NUCLEUS= ^1H
##.DELAY= (6, 6)
##.ACQUISITION MODE= SIMULTANEOUS
##.ACQUISITION SCHEME= undefined
##.AVERAGES= 16
##.DIGITISER RES= 18
##SPECTROMETER/DATA SYSTEM= spect
##.PULSE SEQUENCE= zg
##.SOLVENT NAME= CDCl3
##.SHIFT REFERENCE= INTERNAL, CDCl3, 1, 17.49637
##AUDIT TRAIL= $$ (NUMBER, WHEN, WHO, WHERE, WHAT)
$$ ##TITLE= Audit trail, TOPSPIN		Version 1.3
$$ ##JCAMPDX= 5.01
$$ ##ORIGIN= Bruker BioSpin GmbH
$$ ##OWNER= Irina
$$ $$ F:/spectra/data/iren/nmr/1H/4/audita.txt
$$ ##AUDIT TRAIL=  $$ (NUMBER, WHEN, WHO, WHERE, VERSION, WHAT)
(   1,<2024-10-23 16:14:34.843 +0400>,<Irina>,<DPX200>,<TOPSPIN 1.3>,
      <created by zg
	started at 2024-10-23 16:13:26.953 +0400,
	POWCHK disabled, PULCHK disabled
       configuration hash MD5:
       BE 6D 3F 07 2A EA 11 49 91 17 2B D3 AF B3 58 0D
       data hash MD5: 16K
       FB A5 85 96 F3 5F 33 CF AA A1 B5 03 65 AB 13 AD>)
$$ ##END=
$$ 
$$ $$ hash MD5
$$ $$ BC 92 AF 21 B8 7B 92 A5 1C C7 DD 64 75 45 68 0E
##$RELAX= 
##$RELAX= 
##$RELAX= 
##$RELAX= 
##$RELAX= 
##$RELAX= 
##$RELAX= 
##$RELAX= 
##$RELAX= 
$$ Bruker specific parameters
$$ --------------------------
##$DU= <F:/spectra>
##$EXPNO= 4
##$NAME= <1H>
##$PROCNO= 1
##$TYPE= <nmr>
##$USER= <iren>
##$AMP= (0..31)
100 100 100 100 100 100 100 100 100 100 100 100 100 100 100 100 100 100 
100 100 100 100 100 100 100 100 100 100 100 100 100 100 
##$ANAVPT= -1
##$AQSEQ= 0
##$AQ_mod= 1
##$AUNM= <au_zg>
##$AUTOPOS= <>
##$BF1= 200.13
##$BF2= 200.13
##$BF3= 200.13
##$BF4= 200.13
##$BF5= 200.13
##$BF6= 200.13
##$BF7= 200.13
##$BF8= 200.13
##$BYTORDA= 1
##$CFDGTYP= 0
##$CFRGTYP= 5
##$CHEMSTR= <none>
##$CNST= (0..63)
1 1 145 1 1 1 1 1 1 1 1 1 1 1 1 1 1 1 1 1 1 1 1 1 1 1 1 1 1 1 1 1 1 1 
1 1 1 1 1 1 1 1 1 1 1 1 1 1 1 1 1 1 1 1 1 1 1 1 1 1 1 1 1 1 
##$CPDPRG= <>
##$CPDPRG1= <>
##$CPDPRG2= <>
##$CPDPRG3= <>
##$CPDPRG4= <mlev>
##$CPDPRG5= <mlev>
##$CPDPRG6= <mlev>
##$CPDPRG7= <mlev>
##$CPDPRG8= <mlev>
##$CPDPRGB= <>
##$CPDPRGT= <>
##$D= (0..63)
0 2 0 0 0 0 0 0 0 0.06 0 0.03 0 0 0 0 0.0002 0 0 0 0 0 0 0 0 0 0 0 0 0 
0 0 0 0 0 0 0 0 0 0 0 0 0 0 0 0 0 0 0 0 0 0 0 0 0 0 0 0 0 0 0 0 0 0 
##$DATE= 1729685671
##$DBL= (0..7)
120 120 120 120 120 120 120 120 
##$DBP= (0..7)
150 150 150 150 150 150 150 150 
##$DBP07= 0
##$DBPNAM0= <>
##$DBPNAM1= <>
##$DBPNAM2= <>
##$DBPNAM3= <>
##$DBPNAM4= <>
##$DBPNAM5= <>
##$DBPNAM6= <>
##$DBPNAM7= <>
##$DBPOAL= (0..7)
0.5 0.5 0.5 0.5 0.5 0.5 0.5 0.5 
##$DBPOFFS= (0..7)
0 0 0 0 0 0 0 0 
##$DE= 6
##$DECBNUC= <off>
##$DECIM= 32
##$DECNUC= <off>
##$DECSTAT= 4
##$DIGMOD= 1
##$DIGTYP= 9
##$DL= (0..7)
0 120 120 120 120 120 120 120 
##$DP= (0..7)
150 150 150 150 150 150 150 150 
##$DP07= 0
##$DPNAME0= <>
$$ [...]
##$SW= 21.9926040160658
##$SWIBOX= (0..15)
0 0 2 0 0 0 0 0 0 0 0 0 0 0 0 0 
##$SW_h= 4401.40845070422
##$TD= 16384
##$TD0= 1
##$TE= 300
##$TE2= 300
##$TE3= 300
##$TEG= 300
##$TL= (0..7)
0 120 120 120 120 120 120 120 
##$TP= (0..7)
150 150 150 150 150 150 150 150 
##$TP07= 0
##$TPNAME0= <>
##$TPNAME1= <>
##$TPNAME2= <>
##$TPNAME3= <>
##$TPNAME4= <>
##$TPNAME5= <>
##$TPNAME6= <>
##$TPNAME7= <>
##$TPOAL= (0..7)
0.5 0.5 0.5 0.5 0.5 0.5 0.5 0.5 
##$TPOFFS= (0..7)
0 0 0 0 0 0 0 0 
##$TUNHIN= 0
##$TUNHOUT= 0
##$TUNXOUT= 0
##$USERA1= <user>
##$USERA2= <user>
##$USERA3= <user>
##$USERA4= <user>
##$USERA5= <user>
##$V9= 5
##$VALIST= <valist>
##$VCLIST= <CCCCCCCCCCCCCCC>
##$VD= 0
##$VDLIST= <DDDDDDDDDDDDDDD>
##$VPLIST= <PPPPPPPPPPPPPPP>
##$VTLIST= <TTTTTTTTTTTTTTT>
##$WBST= 1024
##$WBSW= 25
##$XGAIN= (0..3)
0 0 0 0 
##$XL= 0
##$YL= 0
##$YMAX_a= 332161
##$YMIN_a= -487178
##$ZGOPTNS= <>
##$ZL1= 120
##$ZL2= 120
##$ZL3= 120
##$ZL4= 120
##$ABSF1= 10
##$ABSF2= 0
##$ABSG= 5
##$ABSL= 3
##$ALPHA= 0
##$AQORDER= 0
##$ASSFAC= 0
##$ASSFACI= 0
##$ASSFACX= 0
##$ASSWID= 0
##$AUNMP= <proc_1d>
##$AXLEFT= 0
##$AXRIGHT= 0
##$AXTYPE= 0
##$AXUNIT= <>
##$AZFE= 0.1
##$AZFW= 0.1
##$BCFW= 1
##$BC_mod= 2
##$BYTORDP= 1
##$COROFFS= 0
##$CY= 7568.61572265625
##$DATMOD= 1
##$DC= 2
##$DFILT= <>
##$DTYPP= 0
##$F1P= 17.9538593292236
##$F2P= -4.03888763876832
##$FCOR= 0.5
##$FTSIZE= 32768
##$FT_mod= 4
##$GAMMA= 1
##$GB= 1
##$INTBC= 1
##$INTSCL= 1
##$ISEN= 128
##$LB= 0.02
##$LEV0= 0
##$LPBIN= 0
##$MAXI= 945.577
##$MC2= 0
##$MEAN= 0
##$ME_mod= 0
##$MI= -402.1523
##$NCOEF= 0
##$NC_proc= 0
##$NLEV= 6
##$NOISF1= 8.587773
##$NOISF2= 6.764455
##$NSP= 1
##$NTH_PI= 0
##$NZP= 0
##$OFFSET= 17.49637
##$PC= 1
##$PHC0= -39.08723
##$PHC1= -1.886807
##$PH_mod= 0
##$PKNL= yes
##$PPARMOD= 0
##$PPDIAG= 0
##$PPIPTYP= 0
##$PPMPNUM= 100
##$PPRESOL= 1
##$PSCAL= 0
##$PSIGN= 0
##$REVERSE= no
##$SF= 200.13
##$SI= 32768
##$SIGF1= 18.5376
##$SIGF2= -6.396296
##$SINO= 400
##$SIOLD= 32768
##$SREGLST= <1H.CDCl3>
##$SSB= 3
##$STSI= 0
##$STSR= 0
##$SW_p= 4401.40845070422
##$SYMM= 0
##$S_DEV= 0
##$TDeff= 0
##$TDoff= 0
##$TI= <>
##$TILT= no
##$TM1= 0
##$TM2= 0
##$TOPLEV= 0
##$USERP1= <user>
##$USERP2= <user>
##$USERP3= <user>
##$USERP4= <user>
##$USERP5= <user>
##$WDW= 1
##$XDIM= 8192
##$YMAX_p= 0
##$YMIN_p= 0
$$ End of Bruker specific parameters
$$ ---------------------------------
##NTUPLES= NMR FID
##VAR_NAME=  TIME,          FID/REAL,        FID/IMAG
##SYMBOL=    X,             R,               I
##VAR_TYPE=  INDEPENDENT,   DEPENDENT,       DEPENDENT
##VAR_FORM=  AFFN,          ASDF,            ASDF
##VAR_DIM=   8192,          8192,            8192
##UNITS=     SECONDS,       ARBITRARY UNITS, ARBITRARY UNITS
##FACTOR=    0.0002272,     1,               1
##FIRST=     0,             0,               0
##LAST=      1.8609952,     38,              -25
##MIN=       0,             -487178,         -487178
##MAX=       1.8609952,     332161,          332161
$$ Real data points
##PAGE= N=1
##DATA TABLE= (X++(R..R)), XYDATA
$$ plain form
0 0 0 0 0 0 0 0 0 0 0 0 0 0 0 16 -16 16 -16 16 -32 32 -32 48 -48 64 -80 81 -96 112 -129 146 -176 193 -225 257
34 257 -289 321 -369 407 -455 513 -566 630 -700 774 -857 950 -1047 1156 -1273 1401 -1545
51 -1545 1701 -1873 2067 -2286 2532 -2807 3126 -3493 3926 -4446 5080 -5875 6908 -8308 10324
66 10324 -13492 19220 -32858 133811 -53136 -446523 -208246 180678 332161 83895 -167490
77 -167490 -194459 -16251 80736 72862 57667 71815 -29058 -171199 -160103 56353 222576
88 222576 139630 -126812 -260990 -93178 191480 237561 19531 -173227 -140297 5163 92780
99 92780 77431 22005 -22388 -46510 -59013 -17885 84838 130808 12260 -143509 -130021 30923
111 30923 124710 56089 -61833 -81735 -2201 51895 11745 -27626 19050 58043 -17485 -107835
$$ packed form
0@%%%%%%%%%%%%%J6l2L2l2L2m8O4o4Q0r6J12j44J61j77K08k41K75l22L69m18M82
34B57n46O10o90P76q62R68j079J196j330J474j631J807j997K203k429K674k946
51a545L246l574L940m353M818n339N933o619P419q372R526j0955J2783j5216J8632
66A0324k3816L2712n2078J66669j86947l93387K38277L88924J51483k48266k51385
77a67490k6969J78208R6987p874j5195J4148j00873j42141J1096K16456J66223
88B22576q2946k66442j34178J67812K84658M6081k18030j92758L2930J45460Q7617
99I2780j5349n5426m4393k4122j2503M1128J02723M5970j18548j55769J3488J60944
111C0923R3787o8621j17922j9902P9534N4096m0150l9371M6676L8993p5528r0350
$$ plain form
123 -107835 -57766 82137 127406 19250 -107624 -92578 48828 125916 32232 -88639 -64799
134 -64799 37452 46700 -33273 -57138 23483 92179 30636 -102479 -116129 40045 157031
145 157031 57878 -125671 -144692 12311 136166 89906 -45074 -96299 -17450 62276 36799
156 36799 -22551 -11474 24624 -2358 -51722 -30655 45621 77416 15168 -74678 -77440 18421
168 18421 84061 31053 -56313 -60267 -148 34183 20580 -1093 -1633 8468 -1587 -26173 -14247
181 -14247 36400 45341 -16010 -58075 -16565 46016 45657 -7844 -42207 -16417 29649 23262 -29590
194 -29590 -40925 13470 44315 1206 -46024 -27346 27720 46812 7526 -39916 -32047 18272
206 18272 32272 -6346 -23038 11264 30834 -2465 -35304 -14010 38155 51547 -5806 -71344
$$ packed form
123a07835N0069J39903M5269j08156j26874J5046J41406P7088r3684j20871K3840
134f4799J02251R248p9973k3865Q0621O8696o1543j33115j3650J56174J16986
145A57031r9153j83549j9021J57003J23855m6260j34980n1225P8849P9726k5477
156C6799n9350J1077L6098k6982m9364K1067P6276L1795o2248q9846k762R5861
168A8421O5640n3008q7366l954O0119L4331j3603k1673n40J0101j0055k4586J1926
181a4247N0647Q941o1351m2065M1510O2581l59n3501l4363K5790M6066o387n2852
194b9590j1335N4395L0845m3109m7230J8678N5066J9092l9286m7442P869N0319
206A8272J4000l8618j6692L4302J9570l3299l2839K1294N2165J3392n7353o5538
$$ plain form
218 -71344 -51851 37328 75462 14058 -57370 -52248 6156 45084 30769 -11071 -30460 -15498
230 -15498 -1773 -1603 12867 33398 14900 -31883 -41799 3714 50794 44855 -12176 -59685 -38238
243 -38238 28152 53331 12962 -28906 -27717 -5764 9094 14159 10890 594 -13425 -27234 -21688
256 -21688 16209 47141 20013 -35598 -43503 4040 43787 33204 -10390 -38962 -20726 18734
268 18734 27332 3377 -9277 -2098 -2149 -8459 -1204 11553 10331 -5588 -22850 -21059 7759 30897
282 30897 11826 -23386 -22558 7551 21615 8173 -10204 -13642 570 13621 4486 -10026 -326
295 -326 16822 7508 -13108 -11186 6013 11281 897 -12857 -14342 2365 15225 2878 -13912
308 -13912 -5776 9729 5038 -7693 -7531 990 6847 5062 -5014 -8783 6125 18016 4660 -12369
$$ packed form
218g1344J9493Q9179L8134o1404p1428N122N8404L8928j4315m1840j9389J4962
230a5498J3725J70J4470K0531j8498m6783r916M5513M7080n939n7031m7509K1447
243c8238O6390K5179m0369m1868J189K1953J4858N065l269j0296j4019j3809N546
256b1688L7897L0932k7128n5611p905M7543L9747j0583m3594k8572J8236L9460
268A8734Q598k3955j2654P179n1o310P255J2757j222j5919j7262J791K8818K3138
282C0897j9071l5212Q28L0109J4064j3442j8377l438J4212J3051r135j4512R700
295c26J7148r314k0616J922J7199N268j0384j3754j485J6707J2860j2347j6790
308a3912Q136J5505m691j2731J62Q521N857j785j0076l769J4908J1891j3356j7029
$$ plain form
322 -12369 -6396 7622 7735 -1420 -7790 -6389 3463 8627 -2316 -10601 681 9855 -1791 -13137
336 -13137 -5531 6072 6772 -905 -8733 -6118 9235 15582 365 -11751 -2608 8314 4632 -1477
350 -1477 -2124 -1673 900 3425 -762 -2588 4573 4499 -8395 -11945 950 8474 1869 -6689 -9215 -2953
366 -2953 9613 11746 -2986 -11287 -439 7975 2644 -1753 620 1219 633 1407 146 1031 6132
381 6132 2479 -9289 -8784 4055 6969 -2216 -7008 -4852 -464 5305 5218 -3912 -7062 1212 4457
396 4457 -1351 -2010 2634 1993 -65 1332 1749 2108 5026 1698 -6883 -4668 5736 5202 -4251 -6485
412 -6485 -1823 1732 3635 1604 -5243 -5901 1317 2655 -2527 -1327 2600 -305 -2573 1744 4617
427 4617 3066 2266 -625 -4874 -774 7010 4218 -4013 -4216 -225 1085 2520 2386 -2787 -5015 -967
$$ packed form
322a2369N973J4018J13r155o370J401R852N164j0943q285J1282R174j1646j1346
336a3137P606J1603P00p677p828K615J5353O347j5217j2116R143J0922l682o109
350a477o47M51K573K525m187j826P161p4j2894l550J2895P524o605q558k526O262
366b953J2566K133j4732q301J0848Q414n331m397K373N99n86P74j261Q85N101
381F132l653j1768N05J2839K914r185m792K156M388N769q7r130l150Q274L245
396D457n808o59M644o41k058J397M17L59K918l328q581K215J0404n34r453k234
412f485M662L555J903k031o847o58P218J338n182J200L927k905k268M317K873
427D617j551q00k891m249M100P784k792q231k03L991J310J435j34n173k228M048
$$ plain form
443 -967 -482 -3422 -153 4103 -557 -5286 -1808 2829 4133 4469 769 -5467 -3515 4299 5285 1344
459 1344 830 -283 -3641 -1533 4395 3942 -387 -2757 -5313 -6224 361 6771 2801 -4272 -5341 -3540
475 -3540 49 6282 6833 -1503 -7206 -4212 834 5569 9127 4529 -6626 -8714 771 8110 7357
490 7357 1658 -6634 -10618 -3132 6589 6496 963 -3136 -7038 -7477 883 9200 6307 -2408 -8210 -8825
506 -8825 -1187 11767 13761 159 -11519 -8680 2043 10906 11275 1 -11912 -9300 2329 7551
520 7551 5586 2081 -4353 -9646 -5868 2734 6673 4964 -485 -9253 -11219 399 12562 10845 152
535 152 -8957 -10858 -1260 12856 13805 -703 -11174 -8075 531 7684 9358 2153 -7346 -7936 -2961
550 -2961 803 4165 6541 598 -8966 -9730 -2062 6434 11276 6690 -8204 -16097 -4335 12862 15478
$$ packed form
443i67M85k940L269M256m660m729L478M637J304L36l700o236J952P814R86l941
459A344n14j113l358K108N928m53m329k370k556r11O585O410l970p073j069J801
475c540L589O233N51q336n703K994N046M735L558m598j1155k088R485P339p53
490G357n699q292l984P486R721r3n533m099l902m39Q360Q317k893q715n802o15
506h825P638J2954J994j3602j1678K839J0723Q863L69j1274j1913K612J1629N222
520G551j965l505o434n293L778Q602L939j709n449q768j966J1618J2163j717j0693
535A52r109j901R598J4116R49j4508j0471L099Q606P153J674p205r499n90M975
550b961L764L362K376n943r564p64P668Q496M842m586j4894p893J1762J7197K616
$$ plain form
565 15478 3741 -9572 -13121 -2039 12458 12068 -490 -7447 -5579 -3510 -497 5148 6355 970
579 970 -5689 -10093 -8102 4720 16142 8298 -10814 -17781 -6190 11129 18651 7413 -12837 -17367
593 -17367 -497 14514 11869 1237 -6221 -8143 -3905 3335 5788 4203 2210 -4032 -11745 -7866
607 -7866 6465 13443 5832 -7329 -15606 -10449 7643 19527 8832 -10898 -16190 -4790 10034
620 10034 15985 6971 -8773 -12518 -2046 6501 6215 4019 742 -5250 -7744 -3810 1999 7583 8692
635 8692 -1912 -15844 -13481 4754 17168 11121 -5954 -17863 -10997 10052 20099 6541 -10794
648 -10794 -11752 -1798 6087 7906 4379 -1199 -3105 -3515 -5637 -1582 9183 10798 -3286 -15935 -12207
663 -12207 3067 15967 12988 -5724 -19725 -10507 9625 16013 6185 -6526 -11630 -5612 6431
$$ packed form
565A5478j1737j3313l549J1082J4497l90j2558o957J868K069L013N645J207n385
579I70o659m404J991J2822J1422p844j9112o967J1591J7319P522j1238k0250m530
593a7367J6870J5011k645j0632p458j922M238P240K453j585j993o242p713L879
607g866J4331O978p611j3161q277N157J8092J1884j0695j9730n292J1400J4824
620A0034N951r014j5744l745J0472Q547k86k196l277n992k494L934N809N584J109
635H692j0604j3932K363J8235J2414o047j7075j1909O866K1049J0047j3558j7335
648a0794r58R954P885J819l527n578j906m10k122M055J0765J615j4084j2649L728
663a2207J5274J2900k979j8712j4001R218K0132O388r828j2711n104O018J2043
$$ plain form
676 6431 10863 4788 -1450 -3361 -5367 -4705 3121 8913 5271 -3309 -9856 -9736 637 12917 10617
691 10617 -4704 -14670 -9978 2700 12758 10854 -3690 -14579 -7515 7262 12090 6168 -2506
704 -2506 -7671 -5248 2361 5617 3193 1745 53 -5551 -7519 396 8541 7177 -2032 -10793 -11124
719 -11124 980 13066 8966 -5645 -11699 -4560 5283 9272 4990 -4058 -6970 -963 3807 2401
733 2401 1999 3336 389 -4477 -4207 225 4549 5523 -395 -8702 -7796 2076 7636 3444 -2699 -5640
749 -5640 -4555 1073 5990 3444 -2045 -2864 -1115 118 2208 4044 1863 -856 -899 -1418 -1813 1674
765 1674 4481 1022 -4023 -4309 -1752 1594 4496 2361 -4361 -6586 -1537 3182 3747 1784 -1998 -4322
781 -4322 -852 4038 3345 429 317 -129 -2226 -1150 2686 3748 1624 -1391 -4446 -3404 2627 5497
$$ packed form
676F431M432o075o238j911k006O62P826N792l642q580o547J20J0373J2280k300
691A0617j5321r966M692J2678J0058j904j4544j0889P064J4777M828n922q674
704b506n165K423P609L256k424j448j692n604j968P915Q145j364r209q761l31
719a1124J2104J2086m100j4611o054P139R843L989m282r048k912O007M770j406
733B401m02J337k947m866K70M432M324R74n918q307R06R872N560m192o143k941
749e640J085N628M917k546n489q19J749J233K090J836k181k719m3n19l95L487
765A674K807l459n045k86K557L346K902k135o722k225N049M719N65j963l782k324
781d322L470M890o93k916j12m46k097J076L836J062k124l015l055J042O031K870
$$ plain form
797 5497 361 -4909 -4221 -1116 1485 3483 1579 -2976 -3654 -196 1849 1927 2379 733 -2332 -1649 1408
814 1408 2473 2218 1581 -1443 -3846 -671 3357 2034 -1149 -2055 -2315 -1591 1054 1968 -583 -1965 -1159
831 -1159 -1023 -333 2171 2076 -1150 -1438 716 949 432 1777 1364 -842 -888 468 305 522 1562 -242
849 -242 -2603 -1370 583 100 -219 253 -1458 -2597 3 1828 253 -482 -16 -904 -756 1688 2194
866 2194 247 -73 281 -639 196 2510 1416 -1701 -1487 139 -143 214 1016 -597 -2472 -1043 537
883 537 29 200 358 -1672 -1877 1030 2151 366 -176 295 -599 -18 2346 1825 -852 -951 337 58
901 58 785 1568 -555 -2394 -619 989 -257 -618 -279 -1607 -1717 799 1410 -646 -794 238 -214 66
919 66 1789 971 -1039 -187 1102 399 578 1560 -99 -1697 36 1260 -267 -670 -272 -1215 -1444 578
$$ packed form
797E497n136n270O88L105K601J998j904m555o78L458K045P8M52j646l065O83L057
814A408J065k55o37l024k403L175M028j323l183r06k60P24K645R14k551j382Q06
831a159J36O90K504r5l226k88K154K33n17J345m13k206m6J356j63K17J040j804
849b42k361J233J953m83l19M72j711j139K600J825j575p35M66q88J48K444N06
866B194j947l20L54r20Q35K314j094l117K14J626k82L57Q02j613j875J429J580
883E37n08J71J58k030k05K907J121j785n42M71q94N81K364n21k677r9J288k79
901E8P27P83k123j839J775J608j246l61L39j328j10K516O11k056j48J032m52K80
919F6J723q18k010Q52J289p03J79R82j659j598J733J224j527m03L98r43k29K022
$$ plain form
937 578 886 -1064 -1004 124 -625 -212 1274 601 -1196 -94 1237 390 408 1485 346 -1032 531 1400
955 1400 -41 -355 350 -779 -1147 637 595 -1316 -950 234 -715 -790 701 -20 -1442 -256 1213 50
973 50 -166 1056 365 -462 762 1225 -182 69 983 -184 -772 634 752 -934 -852 72 -671 -894 360
992 360 -136 -1377 -404 463 -474 -336 910 267 -768 379 1011 66 477 1302 -33 -860 770 1180
1010 1180 -157 -182 247 -814 -974 439 265 -911 -404 -243 -1315 -631 1309 580 -1314 -701 231 256
1028 256 798 1394 -130 -1016 492 1144 213 645 1019 -586 -1412 11 649 83 298 -443 -2169 -1235
1046 -1235 1133 1034 -853 -1130 -628 -665 305 1561 444 -724 -102 180 -195 1311 2210 139 -1641 -456
1064 -456 975 931 982 181 -1734 -1505 438 500 -499 -15 53 -1594 -1543 348 1074 698 332 -1276 -1902 718
$$ packed form
937E78L08j950O0J128p49M13J486o73j797J102J331q47J8J077j139j378J563Q69
955A400j441l14P05j129l68J784m2j911L66J184r49p5J491p21j422J186J469j163
973E0k16J222o91q27J224M63j407K51R14j167n88J406J18j686Q2R24p43k23J254
992C60m96j241R73Q67r37J38J246o43j035J147O32r45M11Q25j335q27J630M10
1010A180j337k5M29j061j60J413j74j176N07J61j072O84J940p29j894O13R32K5
1028B56N42N96j524q86J508O52r31M32L74j605q26J423O38n66K15p41j726R34
1046a235K368r9j887k77N02l7R70J256j117j168O22K82l75J506Q99k071j780J185
1064d56J431m4N1q01j915K29J943O2r99M84O8j647N1J891P26l76l66j608o26K620
$$ plain form
1084 718 3260 1617 -1239 -1326 28 899 1537 916 -885 -877 289 -310 -1045 593 1480 -643 -2323 -1503
1102 -1503 47 1173 1679 -531 -2891 -1465 1698 2113 580 -268 -845 -969 711 2171 985 -182
1118 -182 -87 -723 -1117 807 1873 105 -1336 -1175 -1131 -367 1331 1206 -886 -1855 -1203 -502 982 2616
1136 2616 780 -2563 -2262 1129 2911 1930 -56 -1933 -1449 1410 2199 -142 -1007 329 36 -1352
1152 -1352 -1058 618 1336 771 -1320 -3592 -1888 2922 3727 -726 -3588 -1993 1341 3206 2115 -1279
1168 -1279 -2694 345 2292 568 -601 811 1007 -555 -1338 -908 436 2000 1063 -2547 -3639 65
1184 65 2788 1556 -817 -1981 -2148 80 2554 1746 -888 -1285 -254 77 1171 2048 461 -1229 -440
1201 -440 383 -31 337 1075 65 -1114 -981 -1008 -371 1822 1957 -1637 -3796 -1103 2225 2650 566 -2276
$$ packed form
1084G18K542j643k856q7J354Q71O38o21j801QJ166n99p35J638Q87k123j680Q20
1102a503J550J126N06k210k360J426L163M15j533q48n77j24J680J460j186j167
1118a82R5o36l94J924J066j768j441J61M4P64J698j25k092r69O52P01J484J634
1136B616j836l343L01L391J782r81j986j877M84K859P89k341q65J336k93j388
1152a352K94J676P18n65k091k272J704M810Q05m453k862J595L334J865j091l394
1168a279j415L039J947j724j169J412J96j562p83M30J344J564r37l610j092L704
1184F5K723j232k373j164j67K228K474q08k634l97J031L31J094Q77j587j690P89
1201d40Q23m14L68P38j010j179J33k7O37K193J35l594k159K693L328M25k084k842
$$ plain form
1219 -2276 -2750 658 3773 1605 -1943 -1405 1145 1040 -96 -410 108 1410 1387 -1682 -3348 91 3784
1236 3784 1590 -2770 -3732 -921 2408 3052 -156 -3455 -1876 1885 2051 -313 -627 320 415 175 35
1253 35 -91 943 1883 -10 -2681 -1190 1697 1884 -27 -1374 -1952 -1008 1158 1687 -344 -1458 -856
1270 -856 -665 33 1693 1324 -1093 -1501 284 1276 961 629 -252 -641 371 680 -644 -249 1479 1018
1288 1018 -1668 -2156 -39 1597 1334 -619 -3066 -2012 1865 2875 -386 -2282 -772 1049 1294 357
1304 357 -673 -397 1315 1195 -1227 -1368 1563 2604 -73 -2259 -1584 559 2143 1007 -2086 -2661
1320 -2661 334 1883 200 -1106 -399 57 -85 -132 -98 385 1142 546 -1281 -923 1496 2044 122 -878
1338 -878 -483 -18 494 730 -271 -857 -62 -111 -894 -358 1029 208 -1388 -1231 19 925 1027 -17 -1295
$$ packed form
1219b276m74L408L115k168l548N38K550j05j136l14N18J302k3l069j666L439L693
1236C784k194m360r62K811L329O44l208l299J579L761J66k364l14R47R5k40j40
1253C5j26J034R40j893k671J491K887J87j911j347n78R44K166N29k031j114O02
1270h56J91O98J660l69k417m08J785R92l15l32q81l89J012L09j324L95J728m61
1288A018k686m88K117J636k63j953k447J054L877J010l261j896J510J821K45r37
1304C57j030K76J712j20k422j41K931J041k677k186O75K143J584j136l093n75
1320b661K995J549j683j306P07M56j42m7L4M83P57n96j827L58K419N48j922j000
1338h78L95M65N12K36j001n86P95m9p83N36J387q21j596J57J250R06J02j044j278
$$ plain form
1357 -1295 -410 1506 1075 -646 -470 892 716 -336 -461 89 839 986 -684 -1969 -414 1567 712
1374 712 -1528 -1520 48 761 370 -397 -892 -92 1174 330 -1087 -175 1557 1009 -552 -774 189 1112 1123
1393 1123 -265 -1552 -356 1492 561 -1309 -857 443 370 -386 -784 -585 456 870 -439 -1632 -88
1410 -88 1680 708 -870 -542 492 854 702 -146 -848 251 1140 18 -957 -66 973 147 -830 -723
1428 -723 -152 385 428 -608 -1397 21 1202 169 -997 -90 750 360 6 -54 -32 805 995 -390 -907
1447 -907 579 1362 -37 -1031 -234 404 312 -73 -872 -967 415 772 -722 -1255 244 942 -154 -660 -224
1466 -224 256 775 627 -576 -697 879 1300 -294 -833 225 807 270 -245 -540 -485 496 493 -919 -1190
1485 -1190 380 809 -443 -805 -181 258 370 243 -541 -390 978 908 -562 -567 659 893 144 -265 -175
$$ packed form
1357a295Q85J916m31j721J76J362j76j052j25N50P50J47j670j285J555J981q55
1374G12k240QJ568P13l91p67m95Q00J266q44j417R12J732n48j561k22R63R23J1
1393A123j388j287J196J848r31j870M52J300p3p56l98J99J041M14j309j193J544
1410h8J768r72j578L28J034L62j52q48p02J099Q89j122r75Q91J039q26r77J07
1428g23N71N37M3j036p89J418J181j033j166R07Q40l90l54o0K2Q37J90j385n17
1447i07J486P83j399r94P97O38r2l85p99r5J382L57j494n33J499O98j096n06M36
1466b24M80N19j48j203j21J576M21j594n39J058N82n37n15k95N5R81lj412k71
1485a190J570M29j252l62O24M39J12j27p84J51J368p0j470nJ226K34p49m09R0
$$ plain form
1504 -175 23 590 278 -923 -726 638 510 -859 -755 205 195 -151 -196 -420 -77 764 483 -648 -288
1523 -288 967 685 -319 -261 266 248 455 156 -593 -211 761 152 -1010 -569 403 133 -411 -513 -358 -28
1543 -28 460 -29 -817 -263 915 363 -596 -102 491 407 322 30 -276 158 844 108 -872 -128 671 136 -532
1564 -532 -350 -170 -79 128 -124 -804 -164 575 64 -682 24 506 286 -10 16 -93 367 825 89 -479 36
1585 36 717 131 -418 -71 87 -237 -76 -104 -526 -56 250 -429 -706 115 449 -132 -316 8 33 121 460
1606 460 133 -230 120 384 -79 -152 405 359 -262 -173 -32 -145 185 209 -575 -809 106 415 -229 -328 17 -8
1628 -8 -72 257 229 -100 380 408 -142 -36 580 542 49 -140 -99 -66 65 386 -225 -522 -41 168 -290 -244 65
1651 65 -283 -345 101 71 -108 170 274 -209 -110 440 405 -30 108 333 -52 9 297 145 -139 -22 -99 -486
$$ packed form
1504a75J98N67l12j201J97J364j28j369J04R60j0l46m5k24L43Q41k81j131L60
1523b88J255k82j004N8N27j8K07k99p49L82R72o09j162M41R72k70n44j02J55L30
1543b8M88m89p88N54J178n52r59M94N93q4q5k92l06M34O86p36r80P44P99n35o68
1564e32J82J80R1K07k52o80O40P39n11p46P06M82k20k96K6j09M60M58p36n68N15
1585C6O81n86n49L47J58l24J61k8m22M70L06o79k77Q21L34n81j84L24K5Q8L39
1606D60l27l63L50K64m63p3N57m6o21Q9J41j13L30K4p84k34R15L09o44r9L45k5
1628ho4L29k8l29M80K8n50J06O16l8m93j89M1L3J31L21o11k97M81K09m58M6L09
1651F5l48o2M46l0j79K78J04m83R9N50l5m35J38K25l85O1K88j52k84J17p7l87
$$ plain form
1673 -486 -197 323 -59 -463 -233 -73 -146 173 255 -191 -376 196 311 -21 208 316 6 -102 287 299 -24
1694 -24 270 184 -359 -447 186 163 -152 -49 -335 -570 -124 484 -1 -418 -178 -95 -54 337 361 -173 -240 334 335
1717 335 -32 236 348 28 -56 135 -128 -171 351 205 -493 -475 146 172 -31 -184 -398 -509 141 504 -24
1738 -24 -336 17 67 2 303 301 -68 108 410 57 -244 240 423 -87 -256 -244 -324 -89 403 62 -778 -630
1760 -630 167 245 -15 -36 -423 -322 352 543 -171 -307 238 259 80 111 126 -1 420 268 -455 -582 273 679
1782 679 -99 -549 -398 -154 321 427 -220 -919 -186 545 140 -240 66 107 35 373 72 -234 244 709 76
1803 76 -361 -92 225 294 170 -154 -733 -250 523 213 -483 -523 -175 -107 87 225 -201 -358 113 359 -21
1824 -21 10 221 109 121 150 13 -259 353 603 -43 -606 -240 202 255 245 -325 -711 -59 589 90 -534 -340
$$ packed form
1673d86K89N20l82m04K30J60p3L19Q2m46j85N72J15l32K29J08l10j08L89J2l23
1694b4K94q6n43q8O33k3l15J03k86k35M46O08m85m17K40Q3M1L91K4n34o7N74J
1717C35l67K68J12l20q4J91k63m3N22j46o98J8O21K6k03j53k14j11O50L63n28
1738b4l12L53N0o5L01kl69J76L02l53l01M84J83n10j69J2q0K35M92l41q40J48
1760f30P97P8k60k1l87J01O74J91p14j36N45K1j79L1J5j27M21j52p23j27Q55M06
1782F79p78m50J51K44M75J06o47o99P33P31m05l80L06M1p2L38l01l06M78M65o33
1803G6m37K69L17O9j24l24n79M83P73l10o96m0L48O8J94J38m26j57M71K46l80
1824b1L1K11j12J2K9j37k72O12K50o46n63L66M42N3j0n70l86O52O48m99o24J94
$$ plain form
1846 -340 135 108 134 34 -163 95 477 199 -433 -69 607 408 -113 -311 -279 47 636 261 -671 -541 254
1867 254 267 -284 -247 -270 -163 124 37 -189 -85 315 197 -208 -110 347 228 168 235 -21 -124 102 378 49
1889 49 -292 -182 -190 -102 116 45 -404 -290 38 30 -82 52 -110 -236 135 255 -63 -133 353 354 -37 41 -6 204
1913 204 347 234 -446 -440 156 456 -45 -425 -163 -6 100 -5 -318 -307 148 256 -157 -374 218 384 164
1934 164 -17 -136 107 385 406 -107 -298 98 460 14 -159 -99 -96 -74 -64 -224 -321 14 219 -246 -410 68
1956 68 238 -48 -108 -48 -61 203 345 99 -101 195 265 -124 -80 206 100 -135 -209 -78 35 34 33 -285 -277 108
1980 108 79 -196 -148 96 87 -60 86 80 71 324 265 -213 -140 375 264 -146 -179 60 139 132 29 -271 -213 195 -58
2005 -58 -470 -267 124 72 -126 -189 -116 46 378 135 -346 -95 428 385 -112 -103 107 94 41 69 -152 -49 216
$$ packed form
1846c40M75k7K6j00j97K58L82k78o32L64O76j99n21j98L2L26N89l75r32J30P95
1867B54J3n51L7k3J07K87q7k26J04M00j18m05R8M57j19o0O7k56j03K26K76l29
1889D9l41J10qQ8K18p1m49J14L28qj12J34j62j26L71J20l18p0M86Jl91P8m7K10
1913B04J43j13o80ON96L00n01l80K62J57J06j05l13J1M55J08m13k17N92J66k20
1934A64j81j19K43K78K1n13j91L96L62m46j73O0LK2J0j60r7L35K05m65j64M78
1956F8J70k86o0O0j3K64J42k46k00K96P0l89M4K86j06k35p4J31J13jjl18QL85
1980A08k9k75M8K44rj47J46orK53n9m78P3N15j11m10l3K39P9pj03l00N8M08k53
2005e8m12K03L91n2j98o3P3J62L32k43m81K51N23m3m97RK10j3n3K8k21J03K65
$$ plain form
2028 216 21 -409 -296 154 8 -108 -226 -95 -2 116 97 -253 -91 295 132 -159 44 289 180 -49 -57
2049 -57 6 66 252 26 -327 -100 276 -27 -305 -84 124 -175 -68 -165 -130 44 271 -9 -288 77 336 83
2071 83 -175 51 51 92 251 20 -235 129 342 -51 -255 90 171 28 -89 -163 -290 42 193 -237 -359 48
2093 48 351 25 -136 72 100 124 191 49 -164 164 245 -86 -220 97 202 -68 -139 -73 -15 -38 131 -151 -263
2116 -263 115 223 -135 -208 58 114 118 -6 38 -44 198 272 -107 -137 283 269 -66 -81 57 69 16 30 -167 -219 89
2141 89 3 -250 -258 23 27 -77 -78 -27 -27 196 124 -91 15 210 165 -87 -15 193 94 -16 -61 -105 -100 148 63 -373 -107
2168 -107 116 8 -219 -271 -108 -24 124 -84 -183 -27 218 138 -161 -36 315 126 -33 -6 -30 84 260 98
2190 98 -330 -108 173 98 -175 -69 -47 0 43 -37 -176 -20 226 54 -225 -13 225 72 -41 190 137 137 227
$$ packed form
2028B16j95m30J13M50j46j16j18J31R3J18j9l50J62L86j63k91K03K45j09k29q
2049e7O3O0J86k26l53K27L76l03k78K21K08k99J07r7L5J74K27k80k79L65K59k53
2071H3k58K26%M1J59k31k55L64K13l93k04L45Q1j43j17p4j27L32J51m30j22M07
2093D8L03l26j61K08K8K4O7j42k13L28Q1l31j34L17J05k70p1O6N8k3J69k82j12
2116b63L78J08l58p3K66N6Mj24M4q2K42P4l79l0M20j4l35j5J38J2n3J4j97n2L08
2141H9q6k53qK81Mj04jN1%K23p2k15J06J95m5k52P2K08r9j10m5m4NK48q5m36K66
2168a07K23j08k27n2J63Q4J48k08r9J56K45q0k99J25L51j89j59K7k4J14J76j62
2190I8m28K22K81p5k73J06K2M7M3q0j39J56K46j72k79K12K38j53j13K31n3%R0
$$ plain form
2213 227 -18 -122 96 227 -22 -226 13 78 -86 -132 -35 -173 8 4 -54 -204 -12 177 -53 -126 84 126 88
2236 88 60 -77 -54 128 365 -35 -256 51 262 4 -194 -174 -25 2 12 -87 -232 -124 232 -90 -245 -26
2258 -26 161 29 -2 13 3 63 202 15 -142 71 122 -9 -117 -40 -47 -91 -21 -30 -112 41 54 -221 -219 91 85 -36
2284 -36 -147 12 1 114 128 -76 -30 185 190 -111 -135 282 183 63 -38 -123 12 122 110 -218 -284 -29 81 -121
2308 -121 -98 -72 -111 -30 22 -42 -83 113 124 -40 13 165 135 60 101 -4 -135 72 157 -59 -179 35 5 -104 59
2333 59 85 -120 -146 2 6 -61 31 43 -138 15 111 -70 29 157 184 -101 -12 82 47 115 111 -10 -233 39 175 48
2359 48 -255 -169 -21 -31 37 -8 -58 -54 188 -107 -95 12 76 38 45 -16 -45 -12 189 123 -177 -45 82 19 8 33 -94
2386 -94 -152 -25 90 -69 -222 32 135 15 -8 -3 -22 59 198 -62 -128 93 252 22 -31 2 -92 10 203 -74
$$ packed form
2213B27k45j04K18J31k49k04K39O5j64m6R7j38J81mn8j50J92J89k30p3K10M2l8
2236H8k8j37K3J82K37m00k21L07K11k58j98K0J49K7J0r9j45J08L56l22j55K19
2258b6J87j32l1J5j0O0J39j87j57K13N1j31j08P7pm4P0rq2J53J3k75KL10oj21
2284c6j11J59j1J13J4k04M6K15Nl01k4M17r9j20j01q5J35J10j2l28o6K55J10k02
2308a21K3K6l9Q1N2o4m1J96J1j64N3J52l0p5M1j05j31K07Q5k16j20K14l0j09J63
2333E9K6k05k6J48Mo7R2J2j81J53R6j81R9J28K7k85Q9R4l5O8mj21k23K72J36j27
2359D8l03Q6J48j0O8m5n0MK42k95J2J07O4l8Po1k9L3K01o6l00J32J27o3j1K5j27
2386i4n8J27J15j59j53K54J03j20k3Nj9Q1J39k60o6K21J59k30n3L3r4J02J93k77
$$ plain form
2410 -74 -305 -28 160 68 -98 -128 -68 -74 81 30 -198 -31 165 72 -42 39 94 83 130 -7 -109 -71 232 130
2434 130 16 -64 3 -76 28 118 -57 -272 10 45 -104 52 104 -29 -18 162 -5 -73 -48 165 -40 -40 24 31 62
2459 62 157 14 -49 -58 58 6 -67 -162 -72 23 16 -5 -214 -43 77 68 -195 -78 54 81 14 -1 -36 20 159 147 -156
2486 -156 -111 113 118 13 -76 -48 -116 88 -32 -55 -87 22 27 -90 -162 33 27 6 50 24 22 19 122 -60 -55 142 54 -118
2514 -118 23 137 -49 -48 7 -26 -118 92 -116 -209 -31 -48 -106 -105 28 -14 -1 -2 16 21 97 152 3 -5 85 187 77
2541 77 -68 29 -12 43 79 0 -163 -79 104 -9 -231 22 5 -2 52 -136 -78 37 151 -9 -196 33 127 147 19
2566 19 -31 -10 127 106 -63 -151 -48 177 -105 -172 -21 -16 -90 -33 -42 -125 -108 95 -27 -97 96 14 32 -51 40 44 -9
2593 -9 13 24 -17 121 154 -10 -68 82 98 -88 -154 -56 -32 -13 -40 -144 -80 49 153 -72 -182 80 86 61 -91 19
$$ packed form
2410g4k31K77J88r2j66l0O0oJ55n1k28J67J96r3j14Q1N5j1M7j37j02L8L03j02
2434A30j14q0O7p9J04R0j75k15K82L5j49J56N2j33J1J80j67o8K5K13k05%O4PL1
2459F2R5j43o3rJ16n2p3r5R0R5pk1k09J71J20rk63J17J32K7o7j5l5N6J39j2l03
2486a56M5K24Nj05q9K8o8K04j20k3l2J09Nj17p2J95ok1M4k6klJ03j82NJ97q8j72
2514a18J41J14j86JN5l3r2K10k08r3J78j7n8JJ33m2J3jJ8NP6N5j49qR0J02j10
2541G7j45R7m1N5L6p9j63Q4J83j13k22K53j7pN4j88N8J15J14j60j87K29R4K0j28
2566A9n0K1J37k1j69q8J03K25k82o7J51Np4N7rq3J7K03j22p0J93q2J8q3R1Mn3
2593iK2J1m1J38L3j64n8J50J6j86o6R8K4J9k7j04O4J29J04k25j10K62Ok5j52J10
$$ plain form
2619 19 59 149 73 -50 -116 149 60 -113 -144 -87 -30 -7 -25 -84 -95 124 11 -61 -150 -3 22 -76 3 18 80 83 58 -30
2647 -30 -36 147 129 -19 -1 69 96 61 -7 2 -70 13 -63 -148 -16 92 -50 -169 -68 77 48 -21 109 -76 -40 159
2673 159 -8 -29 2 102 124 -14 -2 32 32 109 -79 -149 -67 53 -9 -58 -115 12 16 -11 -41 -130 64 98 63 -145 10
2700 10 70 91 -36 27 180 105 58 6 -65 -60 165 -19 -32 12 24 -33 -75 75 -20 59 18 -42 -51 -44 141 -71 -23 84
2728 84 -13 1 66 17 -57 144 107 -14 -71 18 68 4 -56 8 -37 -48 -21 -53 -104 15 82 -3 -73 -66 4 36 42 35 14 56
2758 56 69 -20 -85 71 75 -133 -79 80 -13 -3 25 -30 -29 20 -47 -25 -50 -1 68 -8 -8 24 57 49 -12 -38 120 130 80 -79
2788 -79 -65 112 46 -1 -99 -44 -33 17 -37 -141 22 39 22 -49 -93 25 -45 36 23 -56 -42 166 105 3 -22 -25 83
2815 83 -3 63 -18 12 23 1 -108 -59 46 63 -33 -73 26 -44 -29 -53 -63 -44 69 -71 -26 38 58 -23 -29 88 63 65 -26
$$ packed form
2619A9M0R0p6j23o6K65q9j73l1N7N7K3j8n9j1K19j13p2q9J47K5r8P9J5O2Lk5q8
2647c0oJ83j8j48J8P0K7l5o8Rp2Q3p6q5J32J08j42j19J01J45k9o9J30j85L6J99
2673A59j67k1L1J00K2j38J2L4%P7j88p0Q2J20o2m9n7J27Mk7l0q9J94L4l5k08J55
2700A0O0K1j27O3J53p5m7n2p1NK25j84j3M4J2n7m2J50r5P9m1o0rPJ85k12M8J07
2728H4r7J4O5m9p4K01l7j21n7Q9N0o4o0O4m5j1K7l2n1J19O7q5p0PP0L2Opk1M2
2758E6J3q9o5J56Mk08N4J59r3J0K8n5JM9o7K2k5M9O9p6%L2L3qo1k6J58J0n0j59
2788g9J4J77o6m7r8N5J1N0n4j04J63J7j7p1m4J18p0Q1j3p9J4K08o1j02k5lJ08
2815H3q6O6q1L0J1k2j09M9J05J7r6m0R9p0J5k4j0J9J13j40M5O4K0q1oJ17k5Kr1
$$ plain form
2844 -26 75 21 27 32 -96 -185 -3 17 31 -85 -46 -10 -76 -34 -11 -27 -34 -7 94 -32 -6 60 -22 17 86 53 -28 76
2872 76 -22 -29 -10 42 -10 -43 -14 21 16 -78 -14 -84 26 117 -4 -78 17 85 52 76 89 99 -103 79 54 -9 166 34
2900 34 -65 -22 29 33 -41 -1 -43 -24 41 2 -5 -48 11 67 -11 -8 -9 67 -1 27 40 64 124 4 -16 -38 20 52 21 -62 -32 -8
2932 -8 -50 12 -96 -77 -50 -34 -15 32 -20 87 5 83 -56 -85 115 94 94 -80 41 41 -92 -21 94 -31 -56 40 21
2959 21 -2 19 -11 -53 21 56 -94 -31 28 -7 -38 -60 57 6 2 42 -20 -123 30 28 2 33 -2 24 -31 43 24 -115 -136
2988 -136 18 28 -17 -30 15 -45 -48 -17 -65 28 -17 51 -11 -30 49 -2 86 81 1 -37 110 16 -68 -23 24 59 -4 -42 -10 -134
3018 -134 -7 20 -77 -71 11 -21 -26 -20 -72 34 -40 163 86 -31 -7 102 90 -30 -3 -39 -1 30 66 -76 -69 -27 11 -47
3046 -47 -20 110 80 -3 -27 -21 -29 102 63 -84 -40 -24 -63 117 113 99 43 23 108 -38 22 -1 -42 -28 60 -29 -49 -60 3
$$ packed form
2844b6J01n4ONj28q9J82K0J4j16L9L6o6M2K3j6pK7J01j26K6O6q2L9O9l3q1J04
2872G6r8pJ9N2n2l3K9L5nr4O4p0J10R1j21p4R5O8l3K4J3J0k02J82k5o3J75j32
2900C4r9M3N1Mp4M0m2J9O5l9pm3N9N6p8LjP6o8K8J3K4O0j20k0k2N8L2l1q3L0K4
2932hm2O2j08J9K7J6J9M7n2J07q2P8j39k9K00k1%j74J21%j33P1J15j25k5R6j9
2959B1k3K1l0m2P4L5j50O3N9l5l1k2J17n1mM0o2j03J53kk6L1l5K6n5P4j9j39k1
2988a36J54J0m5j3M5o0lL1m8R3m5O8o2j9P9n1Q8nq0l8J47r4q4M5M7L5o3l8L2j24
3018a34J27K7r7OQ2l2nOn2J06p4K03p7j17K4J09j2j20K7l6L8L1L6j42PM2L8n8
3046d7K7J30l0q3k4OqJ31l9j47M4J6l9J80mj4n6k0Q5j46O0k3m1J4Q8q9k0j1O3
$$ plain form
3075 3 -40 9 62 -74 -107 57 -14 32 7 -27 99 14 30 -24 -51 39 38 -12 -39 11 -56 -159 -40 2 -66 -23 100 -54
3103 -54 -131 84 18 42 9 49 -18 15 30 -21 14 -42 11 18 -18 -38 57 22 -32 -38 -18 15 48 74 17 -78 -49 18 41 82 -16
3134 -16 -37 -17 21 0 17 -11 -25 5 23 47 -30 65 28 21 -12 -102 12 -31 27 -28 -38 -36 88 59 -118 -46 -20 63 -6 -45
3164 -45 57 -59 51 57 -21 -18 81 3 9 -71 -38 -50 57 11 13 -32 97 41 -104 -31 -45 41 -20 -12 -4 -52 -60 -11 -19 19 22 34
3196 34 -11 -35 79 -22 18 87 29 -13 20 -49 -85 -25 10 -72 -27 -5 54 50 -23 -10 -101 38 71 54 -54 -5 79 16 1
3225 1 -23 -56 32 7 6 -47 -38 -13 -110 -9 -7 -48 -32 23 26 -33 -74 59 -19 -15 63 12 -14 33 33 -90 17 -15 15 -15 -7 2 -10
3258 -10 -76 57 50 33 46 6 -68 37 34 -25 -51 27 107 11 -45 18 28 -41 55 20 -6 84 171 -8 81 40 26 -26 27 51
3288 51 24 -3 25 -75 -132 69 51 -71 -70 -26 -52 1 60 -15 -15 37 89 44 -43 15 84 -53 -61 -16 2 -23 9 -48 -17 75
$$ packed form
3075Cm3M9N3j36l3J64p1M6k5l4J26q5J6n4k7R0jn0k7N0o7j03J19M2o8M3J23j54
3103e4p7K15o6K4l3M0o7L3J5n1L5n6N3Pl6k0R5l5n4oK0L3L3K6n7r5K9O7K3M1r8
3134a6k1K0L8k1J7k8j4L0J8K4p7R5l7pl3r0J14m3N8n5j0KJ24k9j77P2K6Q3o9l9
3164d5J02j16J10Op8LR9p8Oq0L3j2J07m6Km5J29n6j45P3j4Q6o1QQm8qM9qL8LJ2
3196C4m5k4J14j01M0O9n8m2L3o9l6O0L5q2M5K2N9mp3J3r1J39L3j7j08M9Q4o3j5
3225Ak4l3Q8k5jn3RK5r7J01Km1J6N5Ln9m1J33p8MP8n1k6M7%j23J07l2L0l0QRj2
3258a0o6J33pj7J3m0p4J05ln9k6P8Q0r6n6O3J0o9R6l5k6R0Q7j79Q9m1j4n2N3K4
3288E1k7k7K8j00n7K01j8j22JM4k6N3N9p5%N2N2m5q7N8O9j37qM5J8k5L2n7L1R2
$$ plain form
3318 75 94 5 -54 20 61 -15 -32 -47 -28 26 25 104 25 -42 74 17 -59 78 16 10 -17 -32 -63 -71 -78 -20 -28 50 -1 38 -45 13
3350 13 59 79 108 14 -24 34 -4 -36 -13 30 -9 -17 -14 -41 56 -49 -87 -107 -55 26 -5 -30 35 14 18 33 31 -33 -6 1 15 44
3382 44 -21 60 -55 -26 69 27 28 -53 100 25 -21 103 -27 -68 7 -27 27 -66 -41 -18 -54 -88 10 -28 20 36 37 -9 43
3411 43 -27 100 46 -18 -12 46 15 14 -73 21 127 29 79 9 -39 4 20 58 -46 27 2 105 -16 8 -32 10 -56 28 -59
3440 -59 -27 106 33 -10 29 21 -43 -36 -76 39 -2 17 -44 -22 -33 74 62 10 82 37 -5 -54 -39 21 15 -37 -7 -51 51 49
3470 49 -45 -39 -41 56 -10 34 3 -80 25 52 6 -72 -51 36 -61 38 25 -5 -71 90 6 -28 -4 0 77 -46 -8 2 -57 15
3500 15 -118 -67 0 12 3 23 -113 -27 -6 -50 33 -52 -5 2 61 -4 0 93 0 23 10 58 45 60 39 -18 -19 90 8 -65 -9
3531 -9 34 -18 -74 -41 22 43 19 25 40 -30 -30 -14 -6 53 -6 1 -82 67 21 63 -80 28 -24 20 123 -14 -32 2 69 -6
$$ packed form
3318G5J9q9n9P4M1p6j7j5J9N4jP9p9o7J16n7p6J37o2ok7j5l1qpN8qP8n1L9q3N8
3350A3M6K0K9r4l8N8l8l2K3M3l9qLk7R7j05l8k0N2Q1l1k5O5k1MJ5ko4K7PJ4K9
3382D4o5Q1j15K9R5m2Jq1J53p5m6J24j30m1P5l4N4r3K5K3l6l4R8l8M8J6Jm6N2
3411D3p0J27n4o4ON8l1jq7R4J06r8N0p0m8M3J6L8j04P3k5J03j21K4m0M2o6Q4q7
3440e9L2J33p3m3L9qo4Pm0J15m1J9o1K2j1J07j2n2P2m5m2m9J5O0on2L0m4J02k
3470D9r4OkR7o6M4l1q3J05K7m6p8K1Q7r7R9j3l0o6J61q4l4K4MP7j23L8J0n9P2
3500A5j33N1O7J2rK0j36Q6K1m4Q3q5M7PN9o5MR3r3K3j3M8j3J5k1n7jJ09q2p3N6
3531iM3n2n6L3O3K1k4OJ5p0%J6QN9n9Pq3J49m6M2j43J08n2M4J03j37j8L4O7p5
$$ plain form
3561 -6 -5 -24 25 24 10 -27 -6 -14 89 102 -36 37 55 40 19 17 12 51 84 -64 -37 33 -16 36 -29 -71 60 -21 40 38 26 -59
3593 -59 6 -49 32 55 16 -66 52 -32 46 47 -12 -80 74 33 35 25 22 41 43 -24 -41 -50 67 41 60 -10 -41 20 12 -9 28 -14
3625 -14 62 87 97 5 -52 -35 -10 3 7 -63 -61 51 -34 -67 -110 2 17 15 -79 -54 -39 -17 -30 -19 29 29 72 88 -48 105
3655 105 -5 -42 91 18 19 3 33 -12 25 29 -19 8 -33 48 -50 -46 44 40 37 71 30 26 86 86 112 -108 44 62 56 -21 27 78
3687 78 43 41 -33 -57 -15 6 -4 -73 -73 -10 -1 23 38 34 -18 91 88 -15 -6 -4 27 8 106 -8 66 -8 1 14 -43 -79 -44 64
3719 64 -36 -16 -30 -47 39 34 -6 -82 66 10 17 25 -82 -52 40 -33 -56 -14 40 48 -19 -51 -53 -110 11 42 -72 -45 7 42
3749 42 46 4 55 -3 -34 -24 -89 106 -68 95 26 -15 0 4 50 1 113 -64 -31 7 56 -17 -61 52 -80 -6 -12 -31
3777 -31 33 39 37 -54 -51 -34 -114 -24 78 -9 -73 80 -3 -12 47 35 107 15 -8 48 -16 -8 9 -57 -7 -2 38 -29 2 -48 -78 -4
$$ packed form
3561fJj9M9jj4l7K1qJ03J3j38P3J8j5k1knL9L3j48K7P0m9N2o5m2J31q1O1kj2q5
3593e9O5n5Q1K3l9q2J18q4P8Jn9o8J54m1Kj0lJ9Ko7j7rJ17k6J9p0l1O1qk1L7m2
3625a4P6K5J0r2n7J7K5J3Mp0KJ12q5l3m3J12J5kr4K5J5K2j3J1M8%M3J6j36J53
3655A05j10l7J33p3Jj6L0m5L7Mm8K7m1Q1r8MR0mlL4m1mO0%K6k20J52J8op7M8N1
3687G8l5kp4k4M2K1j0o9%O3RK4J5mn2J09lj03RKL1j9R8j14P4p4RJ3n7l6L5J08
3719F4j00K0j4j7Q6nm0p6J48n6PQj07L0R2p3k3M2N4Qo7l2kn7J21L1j14K7N2L5
3749D2Mm2N1n8l1J0o5J95j74J63o9m1J5MM6m9J12j77L3L8M9p3m4J13j32P4oj9
3777c1O4Okr1LJ7q0R0J02q7o4J53q3rN9j2P2r2k3N6o4QJ7o6N0NM0o7L1n0l0P4
$$ plain form
3809 -4 80 3 11 -62 -6 -40 -15 37 39 -69 35 -76 19 81 24 -78 71 -1 57 26 -70 -60 -69 26 -126 51 -11 44 -5
3838 -5 -94 -46 42 -60 78 67 107 63 -49 -31 -35 73 62 -38 10 -6 66 49 24 52 -13 4 -35 -36 -34 -31 52 20 -17 -22 -1
3869 -1 16 49 42 -19 111 52 -30 -6 -7 -30 27 28 10 15 7 -32 -60 23 1 75 -27 35 10 8 87 94 -3 -24 60 6 -24 -15 30 58
3903 58 10 5 -71 -19 29 -42 30 76 -72 20 22 -11 -15 -33 -33 59 -15 -33 1 17 -7 -38 35 -11 9 36 -40 56 -36 40 43 23
3935 23 112 26 -26 -8 -8 -81 -76 14 33 58 -73 -4 -59 -22 41 -10 17 24 64 -50 29 -94 -37 4 16 6 -24 -41 55 30
3965 30 -75 14 50 30 -25 -35 -22 62 59 -41 -30 -56 117 22 -1 10 20 -48 11 10 29 1 -1 71 28 -21 -20 72 -19 33 51
3996 51 -11 -10 4 -42 10 -80 -91 -45 -55 75 85 9 17 -19 65 125 -25 -53 -21 59 62 -94 2 -62 -7 39 -157 -49 56
4025 56 -14 -39 -23 80 40 22 60 19 59 71 2 39 -38 -16 8 0 86 26 38 -20 67 -14 -81 -32 38 -14 -72 -11 31 -37
$$ packed form
3809dQ4p7Qp3N6l4K5N2Kj08J04j11R5O2n7j02J49p2N8l1r6J0rR5j52J77o2N5m9
3838eq9M8Q8j02J38j1M0m4j12J8mJ08j1j00M8j6P2j7k5K8o5J7l9jKLQ3l2l7nK1
3869aJ7L3po1J30n9q2K4jk3N7Jj8Nql9k8Q3k2P4j02O2k5kP9Pr7k1Q4n4l0RM5K8
3903E8m8np6N2M8p1P2M6j48R2Kl3mj8%R2p4j8L4J6k4l1P3m6K0K7p6R6r2P6Lk0
3935B3Q9q6n2J8%p3NR0J9K5j31O9n5L7O3n1K7PM0j14P9j23N7M1J2j0l0j7R6k5
3965C0j05Q9L6k0n5j0J3Q4lj00J1k6J73r5k3J1J0o8N9jJ9k8kP2m3m9JR2r1N2J8
3996E1o2JJ4m6N2r0j1M6j0J30J0p6Ql6Q4O0j50k8L2Q0Lj56R6o4N5M6j96J08J05
4025E6p0k5J6J03m0j8L8m1M0J2o9L7p7K2K4qQ6o0J2n8Q7q1o7M9P0n2n8O1M2o8
$$ plain form
4055 -37 -32 -50 -20 -76 53 38 32 -89 -4 -70 -40 87 144 12 -83 2 -25 37 34 -90 17 -9 56 -94 -37 35 10 -4
4083 -4 -71 -13 73 134 61 21 -144 19 19 -43 118 7 9 70 5 -83 -57 55 -7 -69 -45 -20 37 20 69 -83 39 -40
4111 -40 55 -60 -30 30 -48 10 -27 36 37 43 -27 16 24 136 25 -106 31 38 34 -26 -24 -8 28 84 83 -35 38 116 20 -14 60
4142 60 20 -67 20 16 -21 10 120 64 -26 -17 17 -29 2 -67 51 -36 -29 -13 -121 -23 35 49 -39 0 36 15 -10 -9 -65 9 134
4173 134 17 -46 -13 93 5 98 39 40 8 28 61 -37 -79 131 13 -6 -53 20 20 -32 50 -52 -6 38 -2 19 27 50 -60
4202 -60 34 117 -18 58 11 5 -3 -26 40 -59 -25 -16 -28 -111 -63 -19 -90 -99 -57 -4 -31 4 73 59 -68 83 125 127 12 49 35
4233 35 -15 1 3 7 89 -7 -8 -7 -31 -47 -8 -23 -62 -51 18 38 -36 -44 -16 19 21 58 11 -29 -23 62 151 9 -51 -3 -34 19 -8
4266 -8 -86 -92 10 -1 -33 2 47 39 -24 65 10 -54 57 82 48 -30 72 37 77 40 70 90 2 44 -2 -64 19 -20 92 45
$$ packed form
4055c7Nj8L0n6J29j5oj21Q5o6L0J27N7j32r5Q5k7O2lj24J07k6O5j50N7P2k5j4
4083do7N8Q6O1p3m0j65J63%o2J61j11KO1o5q8K6J12o2o2K4K5N7j7M9j52J22p9
4111d0R5j15L0O0p8N8l7O3JOp0M3QJ12j11j31J37Pmo0KJ6L6N6jj18P3P8r6l4P4
4142F0m0q7Q7ml7L1J10n6r0RL4m6L1o9J18q7PJ6j08R8N8J4q8L9L6k1k5Jn6P4J25
4173A34j17o3L3J06q8R3n9Jl2K0L3r8m2K10j18j9m7P3%n2Q2j02M6M4m0K1QK3j10
4202f0R4Q3j35P6m7oqk3O6r9L4Rj2q3M8M4p1rM2N3k7L5O9j4j27J51M2Kj15L7j4
4233C5n0J6KMQ2r6jJk4j6L9j5l9J1O9K0p4qK8L5KL7m7m0OQ5Q9j42o0M8l1N3k7
4266hp8oJ02j1l2L5M5qo3Q9n5o4J11K5l4p8J02l5M0l7L0K0q8M2m6o2Q3l9J12m7
$$ plain form
4296 45 -31 -62 30 15 -23 -58 -24 -23 21 0 79 48 -40 -18 35 8 -13 -37 -78 -37 38 -39 -54 -53 -17 61 -40 13 85 12 7
4327 7 64 12 25 42 20 -54 16 36 49 103 85 26 33 31 31 18 -10 -60 99 62 -1 -40 -163 -30 66 -1 -54 -19 7 11 -10
4358 -10 64 45 9 19 28 -12 46 -23 11 -3 1 42 7 5 -70 -102 -22 80 -12 -24 -8 -35 -35 16 90 -90 -117 19 23 19 -54 29
4390 29 95 82 -17 8 -22 4 47 -22 13 30 31 8 -58 15 -39 -47 96 62 -41 -14 0 -73 12 11 -40 -35 27 -32 -6 3 26 72
4422 72 -59 68 38 -46 132 -10 3 -7 -14 -12 -41 45 -103 -55 -63 61 -74 -1 -74 -43 66 42 92 -18 -7 114 72
4449 72 4 9 5 74 -1 -10 -32 31 31 35 -13 -55 -93 -18 -72 -83 -82 -51 -22 43 -11 -31 -2 30 -27 18 12 -15 27 35 51 -78 150
4482 150 47 -111 58 -32 4 -85 14 -45 -16 8 32 7 16 -25 -112 -3 20 22 48 -10 78 1 -40 -14 -30 20 -48 112
4510 112 -31 3 35 18 -92 -55 -9 -5 -43 -2 -2 23 -11 -14 51 47 -34 69 18 51 11 -91 29 38 -9 33 -22 -40 -90 -33
$$ packed form
4296D5p6l1R2j5l8l5L4JM4k1P9l1q8K2N3k7k1k4m1M1P5p7j5JL6P8j01N3P2p3n
4327GN7n2J3J7k2p4P0K0J3N4j8n9Pk%j3k8n0J59l7o3l9j23J33R6o7n3L5K6Mk1
4358a0P4j9l6J0Rm0N8o9L4j4MM1l5kp5l2Q0J02r2j2J6k7%N1P4j80k7J36Mmp3Q3
4390B9O6j3r9K5l0K6M3o9L5J7Jk3o6P3n4qJ43l4j03K7J4p3Q5jn1NO2n9K6RK3M6
4422G2j31J27l0q4J78j42J3j0pKk9Q6j48M8qJ24j35P3p3L1J09k4N0j10J1J21m2
4449G2o8NmO9p5rk2O3%Mm8m2l8P5n4j1JL1K9O5n4k0K9L2n7M5ok7M2QJ6j29K28
4482A50j03j58J69r0L6q9R9n9K9K4K4k5Rm1q7J09K3KK6n8Q8p7m1K6j6N0o8J60
4510A12j43L4L2j7j10L7M6Ml8M1%K5l4lO5mq1J03n1L3m0j02J20Rm7M2n5j8n0N7
$$ plain form
4540 -33 20 -80 -17 39 -22 -72 13 -59 -51 -74 -54 49 -11 33 5 -20 -46 0 -20 -27 -7 4 -18 -65 29 -11 55 123 13 24
4570 24 54 -69 -57 -26 -28 -33 -135 35 13 -7 11 5 11 -1 68 -29 -26 -42 11 -8 -55 -48 -20 -6 4 -37 -70 50 14 -82 32
4601 32 -84 18 17 28 -40 -60 0 9 -2 59 -35 25 154 6 68 -5 -2 63 28 -54 -25 37 3 -117 -68 26 -51 -6 48
4630 48 -34 -29 15 32 19 32 128 48 18 46 -9 102 -15 -51 -58 -80 16 16 -37 -51 29 -44 -59 64 -7 -57 23 -70 -134 -70
4660 -70 16 -5 23 58 43 -38 49 -27 -30 -15 10 31 -77 37 126 -29 25 20 -72 24 -71 -5 18 17 56 -118 -68 30 -18 -69
4690 -69 1 24 8 71 88 24 -20 -54 22 -10 -7 -28 -56 -59 -61 -16 14 79 -5 -38 -46 93 -26 -19 -67 -90 -43 5 77 -24 -42
4721 -42 81 19 -12 -35 48 -46 -6 -35 2 -74 -38 44 -21 -20 -6 49 -60 98 -39 53 -21 118 -13 -20 11 24 3 -70
4749 -70 76 -29 33 4 64 -8 39 36 39 11 9 -16 -28 -15 -28 -18 -24 17 -39 -13 -55 -4 -7 -22 39 -38 -34 8 29 -19 58 10
$$ packed form
4540c3N3j00O3N6o1n0Q5p2Qk3K0J03o0M4k8k5k6M6k0pK0J1k2m7R4m0O6O8j10J1
4570B4L0j23J2L1knj02J70k2k0J8oOj2O9r7Lj6N3j9m7PK8J4J0m1l3J20l6r6J14
4601C2j16J02jJ1o8k0O0Rj1O1r4O0J29j48O2p3LO5l5q2K9O2l4j20M9R4p7M5N4
4630D8q2NM4J7j3J3R6q0l0K8n5J11j17l6pk2R6%n3j4Q0p3j5J23p1n0Q0r3o4O4
4660g0Q6k1K8L5j5q1Q7p6lJ5K5K1j08J14Q9j55N4nr2R6r5O6K3jL9j74N0R8m8n1
4690f9P0K3j6O3J7o4m4l4P6l2Lk1k8lkM5L0O5q4l3qJ39j19Pm8k3M7M8P2j01j8
4721d2J23o2l1k3Q3r4M0k9L7p6L6Q2o5JJ4N5j09J58j37R2p4J39j31pL1J3k1p3
4749g0J46j05O2k9O0p2M7lLk8kk5j2J3j3J0oM1n6K6m2N1lj5O1p7MM2K1m8P7m8
$$ plain form
4781 10 -14 -13 35 -19 -14 19 79 93 -54 9 -33 -10 -39 -4 -119 13 16 1 -39 15 105 23 25 55 131 41 70 -73 -66 -16 127
4812 127 -24 6 -53 -64 67 -12 -12 -119 0 -16 24 -103 8 -5 24 7 -71 -43 -85 96 -14 11 56 -65 -12 -14
4838 -14 63 46 15 50 52 3 -30 5 -72 -14 -2 13 -66 47 4 30 16 25 -17 59 39 78 -44 15 33 8 35 15 -27 -52
4868 -52 35 45 -106 -48 -29 28 -64 -27 -41 -78 -83 -23 -69 21 35 95 -24 -65 91 -72 -49 -58 -68 -28 27 22 -72 -38 68
4897 68 6 -43 -41 15 -26 38 -44 -42 -20 54 34 -72 1 -42 21 -70 -36 39 61 1 -4 11 21 25 13 13 -29 -59 -36 19 63 11
4929 11 -27 -22 -56 -81 -5 57 -92 -154 78 27 97 -18 29 67 -31 6 -27 26 1 31 6 -20 -8 -36 -19 -27 -2 -51 -39 61
4959 61 52 -4 -28 11 -21 0 -21 69 65 158 13 -11 23 9 36 -80 25 33 41 -31 -28 -61 -34 -65 -29 -22 -39 47 22 9 7 -15
4991 -15 28 -3 83 -16 38 6 -8 19 109 14 -27 46 92 8 -48 55 -43 -55 -27 43 -34 3 -9 -81 -45 53 58 33 55 90
$$ packed form
4781A0k4JM8n4NL3O0J4j47O3m2K3k9L5j15J32Lj5m0N4R0q2KL0P6r0K9j43PN0J43
4812A27j51L0n9j1J31p9%j07J19j6M0j27J11j3K9j7p8K8m2J81j10K5M5j21N3k
4838a4P7j7l1L5Km9l3L5p7N8J2J5p9J13m3K6j4Rm2P6k0L9j22N9J8k5K7k0m2k5
4868e2Q7J0j51N8J9N7r2L7j4l7nO0m6R0J4O0j19m1J56j63K3rj0M0N5nr4L4J06
4897F8o2m9KN6m1O4q2KK2P4k0j06P3m3O3r1L4P5K2o0nJ5J0Mj2%m2l0K3N5M4n2
4929A1l8Nl4k5P6O2j49o2K32n1P0j15M7L8r8L7l3N3k5L0k5k6J2k8J7qK5m9J2J00
4959F1rn6k4L9l2K1k1R0mR3j45k4L4j4K7j16J05QQp2Ll3K7l1L6Pj7Q6k5j3kk2
4991a5M3l1Q6r9N4l2j4K7R0r5m1P3M6q4n6J03r8j2K8P0p7L7j2p2L6R8Nk5K2L5
$$ plain form
5021 90 33 -69 -33 52 9 19 21 24 35 12 -49 -55 -11 21 -51 29 -30 -11 -71 -145 -1 -31 -97 -59 39 -14 20 -11 71 1 100
5052 100 54 -13 36 -51 -83 66 -44 -76 17 55 -86 0 6 -38 -10 -34 -46 -103 22 34 12 17 41 -8 38 -6 40 32 -5
5081 -5 -56 -46 50 -8 21 -83 17 47 -24 -70 -60 -4 -107 -9 -7 0 37 -29 -3 -15 -23 12 27 12 -6 107 -14 37 20 -76
5111 -76 36 25 33 56 42 -22 -32 -122 -57 -43 -80 12 -14 -77 20 44 5 -51 50 -7 62 -30 22 28 24 -5 46 -26 39 50 -116
5142 -116 -40 -42 -40 -30 -1 -26 -59 -95 49 -51 71 -7 -55 21 -69 85 -31 -4 34 0 26 18 40 -6 -33 -2 49 2 -26
5171 -26 6 -68 20 8 -22 -114 -18 14 58 -75 -61 -10 11 -8 15 -35 -65 99 0 -83 89 4 -5 -42 35 39 49 47 18 -23
5201 -23 58 16 62 -48 -32 -17 -30 16 165 -16 21 73 -68 53 50 4 35 4 4 -27 -4 -89 -16 7 -44 -15 -118 10
5229 10 -29 -40 -69 -71 6 -71 -21 -86 -56 -10 -25 102 -75 -51 10 16 29 -30 -42 102 85 -2 -7 112 24 45 -70 -11 74
$$ packed form
5021I0n7j02L6Q5m3J0KLJ1k3o1oM4L2p2Q0n9J9o0p4J44l0o6L8R8n3L4l1Q2p0R9
5052A00m6o7M9q7l2J49j10l2R3L8j41Q6Om4K8k4j2n7J25J2k2NK4m9M6m4M6ql7
5081en1J0R6n8K9j04J00L0p1m6J0N6j03R8KPL7o6K6j2qL5J5j5j8J13j21N1j7r6
5111g6J12j1QK3j4o4j0r0O5J4l7R2k6o3R7K4l9n6J01n7O9r2N2Omk9N1p2O5J1j66
5142a16P6kKJ0K9k5l3l6J44j00J22p8m8P6r0J54j16K7L8l4K6qK2m6k7L1N1m7k8
5171b6L2p4Q8j2l0r2R6L2M4j33J4N1K1j9K3n0l0J64r9q3J72q5rl7P7MJ0kk9m1
5201b3Q1m2M6j10J6J5j3M6J49j81L7N2j41J21lm6L1l1%l1K3q5P3K3n1K9j03J28
5229A0l9j1k9kP7p7N0o5L0M6j5J27j77K4O1OJ3n9j2J44j7q7nJ19q8K1j15N9Q5
$$ plain form
5258 74 -28 -1 -26 -28 -2 -78 16 -48 -50 61 -25 -19 -43 -8 -33 60 -30 -61 43 -1 -57 -104 -84 83 21 -55 13 -10 -17 16
5288 16 38 -6 -54 23 -88 -13 -40 26 8 85 41 -58 33 -25 1 -112 24 -36 -5 -40 56 -30 -15 -16 31 17 -4 38 -135
5317 -135 -41 73 -36 -22 -69 -58 -69 42 60 0 10 48 16 -75 46 -47 -44 -5 -51 -25 40 -65 -126 -16 -67 -25 -14
5344 -14 -63 32 12 31 -7 -44 54 -36 27 79 -30 -61 50 27 -1 -10 -74 -63 -17 22 69 5 -34 -14 0 -31 14 -25 -54 6
5374 6 6 7 0 37 -17 -4 23 15 17 -80 14 46 -30 94 -106 -5 -14 -73 16 -56 -44 0 -96 -10 40 -60 24 -55 -35 -9 -21 -26
5406 -26 -78 -38 19 61 -15 -9 -24 -18 -8 -65 -31 -85 -61 -115 -41 -63 -16 -11 -25 18 -6 102 15 25 -40 90 14 -1 11 73 -36
5437 -36 26 52 20 73 -17 16 32 -23 -57 29 -48 14 -44 -2 8 12 -60 -11 81 20 11 34 42 -46 -25 5 23 61 89 -18 18
5468 18 59 51 -58 -79 -52 -48 -38 -77 -63 23 -18 40 -11 -94 5 11 13 -72 38 -2 1 -88 89 7 -105 1 38 64 -8 22
$$ packed form
5258G4j02K7k5kK6p6R4o4kJ11q6Ok4L5k5R3r0l1J04m4n6m7K0J67o2p6O8k3pL3
5288A6K2m4m8P7j11P5k7O6j8P7m4r9R1n8K6j13J36o0L1l5R6q6J5jM7j4k1M2j73
5317a35R4J14j09J4m7J1j1J11J8o0J0L8l2r1J21r3LL9m6K6O5j05o1J10n1M2J1
5344a4m9R5k0J9l8l7R8r0O3N2j09l1J11k3k8ro4J1M6L9M7o4l9K0J4l1M5l9k9O0
5374F%JpL7n4J3K7qKr7R4L2p6J24k00J01rn9Q9p2J2M4r6Q6N0j00Q4p9K0K6j2n
5406b6n2M0N7M2p6Oj5OJ0n7L4n4K4n4P4k2M7Nj4M3k4J08q7J0o5J30p6j5J2O2j09
5437c6O2K6l2N3r0L3J6n5l4Q6p7O2n8M2J0Mp2M9R2o1rK3Qq8K1L0J8L8K8j07L6
5468A8M1qj09k1K7MJ0l9J4Q6m1N8n1q3R9OKq5J10m0Lq9J77q2j12J06L7K6p2L0
$$ plain form
5498 22 17 -48 -33 -67 -35 16 6 -127 -74 2 -34 0 -39 -38 -15 37 48 36 35 71 66 -47 37 29 -10 17 21 -58 -57 12 -96 -41
5530 -41 -10 -67 -39 19 35 -48 -49 -26 3 41 26 -34 70 92 -8 24 70 -6 5 -15 -103 42 -14 82 17 3 -20 -19 -38 17
5560 17 -55 -99 27 16 -31 59 -57 -32 96 67 1 34 92 40 73 -21 7 25 4 117 24 -38 -57 -35 -4 -70 -21 -94
5588 -94 -58 -42 -68 -12 6 95 62 -49 -20 -4 6 22 -13 -46 -31 5 -55 -106 -36 85 41 -24 -32 1 -25 170 48 1 12
5617 12 30 -10 -63 63 -45 56 45 30 -16 -66 -34 24 -47 -3 65 50 18 -7 55 30 -13 8 -61 -8 -94 -59 -38 -39 -43 -18
5647 -18 26 -45 0 -44 8 60 3 -31 140 11 70 2 78 -28 -40 59 -13 -42 31 -43 -32 36 -4 -58 -28 -113 -4 -10 -35
5676 -35 -84 47 1 -12 49 -9 -39 28 -21 56 41 -46 -33 32 -81 -107 -13 -13 38 32 9 9 -17 -48 10 -60 14 -72 -19 -19 -19 -25
5708 -25 -44 28 76 84 -67 59 -9 7 -19 -47 69 56 16 -99 -16 -5 37 71 -1 59 -28 52 -13 55 13 52 15 80 94
$$ packed form
5498B2no5J5l4L2N1j0j33N3P6l6L4l9JK3N2J1j2jL6nj13Q4ql9K7Mp9JO9j08N5
5530d1L1n7K8N8J6q3jK3K9L8j5o0J04K2j00L2M6p6J1k0q8J45n6R6o5j4k3Jj9N5
5560A7p2m4J26j1m7R0j16K5J28k9o6L3N8n2L3r4K8J8k1J13r3o2j9K2L1o6M9p3
5588i4L6J6k6N6J8Q9l3j11K9J6J0J6l5l3J5L6o0n1P0J21m4o5qL3k6J95j22m7J1
5617A2J8m0n3J26j08J01j1j5m6n0L2N8p1M4O8j5l2k5O2k5m3K1o9N3q6L5K1jmK5
5647a8M4p1M5m4N2N2n7l4J71j29N9o8P6j06j2R9p2k9P3p4J1O8m0n4L0q5J09ok5
5676c5m9J31m6j3O1n8l0O7m9P7j5q7J3O5j13k6R4%N1ok3%k6l1N8p0P4q6N3%%o
5708b5j9P2M8Qj51J26o8J6k6k8J16j3m0j15Q3J1M2L4p2O0q7Q0o5O8m2L9l7O5J4
$$ plain form
5737 94 90 52 1 -20 10 1 82 -38 0 2 43 -14 -76 -18 30 -33 -57 -29 22 31 15 -26 -25 21 -76 53 69 58 66 0 -31 -7
5769 -7 -83 -18 -45 -129 17 68 60 18 -49 -13 25 -52 -90 35 -18 -24 29 23 -4 -25 -4 -34 -19 47 -30 -53 -21 58 -71 -2 17
5800 17 -151 -53 26 17 49 -8 -79 -22 55 82 64 -50 -44 69 -40 26 -28 -15 34 19 50 38 8 84 -6 -32 7 -51 -12
5829 -12 42 73 -47 33 -43 18 -29 -19 0 -64 -34 12 -92 -59 33 4 -14 48 53 -116 33 -16 3 3 56 -98 19 31
5857 31 -61 58 -28 -19 67 -69 81 6 -41 7 66 48 15 6 -10 5 -28 66 9 11 53 99 -41 49 -65 -27 -3 17 -26
5886 -26 -61 -54 -31 -27 -27 -34 -42 -50 -8 -52 -24 52 40 73 19 -85 5 -25 -1 15 -67 30 48 -18 -42 18 10 -11 34 -95 31 1
5918 1 61 -23 -83 69 80 -35 60 -30 37 -68 13 26 36 66 -106 -12 34 -46 96 -56 36 8 -9 -31 -35 -12 -42 61
5946 61 43 41 78 16 1 23 40 82 25 -1 12 18 -3 21 -29 20 -1 -16 -67 -23 15 30 -1 18 28 37 40 22 32 -43 -9 13
$$ packed form
5737I4ml8n1k1L0rQ1j20L8KM1n7o2N8M8o3k4K8N1Rj6m1JM6r7J29J6j1Qo6l1K4
5769gp6O5k7q4J46N1qm2o7L6L8p7l8J25n3oN3ok7k1K1l0J5O6p7k3L2P9j29O9J9
5800A7j68R8P9rL2n7p1N7P7K7j8j14OJ13j09O6n4J3M9j5L1j2l0P6r0k6L9n8L9
5829a2N4L1j20Q0p6O1m7J0J9o4L0M6j04L3R2k9j8O2Nj69J49m9J9%N3j54J17J2
5857C1r2J19q6RQ6j36J50p5m7M8N9j8l3rj6J5l3R4n7KM2M6j40R0j14L8K4K0m3
5886b6l5PK3M%pqqM2m4K8P6j2L3n4j04R0l0K4J6q2R7J8o6k4O0qk1M5j29J26l0
5918AO0q4o0J52J1j15R5r0O7j05Q1J3J0L0j72R4M6q0J42j52R2k8j7k2mK3l0J03
5946F1j8kL7o2j5K2J7M2n7k6J3Ok1K4n0M9k1j5n1M4L8J5l1J9J0RLj8J0p5L4K2
$$ plain form
5978 13 -42 -16 78 61 69 5 61 -25 4 72 -32 -36 19 17 -22 83 -62 -46 4 28 36 -16 -19 -6 -58 -21 -31 -81 35 84 -19
6009 -19 4 9 6 -62 -42 -9 48 -25 -95 74 22 -53 8 23 -13 103 14 11 26 -11 -31 -85 55 34 -59 33 -36 66 -48
6038 -48 48 27 -18 -11 0 -36 -23 -98 -14 44 -12 -86 -47 -7 10 0 -15 -21 36 7 37 -14 -26 -4 -35 33 57 -12 74 16 10 6
6070 6 16 10 6 35 -25 0 50 14 56 19 53 40 0 22 -23 -23 10 -9 -55 51 -9 -24 -42 -22 36 -48 61 -37 -2 -7 -2 57
6102 57 -34 -10 -5 71 -2 -56 -16 -60 1 5 -8 -14 59 -55 21 -27 -14 22 21 87 -53 -27 32 22 5 -26 -8 93 4 85 -71
6133 -71 -47 86 79 65 -16 -20 -28 -12 -3 -31 -49 7 -35 10 -6 15 0 83 39 -68 -13 -2 -24 5 -33 10 38 -33 -58 2 -40
6164 -40 -74 36 37 -42 -12 3 -24 21 -80 19 -48 41 62 35 15 45 -45 -18 -7 29 -43 83 -22 -20 14 -40 -41 -44 -65 -55
6194 -55 -30 -27 -20 45 -135 6 12 -64 19 -62 45 74 -61 -3 -75 -2 42 -51 15 -20 -94 -41 -39 2 -26 -26 -67 48 -41 66
$$ packed form
5978A3n5K6R4j7Qo4N6q6K9O8j04mN5kl9J05j45J6N0K4Qn2lJ3n2L7j0n0J16M9j03
6009a9K3Nlo8K0L3N7p3p0J69n2p5O1J5l6J16q9lJ5l7k0n4J40k1r3R2o9J02j14
6038d8R6k1m5PJ1l6J3p5Q4N8n6p4L9M0J7j0j5oN7k9L0n1j2K2l1O8K4o9Q6n8om
6070FJ0omK9o0K5N0l6M2l7L4j3m0K2m5%L3j9m6J06o0j5j8K0N8q4J09r8L5nNN9
6102E7r1K4NP6p3n4M0m4O1Mj3oP3j14P6m8J3L6jO6j40K6N9j0j7l1J8J01q9Q1j56
6133g1K4J33pj4q1mqJ6Rk8j8N6m2M5j6K1j5Q3m4j07N5J1k2K9l8M3K8p1k5O0m2
6164d0l4J10Jp9L0J5k7M5j01R9o7Q9K1k7k0L0r0K7J1L6p2J26j05KL4n4jlk1J0
6194e5K5LPO5j80J41Op6Q3q1J07K9j35N8p2P3M4r3O6l5p4N3KM1k8%m1J15q9J07
$$ plain form
6224 66 71 -10 -19 13 41 29 39 15 -11 27 50 -41 -20 -64 -55 -14 -24 -34 -4 -2 -4 11 2 -42 19 -7 -62 3 10 -23 39 52 29 -21
6258 -21 37 -1 20 0 -11 -24 5 -62 40 51 82 -73 -80 0 64 2 -6 2 13 59 104 76 -41 19 -61 -20 -45 19 -84 16
6288 16 -4 38 39 -81 90 -51 -54 63 -43 -8 -133 -21 -14 -15 -23 -127 8 -74 -71 -9 -33 60 47 38 37 45 69 14 62 46
6318 46 49 -70 -17 111 4 -14 87 85 54 24 -14 36 -29 15 32 -49 29 33 -3 43 -19 49 -42 14 20 25 -54 -10 58 81 -29
6349 -29 -63 -28 -35 13 -65 -2 -66 -5 -34 -25 17 67 8 79 30 7 17 -25 38 18 -74 36 10 -74 37 28 149 93 16 -99
6379 -99 -20 -56 -24 86 -29 -51 11 14 7 86 0 -54 14 -34 7 40 78 -15 -80 -6 -5 30 -31 11 -50 -106 69 23 33 -44
6409 -44 2 -50 12 53 -26 -15 -69 71 -35 49 65 13 92 71 43 -39 -2 31 -72 50 -40 42 16 -95 -34 52 44 -13
6437 -13 -27 -4 -44 27 -5 38 31 21 43 10 -6 6 85 -84 73 8 17 20 30 89 18 -15 -63 -2 40 -67 45 -29 -43 -33
$$ packed form
6224F6Nq1rL2K8j2J0k4k6L8K3r1K1m4RM1j0j0L0KkJ5rm4O1k6n5O5Pl3O2J3k3n0
6258b1N8l8K1k0j1j3K9o7J02J1L1j55pQ0O4o2qQJ1M6M5k8j17O0q0M1k5O4j03J00
6288A6k0M2Jj20J71j41lJ17j06L5j25J12Pjqj04J35q2LO2k4R3j3rjQK4n5M8j6
6318D6Lj19N3J28j07j8J01kl1l0l8N0o5M4J7q1P8Ml6M6o2O8r1N6ONp9M4O8K3j10
6349b9l4L5pM8p8O3o4O1k9RM2N0n9P1m9k3J0m2O3k0r2J10k6q4J11rJ21n6p7j15
6379i9P9l6L2J10j15k2O2LpP9q6n4O8m8M1L3L8r3o5P4JL5o1M2o1n6J75m6J0p7
6409d4M6n2O2M1p9J1n4J40j06Q4J6n2P9k1k8q2L7L3j03J22r0Q2k6j11O1Q6qn7
6437a3j4K3m0P1l2M3pj0K2l3j6J2P9j69J57o5RLJ0N9p1l3m8O1M2j07J12p4j4J0
$$ plain form
6467 -33 -19 -46 32 36 32 -67 -31 -8 5 9 -12 45 40 21 -22 67 -8 75 78 -6 -71 33 16 -50 -22 -4 -40 -82 -54 34 16 28
6499 28 128 -67 -15 18 73 -51 52 66 -70 -44 1 -12 13 -83 22 -41 -40 -36 -44 60 -6 -29 -16 89 4 10 -53 36
6527 36 -39 -28 63 -43 4 52 45 -46 18 11 5 2 -34 57 -26 -11 19 -66 -53 -8 -27 34 58 -53 -81 -49 117 -47 -8 -61
6557 -61 21 -16 38 17 -47 60 -42 61 80 12 4 53 8 77 -41 -82 23 -31 70 -29 38 18 -7 -100 53 -21 63
6584 63 17 65 -16 26 2 -9 -21 102 65 45 -101 1 14 9 75 -30 -29 -7 -76 19 57 -24 -49 -33 130 10 -9 12
6612 12 -18 4 -4 67 -11 -1 3 -1 16 113 -21 -59 -4 -96 42 -38 29 42 57 -21 16 17 -12 -42 -31 46 29 34 4 65 -58
6643 -58 -15 25 19 -7 -20 -11 46 -12 2 2 92 6 -109 -20 -106 -65 32 11 -30 -18 5 -24 -67 22 -20 -3 46 88 -71 -46 34
6674 34 139 69 -41 29 20 65 -24 42 44 -56 -10 66 37 69 20 19 105 27 -7 32 13 36 -43 13 23 -41 22 -102 -72 -79
$$ packed form
6467c3J4k7P8Mmr9L6K3J3Mk1N7nj9m3Q9p5Q3Lq4o5J04j7o6K8J8l6m2K8Q8j8J2
6499B8J00j95N2L3N5j24J03J4j36K6M5j3K5r6J05o3JMqJ04o6k3J3J05q5Oo3Q9
6527C6p5J1R1j06M7M8pr1O4poll6R1q3J5L0q5J3M5j9O1K4j11k8L2J66j64L9n3
6557f1Q2l7N4k1o4J07j02J03J9o8qM9m5O9j18m1J05n4J01r9O7k0k5r3J53p4Q4
6584F3m6M8q1M2k4j1j2J23l7k0j46J02J3nO6j05JK2o9R5L8q1k5J6J63j20j9K1
6612A2l0K2qP1p8J0MmJ7R7j34l8N5r2J38q0O7J3J5p8L7Jk9l0J1P7j7Nl0O1j23
6643e8M3M0ok6j3RN7n8J4%R0q6j15Q9q6M1R7k1m1J2K3k9m3Q9m2J7M9M2j59K5Q0
6674C4J05p0j10P0rM5q9O6Kj00M6P6k9L2m9jQ6p8l4L9j9K3p9N6J0o4O3j24L0p
$$ plain form
6704 -79 -12 -15 35 -13 47 32 18 -6 21 15 -48 43 -3 -22 31 -13 14 -4 -62 -4 73 37 -24 -57 -28 -4 50 26 -65 -32 51
6735 51 -16 83 14 80 -26 26 5 -32 0 16 52 -24 80 91 28 -41 17 14 -46 -62 -40 32 -10 3 63 5 -40 8 -16 15
6765 15 -69 1 -14 -35 -74 -6 -3 -29 54 30 80 46 93 -40 33 -74 74 29 33 2 -26 24 83 -141 50 -2 31 -27 16
6794 16 5 -14 3 31 90 -82 -10 27 71 10 -42 -69 -9 -37 -54 5 30 -29 69 4 18 -58 -58 75 -35 54 -21 -20 -21 13
6824 13 7 -40 -48 21 55 30 -50 1 -66 -36 30 46 30 -8 -1 23 52 -5 27 -69 -58 8 -61 28 -69 -12 65 -2 -20 -5 4 -11
6856 -11 -19 -82 71 17 -22 19 -46 -105 4 29 23 -102 39 -12 -51 24 19 -36 -81 24 34 -50 -27 -30 -6 -33 -54 51 58 -61
6886 -61 42 -38 55 -12 -12 -2 6 15 43 -60 62 5 -47 11 34 -22 -49 45 -15 17 -22 69 -65 17 -6 31 -2 31 117 15
6916 15 -73 39 -67 33 44 -79 22 30 17 -4 -14 43 -33 -1 26 -4 35 47 64 -7 97 49 32 3 5 -69 6 75
$$ packed form
6704g9O7lN0m8O0j5j4k4K7oo3R1m6j9N3m4K7j8n8N8P7l6o1l3K9K4N4k4r1L3Q3
6735E1o7R9o9O6j06N2k1l7L2J6L6p6J04J1o3o9N8lo0j6K2P2m2J3O0n8m5M8k4L1
6765A5q4P0j5k1l9O8Lk6Q3k4N0l4M7j33P3j07J48m5Ml1k8N0N9k24J91n2L3n8M3
6794A6j1j9J7K8N9j72P2L7M4o1n2k7O0k8j7N9K5n9R8o5J4p6%J33j10Q9p5JjL4
6824A3om7qO9L4k5q0N1o7L0O6J6j6l8PK4K9n7L2r6J1O6o9Q9r7N7P7o7j8J5Rj5
6856a1qo3J53n4l9M1o5n9J09K5oj25J41n1l9P5nn5m5J05J0q4K3lK4k7k1J05Pj19
6886f1J03q0R3o7%J0QRK8j03J22n7n2N8K3n6k7R4o0L2l9R1j34Q2k3L7l3L3Q6j02
6916A5q8J12j06J00J1j23J01Qj3k1j0N7p6L2K7l0L9J2J7p1J04m8j7k9Kp4P5O9
$$ plain form
6944 75 21 30 37 22 -98 -32 2 -48 29 -44 3 38 -54 -21 17 32 19 -24 149 -115 30 3 -30 14 52 33 -27 7 -24
6973 -24 -59 -76 37 -4 34 53 -14 -69 -8 -33 -32 -20 -57 40 20 36 75 -27 -44 -32 35 29 -17 -20 73 -107 -42 -30 29 -31
7003 -31 14 -63 13 -78 -1 39 35 -68 22 72 -54 -8 -33 -2 57 107 14 -4 68 29 41 4 -58 27 64 73 16 -85 -64 -83
7033 -83 55 4 5 17 -40 104 69 -15 29 -33 -12 -55 0 14 -15 5 9 45 24 9 -18 -15 20 -5 19 -54 98 2 13 24
7063 24 45 -72 10 -102 -26 36 -36 22 -57 -84 -80 59 30 -37 38 2 19 57 -36 -44 -54 -5 32 47 30 28 -50 -89 -27 -84
7093 -84 -89 44 59 -26 50 77 -48 31 80 9 49 -14 86 41 58 5 -83 111 -16 -39 -11 -9 -24 -23 -93 -35 53 -53 -57
7122 -57 -104 -55 -74 101 21 57 -42 43 61 -52 6 58 10 32 34 115 120 -46 -3 15 18 -23 -41 50 -36 -13 -92 33 -9 -10
7152 -10 -64 -9 -1 6 -57 -18 -126 109 -17 18 -13 38 -21 -29 -35 -11 -11 -32 27 -67 -55 -58 -35 43 -26 -23 47 -31 -1 -73 -95 -4
$$ packed form
6944G5n4RPj5j20O6L4n0P7p3M7L5r2L3L8J5j3m3J73k64J45k7l3M4L8j9o0L4l1
6973b4l5j7J13m1L8J9o7n5O1k5JJ2l7R7k0J6L9j02j7J2O7om6lR3j80O5J2N9o0
7003c1M5p7P6r1P7M0mj03R0N0j26M6k5L1N9N0r3j8P2l9J2l7o2Q5L7Rn7j01K1j9
7033h3J38n1JJ2n7J44l5q4M4o2K1m3N5J4k9K0ML6k1j5k7LL5k5K4p3J52r6J1J1
7063B4K1j17Q2j12P6O2p2N8p9k7MJ39k9o7P5l6J7L8r3qj0M9L7J5j7kp8l9O2n7
7093h4nJ33J5q5P6K7j25P9M9p1M0o3J00m5J7n3q8J94j27k3K8Kj5Jp0N8Q8j06m
7122e7m7M9j9J75q0L6r9Q5J8j13N8N2m8K2KQ1Nj66M3J8Lm1j8R1q6K3p9J25m2j
7152a0n4N5QPo3L9j08K35j26L5l1N1n9qoK4%k1N9r4J2lK3P8o9LP0p8L0p2k2R1
$$ plain form
7184 -4 52 9 -57 -17 -43 40 48 29 91 -69 -33 71 -8 -24 -7 -41 12 -41 17 9 -44 -56 -20 75 -9 -13 56 35 -24 28 -75
7215 -75 -121 34 -33 -46 -28 21 -19 -23 -99 -89 46 -12 -78 -25 58 -18 -20 41 -56 12 -16 -18 -3 -19 -45 49 -33 9 -19 78 60
7246 60 23 -15 31 66 4 3 -67 -17 -88 -22 -48 66 57 43 -39 -12 -26 59 -37 27 -55 -52 4 -52 10 32 18 -94 -108 -10 -74
7277 -74 -1 18 -70 -55 -1 -7 32 49 -4 38 -27 -1 12 -27 6 51 58 -99 -42 26 33 -70 -6 14 -34 -40 83 56 41 -63
7307 -63 45 15 18 -43 -33 45 0 -40 38 9 -15 51 8 17 30 -17 29 51 -59 -29 -15 -29 -106 -17 17 -4 32 -16 30 7
7337 7 0 31 -22 -80 -8 -28 -87 67 118 -5 38 -30 63 54 3 94 50 -17 -28 -17 9 -49 48 81 -91 -61 -3 -30 -36 -58 -61
7368 -61 7 -16 -28 -26 16 33 -46 16 45 -29 -82 106 -7 6 33 -62 -55 61 23 21 38 23 93 -8 119 -15 -5 -24 -30
7397 -30 -28 -12 -67 -30 54 -29 41 -33 -31 37 -42 33 10 -70 -19 63 -19 -25 24 -79 -16 -19 70 2 -28 28 37 47 104 4 -40 -17
$$ packed form
7184dN6m3o6M0k6Q3Qj9O2j60L6J04p9j6J7l4N3n3N8qn3j2L6R5q4mO9k1n9N2j03
7215g5m6J55o7j3J8M9m0mp6J0J35n8o6N3Q3p6kO1r7O8k8kJ5j6k6R4q2M2k8R7j8
7246F0l7l8M6L5o2jp0N0p1O6k6J14rj4q2K7j4Q5r6O4q2LN6n6O2K2j4j12j4R8o4
7277g4P3J9q8J5N4oL9J7n3M2o5K6J3l9L3M5Pj57N7O8Pj03O4K0m8oJ23k7j5j04
7307f3J08l0Lo1J0P8m5m0P8k9k4O6m3RJ3m7M6K2j10L0J4j4p7Q9L4k1L6m8M6k3
7337GpL1n3n8P2k0n9J54N1j23M3o8R3rn1R1m4o7j1J1K6n8R7L3j72L0N8k7ok2l
7368f1O8k3j2KM2J7p9O2K9p4n3J88j13J3K7r5PJ16l8kJ7j5P0j01J27j34J0j9o
7397c0KJ6n5L7Q4q3P0p4KO8p9P5k3q0N1Q2q2oM9j03O3lQ9o8l0N6RJ0N7j00m4K3
$$ plain form
7429 -17 -67 -39 39 53 31 32 -10 -35 20 33 22 -57 15 50 36 14 -68 16 -38 41 44 2 -11 18 52 33 -33 26 -20 21 -22
7460 -22 -11 56 -13 147 -27 73 -53 82 67 -6 8 -70 -17 -75 53 -88 30 16 59 -2 -105 48 -20 8 1 -52
7486 -52 -51 36 0 -58 -16 -36 -45 73 -92 3 -63 -25 61 -47 58 47 64 66 -14 -20 -33 22 36 -6 46 58 14 51 5 64
7516 64 -7 -113 -39 7 -11 92 -51 -71 -53 17 -63 -49 -13 -58 30 -52 12 37 -116 -101 -40 27 28 2 -20 -38 54 87 36
7545 36 96 -20 20 -37 14 -8 43 -1 1 14 -3 12 9 -55 84 -18 56 21 35 43 26 -8 -22 31 22 -3 -24 30 -73 5
7575 5 -63 24 -38 27 53 -21 -8 -19 55 -91 -59 -10 -48 75 -24 4 -20 33 -6 40 29 -65 -12 11 40 -22 32 -11 -16 -56
7605 -56 -2 46 58 7 -48 96 117 16 66 37 54 8 -13 -31 -66 -23 34 17 -58 43 20 36 -72 -15 -15 -46 -61 -32 -18
7634 -18 24 -36 35 -41 -45 -68 -68 -35 89 64 31 36 55 -45 -29 -21 -9 49 71 16 -24 41 -32 -20 55 3 -20 126 40 -9 -28
$$ packed form
7429a7n0K8P8J4k2Jm2k5N5J3j1p9P2L5j4k2q2Q4n4P9Lm2j3K9L4j9o6N9m6M1m3
7460b2J1O7o9J60j74J00j26J35j5p3J4p8N3n8J28j41J18j4M3o1j03J53o8K8pn3
7486e2JQ7l6n8M2k0rJ18j65R5o6L8Q6j08J05j1J7Kq0oj3N5J4m2N2J2m4L7m6N9
7516F4p1j06P4M6j8J03j43k0J8P0q0J4L6m5Q8q2O4K5j53J5O1O7Jk6k2j8R2L3n1
7545C6O0j16M0n7N1k2N1m4KJ3j7J5lo4J39j02P4l5J4Qj7l4j4N3rk5k1N4j03P8
7575Eo8Q7o2O5K6p4J3j1P4j46L2M9l8J23r9K8k4N3l9M6j1r4N3K3K9o2N4m3nm0
7605e6N4M8J2n1n5J44K1j01N0k9J7m6k1j8l5M3N7j7p5J01k3J6j08N7%l1j5K9J4
7634a8M2o0P1p6mk3%L3J24k5l3NJ9j00J6QJ2N8K2n5m0O5p3J2P5n2k3J46q6m9j9
$$ plain form
7665 -28 29 34 2 30 -4 -22 31 -3 73 -16 8 31 -34 -29 -25 -63 -46 -13 31 68 -44 0 48 -24 -12 -12 7 -41 -14 52 46 -51
7697 -51 -33 35 11 21 -61 32 38 -20 21 72 11 58 -22 55 -1 -47 53 -23 5 27 -67 -70 39 9 -70 18 -11 0 63 13
7727 13 40 -32 -45 -27 76 35 -43 30 11 -21 -11 -24 -40 -71 21 56 21 26 37 -28 -16 40 -68 -17 49 -13 18 36 9 56
7757 56 -60 -100 27 -46 -21 101 -7 -7 15 -34 10 -87 -95 34 -35 -53 -15 19 62 -19 46 -5 31 -63 -20 -74 59 -17
7785 -17 25 58 -62 -32 18 -59 -11 -73 -19 -14 -121 -47 -5 -59 -3 39 11 35 -8 9 -45 -63 -13 -7 -27 20 12 -16 -29 -76 -91
7816 -91 -42 -71 70 -8 20 17 10 9 37 -58 4 -60 38 48 -121 9 31 -8 -18 54 -60 -4 -8 26 -13 5 54 31 -28 -25 -45
7847 -45 69 -29 -51 74 33 -35 32 -3 -51 41 -6 -40 -72 -39 105 42 17 45 1 64 84 -31 -11 -54 -10 58 43 128
7875 128 5 -22 4 -27 87 5 -72 2 47 -73 -21 -115 -55 31 -25 -6 -7 -39 -22 -5 -8 -65 -14 -14 -71 65 -52 23 -37
$$ packed form
7665b8N7Nl2K8l4j8N3l4P6q9K4K3o5NMl8J7L3M4L7j12M4M8p2J2%J9m8K7O6or7
7697e1J8O8k4J0q2R3On8M1N1o1M7q0P7n6m6J00p6K8K2r4lJ09l0p9Q8k9J1O3n0
7727A3K7p2j3J8J03m1p8P3j9l2J0j3j6l1R2L5l5NJ1o5J2N6j08N1O6o2L1J8k7M7
7757E6j16m0J27p3K5J22j08%K2m9M4r7qJ29o9j8L8L4M3q1O5n1L6r4M3n4J33p6
7785a7M2L3j20L0N0p7M8o2N4Nj07P4M2n4N6M2k8K4m3J7n4j8N0Ok0M7qk8j3m7j5
7816i1M9k9J41p8K8lpjK8r5O2o4R8J0j69J30K2l9j0P2j14N6mL4l9J8M9k3n9Lk0
7847d5J14r8k2J25m1o8O7l5m8R2m7l4l2L3J44o3k5K8m4O3K0j15K0m3M4O8j5Q5
7875A28j23k7K6l1J14q2p7P4M5j20N2r4O0Q6n6J9jl2J7J7ln7N1%n7J36j17P5o0
$$ plain form
7904 -37 -12 -68 -1 30 3 7 -95 10 16 58 8 55 -29 -67 73 -56 22 -38 70 44 65 47 -24 48 87 21 31 54 -45
7933 -45 28 33 56 -36 -45 100 -81 -3 14 -38 -18 113 7 8 28 -75 -11 -59 -36 -28 -12 133 -25 15 62 -35 -14 -40 17
7962 17 28 -65 -56 33 -38 53 37 -11 -36 -6 44 -70 -80 2 59 72 -20 -45 22 52 76 -26 43 73 61 26 27 -37 -32 28 -16
7993 -16 -2 5 -30 74 -40 13 24 16 -27 -35 53 -28 19 59 20 45 -49 29 -12 21 20 -9 66 -30 -37 -67 97 -48 -35 7 -14
8024 -14 32 30 -11 6 -73 8 -67 -13 58 24 -4 22 72 35 73 60 63 25 7 -19 -47 -89 16 -18 53 -10 26 56 -12 22 -16
8055 -16 54 -107 -41 10 -15 24 -55 55 16 -13 -31 24 122 62 36 39 35 23 93 -20 -44 -24 -10 82 33 86 -18 7 23
8084 23 -34 47 -37 -9 28 20 48 -8 -27 -3 -10 -40 100 11 -64 -15 -27 -70 19 79 -47 25 50 -62 -9 22 28 9 67 -19
8114 -19 90 81 40 7 72 -22 -15 136 10 -17 -35 -119 -23 -45 -8 -40 -6 18 95 -3 89 -63 60 51 -71 40 52 -17
$$ packed form
7904c7K5n6O7L1k7Mj02J05OM2n0M7q4l8J40j29P8o0J08k6K1j8p1P2L9o6J0K3r9
7933d5P3NK3r2rJ45j81P8J7n2K0J31j06JK0j03O4m8K3QJ6J45j58M0M7r7K1k6N7
7962A7J1r3RQ9p1R1j6m8k5L0N0j14j0Q2N7J3r2k5O7L0K4j02O9L0j2l5Jo4NO0m4
7993a6J4Pl5J04j14N3J1qm3qQ8q1M7M0l9K5r4P8m1L3jk9P5r6pl0J64j45J3M2k1
8024a4M6km1J7p9Q1p5N4P1l4k8K6N0l7L8j3Ll8j8k6k8m2J05l4P1o3L6L0o8L4l8
8055a6P0j61O6N1k5L9p9J10l9k9j8N5R8o0k6Lmj2P0j13k4K0J4R2m9N3j04K5J6
8084B3n7Q1q4K8L7qK8n6j9K4pl0J40q9p5M9j2m3Q9O0j26P2K5j12N3L1Oj9N8q6
8114a9J09rm1l3O5r4PJ51j26k7j8q4R6k2L7l2L4K4P7r8R2j52J23rj22J11J2o9
$$ plain form
8142 -17 5 -59 -21 64 -40 -8 -102 -11 6 14 20 -13 74 -77 43 11 -23 -1 -109 5 40 36 46 -47 -16 152 -54 70
8170 70 83 -67 16 3 32 -61 -8 7 -63 -10 4 -59 5 -14 -45 76 -30 28 -6 15 38
$$ packed form
8142a7K2o4L8Q5j04L2r4R1J7QOl3Q7j51J20l2l4K2j08J14L5mJ0r3L1J68k06J24
8170G0J3j50Q3j3K9r3N3J5p0N3J4o3O4j9l1J21j06N8l4K1K3
8191C8
$$ Imaginary data points
##PAGE= N=2
##DATA TABLE= (X++(I..I)), XYDATA
$$ plain form
0 0 0 0 0 0 0 0 0 0 0 0 0 0 0 0 16 -16 16 -16 16 -32 32 -32 48 -48 64 -65 80 -96 112 -128 144 -161 192 -209
34 -209 240 -272 304 -337 376 -417 465 -517 577 -637 706 -774 854 -946 1042 -1145 1263 -1391
52 -1391 1533 -1694 1873 -2075 2308 -2573 2887 -3256 3701 -4255 4962 -5895 7195 -9134 12337
67 12337 -18582 35350 -175203 -487178 -74762 317970 317368 -42327 -260595 -169591 77039
78 77039 158092 80477 1739 -7049 -71373 -139764 -64939 138735 210932 41117 -200177 -222415
90 -222415 15512 248073 180729 -94998 -237061 -106298 84143 132611 53117 -30704 -59924
101 -59924 -44307 -16762 30035 90263 82292 -45027 -152196 -77170 97723 144758 23274
112 23274 -94990 -76873 24380 67980 10731 -39639 -3149 30024 -32932 -91559 -17329 105498
$$ packed form
0@%%%%%%%%%%%%%%J6l2L2l2L2m8O4o4Q0r6J12j29J45j76K08k40K72l05L53m01
34b09M49n12N76o41P13p93Q82r82J094j214J343j480J628j800J988k187K408k654
52a391K924l227L567l948M383m881N460o143O957p956R217j0857J3090j6329K1471
67A2337l0919N3932k10553l11975M12416L92732o02l59695k18268R1004K46630
78G7039Q1053p7615p8738q788o4324o8391P4825K03674P2197j69815k41294k2238
90b22415K37927K32561o7344k75727j42063J30763J90441M8468p9494q3821k9220
101e9924J5617K7545M6797O0228p971j27319j07169P5026J74893M7035j21484
112B3274j18264J8117J01253M3600n7249n0370L6490L3173o2956n8627P4230J22827
$$ plain form
124 105498 99526 -34792 -126603 -60382 83730 118976 -3934 -110933 -53356 63326 61524
135 61524 -26793 -42618 35615 75994 -2248 -105409 -75766 76705 141442 2774 -156735
146 -156735 -112663 71246 151209 44692 -96649 -105616 5892 80813 33337 -38781 -25160
157 -25160 20404 2915 -34603 -4432 60327 60674 -16946 -82291 -49772 49777 86756 7107
169 7107 -76583 -53533 25080 49814 14165 -17528 -15976 -2880 -6334 -19995 -5600 33274 29970
182 29970 -28303 -52885 3098 59028 37204 -24522 -44375 -4749 37140 21774 -28222 -30826
194 -30826 23238 43603 -7393 -47807 -15595 37246 36450 -14040 -49995 -25826 26649 32731 -11051
207 -11051 -27232 8659 26348 -7225 -31445 -1625 41211 34058 -24908 -64737 -21255 62060
$$ packed form
124A05498n972j34318r1811O6221J44112L5246j22910j06999N7577J16682j802
135F1524q8317j5825P8233M0379p8242j03161K9643J52471O4737j38668j59509
146a56735M4072J83909P9963j06517j41341q967J11508P4921m7476p2118J3621
157b5160M5564j7489l7518L0171O4759L47p7620o5345L2519R9549L6979p9649
169G107q3690K3050P8613K4734l5649l1693J552J3096l454j3661J4395L8874l304
182B9970n8273k4582N5983N5930k1824o1726j9853L9626M1889j5366m9996k604
194c0826N4064K0365n0996m0414L2212N2841p96n0490l5955K4169N2475O082m3782
207a1051j6181L5891J7689l3573k4220K9820M2836p153n8966l9829M3482Q3315
$$ plain form
219 62060 71516 -10249 -70840 -37199 32783 52980 14420 -32007 -38951 -9262 12459 9509 10393
232 10393 17415 -3271 -38178 -30314 21272 51485 21875 -35135 -56726 -12611 50956 54544 -3235
245 -3235 -42438 -23118 11534 21658 13871 1573 -10619 -17992 -17563 -3514 25099 36307 -1012
258 -1012 -47620 -36514 19762 46306 15421 -30081 -40499 -6640 32300 29890 -3595 -17007
270 -17007 -2991 3958 -1264 3579 12325 5848 -10549 -18325 -7506 17205 27773 1144 -30741
283 -30741 -21043 13556 21254 -1270 -18632 -13621 3985 13976 3440 -10258 -870 14731 4775
296 4775 -14484 -8174 11524 13081 -1397 -11257 -6490 9305 16641 1028 -15355 -5915 10002
309 10002 3248 -11109 -8510 2489 5682 771 -6959 -7403 5755 13790 -857 -15819 -5417 11205
$$ packed form
219F2060R456q1765o0591L3641O9982K0197l8560m6427o944K9689K1721k950Q84
232A0393P022k0686l4907P864N1586L0213k9610n7010k1591M4115O3567L588n7779
245c235l9203J9320L4652J0124p787j2298j2192p373M29J4049K8613J1208l7319
258a012m6608J1106N6276K6544l0885m5502j0418L3859L8940k410l3485j3412
270a7007J4016O949n222M843Q746o477j6397p776J0819K4711J0568k6629l1885
283c0741R698L4599P698k2524j7362N011J7606R991j0536j3698R388J5601r956
296D775j9259O310J9698J557j4478r860M767J5795P336j5613j6383R440J5917
309A0002o754j4357K599J0999L193m911p730m44J3158Q035j4647j4962J0402J6622
$$ plain form
323 11205 8660 -2836 -6077 -536 7871 9752 -1121 -8814 1743 9948 -2290 -12976 -3047 8617
337 8617 4834 -5093 -9231 -3801 8313 10230 -5772 -15630 -2670 10134 4295 -4017 -2292 1366
351 1366 3474 4960 1665 -1075 3917 3981 -6542 -8225 5299 10745 -1 -8803 -6730 1039 8888
366 8888 6276 -8604 -14354 -1019 8638 1171 -5111 -982 1701 771 1602 1576 1461 4335 1580 -7054
382 -7054 -4595 8299 9418 -2308 -6838 -1307 3368 5096 2140 -6313 -8361 555 4178 -2661 -4436
397 -4436 1024 1314 -1792 -172 1424 1003 2205 344 -5280 -1976 8107 6691 -3675 -4654 2630
412 2630 5333 3625 76 -5217 -5048 2081 3236 -3080 -3422 1085 -923 -3704 437 3155 -59 -2023
428 -2023 -2535 -3666 632 7311 4081 -4321 -3122 3554 4535 2991 1788 -2203 -3929 678 2211 -1327
$$ packed form
323A1205k545j1496l241N541Q407J881j0873p693J0557Q205j2238j0686R929J1664
337H617l783r927m138N430J2114J917j6002r858J2960J2804n839q312J725L658
351A366K108J486l295k740M992O4j0523j683J3524N446j0746q802K073P769P849
366H888k612j4880n750J3335R657p467o282M129K683r30Q31k6j15K874k755q634
382g054K459J2894J119j1726m530N531M675J728k956q453k048Q916L623o839j775
397d436N460K90l106J620J596m21J202j861n624L304J0083j416j0366r79P284
412B630K703j708l549n293J69P129J155o316l42M507k008k781M141K718l214j964
428b023n12j131M298O679l230q402J199O676R81j544j203l991j726M607J533l538
$$ plain form
444 -1327 -126 3039 -1471 -6240 -1835 3283 2064 -571 -3340 -6427 -2884 5287 5409 -589 -1625
459 -1625 -146 -1257 984 6001 4305 -1695 -3243 -2294 -1153 4015 7489 1226 -6672 -5539 -699
474 -699 2105 4402 2278 -6111 -9391 -2664 4071 5620 4783 -683 -8698 -6760 5078 10497 5012
489 5012 -2618 -7220 -5966 3270 11040 6853 -2356 -5677 -5177 -2911 4296 8756 1850 -8156 -9840
504 -9840 -4737 3669 11057 7518 -7374 -14753 -5266 7744 11730 5969 -5415 -12218 -4302 9272
518 9272 11320 3844 -2175 -5536 -6777 -548 7511 7304 791 -5341 -9332 -6866 4837 12545 4787
533 4787 -8278 -12657 -7243 4207 13451 8668 -7269 -13643 -3840 7503 10570 6825 -1990 -8770
547 -8770 -5427 3016 6137 5112 3439 -2742 -9502 -6440 3555 8772 6628 -1642 -12658 -13812 1592
$$ packed form
444a327J201L165m510m769M405N118j219k635k769l087L543Q171J22n998j036
459a625J479j111K241N017j696o000j548R49J141N168L474o263p898J133M840
474f99K804K297k124q389l280O727O735J549q37n466q015J938J1838N419n485
489E012p630m602J254R236P770m187r209l321N00K266P207M460o906j0006j684
504i840N103Q406P388l539j4892p379R487J3010L986n761j1384o803P916J3574
518I272K048p476o019l361j241O229Q059k07o513o132l991K466J1703P708p758
533D787j3065m379N414J1450R244m783j5937o374R803J1343L067l745q815o780
547h770L343Q443L121j025j673o181o760L062R995N217k144q270j1016j154J5404
$$ plain form
562 1592 15744 10667 -5410 -14388 -9586 4617 15214 9358 -5657 -10150 -2786 2912 4524 6589
576 6589 4659 -2556 -7298 -6495 -984 8641 12822 379 -16562 -15691 1753 15454 13215 -2995
590 -2995 -18408 -14446 6374 18070 8115 -6307 -9927 -5592 1792 7999 7355 2004 -1853 -4873
604 -4873 -7464 -994 11012 11754 -1154 -12964 -13165 -2238 12690 15936 -461 -18126 -15211 2368
618 2368 14421 11913 -1512 -13866 -11056 3781 11617 6567 370 -2536 -5209 -4401 1961 6958
632 6958 7226 3266 -6353 -14175 -6427 11413 16577 2559 -14134 -17332 -3738 14776 16793 -2111
646 -2111 -17654 -11178 4340 10469 7148 636 -4447 -4220 -1166 -15 3096 9353 6812 -7315 -14771
661 -14771 -4379 11145 15718 4880 -13211 -19445 -3792 15313 14311 -2332 -13489 -11158 -299
$$ packed form
562A592J4152n077j6077q978M802J4203J0597n856j5015m493P364N698J612K065
576F589j930p215m742Q03N511R625M181j2443j6941Q71J7444J3701k239j6210
590b995j5413L962K0820J1696r955j4422l620M335P384O207o44n351l857l020
604d873k591O470J2006P42j2908j1810k01J0927J4928L246j6397j7665K915J7579
618B368J2053k508j3425j2354K810J4837P836n050o197k906k673Q08O362M997
632F958K68l960r619p822P748J7840N164j4018j6693l198J3594J8514K017j8904
646b111j5543O476J5518O129l321o512n083K27L054J151L111O257k541j4127p456
661a4771J0392J5524M573j0838j8091o234J5653J9105j002j6643j1157K331J0859
$$ plain form
674 -299 10073 10048 113 -6709 -5008 -2332 455 6456 8853 1980 -6616 -8136 -2626 7080 13085 5358
690 5358 -10520 -15067 -3825 9176 12344 3777 -10300 -15289 -3055 11447 10972 -325 -8362 -8341
704 -8341 -1935 6023 7337 2127 -1270 -1581 -3636 -2956 4674 9695 3766 -6265 -10424 -5058 6630
719 6630 13110 3880 -11008 -12533 -671 8586 7309 -535 -8083 -7416 986 5956 2931 142 939
734 939 -909 -3888 -1436 3888 5881 3497 -2468 -7538 -3657 6271 8690 731 -6180 -6050 -2100 2925
750 2925 5130 642 -5110 -4457 -394 1388 2058 2457 -60 -2607 -1514 109 522 2878 4325 197
766 197 -4135 -2371 1903 3863 3775 112 -5413 -5522 901 4869 2437 -1521 -4183 -4361 -133 4128
782 4128 2075 -2208 -2147 -831 -1265 156 3564 3484 116 -2346 -2736 -137 4813 5499 -826 -5538 -2646
$$ packed form
674b99J0372k5r935o822J701K676K787O001K397o873q596j520N510R706O005p727
690E358j5878m547J1242J3001L168q567j4077m989J2234J4502m75j1297q037K1
704h341O406P958J314n210l397l11k055O80P630N021n929j0031m159N366J1688
719F630O480r230j4888j525J1862R257j277p844p548O67Q402M970l025k789P97
734I39j848k979K452N324J993k384n965n070L881R928K419p959o911J30L950N025
750B925K205m488n752O53M063J782O70L99k517k547J093J623M13K356J447m128
766A97m332J764M274J960q8l663n525j09O423L968k432l958k662j78M228M261
782D128k053m283O1J316m34J421L408q0l368k462l90K599M950O86o325m712K892
$$ plain form
799 -2646 1841 3081 2393 -435 -4344 -3799 699 2401 695 -336 -1412 -3119 -1672 2210 2666 965
815 965 -219 -1642 -2349 1179 4781 2383 -1809 -1841 -328 542 2205 2024 -1054 -2689 -1015 -182 -110
832 -110 1096 457 -2606 -2544 426 844 -207 492 498 -1301 -895 1326 1387 952 1357 116 -1607 -57 2287
851 2287 1186 -251 20 -922 -1778 402 1868 -467 -1921 -1011 -1080 -1043 1008 1312 -1091 -1440 -73 -72
869 -72 292 2139 1200 -1637 -1001 1565 1390 766 1140 -134 -1819 -176 1572 406 -467 -455 -1680 -1891
887 -1891 786 1641 -924 -1823 -498 -581 -376 1547 1141 -1621 -1070 1013 1196 1036 1391 -152 -1574 470
905 470 2221 572 -592 -168 -761 -924 1012 1231 -1239 -1833 -249 -356 -581 667 7 -1760 -722
922 -722 1130 555 133 1051 67 -1164 563 2129 528 -552 312 -38 -475 1165 1120 -1145 -1391 128
$$ packed form
799b646M487J240o88k828l909N45M498J702j706j031j076j707J447L882M56j701
815I65j184j423p07L528L602k398m192l2J513Q70J663j81l078j635J674Q33P2
832a10J206o39l063O2K970M18j051O99Oj799M06K221O1m35M05j241j723J550K344
851B287j101j437K71r42q56K180J466k335j454R10o9L7K051L04k403l49J367J
869g2L64J847r39k837O36K566j75o24L74j274j685J643J748j166q73J2j225k11
887a891K677Q55k565q99J325q3K05J923m06k762N51K083J83j60L55j543j422K044
905D70J751j649j164M24n93j63J936K19k470n94J584j07k25J248o60j767J038
922g22J852n75m22R18r84j231J727J566j601j080Q64l50m37J640m5k265k46J519
$$ plain form
940 128 -314 -728 465 -223 -1885 -872 861 -25 -576 499 -75 -1106 512 1789 273 -417 782
957 782 422 -28 1216 1244 -719 -717 650 26 -746 302 -49 -1540 -760 728 -429 -1206 62 -58 -1011
976 -1011 1 932 -365 -326 969 285 -352 1061 1438 -331 -367 1006 367 -353 520 289 -1187 -436
994 -436 583 -554 -987 147 -303 -1440 -405 515 -365 -365 564 -178 -893 856 1676 -42 -296 665 225
1013 225 -24 1134 992 -489 -270 285 -538 -419 1016 90 -1927 -1256 324 -41 -255 265 -794 -1527
1031 -1527 210 1112 74 47 794 -240 -825 870 1752 554 128 -114 -1009 -277 1834 1146 -1255 -1573
1049 -1573 -314 -257 145 773 -508 -1674 -743 125 -82 726 1310 -579 -2062 43 1779 1430 712 13
1067 13 -1090 -420 1546 1479 -205 -226 -9 -1037 -1055 725 1006 -291 -1043 -1634 -1647 631 2563 250 -2623
$$ packed form
940A28m42m14J193o88j662J013J733q86n51J075n74j031J618J277j516o90J199
957G82l60m50J244K8j963KJ367o24p72J048l51j491P80J488j157p77J268j20r53
976a011J012R31j297L9J295o84o37J413L77j769l6J373o39p20Q73k31j476P51
994d36J019j137m33J134m50j137J035R20q80%R29p42p15J749Q20j718k54R61m40
1013B25k49J158j42j481K19N55q23J19J435r26k017O71J580l65k14N20j059p33
1031a527J737R02j038k7P47j034n85J695Q82j198m26k42q95P32K111o88k401l18
1049a573J259N7M02O28j281j166R31Q68k07Q08N84j889j483K105J736l49p18o99
1067A3j103O70J966o7j684k1K17j028j8J780K81j297p52n91j3K278J932k313k873
$$ plain form
1086 -2623 -1804 717 1393 1262 455 -905 -753 974 889 -67 940 1557 -700 -2005 -472 1303 1462
1103 1462 647 -1344 -3025 -1053 2068 1599 -968 -1755 -1229 -681 924 1891 279 -1031 -425 -13 -96
1120 -96 1469 2123 84 -1570 -479 315 728 1526 847 -1414 -2176 -518 470 914 1122 -759 -3364 -2083
1138 -2083 1861 2660 391 -1641 -2134 -682 2100 2389 -242 -1272 560 819 -547 -81 1490 1382
1154 1382 26 -1652 -2466 -357 3323 2649 -2466 -4473 -1183 2292 2507 193 -2677 -2831 689 2646
1170 2646 359 -1198 400 995 -515 -844 395 1474 1865 486 -2351 -2465 1507 3465 694 -2259
1186 -2259 -2440 -1192 887 2335 612 -2251 -2173 -86 573 817 1236 -352 -1657 -378 1125 659 572
1203 572 967 148 -848 -356 365 745 1590 1089 -2124 -3345 70 3017 1808 -1348 -3108 -2227 1207
$$ packed form
1086b623Q19K521O76j31q07j360J52J727q5r56J007O17k257j305J533J775J59
1103A462q15j991j681J972L121m69k567p87N26N48J605R67j612j310O06M12q3
1120i6J565O54k039j654J091P94M13P98o79k261p62J658R88M44K08j881k605J281
1138b083L944P99k269k032m93J452K782K89k631j030J832K59j366M66J571j08
1154A382j356j678q14K109L680o74n115k007L290L475K15k314k870j54L520J957
1170B646k287j557J598N95j510l29J239J079L91j379k837j14L972J958k771k953
1186b259j81J248K079J448j723k863P8K087O59K44M19j588j305J279J503m66q7
1203E72L95q19r96M92P21L80Q45n01l213j221L415K947j209l156j760Q81L434
$$ plain form
1220 1207 3340 407 -3211 -1800 1427 1351 -289 -386 613 1319 808 -1399 -2090 1408 3966 930 -3502
1237 -3502 -2985 943 3187 1975 -1608 -3886 -1533 2399 1902 -1396 -1795 -70 282 -100 -59 116 625
1254 625 1077 -366 -2063 -208 2731 2102 -692 -1538 -841 358 1846 1537 -953 -2028 -650 70 324
1271 324 948 261 -1885 -1881 462 1302 350 -373 -759 -690 439 981 -172 -53 1445 844 -1545 -1250 1138
1290 1138 2112 799 -1349 -2603 -853 2438 2436 -1406 -3087 -762 1352 819 -619 -1189 -494 934 801
1307 801 -1181 -1117 1713 2359 -685 -2305 -485 1821 2313 615 -2116 -1878 1112 2379 50 -1725
1323 -1725 -601 212 -221 -380 -148 -14 329 -180 -1432 -945 1423 1567 -633 -1354 -160 675 919 766
1341 766 -87 -601 271 540 -278 -43 931 19 -1580 -1010 584 954 279 -809 -1506 -530 1315 669 -1285
$$ packed form
1220A207K133k933l618J411L227p6j640r7R99P06n11k207o91L498K558l036m432
1237c502N17L928K244j212l583k278K353L932m97l298l99J725L52l82M1J75N09
1254F25M52j443j697J855K939o29k794q46O97J199J488l09k490j075J378P20K54
1271C24O24o87k146MK343Q40r52p23l86O9J129N42j153J19J498o01k389K95K388
1290A138R74j313k148j254J750L291kl842j681K325K114n33j438n70O95J428j33
1307H01j982O4K830O46l044j620J820K306M92j698k731K38K990J267k329j775
1323a725J124Q13m33j59K32J34L43n09j252M87K368J44k200p21J194Q35K44j53
1341G66q53n14Q72K69q18K35R74r12j599N70J594L70o75j088o97R76J845o46j954
$$ plain form
1360 -1285 -834 808 695 -433 -273 590 1069 662 -451 -1201 409 2102 714 -1570 -1162 778 1057
1377 1057 134 -725 -1101 -168 663 -183 -1447 -481 1175 499 -1239 -850 500 1126 707 -438 -1195 230
1395 230 1874 793 -1102 -502 978 733 -347 -547 -147 392 518 -720 -1576 -103 1486 194 -1477
1412 -1477 -1003 473 636 128 -463 -657 272 1187 125 -733 313 1332 290 -699 -181 540 610 314
1430 314 -592 -1097 150 1051 -230 -1430 -277 641 -67 -544 -428 -204 335 443 -467 -903 708 1442
1448 1442 -93 -1012 154 1052 610 1 -407 -365 585 853 -688 -1251 357 898 -464 -1071 -377 244
1466 244 271 -1 -710 -751 782 1087 -492 -948 446 1084 259 -272 -224 156 853 702 -659 -882 694
1485 694 885 -592 -1028 -66 335 64 -263 -870 -566 510 553 -785 -909 545 810 -275 -394 98 387
$$ packed form
1360a285M51J642j13j128J60Q63M79m07j113p50J610J693j388k284M08J940K79
1377A057r23q59l76R33Q31q46j264R66J656o76j738L89J350O26m19j145p57J425
1395B30J644j081j895O00J480k45j080k00M00N39J26j238q56J473J589j292j671
1412a477M74J476J63n08n91j94R29R15j062q58J046J019j042r89N18P21P0k96
1430C14r06n05J247R01j281j200J153R18p08m77J16K24N39J08r10m36J611P34
1448A442j535r19J166Q98m42o09m08M2R50K68j541n63J608N41j362o07O94O21
1466B44K7k72p09m1J533L05j579m56J394O38q25n31M8L80O97j51j361k23J576
1485F94J91j477m36R62M01k71l27o07L04J076M3j338j24J454K65j085j19M92K89
$$ plain form
1504 387 645 440 -552 -351 880 645 -676 -566 478 398 -245 -391 -303 -240 326 1 -1029 -569 690
1523 690 452 -705 -420 270 355 236 132 -262 -34 968 442 -725 -267 859 463 -336 -319 -73 138
1542 138 311 -182 -991 -373 600 123 -1014 -481 425 156 -209 -237 -159 279 684 205 -648 124 1047 351
1562 351 -457 -147 283 229 254 -122 -611 -96 584 -129 -876 -281 417 -57 -380 -234 -150 17 480 34 -557
1583 -557 72 801 299 -232 173 476 139 86 184 -145 74 312 -174 -602 50 326 -442 -603 -155 -16 -146
1604 -146 101 -106 -393 -28 480 -94 -280 541 498 -116 -146 269 214 371 364 -150 -422 349 529 -269 -548 -103
1626 -103 -33 -153 -122 -129 -282 -88 234 -391 -354 426 439 -212 -101 140 155 264 397 27 -318 151 456 -92
1648 -92 -137 104 -178 -438 -96 64 -241 -98 17 -404 -400 242 242 -252 -220 117 5 -33 338 195 -80 199 173
$$ packed form
1504C87K58k05r92K01J231k35j321J10J044q0o43j46Q8O3N66l25j030M60J259
1523F90k38j157K85O90Q5j19j04l94K28J002n26j167M58J126l96p99J7K46K11
1542A38J73m93q09O18R73m77j137N33R06k69l65k8P8M38M05m79q53P72R23o96
1562C51q08L10M30n4K5l76m89N15O80p13p47N95O98m74l23J46Q4J67M63m46n91
1583e57O29P29n02n31M05L03l37n3R8l29K19K38m86m28O52K76p68j61M48J39j30
1604a46K47k07k87L65N08n74j86Q21m3o14l0M15n5J57pn14k72P71J80p98k79M45
1626a03P0j20L1pj53J94L22o25L7P80J3o51J11K41J5J09J33l70l45M69L05n48
1648i2m5K41k82k60L42J60l05J43J15m21MO42%m94L2L37j12l8L71j43k75K79k6
$$ plain form
1671 173 -166 134 508 150 -384 -173 152 -12 57 57 -382 -444 29 143 -206 -158 108 -226 -225 305 252 -107 206
1694 206 148 -144 -81 553 377 2 52 79 -211 69 485 -83 -511 -278 -27 -105 17 23 -509 -449 169 175 -187
1717 -187 -32 213 -20 -100 244 214 141 480 308 -398 -289 415 457 -50 -238 -200 -326 290 432 -264 -589 -185
1739 -185 3 -166 -63 -4 -250 -117 235 36 -107 231 450 48 -207 43 14 282 542 127 -644 -386 413
1760 413 384 -199 -367 -439 -238 222 336 -411 -527 141 326 -51 -53 23 30 232 183 -215 -346 679 775 -157 -444
1783 -444 -188 250 441 205 -473 -743 -6 476 27 -487 -220 -53 -45 26 -63 -336 47 425 -56 -403 28
1804 28 497 360 -3 -233 -272 81 734 369 -464 -431 40 111 43 -56 -429 -428 45 210 -191 -297 97 61 -79
1827 -79 13 -32 -43 383 558 -132 -515 73 599 443 98 -309 -488 151 666 -11 -722 -373 136 161 -129 -157
$$ packed form
1671A73l39L00L74l58n34K11L25j64O9%m39o2M73J14l49M8K66l34JN30n3l59L13
1694B06n8k92O3O34j76l75N0K7k90K80M16n68m28K33K51p8J22On32O0O18Ol62
1717a87J55K45k33q0L44l0p3L39j72p06J09P04M2n07j88L8j26O16J42o96l25M04
1739a85J88j69J03N9k46J33L52j99j43L38K19m02k55K50k9K68K60m15p71K58P99
1760D13k9n83j68p2K01M60J14p47j16O68J85l77kP6PK02m9l98j31J025R6r32k87
1783d44K56M38J91k36o78k70P37M82m49n14K67J67QP1q9k73L83L78m81l47M31
1804B8M69j37l63k30l9L53O53l65q33L3M71P1o8r9l73JM73J65m01j06L94l6j40
1827g9R2m5j1M26J75o90l83N88N26j56l45m07j79O39N15o77p11L49N09K5k90k8
$$ plain form
1849 -157 -294 -112 219 -15 -502 -127 588 242 -201 -271 51 357 607 159 -626 -347 402 453 -224 -346 -68
1870 -68 31 65 17 -270 -288 98 -25 -390 -227 189 131 -10 80 -85 -59 263 414 82 -210 82 188 85 358
1893 358 193 -238 -196 74 17 -175 -80 -184 -273 -145 124 -219 -415 -8 160 -243 -143 41 122 272 92 -183
1915 -183 -293 401 617 -6 -322 -11 249 108 20 -210 -255 67 222 -158 -359 156 300 -135 -354 -166 -8
1936 -8 244 370 -161 -365 251 555 99 -165 65 150 95 13 -29 -180 166 166 -233 -391 30 257 -199 -403 -158
1959 -158 -47 89 13 -121 -245 80 205 -181 -114 279 217 -97 -30 216 128 189 166 -207 -192 149 194 -260 -201
1982 -201 81 -17 -236 -12 -25 -55 100 -3 -337 -160 339 240 -254 -12 247 291 144 42 -170 -17 369 196
2004 196 -394 -211 237 20 -224 -308 -80 -20 87 -149 -425 -291 246 224 -256 -204 97 186 47 100 34 77 311
$$ packed form
1849a57j37J82L31k34m87L75P15l46m43p0L22L06K50m48p85K79P49N1o77j22K78
1870f8R9L4m8k87j8L86j23l65J63M16n8j41R0j65K6L22J51l32k92K92J06j03K73
1893C58j65m31M2K70n7j92R5j04q9J28K69l43j96M07J68m03J00J84Q1J50j80k75
1915a83j10O94K16o23l16L11K60j41q8k30m5L22J55l80k01N15J44m35k19J88J58
1936hK52J26n31k04O16L04m56k64K30Q5n5q2m2j51L46%l99j58M21K27m56k04K45
1959a58J11J36p6j34j24L25J25l86O7L93o2l14O7K46q8O1k3l73J5L41M5m54N9
1982b01K82r8k19K24j3l0J55j03l34J77M99r9m94K42K59M4j47j02k12J53L86j73
2004A96n90J83M48k17k44q4K28O0J07k36k76J34N37k2m80N2L01Q9j39N3o6M3K34
$$ plain form
2027 311 126 -196 -58 342 181 -185 -63 4 -77 96 -64 -304 -135 57 4 -292 -57 173 30 -130 31
2048 31 68 113 230 96 -188 62 419 78 -200 -22 218 -112 -124 -85 -171 -76 156 -160 -276 -67 243 -125
2070 -125 -348 -181 27 142 100 -32 -147 195 376 94 -161 80 305 39 -36 88 -7 67 88 -124 -404 39
2092 39 261 -138 -254 -49 58 14 1 -63 -116 67 325 -93 -193 203 277 16 -33 63 -6 59 143 -19 -243 95
2116 95 194 -224 -234 47 37 -152 -250 -162 -104 74 125 -136 -174 150 278 -65 -8 121 177 103 145 -24 -131 189
2140 189 185 -173 -125 141 128 -198 -159 -70 -130 15 -10 -338 -274 141 53 -250 -127 198 55 -59 -10 39 159 329
2164 329 113 -202 27 222 122 -257 -87 63 -14 48 -158 -197 -139 68 -22 -256 -191 208 70 -61 -101 47
2186 47 101 278 97 -127 7 404 148 6 -20 63 52 -36 -26 -143 -99 86 25 -281 -66 219 -86 -236 -94
$$ packed form
2027C11j85l22J38M00j61l66J22O7q1J73j60k40J69J92n3k96K35K30j43j60J61
2048C1L7M5J17j34k84K50L57l41k78J78K40l30j2L9q6R5K32l16j16K09L10l68
2070a25k23J67K08J15m2j32j15L42J81k82k55K41K25k66p5J24r5P4K1k12k80M43
2092C9K22l99j16K05J07m4j3o4n3J83K58m18j00L96P4k61m9R6o9O5Q4j62k24L38
2116I5R9m18j0K81j0j89r8Q8N8J78N1k61l8L24J28l43N7J29N6p4M2j69j07L20
2140A89ml58M8K66j3l26L9Q9o0J45k5l28O4M15q8l03J23L25j43j14M9M9J20J70
2164C29k16l15K29J95j00l79J70J50p7O2k06l9N8K07r0k34O5L99j38j31m0J48
2186D7N4J77j81k24J34L97k56j42k6Q3j1q8J0j17M4J85o1l06K15K85l05j50J42
$$ plain form
2209 -94 3 20 183 100 -67 65 211 -2 -89 114 230 -2 -85 -46 9 13 129 -51 -176 9 202 -94 -367
2232 -367 21 139 -22 -72 -32 9 135 205 -15 -121 112 398 135 -99 69 206 42 80 -3 -154 -21 129
2254 129 -91 -317 -70 8 -120 -111 -83 -44 -13 84 -112 -180 81 177 80 -60 139 55 84 73 32 -20 88 69 -124
2279 -124 -132 61 188 -123 -307 41 -60 -40 11 -111 -138 30 84 -165 -145 211 157 -65 -4 59 60 148 217 -127 -215
2304 -215 160 232 -72 -94 0 -53 -80 -7 -146 -196 -97 53 -160 -191 152 114 -19 -16 -15 6 168 309 13 -114 143
2329 143 122 -33 97 140 -76 -163 90 36 -191 -12 21 -134 -154 123 -85 -114 30 50 -26 -159 121 95 131 64
2353 64 64 -86 95 258 75 -173 -48 -28 14 36 -22 -236 -28 177 1 -260 -32 76 1 -49 -35 -44 -48 177 144
2378 144 -63 -38 179 172 43 19 16 -42 163 238 -96 -53 9 42 -149 -108 -26 -117 -16 11 -120 -187 155 163 -57 -28
$$ packed form
2209i4R7J7J63q3j67J32J46k13q7K03J16k32q3L9N5MJ16j80j25J85J93k96k73
2232c67L88J18j61n0M0M1J26P0k20j06K33K86k63k34J68J37j64L8q3j51J33J50
2254A29k20k26K47P8j28RK8L9L1R7j96o8K61R6r7j40J99q4K9j1m1n2J08j9j93
2279a24qJ93J27l11j84L48j01K0N1j22k7J68N4k49K0L56n4k22O1O3JQ8O9l44q8
2304b15L75P2l04k2R4n3k7P3j39n0R9J50k13l1L43l8j33LJK1J62J41k96j27K57
2329A43k1j55J30M3k16q7K53n4k27J79L3j55k0K77k08k9J44K0p6j33K80k6L6o7
2353F4%j50J81J63j83k48J25K0M2K2n8k14K08K05j76k61K28J08p5n0J4rmK25l3
2378A44k07K5K17pj29k4ln8K05P5l34M3O2L3j91M1Q2r1J01K7j31o7L42Qk20K9
$$ plain form
2404 -28 -10 -30 95 175 -31 -202 20 215 37 -145 -66 39 -71 96 -4 -194 -5 80 -73 -248 -105 70
2426 70 -35 5 -15 -59 -16 138 120 -97 27 201 80 115 103 39 -114 74 79 -34 -95 -7 -95 -67 -22 -84 -183 -76
2452 -76 66 -44 -234 -73 131 -36 92 93 -104 52 151 104 -84 -48 33 34 37 84 -42 -74 130 10 -168 -121 69
2477 69 66 -57 -163 -111 -30 168 31 -128 -64 109 169 40 -40 30 78 125 116 -2 -122 55 142 -79 -164 -4 3 35
2503 35 -43 -77 -84 16 31 -151 -114 -27 49 47 54 114 -39 35 65 4 10 113 -14 -50 -22 28 -49 -138 -38 76 -58 -38
2531 -38 -57 -88 -29 143 -26 -182 117 147 35 -59 -25 101 64 112 -14 -144 104 198 79 -151 -12 137 37
2554 37 -17 -62 -39 -12 48 -142 -231 -47 81 19 -137 -114 4 30 98 5 -31 -48 195 -41 -72 81 80 25 -5 -75 18
2581 18 -12 63 -41 -122 -22 36 -79 -88 -4 -16 -98 14 11 44 87 17 27 -76 183 104 -23 -37 80 46 40 -57 -41 -59
$$ packed form
2404b8J8k0J25Q0k06j71K22J95j78j82P9J05j10J67j00j90J89Q5j53j75J43J75
2426G0j05M0k0m4M3J54j8k17J24J74j21L5j2o4j53J88Nj13o1Q8q8K8M5o2r9J07
2452g6J42j10j90J61K04j67J28Jj97J56R9m7j88L6Q1JLM7j26l2K04j20j78M7J90
2477F9lj23j06N2Q1J98j37j59O4J73O0j29q0P0M8M7rj18j20J77Q7k21q5J60PL2
2503C5p8l4pJ00J5j82L7Q7P6kPO0j53P4L0o1OJ03j27l6K8N0p7q9J00J14j34K0
2531c8j9l1N9J72j69j56K99L0j12r4L4J26l7M8j26j30K48R4j19k30J39J49j00
2554C7n4m5K3K7O0j90q9J84J28o2j56K3J18K6O8r3l6j7K43k36l1J53jn5l0p0R3
2581A8l0P5j04q1J00N8j15rQ4j2q2J12lL3M3p0J0j03K59p9j27j4J17l4or7J6j8
$$ plain form
2609 -59 -21 41 -215 -207 24 125 -144 -137 -119 -7 47 -6 -31 -67 79 133 -65 -31 79 169 85 11 36 -43 152 118 -7
2636 -7 -48 39 90 -107 -115 -38 50 39 35 -196 52 90 111 -95 -69 174 41 59 -93 38 -50 34 132 -80 -93 127 -19
2663 -19 -181 -22 107 -38 -83 -55 -120 -78 41 -56 -100 -83 118 71 -71 0 67 14 99 18 -128 40 112 17 -110
2688 -110 0 86 30 -51 -34 -40 -46 43 -7 -12 -43 62 8 -40 -10 -49 22 33 56 -50 40 155 -8 54 1 136 5 21
2716 21 8 -50 -104 -18 -66 -91 -25 -6 -160 -161 -9 -8 -55 -43 -36 28 5 36 -103 0 4 94 51 -19 107 -65 72 24 -58
2745 -58 -15 54 36 -44 -211 36 55 -70 -53 28 8 -35 40 52 9 85 75 32 6 47 35 37 -94 50 24 74 68 -80
2773 -80 -85 10 -1 -62 -30 -10 -4 40 -112 17 -53 98 74 34 -42 63 105 51 64 -9 55 17 147 -61 18 120 85 -21
2801 -21 21 -42 103 -21 -40 -61 31 82 20 -76 -33 66 18 -44 -7 -75 -87 -7 -31 -5 -1 38 -32 -9 -37 10 4 -139 -39
$$ packed form
2609e9L8O2k56QK31J01k69PJ8J12N4n3k5l6J46N4j98L4J10R0q4p4K5p9J95l4j25
2636gm1Q7N1j97qP7Q8j1mk31K48L8K1k06K6K43j33J8j52J31q8Q4R8k12j3K20j46
2663a9j62J59J29j45m5K8o5M2J19r7m4J7K01m7j42P1O7n3Q5q1j46J68P2r5j27
2688a10J10Q6n6q1J7ooQ9n0nl1J05n4m8L0l9P1J1K3j06R0J15j63O2n3J35j31J6
2716B1j3n8n4Q6m8k5O6J9j54jJ52Jm7J2PO4k3L1j39J03MR0m3p0J26j72J37m8q2
2745e8M3O9j8q0j67K47J9j25J7Q1k0m3P5J2m3P6j0m3k6M1j2Kj31J44k6N0oj48
2773h0nR5j1o1L2K0OM4j52J29p0J51k4m0p6J05M2n4J3p3O4l8J30k08P9J02l5j06
2801b1M2o3J45j24j9k1R2N1o2r6M3R9m8o2L7o8j2Q0k4K6ML9p0K3k8M7oj43J00
$$ plain form
2830 -39 -49 -52 -40 -20 -65 -87 27 -33 -4 59 49 5 18 -9 36 98 15 93 -49 17 77 38 -187 34 47 -96 -43 75
2858 75 29 -113 71 -75 -166 -91 4 43 -50 3 -19 17 24 -12 -82 -46 70 71 -69 11 116 -8 -39 6 10 -53 -85 -119
2886 -119 -16 26 26 -55 -15 67 52 -31 4 56 47 105 79 -43 77 75 175 25 -85 -15 -8 -7 39 -13 -114 46 8 -11
2914 -11 -36 -31 -1 -75 -92 -53 -102 68 41 -94 -124 28 84 -98 -12 -39 14 -22 -26 15 -25 -20 76 -163 -73 -75 -55 -53 -25 -55
2944 -55 -92 19 166 38 -15 -6 38 -46 116 4 4 -78 -5 147 62 70 78 -21 0 76 -71 -77 49 31 -54 6 35 -96
2972 -96 -65 31 -33 -126 -108 80 14 -4 19 -36 -31 7 59 7 -66 1 29 -19 10 -8 12 -34 -42 -64 -100 61 -47 -59 -96 21
3002 21 44 -5 -10 39 62 -37 150 55 -46 131 15 68 16 6 -25 -26 6 -3 -22 3 14 -104 -15 -43 -169 -55 -2 32
3030 32 -100 -38 -9 -31 -69 54 -67 18 21 -12 -21 -52 107 -17 -54 -47 49 -57 59 4 -7 52 30 53 -3 -71 57 76
$$ packed form
2830c9j0lJ2K0m5k2J14o0K9O3j0m4J3k7M5O2q3P8j42O6O0l9k25K21J3j43N3J18
2858G5m6j42J84j46r1P5R5L9r3N3k2L6Pl6p0L6J16Jj40Q0J05j24l1M5Mo3l2l4
2886a19J03M2%q1M0Q2j5q3L5N2rN8k6j22J20kJ00j50j10P0PJM6n2j01J60l8j9
2914a1k5NL0p4j7L9m9J70k7j35l0J52N6j82Q6k7N3l6mM1m0NR6k39R0kK0KK8l0
2944e5l7J11J47j28n3RM4q4J62j12%q2P3J52q5QQr9K1P6j47oJ26j8q5O0K9j31
2972i6L1R6o4r3J8J88o6j8K3n5NL8N2n2p3O7K8m8K9j8K0m6qk2l6J61j08j2l7J17
3002B1K3m9nM9K3r9J87r5j01J77j16N3n2j0l1jL2rj9K5J1j18Q9k8j26J14N3L4
3030C2j32O2K9k2l8J23j21Q5Ll3rl1J59j24l7PR6j06J16n5j1N9k2K3n6o8J28J9
$$ plain form
3058 76 -22 55 37 35 36 34 -11 51 31 34 -28 -54 -21 -47 36 64 59 -53 -11 -1 -93 -29 61 -166 -28 -36 31 -5 -12 31 -13 32
3090 32 25 -23 23 116 78 14 8 -4 -11 134 55 -22 -27 0 42 -43 -95 46 84 57 1 -68 22 31 104 48 -23 -6 50 -45 -18 -32
3122 -32 -22 -15 18 -6 -85 -77 -9 -65 -95 -14 62 -24 12 3 -12 12 -19 3 -6 132 59 -41 9 83 8 19 -12 57 62 19 -5 -49
3154 -49 40 54 75 16 20 5 -24 20 -45 -47 -54 68 27 -49 -83 60 53 -21 -43 -44 37 -32 49 -92 -30 53 -34 19 -37 -52 -25
3185 -25 1 -21 20 58 -1 -69 -28 -29 -13 53 14 15 152 -54 -27 -22 56 33 97 -7 -33 86 27 -39 -82 40 48 -76 -11
3214 -11 -17 5 28 93 30 -125 -65 7 36 -25 19 -24 -69 -46 -46 10 28 95 -22 36 14 10 -29 55 -21 -58 19 46 37 -84 -61
3245 -61 54 28 -24 9 27 -27 85 68 -50 14 105 -43 -25 54 61 -26 -51 22 -32 46 98 4 -42 5 12 -64 -63 -48 18 -29
3275 -29 100 34 -52 41 -44 -103 -58 -16 48 38 -57 -18 -33 23 -59 -37 -111 -34 -40 -137 -90 48 103 30 12 -59 -9 38 17 16
$$ packed form
3058G6r8P7j8kJkm5O2k0Lo2k6L3k6Q3K8nj12M2J0r2O4R0k27J38qO7l6pM3m4M5
3090C2pm8M6R3l8o4oj2pJ45p9p7nK7M2q5n2J41L8k7n6o9R0RP3n6p1J7N6r5K7j4
3122c2J0PL3k4p9QO8n6l0Q1P6q6L6rj5K4l1K2rJ38p3j00N0P4p5J1l1O9Nm3k4m4
3154d9Q9J4K1n9Mj5k9M4o5kpJ22m1p6l4J43pp4k2jQ1o9Q1j41O2Q3q7N3n6j5K7
3185b5K6k2M1L8n9o8M1jJ6O6l9JJ37k06K7NP8k3O4j04k6J19n9o6m3J22Qj24O5
3214a1oK2K3O5o3j55O0P2K9o1M4m3m5K3%N6J8O7j17N8k2ml9Q4p6l7P7K7rj21K3
3245f1J15k6n2L3J8n4J12j7j18O4R1j48J8P9Pq7k5P3n4P8N2r4m6M7Pp6JJ5O6m7
3275b9J29o6q6R3q5n9M5M2O4j0r5L9j5N6q2K2p4P7or7M7J38N5p3j8p1N0M7k1j
$$ plain form
3305 16 28 25 36 53 -34 12 16 28 90 19 -37 -42 32 -33 -37 68 -15 -44 -34 18 -1 -127 -41 -93 -18 -29 -35 16 -21 31 -4 -96
3337 -96 12 -39 8 -32 34 -43 44 92 -50 -79 -27 21 10 -3 3 -34 -71 97 146 -66 -65 63 8 66 109 38 84 11 27
3366 27 11 11 51 26 -16 37 -16 11 -111 -96 -30 -5 39 39 -59 -43 56 -108 17 -79 -26 -23 100 -23 -6 -23 43 79 -6
3395 -6 -67 34 33 23 7 28 -57 -24 -63 -99 22 25 -13 -4 -27 -34 -105 68 77 -72 15 48 25 15 33 36 -20 25 42 -5 -68 73
3427 73 -4 -3 23 -35 -50 -80 -69 -25 94 -95 30 -59 13 -34 -25 -104 26 32 -49 4 48 81 -4 65 45 13 -41 -18 8 -55
3457 -55 -43 76 27 57 66 38 -24 -35 2 -10 27 55 34 -10 34 142 49 52 -66 -47 -30 69 -12 -74 17 -32 -22 -46 -39 26
3487 26 -66 68 -62 54 -40 65 16 -1 15 45 5 -10 -43 45 -26 29 63 -62 51 106 22 3 -20 -8 0 -53 -12 -15
3515 -15 2 67 -53 -52 61 74 22 1 50 60 1 -19 -121 -112 32 85 -34 -45 34 43 -130 -76 11 -54 88 49 34 -56
$$ packed form
3305A6J2lJ1J7q7M6MJ2O2p1n6nP4o5mJ05q3k9J0N2j9j26Q6n2P5j1oN1l7N2l5r2
3337i6J08n1M7m0O6p7Q7M8j42k9N2M8j1j3Ol7l7J68M9k12JJ28n5N8M3p1M6p3J6
3366B7j6%M0k5m2N3n3K7j22J5O6K5M4%r8J6R9j64J25r6N3LJ23j23J7j7O6L6q5
3395fo1J01jj0j6K1q5L3l9l6J21Ll8Rk3pp1J73Rj49Q7L3k3j0J8Ln6M5J7m7o3J41
3427G3p7JK6n8j5l0J1M4J19j89J25q9P2m7Rp9J30Oq1N3M4L3q5O9k0l2n4K3K6o3
3457e5J2J19m9L0Rk8o2j1L7j2L7K8k1m4M4J08r3Lj18J9J7R9q1o2R1m9J0k4PO5
3487B6r2J34j30J16r4J05m9j7J6L0m0j5l3Q8p1N5L4j25J13N5q4j9k3J2Qn3M1l
3515a5J7O5j20JJ13J3n2k1M9J0n9k0j02RJ44N3j19j1P9Rj73N4Q7o5J42l9j5r0
$$ plain form
3543 -56 -45 46 -84 31 30 -1 51 6 61 74 6 81 -18 -30 50 -8 -20 32 -25 -21 4 82 23 -45 31 39 -32 -5 -36 3 25
3574 25 -23 54 7 -24 -20 28 27 84 79 4 -11 61 -29 -56 -12 -73 -40 -60 -49 0 -18 -28 -171 -53 -66 26 -6 -61 71 -8
3604 -8 26 52 1 -118 17 12 -15 -37 -67 50 -21 -38 25 -96 -22 -35 -5 83 -62 52 3 -12 2 14 25 -85 19
3631 19 -47 68 101 -34 -80 83 -41 -21 29 53 0 45 -58 -74 -76 89 4 -84 0 4 -33 -49 79 2 -45 -19 27 1
3659 1 -10 -30 -5 5 50 -76 49 49 6 128 -70 20 4 2 42 -24 29 18 41 -66 3 43 37 -13 18 -76 20 -36 -4 67
3689 67 1 -28 77 87 78 35 26 28 -45 -131 17 -24 26 -35 -52 43 15 35 -95 60 66 -56 47 118 -29 15 1 43 -47
3718 -47 16 -30 19 -18 74 10 -6 -43 -62 -23 -142 -23 -58 25 35 27 -56 6 -27 -56 -3 34 -59 -102 -70 17 16 59 32 10
3748 10 3 -68 41 6 18 11 -34 -65 16 -39 -69 -42 36 -37 -62 -2 57 10 5 9 43 43 63 -56 16 -4 7 35 60 87 1 -2
$$ packed form
3543e6J1R1j30J15jl1N2m5N5J3o8P5r9j2Q0n8j2N2n7MK5P8n9o8P6Qp1K7l1L9K2
3574B5m8P7m7l1MM8jN7np5j5P2r0k7M4o1L3k0J1M9j8j0j43J18j3R2l2n5J32p9
3604hL4K6n1j19J35nk7k2l0J17p1j7O3j21P4j3L0Q8j45J14m9j5J4J2J1j10J04
3631A9o6J15L3j35m6J63j24K0N0K4n3M5j03j6kJ65q5q8Q4Ml7j6J28p7m7K6M6k6
3659Aj1k0K5J0M5j26J25%m3J22j98R0j6kM0o6N3j1K3j07O9M0on0L1r4R6n6L2P1
3689F7o6k9J05J0rm3rKp3q6J48m1N0o1j7R5k8K0j30J55Oj22J03P1j47M4j4M2r0
3718d7O3m6M9l7R2o4j6l7j9L9j19J19l5Q3J0qq3O2l3k9N3L7r3m3L2Q7jM3k7k2
3748A0pp1J09l5J2pm5l1Q1n5l0K7P8p3k5O0N9m7nML4%K0j19P2k0J1K8K5K7q6l
$$ plain form
3780 -2 -89 -65 27 -43 4 -74 -2 -13 -59 -66 -105 7 -43 -20 14 7 -16 23 65 -3 19 -95 -101 99 -40 36 -64 -86 54
3809 54 -22 -58 40 -11 -63 -40 1 32 -98 -47 68 30 -38 -18 -24 -25 23 -15 18 1 55 40 -8 -44 101 -48 25 8 -78
3838 -78 -37 -78 -31 -161 39 0 65 17 -4 -72 -32 14 3 57 -3 -71 -36 19 8 -18 -41 -15 19 -50 -27 36 39 -53 -69 -21
3868 -21 -77 75 -27 62 0 21 -6 31 50 93 62 -10 -16 71 67 116 8 -12 28 -32 -15 -87 97 -82 -108 -34 55 -2 -36
3897 -36 -94 -62 -50 39 106 7 -92 51 24 -6 -10 2 -64 27 -27 51 -63 15 -12 -56 -71 15 23 -46 38 35 -81 -75 -42 -88 -49
3928 -49 -39 27 21 58 71 6 -21 56 -46 27 -30 5 27 -11 -56 -54 -71 10 -3 -64 15 -35 -101 -16 10 5 -67 7 -49 -67 63
3959 63 35 84 17 7 117 -39 -15 69 60 -39 1 -16 -56 53 13 7 -44 -28 -146 12 7 12 52 -40 -46 -19 -3 57 54 30 6
3990 6 12 -20 -11 -29 45 -99 22 -110 -79 48 -5 85 22 -103 33 -17 -73 24 -60 51 88 -7 32 -30 68 107 14 34
$$ packed form
3780bq7K4R2p0M7p8P2j1m6pl9J12n0K3L4pk3L9M2o8K2j14oK00j39P6j00k2J40
3809E4p6l6R8n1n2K3M1L1j30N1J15l8o8K0ojM8l8L3j7N4j5m8l6J45j49P3j7q6
3838g8M1m1M7j30K00l9O5m8k1o8M0M6j1N4o0o8L5N5j1k6k3K6L4o9K3O3Lr2j6M8
3868b1n6J52j02Q9o2K1k7L7J9M3l1p2oQ7mM9j08k0M0o0J7p2J84j79k6P4Q9n7l4
3897c6n8L2J2Q9O7r9r9J43k7l0mJ2o6R1n4P8j14P8k7m4j5Q6Qo9Q4lj16OL3m6L9
3928d9J0O6oL7J3o5k7P7j02P3n7L5K2l8m5Kj7Q1j3o1P9n0o6Q5K6np2P4n6j8J30
3959F3k8M9o7j0J10j56K4Q4rr9M0j7m0J09m0on1J6j18J58nNM0r2oK7J6O0lk4k4
3990FOl2Rj8P4j44J21j32L1J27n3R0o3j25J36n0n6R7q4J11L7r5L9o2R8L9r3K0
$$ plain form
4018 34 2 -20 62 85 4 70 64 40 63 -30 46 -112 -59 -84 -31 -54 -53 -65 -5 50 -3 1 -1 70 32 6 -12 49 -17 17 9 -19
4050 -19 -76 65 20 -81 -100 -58 -6 -22 -3 -11 -53 -55 26 19 -90 75 19 85 8 78 -7 44 42 -19 -41 12 -16 -32 13 6 41
4081 41 -15 -83 -104 -51 15 -21 -68 -21 -18 6 -9 56 56 -25 68 82 15 -14 45 -24 -44 8 60 -88 -40 2 -15 -41 -48 20 -44
4112 -44 -100 -34 -16 -29 -6 -16 0 49 -131 50 -8 47 16 9 -22 67 43 20 83 -2 59 49 93 56 7 -70 56 -73 -69
4141 -69 20 -11 -18 14 -41 -32 3 139 -27 6 15 1 -112 -55 7 61 -17 -12 -64 -28 67 -1 -69 61 36 -13 -59 -8 -10 7 25
4172 25 17 -10 104 -83 -12 -11 39 63 9 20 102 106 -74 73 2 21 -17 49 -63 6 -9 -67 -46 -48 22 -55 -67 -5 -7 22
4202 22 51 92 1 -77 38 -52 19 148 15 -99 65 -42 0 -62 -2 69 26 34 18 50 -110 -16 -10 5 17 -38 75
4229 75 96 57 71 -60 78 -12 75 19 44 -3 -3 58 11 46 21 -6 -91 -72 -33 -75 -35 -57 -39 48 -93 72 -12 29 -22
$$ packed form
4018C4l2k2Q2K3q1O6ok4K3r3P6j58N3k5N3k3Jj2O0N5n3MkP1l8k6j8O1o6L4qk8
4050a9n7J41m5j01j9M2N2j6J9qm2kQ1pj09J65n6O6p7P0q5N1ko1k2N3k8j6M5pL5
4081D1n6o8k1N3O6l6m7M7LK4j5O5%q1R3J4o7k9N9o9k0N2N2j48M8M2j7k6pO8o4
4112d4n6O6J8j3K3j0J6M9j80J81n8N5l1pl1Q9k4k3O3q5O1j0M4l7m9p7J26j29M
4141f9Q9l1pL2n5RL5J36j66L3Rj4j13N7O2N4p8Nn2L6R5o8o8J30k5m9m6N1kJ7J8
4172B5qk7J14j87P1JN0K4n4J1Q2Mj80J47p1J9l8O6j12O9j5n8K1kP0p7j2O2kK9
4202B2K9M1r1p8J15r0P1J29j33j14J64j07M2o2O0P1m3Qj6L2j60R4OJ5J2n5J13
4229G5K1l9J4j31J38r0Q7n6K5m7%O1m7L5k5k7q5J9L9m2M0k2J8Q7j41J65q4M1n1
$$ plain form
4258 -22 32 47 6 85 76 3 29 97 -127 -2 19 -53 -99 -75 -79 -24 -2 -84 -142 46 -66 13 5 33 6 -30 -29 69 -44 1
4288 1 70 7 -26 9 -8 3 56 38 12 -91 -48 35 -3 -25 -15 -14 -8 -28 76 -53 32 58 14 3 44 -9 46 84 83 1 -110
4319 -110 34 -30 -50 -11 7 36 40 36 -8 -81 49 15 -72 -71 71 -27 40 28 61 25 11 58 8 -23 10 80 -32 -26 39 -68
4349 -68 -1 28 26 8 14 -22 -114 -79 9 -42 60 35 -50 -125 -36 -68 -26 -49 -5 8 35 21 55 62 24 3 64 26 21 26 -32 55
4381 55 -13 9 -97 25 -62 64 -19 -10 37 68 28 50 -13 54 29 -5 64 65 1 -5 23 -46 53 -15 82 -34 22 -26 -33 -63
4411 -63 -86 -76 38 -100 -5 -21 -48 112 -58 -69 -6 17 -68 9 16 -55 -45 64 121 -22 54 66 11 -55 31 90 -24
4438 -24 -17 31 44 8 27 8 -12 -48 -18 26 4 -52 -24 105 -63 92 -57 3 43 56 -4 47 44 8 24 -65 -58 -88 -22 -21
4468 -21 -85 -7 -7 -27 -18 2 17 -33 41 -8 -72 -5 5 7 53 15 76 37 71 103 8 -79 156 96 87 1 21 -34 -49 62 57 -12
$$ packed form
4258b2N4J5m1P9rp3K6O8k24J25K1p2m6K4mN5K2q2n8J88j12P9qK8k7l6JR8j13M5
4288AO9o3l3L5j7J1N3j8k6j03M3Q3l8k2J0JOk0J04j29Q5K6m4j1M1n3N5L8jq2j11
4319a10J44o4k0L9J8K9Mmm4p3J30l4q7JJ42r8O7j2L3l6j4M7n0l1L3P0j12OO5j07
4349f8O7K9kj8Ol6r2L5Q8n1J02k5q5p5Q9l2M2k3M4J3K7j4L4Pl8k1O1l8nNn8Q7
4381E5o8K2j06J22q7J26q3RM7L1m0K2o3O7k5l4O9Jo4oK8o9R9o8R7j16N6m8pl0
4411f3k3J0J14j38R5j6k7J60j70j1O3K3q5P7Pp1J0J09N7j43P6J2n5o6Q6N9j14
4438b4PM8J3l6J9j9k0l6L0M4k2n6K8J29j68J55j49O0M0J3o0N1ll6J6q9Pl0O6J
4468b1o4P8%k0RK0J5n0P4m9o4O7J0KM6l8O1l9L4L2r5q7K35o0rq6K0n5j5J11no9
$$ plain form
4500 -12 -59 -34 57 -6 47 69 29 43 87 -1 -12 12 29 21 -149 7 -40 24 -65 -46 -121 -39 42 -9 -91 37 3 101 67
4529 67 35 -37 105 97 18 56 -63 122 40 149 -17 43 91 -19 -23 8 -22 57 -26 -12 30 -24 -61 -1 -59 19 -47 -4
4557 -4 47 -46 46 -45 -1 7 -23 27 -78 29 71 15 32 -21 -41 32 -67 -37 -64 33 59 34 -103 21 -61 -82 38 6 -27
4586 -27 -49 65 18 -44 -91 49 -8 73 41 -18 15 151 -55 -79 -31 41 83 21 14 -52 -102 -20 -79 -93 -8 14 -26 -9 21
4615 21 -61 -38 30 10 69 19 115 20 -10 12 -12 14 -3 -41 56 5 95 33 -37 -39 94 25 40 40 54 65 15 -53 -28 118
4645 118 64 42 84 15 -25 -79 26 -39 -20 11 5 -10 -52 -50 -12 13 -146 -26 -54 -58 27 20 -28 13 29 12 -21 -10 76 -33
4675 -33 29 36 -15 15 93 -22 -68 9 8 -38 -20 53 -18 -18 -21 -5 -30 53 133 -37 -90 82 78 91 -2 22 28 28 -26 -32 -5 3 59
4708 59 -18 -97 100 45 3 12 -104 -100 2 -52 -74 -60 -39 71 -46 -73 100 22 16 116 30 34 118 1 63 -1 133 110
$$ packed form
4500a2m7K5R1o3N3K2m0J4M4q8j1K4J7qj70J56m7O4q9J9p5Q2Q1n1q2J28l4R8l4
4529F7l2p2J42qp9L8j19J85q2J09j66O0M8j10mL1l0P9q3J4M2n4l7O0n8P8o6M3
4557dN1r3R2r1M4Ql0N0j05J07M2n6J7n3k0P3r9L0k7R7K6k5j37J24q2k1J20l2l3
4586b7k2J14m7o2m7J40n7Q1l2n9L3J36k06k4M8P2M2o2po6n0Q2n9j4Q5K2m0J7L0
4615B1q2K3O8k0N9n0R6r5l0K2k4K6j7l8R7n1R0o2p0kJ33o9J5%J4J1n0o8K5J46
4645A18n4k2M2o9m0n4J05o5J9L1oj5m2KL8K5j59J20k8mQ5pm8M1J6j7l3J1Q6j09
4675c3O2Pn1L0P8j15m6P7jm6J8P3p1%lJ6k5Q3Q0j70n3J72mJ3r3K4O%n4oK7QN6
4708E9p7p9J97n5m2Rj16MJ02n4k2J4K1J10j17k7J73p8oJ00q6MQ4j17O2o4J34k3
$$ plain form
4736 110 -22 44 50 -8 35 -12 -80 98 7 46 -63 30 -11 152 -54 50 73 43 16 50 -53 46 36 -27 -17 61 -1
4763 -1 -27 -15 -63 -7 37 3 -80 55 -53 18 -21 -62 13 61 38 23 -58 -22 10 9 91 -26 -8 30 52 53 32 -95 -9 9
4793 9 -53 -60 -54 -4 -46 9 47 -77 -69 -120 35 5 -19 82 28 61 62 59 -5 16 4 -25 1 -78 2 -24 43 -21 -57 11 -3 89
4825 89 -46 -5 10 -12 16 27 -17 -44 143 99 36 13 10 -28 50 49 -9 -136 3 22 23 -40 110 -42 -75 -25 41 -47 -65
4854 -65 11 -43 9 -10 16 3 -64 15 -25 -68 17 62 -24 75 59 2 89 73 71 -78 -19 26 -112 11 35 -17 -16 31 38 -9
$$ packed form
4736A10j32O6On8M3m7o8J78r1L9j09R3m1J63k06J04K3l0k7L4j03R9j0o3J0P8o2
4763ak6J2m8N6M4l4q3J35j08P1l9m1P5M8k3j5q1L6L2jQ2j17J8L8K2Jk1j27Q6J8
4793Io2pON0m2N5L8j24Qn1J55l0k4J01n4L3Jlo4K1j2k9K6p9Q0k6O7o4l6O8j4R2
4825H9j35M1J5k2K8J1m4k7J87m4o3k3ll8P8jn8j27J39J9Jo3J50j52l3N0O6q8j8
4854f5P6n4N2j9K6j3o7P9m0m3Q5M5q6R9j6n7Q7j6kj49N9M5j38J23K4n2JM7Pm7
$$ [...]
8191b5
##END NTUPLES=NMR FID
##END=
