##TITLE=1H ikalashn
D6-2
22.10.2024
##JCAMPDX= 6.0         $$ Bruker NMR JCAMP-DX V2.0
##DATA TYPE= NMR FID
##DATA CLASS= NTUPLES
##ORIGIN= UXNMR, Bruker Analytische Messtechnik GmbH
##OWNER= root
$$ TOPSPIN		Version 1.3
$$ 2024-10-22 14:29:22.031 +0400  Irina@DPX200
$$ Compression mode = diff/dup
##.OBSERVE FREQUENCY= 200.131300845
##.OBSERVE NUCLEUS= ^1H
##.DELAY= (6, 6)
##.ACQUISITION MODE= SIMULTANEOUS
##.ACQUISITION SCHEME= undefined
##.AVERAGES= 16
##.DIGITISER RES= 18
##SPECTROMETER/DATA SYSTEM= spect
##.PULSE SEQUENCE= zg
##.SOLVENT NAME= D2O
##.SHIFT REFERENCE= INTERNAL, D2O, 1, 17.49637
##AUDIT TRAIL= $$ (NUMBER, WHEN, WHO, WHERE, WHAT)
$$ ##TITLE= Audit trail, TOPSPIN		Version 1.3
$$ ##JCAMPDX= 5.01
$$ ##ORIGIN= Bruker BioSpin GmbH
$$ ##OWNER= Irina
$$ $$ F:/spectra/data/iren/nmr/1H/4/audita.txt
$$ ##AUDIT TRAIL=  $$ (NUMBER, WHEN, WHO, WHERE, VERSION, WHAT)
(   1,<2024-10-22 14:28:57.234 +0400>,<Irina>,<DPX200>,<TOPSPIN 1.3>,
      <created by zg
	started at 2024-10-22 14:27:49.343 +0400,
	POWCHK disabled, PULCHK disabled
       configuration hash MD5:
       BE 6D 3F 07 2A EA 11 49 91 17 2B D3 AF B3 58 0D
       data hash MD5: 16K
       51 F0 6D 8B 7D 36 6D 44 0D 48 CE F2 D2 BA EE E3>)
$$ ##END=
$$ 
$$ $$ hash MD5
$$ $$ 5C 21 33 3E CE 8F BD 4F C8 B1 BB F1 C2 E8 6F B4
##$RELAX= 
##$RELAX= 
##$RELAX= 
##$RELAX= 
##$RELAX= 
##$RELAX= 
##$RELAX= 
##$RELAX= 
##$RELAX= 
$$ Bruker specific parameters
$$ --------------------------
##$DU= <F:/spectra>
##$EXPNO= 4
##$NAME= <1H>
##$PROCNO= 1
##$TYPE= <nmr>
##$USER= <iren>
##$AMP= (0..31)
100 100 100 100 100 100 100 100 100 100 100 100 100 100 100 100 100 100 
100 100 100 100 100 100 100 100 100 100 100 100 100 100 
##$ANAVPT= -1
##$AQSEQ= 0
##$AQ_mod= 1
##$AUNM= <au_zg>
##$AUTOPOS= <>
##$BF1= 200.13
##$BF2= 200.13
##$BF3= 200.13
##$BF4= 200.13
##$BF5= 200.13
##$BF6= 200.13
##$BF7= 200.13
##$BF8= 200.13
##$BYTORDA= 1
##$CFDGTYP= 0
##$CFRGTYP= 5
##$CHEMSTR= <none>
##$CNST= (0..63)
1 1 145 1 1 1 1 1 1 1 1 1 1 1 1 1 1 1 1 1 1 1 1 1 1 1 1 1 1 1 1 1 1 1 
1 1 1 1 1 1 1 1 1 1 1 1 1 1 1 1 1 1 1 1 1 1 1 1 1 1 1 1 1 1 
##$CPDPRG= <>
##$CPDPRG1= <>
##$CPDPRG2= <>
##$CPDPRG3= <>
##$CPDPRG4= <mlev>
##$CPDPRG5= <mlev>
##$CPDPRG6= <mlev>
##$CPDPRG7= <mlev>
##$CPDPRG8= <mlev>
##$CPDPRGB= <>
##$CPDPRGT= <>
##$D= (0..63)
0 2 0 0 0 0 0 0 0 0.06 0 0.03 0 0 0 0 0.0002 0 0 0 0 0 0 0 0 0 0 0 0 0 
0 0 0 0 0 0 0 0 0 0 0 0 0 0 0 0 0 0 0 0 0 0 0 0 0 0 0 0 0 0 0 0 0 0 
##$DATE= 1729592934
##$DBL= (0..7)
120 120 120 120 120 120 120 120 
##$DBP= (0..7)
150 150 150 150 150 150 150 150 
##$DBP07= 0
##$DBPNAM0= <>
##$DBPNAM1= <>
##$DBPNAM2= <>
##$DBPNAM3= <>
##$DBPNAM4= <>
##$DBPNAM5= <>
##$DBPNAM6= <>
##$DBPNAM7= <>
##$DBPOAL= (0..7)
0.5 0.5 0.5 0.5 0.5 0.5 0.5 0.5 
##$DBPOFFS= (0..7)
0 0 0 0 0 0 0 0 
##$DE= 6
##$DECBNUC= <off>
##$DECIM= 32
##$DECNUC= <off>
##$DECSTAT= 4
##$DIGMOD= 1
##$DIGTYP= 9
##$DL= (0..7)
0 120 120 120 120 120 120 120 
##$DP= (0..7)
150 150 150 150 150 150 150 150 
##$DP07= 0
##$DPNAME0= <>
$$ [...]
##$SW= 21.9926040160658
##$SWIBOX= (0..15)
0 0 2 0 0 0 0 0 0 0 0 0 0 0 0 0 
##$SW_h= 4401.40845070422
##$TD= 16384
##$TD0= 1
##$TE= 300
##$TE2= 300
##$TE3= 300
##$TEG= 300
##$TL= (0..7)
0 120 120 120 120 120 120 120 
##$TP= (0..7)
150 150 150 150 150 150 150 150 
##$TP07= 0
##$TPNAME0= <>
##$TPNAME1= <>
##$TPNAME2= <>
##$TPNAME3= <>
##$TPNAME4= <>
##$TPNAME5= <>
##$TPNAME6= <>
##$TPNAME7= <>
##$TPOAL= (0..7)
0.5 0.5 0.5 0.5 0.5 0.5 0.5 0.5 
##$TPOFFS= (0..7)
0 0 0 0 0 0 0 0 
##$TUNHIN= 0
##$TUNHOUT= 0
##$TUNXOUT= 0
##$USERA1= <user>
##$USERA2= <user>
##$USERA3= <user>
##$USERA4= <user>
##$USERA5= <user>
##$V9= 5
##$VALIST= <valist>
##$VCLIST= <CCCCCCCCCCCCCCC>
##$VD= 0
##$VDLIST= <DDDDDDDDDDDDDDD>
##$VPLIST= <PPPPPPPPPPPPPPP>
##$VTLIST= <TTTTTTTTTTTTTTT>
##$WBST= 1024
##$WBSW= 25
##$XGAIN= (0..3)
0 0 0 0 
##$XL= 0
##$YL= 0
##$YMAX_a= 928071
##$YMIN_a= -1303385
##$ZGOPTNS= <>
##$ZL1= 120
##$ZL2= 120
##$ZL3= 120
##$ZL4= 120
##$ABSF1= 10
##$ABSF2= 0
##$ABSG= 5
##$ABSL= 3
##$ALPHA= 0
##$AQORDER= 0
##$ASSFAC= 0
##$ASSFACI= 0
##$ASSFACX= 0
##$ASSWID= 0
##$AUNMP= <proc_1d>
##$AXLEFT= 0
##$AXRIGHT= 0
##$AXTYPE= 0
##$AXUNIT= <>
##$AZFE= 0.1
##$AZFW= 0.1
##$BCFW= 1
##$BC_mod= 2
##$BYTORDP= 1
##$COROFFS= 0
##$CY= 7568.61572265625
##$DATMOD= 1
##$DC= 2
##$DFILT= <>
##$DTYPP= 0
##$F1P= 17.9538593292236
##$F2P= -4.03888763876832
##$FCOR= 0.5
##$FTSIZE= 32768
##$FT_mod= 4
##$GAMMA= 1
##$GB= 1
##$INTBC= 1
##$INTSCL= 1
##$ISEN= 128
##$LB= 0.02
##$LEV0= 0
##$LPBIN= 0
##$MAXI= 945.577
##$MC2= 0
##$MEAN= 0
##$ME_mod= 0
##$MI= -402.1523
##$NCOEF= 0
##$NC_proc= 0
##$NLEV= 6
##$NOISF1= 8.587773
##$NOISF2= 6.764455
##$NSP= 1
##$NTH_PI= 0
##$NZP= 0
##$OFFSET= 17.49637
##$PC= 1
##$PHC0= 293.6808
##$PHC1= 43.53279
##$PH_mod= 0
##$PKNL= yes
##$PPARMOD= 0
##$PPDIAG= 0
##$PPIPTYP= 0
##$PPMPNUM= 100
##$PPRESOL= 1
##$PSCAL= 0
##$PSIGN= 0
##$REVERSE= no
##$SF= 200.13
##$SI= 32768
##$SIGF1= 18.5376
##$SIGF2= -6.396296
##$SINO= 400
##$SIOLD= 32768
##$SREGLST= <1H.CDCl3>
##$SSB= 3
##$STSI= 0
##$STSR= 0
##$SW_p= 4401.40845070422
##$SYMM= 0
##$S_DEV= 0
##$TDeff= 0
##$TDoff= 0
##$TI= <>
##$TILT= no
##$TM1= 0
##$TM2= 0
##$TOPLEV= 0
##$USERP1= <user>
##$USERP2= <user>
##$USERP3= <user>
##$USERP4= <user>
##$USERP5= <user>
##$WDW= 1
##$XDIM= 8192
##$YMAX_p= 0
##$YMIN_p= 0
$$ End of Bruker specific parameters
$$ ---------------------------------
##NTUPLES= NMR FID
##VAR_NAME=  TIME,          FID/REAL,        FID/IMAG
##SYMBOL=    X,             R,               I
##VAR_TYPE=  INDEPENDENT,   DEPENDENT,       DEPENDENT
##VAR_FORM=  AFFN,          ASDF,            ASDF
##VAR_DIM=   8192,          8192,            8192
##UNITS=     SECONDS,       ARBITRARY UNITS, ARBITRARY UNITS
##FACTOR=    0.0002272,     1,               1
##FIRST=     0,             0,               0
##LAST=      1.8609952,     97,              -39
##MIN=       0,             -1303385,        -1303385
##MAX=       1.8609952,     928071,          928071
$$ Real data points
##PAGE= N=1
##DATA TABLE= (X++(R..R)), XYDATA
0@%%%%%%%%%%j6L2l2M8o4O4q0J12j29J45j77K25k72L20l84M48n13N94o90P86q98
$$ 0 0 0 0 0 0 0 0 0 0 0 -16 16 -16 32 -32 32 -48 64 -65 80 -97 128 -144 176 -208 240 -273 321 -369 417 -481
31d81J026j170J330j506J699j908K147k403K683k993L328l699M101m535N017n542
$$ -481 545 -625 705 -801 898 -1010 1137 -1266 1417 -1576 1752 -1947 2154 -2381 2636 -2906
47b906O108o735P423q175R006r924J0945j2085J3366j4816J6469j8377K0607k3260
$$ -2906 3202 -3533 3890 -4285 4721 -5203 5742 -6343 7023 -7793 8676 -9701 10906 -12354
61a2354K6472l0458L5567m2369N1941o6516R1663j46869M79282m42008j132883
$$ -12354 14118 -16340 19227 -23142 28799 -37717 53946 -92923 386359 -55649 -1188532
72a188532N56103J078710M81790o72812p09556q7346M58628K56764K0370j6264
$$ -1188532 -632429 446281 928071 255259 -454297 -541643 -83015 173749 194119 177855
82A77855L0137k58583l67897P454N81289M75969k54455p90176l62251M98761P69058
$$ 177855 207992 -50591 -418488 -411034 170255 646224 391769 -398407 -760658 -261897 507161
93E07161J06761n74193n04242J04326M21392K33496q1823j61964j19044j03017
$$ 507161 613922 39729 -464513 -360187 61205 294701 212878 50914 -68130 -171147
103a71147n1209J63628L04032P7396l37008l65114Q7765M41430K28656k32393
$$ -171147 -222356 -58728 245304 322700 -14308 -379422 -291657 149773 378429 146036
113A46036l37609j7654K26895R4725j25673n7957J40326O7036k06616k04024J57543
$$ 146036 -191573 -209227 17668 112393 -13280 -71237 69089 136125 -70491 -274515 -116972
124a16972L71192Q6556l42678l33917J14936M00101J38580k86257k77891J03277
$$ -116972 254220 340776 -1902 -335819 -220883 179218 317798 31541 -246350 -143073
134a43073K62905j582k27117m2634K52575J59402k34818l37322P2167M43002K12706
$$ -143073 119832 118250 -108867 -151501 101074 260476 25658 -311664 -239497 203505 416211
145D16211l37726m50995K6649M40665K67623k06393l50650m4130K43513J58237
$$ 416211 78485 -372510 -345861 94804 362427 156034 -194616 -238746 4767 163004
155A63004q6091j11422M0399N4329r2095j11768Q1705K03555L7698k15748k01555
$$ 163004 76913 -34509 5890 60219 -31876 -143644 -61939 141616 179314 -36434 -237989
166b37989Q7980K73635J07522j77183k03294K0744J62786O8572p2426o6235K2490
$$ -237989 -150009 123626 231148 53965 -149329 -128585 34201 102773 30347 -35888 -13398
177a3398K3722n0836l7863Q4005J16950l5378j63903n9235J39948J42296n5545
$$ -13398 10324 -40512 -78375 5630 122580 87202 -76701 -135936 4012 146308 90763
188I0763j67629m2903J25496R3040q0435j23241L4863J46277L2097j35915j00799
$$ 90763 -76866 -119769 5727 98767 18332 -104909 -70046 76231 108328 -27587 -128386
199a28386Q5834J52455P583j41486r2182P1659J11438j3212r3424q624Q5228K0101
$$ -128386 -42552 109903 117486 -24000 -116182 -44523 66915 53703 -39721 -48345 36883 56984
211E6984r7545n9760J02339J44384k8317j97283j14018J34544K15855J2059k04070
$$ 56984 -40561 -100321 2018 146402 118085 -79198 -193216 -58672 157183 169242 -34828
222c4828j52342P5484J78916O4362q5134r5983q449L7835J8794J7931M4473Q312
$$ -34828 -187170 -111686 67230 131592 46458 -49525 -57974 -20139 -1345 16586 61059 69371
234F9371q9005j04241K7858J52968R8668q3191j70805n3173J27440J49594m046
$$ 69371 -19634 -123875 -96017 56951 155619 72428 -98377 -151550 -24110 125484 121438
245A21438j30111q8325K9540P3219L2602n199j2795k5981m6385k1152O1860J04043
$$ 121438 -8673 -96998 -67458 5761 38363 33164 20369 -5612 -51997 -73149 -11289 92754
257I2754J5215j17691j14323L8966J45192O8168q5817j24446j6709R1242P4757
$$ 92754 107969 -9722 -124045 -85079 60113 128281 42464 -81982 -98691 -7449 67308
268F7308j9205n7930j5340J7602J334n187K4209L1263j8232o3288l3849M7799
$$ 67308 48103 -9827 -25167 -7565 -6231 -11418 12791 44054 25822 -37466 -71315 -23516
280b3516P8928Q304p8499n9763L9123Q0768J5131n6115m2661K0455M1534j984
$$ -23516 55412 63716 -14783 -74546 -35423 45345 60476 4361 -38300 -17845 23689 21705
292B1705l7463q522L6296J6442l7412l2265K8916N0260p36m8538k8560K7932M3165
$$ 21705 -15758 -24280 12016 28458 -8954 -41219 -12303 37957 37221 -11317 -39877 -11945 31220
305C1220m160m3691j6888L0569K3582j9454k4078J3173L0589K335k9894j9584
$$ 31220 27060 -16631 -33519 -2950 20632 1178 -22900 -9727 20862 23197 -6697 -26281
317b6281K3173L7173n275m5606k0977L1817L4534j0339l4806r753K4842K2428
$$ -26281 -3108 34065 28790 -16816 -37793 -5976 28558 18219 -16587 -26340 -1498 20930
329B0930j0532k3966M431K4769j618l0038q333K9408K1554k0286l4400j278L7726
$$ 20930 10398 -13568 -9137 15632 14014 -16024 -24357 5051 26605 6319 -28081 -29359 8367
342H367K8692j9475l9589k874L3749J9277j6430k2097j967J0289M839n185k319
$$ 8367 37059 17584 -22005 -24879 8870 28147 11717 -10380 -12347 -2058 2781 -2404 -4723
355d723R270N288j5890j5787J5710L0047J689l1962k4913J3021L4570J3107k6959
$$ -4723 4547 9835 -6055 -21842 -6132 23915 25604 -6358 -31271 -18250 16320 29427 2468
368B468l0936P713L1602J0616j6146j1545M987N673l492l995N421Q344n433k0252
$$ 2468 -28468 -20755 10847 21463 5317 -6228 -1241 4432 940 -3055 2366 10710 5277 -14975
382a4975o829K1951K1146r719k5281o451J8330J9025j482j9578j2625R921J4783
$$ -14975 -21804 147 21293 11574 -13707 -20158 -1828 17197 15715 -3863 -16488 -6567 8216
395H216j703j0668r51O620L48l883J62P490N877o390j4674j528J7444J0394j5019
$$ 8216 6513 -4155 -5106 1514 1862 -2021 -1859 5631 11508 5118 -9556 -11084 6360 16754 1735
410A735j8887K433J7858Q948p565j3173j312J1387P341n403n211K549N52n780
$$ 1735 -17152 -14719 3139 12087 4522 -8651 -9963 1424 8765 3362 -1849 700 1252 -4528
424d528j085P277N832k819r343n199P358J4171K757j3595j1729L839J0804M405
$$ -4528 -5613 1664 7496 4677 -4666 -9865 -2507 11664 14421 826 -10903 -7064 3740 8145
438H145n276q233k905M399L098r25K385O246k642j1255k935J0991J1384j496j2891
$$ 8145 2869 -5364 -8269 -3870 -772 -1697 688 6934 4292 -6963 -9898 1093 12477 10981 -1910
453a910j0938K940J3458P867m562q313m122n13M376Q808M272o251j0998o540L245
$$ -1910 -12848 -9908 3550 11417 6855 -1458 -5580 -6093 -1717 7091 11363 5112 -5886 -12426 -9181
468i181J1393R816l800j4906r459N510J4456J1369j307j4149j3628Q80J3690J3301
$$ -9181 2212 12028 8228 -6678 -16137 -10627 3829 15198 13891 -258 -13886 -13006 684 13985
482A3985K497j2084j9373o802J6638K3477M485j8331k0996l542J6249J9059K489
$$ 13985 16482 4398 -14975 -21777 -5139 18338 22823 4492 -16504 -20046 -3797 15262 17751
495A7751j3824j5016n887M470J4116J4919J99j7785j9167p12K0721K5228L349
$$ 17751 3927 -11089 -16976 -12506 1610 16529 16728 -1057 -20224 -20936 -215 25013 28362
508B8362k6231k9529j97K9395K7280k961k9159k4934M684K7203J9669n365j8403
$$ 28362 2131 -27398 -27595 1800 29080 26119 -3040 -27974 -23290 3913 23582 18217 -186
521a86j4001k851Q844J5975J0342n749j8204j6941J314K2851K4993p44k7250k5547
$$ -186 -14187 -17038 -8194 7781 18123 12374 -5830 -22771 -21457 1394 26387 25643 -1607 -27154
535b7154K075K8644K7754k143l2678k8089O817L0769K0201p230k3333j6155M368
$$ -27154 -25079 3565 31319 29176 -3502 -31591 -24774 5995 26196 18966 -4367 -20522 -16154
548a6154J7006J1476P0o400r667j0437j923J2749J8276O508j5085k6166j0800
$$ -16154 852 12328 12398 5998 -3669 -14106 -16029 -3280 14996 21504 6419 -19747 -30547
561c0547K3423L5984O503l1653l3411R39L1959K6872o606k9924j6780R627J6715
$$ -30547 -7124 28860 35363 3710 -29701 -28762 3197 30069 23463 -6461 -23241 -13614 3101
574C101M864j181k24l463j0983j0445N407K4161J9602j3494l9179j9845K6849
$$ 3101 7965 6784 6560 3097 -7886 -18331 -12924 11237 30839 17345 -21834 -41679 -14830
587a4830M4791J2965l3831m3374n031L9172L6876n282l4172k2042M835J8831J3990
$$ -14830 29961 42926 9095 -34279 -39310 -138 36738 31456 -2716 -24758 -19923 -1092 12898
600A2898J828p076j0724j0764n720J0795K5498J3473j8305l4752j4815K3606M1469
$$ 12898 14726 7650 -3074 -13838 -19558 -8763 16735 30208 11903 -22849 -37664 -14058 27411
613B7411J6388l1619m6946r220L8617M2360K233l6624l5120J808L3250K5289o350
$$ 27411 43799 12180 -34766 -43986 -5369 36991 39224 2600 -32520 -30712 2538 27827 21477
626B1477k2521j3718N19P195Q546Q068M578n755j9597j7384J0897L6372K1050
$$ 21477 -1044 -14762 -14243 -7048 1498 9566 14144 8389 -11208 -28592 -17695 18677 39727
639C9727k3465m4476j4936L3024M5262N940m0373l7346P917L6641K0261j1746
$$ 39727 16262 -28214 -43150 -10126 35136 41076 703 -36643 -28726 7915 28176 16430
651A6430k1211p677N507N516k92L862J1456N26k2146k2074R443L5977K2678j9255
$$ 16430 -4781 -12458 -6951 -1435 -1727 2135 13591 14117 -8029 -30103 -20660 15317 37995 18740
665A8740m2675j8668K9795M4231P660l4127l4084m60K7507K4972Kj9253j7106
$$ 18740 -23935 -42603 -12808 31423 39083 4956 -29128 -29588 -2081 22891 22893 3640 -13466
678a3466j774Q136J0470R930K682j1128j8779r130J1296K5815J5463j5243l4708
$$ -13466 -15240 -7104 3366 13296 15978 4850 -13929 -23059 -11763 14052 29515 14272 -20436
691b0436j6504K2576L8746J3653k5926l8746j0179K9661L6676L014k9683k7612
$$ -20436 -36940 -14364 24382 38035 12109 -26637 -36816 -7155 29521 32535 2852 -24760
703b4760O80K2939J9655o18j4900j1711j947K154O475J2143P680j0663k3071j0774
$$ -24760 -24080 -1141 18514 17896 2996 -8715 -10662 -8508 -2033 10110 17790 7127 -15944 -26718
717b6718J7100L0241R408k5316l2321p74L0948K5638o463k7345j6964Q779K1591
$$ -26718 -9618 20623 30031 4715 -27606 -28380 2568 28206 21743 -5602 -22566 -13787 7804
730G804Q810r106j1880k086K774J182J952N571L774m695j2056o302Q913J6699
$$ 7804 16614 7508 -4372 -6458 -3684 -2502 -550 5021 8795 4100 -7956 -14258 -5345 11354
744A1354L861j4248j5086M22J3749J1669r02j1319q627J931Q784M979j117l915
$$ 11354 15215 967 -14119 -13697 52 11721 10819 -500 -9127 -7196 1588 6567 5450 1535
758A535l292j530J095J545J928L042Q27n772p294K57Q882Q435j376j0953r485
$$ 1535 -1757 -3287 -2192 -647 1281 4323 5150 -622 -7916 -7659 1223 9658 8282 -2671 -12156
773a2156K282J3157R165m846j2620o399N317J0736N804n051q541k588L010L078
$$ -12156 -9874 3283 12448 7602 -5018 -11417 -6100 4636 10440 5389 -3152 -5740 -2730 348
787C48K663K597j315o603o118J787R255P524k955j2446p452P021J2049M064o857
$$ 348 3011 5608 4293 -2310 -8428 -6641 2614 10138 7183 -5263 -12715 -5694 6355 10419 3562
802C562r478l323N852Q224K332m655n359j018J484L461L514j3l225m221j738K137
$$ 3562 -5916 -9239 -3387 4837 7169 2514 -2845 -3863 -2379 1082 4596 4583 1358 -2863 -4601 -2464
818b464N466K973m320o514q23M279M227O97k287l587j263J925K521J346M2j978
$$ -2464 3002 5975 1655 -4859 -5682 -1403 2824 3521 1234 -2353 -3616 -1691 830 2176 2218 240
834B40k497k77K946K063m96k83j527j862l32K820J920m63j907k717j543K310M108
$$ 240 -2257 -2534 412 2475 1979 1696 169 -1693 -2025 795 2715 2252 345 -2372 -3915 -1605 2503
851B503P09k849l044j527K258M790J680l504m303k47K797K949J466j317l964j847
$$ 2503 3212 363 -2681 -4208 -1950 2840 4520 1016 -3287 -3534 -737 2212 3678 2361 -1603 -3450
867c450K011L337K021o01m407l437J800N013J654k450l115k334P50L922L120j922
$$ -3450 -1439 1898 3919 3318 -1089 -4526 -2726 2287 3941 1491 -1624 -3958 -3208 714 3834 1912
883A912l964j410J366K857K814q83l873j728J676K322J519M98k826l479O33M330
$$ 1912 -2052 -3462 -2096 761 3575 2692 -1181 -2909 -1233 1089 2608 3106 280 -3199 -2566 1764
899A764J710j439l198k178R81L603J670k429k783n30J436J970J856j133l083o20
$$ 1764 3474 2035 -1163 -3341 -2360 1243 2913 484 -2299 -2829 -1393 577 2433 1300 -1783 -2403
915b403K343J568J49n89j375j645J427K451K08j281j585j153R85K479N90k458
$$ -2403 -60 1508 1657 1068 -307 -1952 -525 1926 2134 853 -732 -1885 -900 1579 2169 -289
931b89j754P28Q04P96O52n76j995o2J325J148L94m84j377p35J642J644n91j158
$$ -289 -2043 -1315 -511 285 937 361 -1634 -1696 -371 777 1171 687 -690 -1425 217 1861 1270 112
949A12k16o56K33J547N50j631r63L94L82O08M40q77j418R4J361K90M9k77j066
$$ 112 -104 -760 -527 1020 1570 -61 -1024 -630 -248 360 800 -77 -1495 -1401 -40 250 299 22 -1044
968a044j37J467J242j041r57O41K77LP3R7o30j55J76m15N90P40n48j630J86J178
$$ -1044 -1181 286 1528 487 -470 171 448 451 524 621 -9 -164 12 -403 187 927 379 -1251 -1065 113
988A13N21p19l58l45m06J084O19l81n19J99L4k72R88Q64n78n79n71n26J069J344
$$ 113 634 -85 -443 -788 -1194 -110 509 128 -391 -192 -158 -430 558 1422 844 265 -306 -832 237 1581
1008A581l64k147n25Q76R16q0J66n86q98l11N36J218Q89q6k519j537J984K986
$$ 1581 1217 -930 -1455 -579 337 257 423 -163 -1061 -1372 -836 382 1271 1185 -1334 -2871 -887 2099
1026B099J08j733j582m40J703J701O4j320j089n22l7R61J610M49k359k020m37
$$ 2099 2207 474 -1108 -1548 155 1856 1920 600 -489 -1011 -1048 -87 1523 1972 -387 -2407 -2844
1043b844K246L008M41l345l172R16L456J815q36j910j627J9J775J761Q98r01k383
$$ -2844 -598 2410 2851 -494 -3666 -2750 706 2521 1685 -225 -1852 -1833 -58 1703 2601 1700 -683
1060f83k148O13M552K056k904l946r73K157L084O80k113k224j96P45O41J424J698
$$ -683 -2831 -2218 2334 4390 1486 -2460 -3433 -1276 1808 2488 375 -1849 -2045 -1300 -659 765 2463
1077B463q41l317k199J729M582K946k895n890j819N109N157j314m266k535J316
$$ 2463 1622 -1695 -3894 -2165 2417 5363 2468 -3422 -5241 -132 5025 3711 -555 -3090 -1774
1092a774K194R37p77l70O24j362k958N88M594K894k757n260k043L655N818J323
$$ -1774 420 1357 580 210 834 -528 -3486 -2898 1696 4590 1833 -3427 -5470 -1815 4003 5326
1108E326m418m993J89L954L099L27k159l067j079J785K222J452k73k547l192l4
$$ 5326 908 -4085 -3896 58 3157 3484 1325 -1742 -2821 -1036 1186 2638 2365 -182 -3374 -3408
1124c408L432K777l83j982k731j758J780M040K783j193m943m450J979P633M486
$$ -3408 24 2801 2418 436 -2295 -4053 -2273 1767 4550 3357 -1586 -6036 -4057 3576 8062
1139H062m878q228j640O081O029k73n763l730K159L628l89k171J427K280j863
$$ 8062 3184 -5044 -6684 -603 5426 5153 -610 -4340 -2181 1447 1058 -1113 314 2594 731
1154G31n075j099N610O606q40r186o170N665J0482K114q257p649J556P540M456
$$ 731 -4344 -5443 167 6773 5933 -3253 -9423 -3758 6724 8838 581 -7068 -5512 2028 6484
1169F484l439n568j47L538K55k395L56L130Q11l550m353K35O376M656l075p477
$$ 6484 3045 -2523 -2670 868 1123 -1272 -916 2214 3025 -525 -4878 -4643 1733 6389 3314 -4163
1185d163k606M727O311J456m067n427j421M442M730p1k775l227r73K001L199N06
$$ -4163 -6769 -2042 4269 5725 1658 -3769 -5190 -748 3982 3911 1136 -2091 -3064 -1063 2136 2642
1201B642k351j005J75m71p16J106K466J455k284n699j654O387P528j387r627n383
$$ 2642 291 -714 -539 -1010 -1726 -620 1846 3301 1017 -4682 -6336 51 7579 6192 -3435 -8818
1217h818N111R444K637p302p825J859P807K754n108l592K169L419j495m290n14
$$ -8818 -3707 5737 8374 1072 -6753 -4894 2913 5667 559 -3033 -864 2555 1060 -3230 -3744
1232c744O131M454n347q771j82R740O796m966r854k729P138Q172j083p653l501
$$ -3744 2387 6841 1494 -7277 -7459 2281 9077 4111 -5743 -8472 -1334 6838 5755 -1898 -5399
1247e399M126M126o81k575K5J612nk410j270K328L963q29m705k941K246M425J693
$$ -5399 -1273 2853 2172 -403 -378 1234 1229 -1181 -2451 -123 3840 3011 -1694 -4635 -2389 2036 3729
1264C729k115l819j813K197L499J751j630l090k411J745M199J836k820l456J49
$$ 3729 1614 -2205 -4018 -1821 1678 3429 1799 -1291 -3702 -1957 2242 4078 1258 -2198 -2049
1279b049K486J745j274j959R16J751r94l518k47M818L565l899o715k37O590N448
$$ -2049 437 2182 908 -1051 -135 1616 622 -2896 -3143 1675 5240 1341 -5374 -5611 979 6427
1295F427k480p898k382N774N742j627n645j261L566K751k048l093R23M170L16
$$ 6427 3947 -3951 -6333 -559 5183 3556 -2089 -3350 216 2967 919 -2174 -1251 2919 3235
1310C235n118l171L948O013o56o307l939L610N893P63m655l728K055L530L13k033
$$ 3235 -1883 -5054 -1106 4907 4251 -2056 -5995 -2385 3508 4271 -384 -4112 -2057 1473 1786 -247
1326b47k58J063k5j297p63K032K178r24l263j405K850K690r09k609p30Q75Q31
$$ -247 -505 558 533 -764 -1527 505 2683 1759 -1504 -2909 -59 2631 1722 -887 -1617 -742 89
1343H9J22l85N51J36j236j592J172L278N79l187k728J629L470Q68k612k234J157
$$ 89 211 -174 377 513 -723 -2315 -1143 2135 2714 -473 -3201 -1572 1898 2766 154 -2080 -923
1360i23K754p7k744p17K716J120k292k473J166L293J114l219l289J585M000Q16
$$ -923 1831 1754 -990 -1707 1009 2129 -163 -2636 -1470 1823 2937 -282 -3571 -1986 2014 2830
1376B830l445k384J835K949o1k534r72K074K212j606l141N13L531J116l127k567
$$ 2830 -615 -2999 -1164 1785 1724 -810 -1782 292 2504 898 -2243 -1730 1801 2917 -210 -2777
1392b777J363L488N43k815k316J258L106m22k825m77K411J087j687j859R40K537
$$ -2777 -1414 2074 2617 -198 -2514 -1256 1850 1428 -1397 -1874 537 1624 -63 -1922 -982 1555
1408A555Q83k886k277J918L127k50k679j288J660K048n83k033n11J572J403j833
$$ 1555 2438 -448 -2725 -807 2320 2070 -609 -1897 -237 1811 1228 -805 -1316 256 1659 -174
1424a74j672J086K492m80k500j103J996K020l26k692o13K275J870j634k045P29
$$ -174 -1846 -760 1732 1252 -1248 -2351 -355 1665 1339 -1353 -1966 309 2179 545 -1500 -771
1440g71K110j0j682r04J328J576m02k474n95K473J650j996k340O72K209Q33j700
$$ -771 1339 1329 -353 -1257 71 1647 1245 -1229 -1824 649 2299 303 -2037 -1365 844 1677 -23
1457b3j797P04K450P0k192j246K087J858j285j891j04J963J616j551k453M11K562
$$ -23 -1820 -1116 1334 1404 -788 -2034 53 1911 626 -1265 -1369 594 2210 659 -1794 -1383 1179
1474A179P60k297j774J605J796j18j895j229J770J783q08k286l5K149J137j755
$$ 1179 1939 -358 -2132 -527 1269 1151 -744 -1973 -203 1580 772 -1514 -1549 600 1737 -18
1490a8j362O99J821J95j354j390Q40K125l69k139l56J970N35j114j398L47J599
$$ -18 -1380 -681 1140 1335 -19 -1409 -569 1556 1187 -952 -1308 662 1197 83 -1315 -968 631
1507F31P68j617j546R94K055n16j827k47J628P02p66j223N5J761O25j279j508
$$ 631 1399 -218 -1764 -770 1285 769 -1058 -1305 323 1025 259 -964 -909 852 1477 198 -1310
1524a310Q10J882k12j605o69J175R73k88j469n39J309J102j175j229K41J702K66
$$ -1310 -500 1382 1170 -435 -1104 71 1044 756 -713 -1252 57 1159 -16 -1245 -1004 698 964
1541I64j476p38P35J633k27j295p68J369J098q07j369J68J270M32r12j187N32
$$ 964 -512 -1250 -515 1118 891 -404 -1172 197 1295 488 -881 -713 557 989 77 -1110 -578
1558e78J374Q4j489p52J005J211l94j083l41P69Q25k74j169p0J237N51n86j191
$$ -578 796 880 -609 -1361 -356 855 461 -622 -963 -194 631 357 -812 -882 355 906 320 -871
1576h71P80J062k54q80n94Q78P94l43r32m90R01N28o05n08J84L81Kl74j37M66
$$ -871 -91 971 717 -163 -757 121 915 572 -360 -850 51 579 -26 -534 -350 31 33 -341 -478 -12
1596a2O54n36q64K74R53K71m76p14J78N91L68l62m44J75K11o0o00N6O91K19q26
$$ -12 642 106 -758 -484 469 740 264 -450 -272 319 687 325 -119 56 267 207 -393 -337 354 573 -253
1617b53m48R9Q57N51q64p67J87Q94L82n38n13K13L50Q3l48m1M10K44j97q62K68
$$ -253 -701 -602 255 806 -58 -825 -638 256 638 100 -413 -200 150 233 -115 -156 254 498 301 -561 -293
1638b93R39k4o00l76o5L63N39l21l34j67J27J81L3K58p2k54k80J48L33K36L4l72
$$ -293 646 622 22 -354 -419 -56 483 162 -172 -339 -212 -31 2 260 188 -66 -346 -198 135 371 405 33
1660C3l92K35L33K08l83j16L85l89j15L88nQ5m81k70J28M78L13l43m55k34M03
$$ 33 -359 -124 209 417 34 -82 303 -86 -201 187 182 267 -214 -484 -356 122 435 92 -363 -597 -194
1681a94L53L98l99l94O0K80L05K9j40k10j92N2P6K5M3L19k18q27K82M10M72j43
$$ -194 159 557 158 -236 -176 104 409 438 298 88 -104 -52 24 49 92 411 193 -634 -352 58 530 387
1703C87o10o55Q7J000O30o77o87J06M19M30J39m08n91M61N49l00n89L34K56k4
$$ 387 -223 -878 -791 209 839 162 -525 -419 0 430 569 161 -430 31 580 280 -309 25 281 257
1723B57n64j20J77O88L30q36r86M70Q98M31m86p23k61M70R17J11q77l42K59M31
$$ 257 -307 -427 -250 438 768 -68 -1054 -584 314 745 259 -464 -725 -255 662 773 -104 -446 -187 244
1743B44L0Pj44q8R6Qn41j71Q13L36n50o26l19N90R91K43r74j211P11J223M46q16
$$ 244 274 281 137 49 145 153 -388 -559 254 590 40 -586 -905 -315 676 919 -55 -1266 -555 668 1114 298
1765B98j162J35Q85O62n48q25L36O08J23o32l32M45O45j1r60q71O39J650k23j118
$$ 298 -864 -729 156 818 270 -555 -219 389 512 -120 -452 -7 638 627 -333 -1204 -565 1085 862 -256
1785b56j096N28J391O15r29j242J02J310M94o35p11K99M25K86n61l71J47Q79j37
$$ -256 -1352 -824 567 1182 253 -989 -887 423 917 282 -429 -130 295 581 20 -351 -204 675 538
1804E38r14m07M41Q79K30q60q83Q5J214P57p09j070r3O40P29K0o65m87M77N78
$$ 538 -376 -783 -342 537 767 -93 -976 -891 323 1080 371 -699 -792 -152 577 597 -68 -555 -78 500
1824E00r3o17k51M21N70j36o86m77Q86Q03l27j225n08Q68J201l20j129n64N41
$$ 500 407 -210 -461 -40 530 394 -292 -769 117 920 593 -632 -1140 -272 929 609 -520 -1084 -543
1843e43J369j2r61p92O65P16K39p76m46M67Q64j36j283k18J021Q84n46j377j07
$$ -543 826 814 -147 -939 -274 442 681 -95 -541 -74 790 654 -629 -847 174 1058 512 -865 -972
1862i72Q69J115l93j370k41P49Q71l3p67k52K18M36N3l65k21O12O9m00j53q5M02
$$ -972 -103 1012 619 -751 -992 -243 628 595 -172 -424 -206 230 283 -82 -303 309 378 -22 -175 -260 142
1883A42K62l79m06Q6P4N78m0m07l97k6L59M95j44l06l17J74L50L15l65k84l4M89
$$ 142 404 25 -381 -295 -221 357 317 -90 -487 -513 -154 341 197 -109 -426 -252 98 413 48 -236 -270 219
1905B19J01k67j52M09J91l14p08J57O49M94l14j097o9O32P70m68q36j0P03L87
$$ 219 320 53 -99 310 501 187 -521 -364 285 779 465 -632 -701 -69 701 233 -603 -613 90 477
1925D77l43l29j34N55N3k77p79N70R69o6r92k83N66P33j51p77n51N71Q01k01q36
$$ 477 134 -195 -329 226 279 2 -777 -207 762 696 -296 -579 -13 720 569 -208 -759 -188 613 412 -424
1946d24n0O14M1l37l25K35N20r2k60l95N54M05j29n88q4M49M1J52l33M9J30q7
$$ -424 -474 140 181 -156 -481 -246 274 182 -78 -473 81 486 357 -231 -315 134 175 327 -6 43 173 86
1968H6j18l16M99J32l25k88J11L44J91l79k62n5N85L1m08j27K63K44j08l53J51
$$ 86 -32 -348 151 283 -42 -330 -219 125 316 -63 -325 -380 205 236 -172 -299 -36 208 100 -253 -102
1989a02M71L7l00n87K99P15p9o31l57M23O72k41n46k13J83O99k54o25K1O91Q6
$$ -102 369 406 106 -481 -182 533 454 -177 -534 -111 561 320 -226 -439 -256 443 189 -436 -415 276 362
2010C62o23k71M02L35K77o50l56M29M01J93n56l41M39L12l65j29j55M86K07l70
$$ 362 -261 -532 -130 205 482 -168 -524 -95 306 499 -57 -398 41 353 -12 -141 -296 190 397 27
2030B7m11N0O22J85o23j69K29L90q4m49m0L19L03k84l26J40L94j8l02l10M43L15
$$ 27 -384 -334 288 473 -150 -319 -90 300 216 -233 -273 46 349 65 -261 -121 273 255 -47 -357 86 401
2052D01j90l42k69N43J72l80l17K11L61j9l51k97L55N20r1m52k33N72L78m42l61
$$ 401 211 -131 -400 143 315 -65 -382 -171 190 171 -180 -477 -122 398 307 -145 -378 194 572 130 -231
2073b31k6M38L25m00o29J20M55J97n49j12L42N17k68l74m5J52L33J40n76NK82
$$ -231 -257 181 506 106 -523 -403 52 249 -300 -412 -70 447 179 -195 -240 -88 245 385 -191 -186 96
2094I6K24k62m31L18L30j74j08k06J87K26J37p52J5M05K10m06j9Q6K63J21n47
$$ 96 320 58 -373 -55 275 101 -7 -213 -26 200 337 -415 -400 5 215 -191 -210 -124 139 260 -287
2115b87oJ38M12N5o23n4M92m6rk76J28K27J80j51l69kM58J62o01J79j21M43k39
$$ -287 -293 -155 257 312 -311 -365 127 81 72 -204 -76 151 331 180 -189 -191 267 429 -172 7 -114 329 90
2138I0l77K3L45J07j10l10J04L42J42l67k96M10K73k35l31j4J11M16j98l09K8
$$ 90 -287 -264 81 188 78 -232 -128 214 356 -11 -307 103 376 141 -190 -204 -93 323 125 -184 -156
2159a56M41j18k47j82J97L85j25l21j66L39L77k94m23r3M92J21j96l6K4J64J28
$$ -156 285 167 -80 -262 -65 320 195 -126 -292 47 424 130 -293 -386 106 227 31 -5 19 183 311
2180C11l14j96K55L93l89j16l01L32K76r3k30l41K86L78k09j44j0K46mk57M5K9
$$ 311 -3 -199 56 449 60 -56 -357 -25 251 158 -72 -413 -127 251 42 -102 -112 134 130 -127 -82 -53
2202e3K84j06k64j11L25J50q8l64J54J67nRq6p1K70l11K0m0J18K13r2l06Q0K17
$$ -53 231 125 -139 -250 75 225 137 -227 -73 94 89 98 12 -59 211 -100 -80 -120 -2 211 119 -187 -107 110
2226A10J98k27k58J16L00j85q8Rk91N97j34k95l2M05J52l11l45J22L36K38n43
$$ 110 308 81 -177 -61 239 54 -34 -25 -316 281 147 -148 -180 225 377 66 -279 -157 179 417 -126
2247a26k33L03Q7J63q9l61K91P2K53n59l3L60N5j56m10L83K8j8O3j90R3J38p6
$$ -126 -359 -56 31 194 105 -256 35 107 360 -199 -232 128 183 27 -383 0 28 10 73 -117 -24 114 38
2270C8n3k04L57o7j95j8J14J14J21k49l11L72K30j38k31P2LK34j75j29J66N4J65
$$ 38 -15 -219 138 71 -124 -142 -28 86 207 -42 -353 19 249 111 -120 -48 -45 189 14 -115 51 105 270
2293B70l08j09J70K45j92j20j42J74J94Qk2m73L01Q9N2l42n5L03jJ02j13p8j7
$$ 270 -38 -147 23 268 76 -44 -186 -12 182 190 168 -305 -4 85 137 -205 -260 43 42 144 31 -47 -64
2316f4K59j58p3J55N2M2j18j35l1J00K5J17j86k34J1J31LK1K3j46J22J64Q5k53
$$ -64 195 37 -36 119 171 213 95 -40 -71 29 54 171 -15 -249 -238 -107 -104 -83 -60 -206 -84 80 165 -88
2340h8J85LO5k07J94k10J32K4j46l3K7Q8J82N5m35n1R1K53L0k34j56J79l9M3J18
$$ -88 97 100 165 -42 152 -58 74 98 -48 -81 -54 34 216 271 -164 -215 -124 129 159 -75 -231 -52 -91 -48 70
2365G0k71J49L70j57r5j82J40J36j69l2K8P2K64k42j48j95L81q7J11j41l92J40
$$ 70 -201 -52 318 161 66 -116 24 160 -9 -41 -13 59 323 81 -67 -262 119 32 143 2 -390 -250
2387b50K62k8Q1k99M22m1j82N9j47Q6N6J32k88R0J59K29k52k43P8r2M83j18l96
$$ -250 12 -16 65 -234 188 147 -35 24 -123 -37 19 151 -137 -47 112 341 89 -154 -76 -168 315 197 -199
2410a99Q9J1L02P5m03p0P7J33J17l4j58m5L55j42k37N9J16J31Lr8k01k0R1Q5m7
$$ -199 -110 -99 203 278 -125 -195 -118 15 132 98 -60 -105 250 108 -129 -70 46 177 180 82 -119 -139 -48 37 -10
2435a0j97J39J11O9l68J69Q%K12q3j84J01M9O7o0L4m8PJ56k70J3q7Q8K58k21n0
$$ -10 -207 -68 43 112 -256 -87 -79 -79 133 50 -134 -33 16 83 23 57 9 16 172 -98 -85 -172 -84 174 -47 -97
2461i7N7J43J15om15J57L9J88j18M0p1kJ08o9m9k40K00K14k55k7K1K08j02j40
$$ -97 -40 103 218 212 -203 -46 -7 181 63 103 32 30 138 69 20 -220 -20 194 -61 -88 -67 141 39 -101
2485a01O1p8J01J25k6k31J83J0o2k4j7J8K0O1j36O0M9K4n0q5k8M07j06j28k6k7
$$ -101 -40 -118 -17 108 82 -149 34 44 -18 -42 -59 -41 -21 40 -96 -36 13 37 -13 -98 -126 281 175 47 21 -6
2511fJ4p3n5J69o5o3J4q1K64j01j26K3N5M5J19j21k2n8K17j60K8q0J90O7k23K9
$$ -6 8 -65 -120 49 -16 -79 -65 -146 118 17 -109 -86 -31 14 133 12 -10 -68 149 -11 17 -63 127 194 -29 0
2537@j06J21J40j91R6k06J54J3r9M6j8K13m5o2l21J96J4J10k19K6K06J42k66p0
$$ 0 -106 15 155 -36 60 -146 8 21 -78 -32 -50 163 118 56 -265 -69 -55 55 -164 -138 68 210 -56 -126
2561a26j22J62K35j03l31J94L19j39j67L7n0K95j73k8pL1J75Oq2o5R6j58o1N6
$$ -126 -248 -86 149 46 -285 -91 228 89 -78 -41 -91 204 31 3 -4 27 202 208 126 61 157 -1 -62 -6
2585fJ09N0Q6l93O7J32l2l2q3K08Lj59r9J7K35M6j56j6p8J09l1j46K1N6K87j78
$$ -6 103 153 239 -154 -87 45 13 -19 -102 106 109 -50 -149 -132 103 149 -7 -23 -101 8 -23 -169 -148 -92 195 17
2611A7L7k81R5K31J07k84m6L12m8j75M0j09OK96k28M7k23K75P3l10J90L2r1J30
$$ 17 54 -227 -132 99 206 -78 -124 188 140 -35 5 -104 -98 198 -30 17 -206 69 142 -168 22 54 -37 93
2635I3j31k19K79o6j61J19J10J07l0k20N5jR9J58k84J87l9r2K7KnJ2K1L1j38K0
$$ 93 -38 -257 22 -44 -205 -86 24 131 101 -119 -64 -65 34 192 -92 95 56 -36 -9 -7 -12 0 21 52 -86 -66
2661f6K67j3j46L7L2p7N0k99K09J72K0l64K32l1j6m6J35j88K54j54J42k77J80
$$ -66 201 188 42 79 111 34 84 -215 -6 166 186 -178 54 23 7 -39 96 -92 162 8 150 -127 53
2684E3J31k10K06j92r1R0J07M3k21n6K40j01O7k65P7K22r7L7j89J65O0J6l4r5
$$ 53 184 -26 180 -12 -103 -13 94 137 -84 -140 100 -1 66 -199 -122 100 3 40 -149 16 76 92 58 -37
2708c7l4J07o8j41Q2O3J91j00l11J57K06l23M6O7J37R8k03R7k19J46J05k5n9J90
$$ -37 -71 36 -32 -173 -91 -28 163 63 -248 -91 115 -208 -162 -95 42 140 -63 34 -185 -39 66 41 -18 172
2732A72O9l11j14L17jj03J67l01L8J54r3M0Q0o7r0O8l9j13K18k11J57j02J07j21
$$ 172 241 -70 -184 133 132 29 196 -105 -67 87 -6 34 114 47 -43 25 -14 -127 91 -120 37 -65 42 -79
2756g9J41mo0p5K2J06q7QO3j7N9j8j63Q7J19N4j26p0P4p3k6N5K1P8L3j36k4j09
$$ -79 62 58 -2 -77 -55 51 -36 -28 35 18 77 59 -104 -17 102 156 30 -40 34 -39 -65 -10 11 89 122 -14 -38 -147
2784a47K60J37k78R8j23P6PJ03j85j3J21j81R1L8P4j80K07j10Qj39r4J45Pk2O2
$$ -147 113 250 -28 70 -53 23 30 133 -52 -65 56 -125 -34 4 78 -102 105 -5 3 -136 -230 -85 -78 -100 -38
2809c8ON0K53k91J54k37q2L04q1p4J70Jk59Q9j46j2J60Q2N1r9J26k26O6P7J1J6
$$ -38 -32 18 271 -20 134 -103 -185 119 38 -36 134 135 -124 -35 -181 -193 -33 49 100 1 127 -99 -33 44 55 71
2835G1M5J5pr0j45K51j2j89k8J55J41l87J00J6L4O0O7k8K7J4rj39l7j8J11j80
$$ 71 116 131 124 34 -111 140 128 -61 -89 66 207 -180 -80 -64 -30 30 97 69 96 110 101 -38 -75 -93 18 -162
2861a62O4N7P0J15j82J18kj19P6l0L5J30l47J1K54j35J46ml09J46L6o6k9J37j63
$$ -162 -98 -41 29 144 -38 80 78 -41 35 5 40 170 -177 -166 88 -47 99 95 -214 -68 -32 -98 -127 10 -153
2886a53L08l32K35p1qJ42j84K47j92M2m8j34K47n0j1k56K55k31rJ80N8M6k45K02
$$ -153 155 -177 58 -13 -21 121 -63 184 -8 34 -14 -148 99 49 38 -218 37 -194 -203 -23 35 81 -164 38
2910C8lJ2o5J54j90K36l00P0K2p9O7N8j20j6l1J91M2j09q8K76k03M3lJ4%k2O0
$$ 38 35 47 -18 136 -54 182 -118 -48 -26 -105 -38 20 -100 -116 -147 44 86 -23 -111 165 -38 5 2 16 16 -6 54
2937E4j68Q7o0J80K2R4j79kj43Q7L7J11j24J77j8j22M1n8l5n0n0M2r8K80O0j06
$$ 54 -114 -27 -87 93 115 209 30 28 -115 -28 9 120 -4 173 155 33 74 16 -19 -69 -119 -77 -175 105 165 59
2963E9j13J0k4J61j5o9J4j65K30j03K22j66j75J82k6K7K04j64k23kK08p7N4J77
$$ 59 -54 -44 -68 93 78 9 23 -142 88 -15 207 41 -134 48 22 49 253 89 -134 -136 72 -5 49 226
2987B26j04r2l6M6n1rO7n3K9J26k15J54j35L2K4l28K75o5K63q1j32m7J09J2J14
$$ 226 122 30 -6 40 -11 -20 47 -6 23 149 -66 88 -47 -15 9 -319 -44 -109 154 73 -59 -106 3 15 129
3012A29j44l5o0J55L3j00p8O2j0J64k03N1m9L7p2K54k29K67k18l3K8NP0j71J48
$$ 129 -15 -50 -110 45 78 -22 -100 -38 -48 116 -87 -36 -85 -48 -120 134 -95 172 -46 -79 -51 -46 24 -147 1
3037AjpJ23J14j37j84K16k75J28M2n6J09k03J98k43K03q6J01j16O6p1Rl6J20P3
$$ 1 0 -7 116 230 93 -91 125 -150 -22 20 -36 73 -130 68 -175 28 -58 43 -73 -7 -78 -69 -105 15 88
3062H8q3P7j65L3M4J83j75l3J3j64P6K27Qj58J51k85J57o9KK25j09k13K01j34
$$ 88 5 82 -83 -50 -6 177 2 -31 -18 -182 -106 121 129 -29 122 -163 -6 -75 -73 152 43 -170 31 -103
3086a03J25K7Kk21K58n8p1m7J15O3j68K50l12N2j4J20j62O3P2j1j21P6J66k0J0
$$ -103 22 49 51 -170 88 30 -41 -88 27 90 -78 172 -140 -88 -102 18 -144 -81 -9 -20 -141 -65 101 81 91
3111I1j2p8R4j22P8k8KN1P0j91O5J26j14J18k10N8j94J74%rm9j77K88k15K44r7
$$ 91 79 1 95 -27 51 23 25 76 146 -45 20 146 32 150 -60 -2 -196 -22 -22 -31 -80 -257 31 -184 60 -37
3137c7p4K19k41Q5m9J30O5k11M0O1l4k0N6l3J8J31j02j37J36O5q9j6P2k21J27
$$ -37 -111 108 -133 -48 -97 33 98 -113 -73 -12 -46 -66 -10 -43 -25 106 4 -133 3 68 -21 -37 35 -186 -59
3162e9J06j00m9K7R4p9P3k30J37J03l06K22nK42k01R7k12J27J82j71J5O2J10j77
$$ -59 47 -53 -102 -75 19 -60 13 -217 -80 23 -283 -61 -66 176 -25 72 -140 -13 169 -2 13 75 185 8
3186HJ7j07J01J72p7n9j75m9K0R5J39n6Q2j2r2k6n7J30l5K3j54K73k13j8Q4J42
$$ 8 25 -82 19 191 114 55 -120 -169 -149 -54 85 29 111 99 7 -19 -76 54 19 42 -112 161 -52 -70 14 156
3212A56j69K7k4o0P5n4J05m0Qj9k7n8j60J22qK2K2M6j2j12N6J11MP0Q2j47M1n9
$$ 156 -13 14 -10 -70 5 -49 56 16 24 5 -22 -80 -240 -118 -126 -104 -82 -36 -48 -160 -104 7 11 81 163 16 57 -2
3240bj37O1K6J02o3J17j54j08J46O0r5m5K9Q6J8qJ16j11l04J55JR0p9J88l7Jj28
$$ -2 -139 -78 -52 50 -13 104 -50 -158 -12 48 -47 -92 -63 23 41 33 149 38 -266 -111 -110 -20 -99 89 52 53 -75
3267g5j14K22j22n3J69p8jR2N9k34LM4K5o3K13M3j57M4Jj24R5rk2P3K1k17K54
$$ -75 -189 33 -89 -142 27 -51 -52 40 99 -135 -132 -88 -63 -126 87 130 -27 17 18 -106 -11 -20 -42 31 52 -165 89
3294H9p7j01Q8RO9j40J23j55J85n7j61J09j08J56Rj56K12m6%kj02q7J19R6o9m3
$$ 89 12 -89 -1 8 77 -63 60 -95 90 33 -128 -19 -127 29 38 -118 94 48 48 46 -56 -143 -24 72 3 -40
3320d0J84j32jqkp0R1Q5r3k38J01j14J49K3j5J70j41L4k6Pm9J49o0j85J73P6o
$$ -40 144 12 11 3 1 -69 22 107 14 -224 -123 -237 -88 -65 -80 90 -51 -17 -43 -36 -85 64 4 -181 -8 68 62
3347F2M9j0J15r5j37j06J18o0R3o9J04l12L47m5m1l8p3J62p1Q1k24K34k07J90
$$ 62 111 101 216 121 -16 -122 -4 -64 29 -40 64 -248 99 54 13 -25 -98 64 -7 74 -150 84 -123 67
3371F7P0k26J54R9j42j64L08j70r2J95j8J47j60P3k33J32p2j8J23o1qK19Ll48
$$ 67 137 -89 65 164 22 -142 166 -4 -96 99 81 228 68 141 -92 40 -32 -50 73 12 4 223 226 -122
3395a22M0p0K23j2mq0J26L4m4k7j58K22Lj73P6L0J93m66J45K00k00L09j05j91
$$ -122 -82 -152 71 59 55 -25 101 135 91 64 -94 128 131 -42 34 64 257 -209 -64 136 -64 245 140 -51
3419e1R1J21j74J29q0mm9J06j46L4j08J61j2j5l9N6j3n0P0L9p5J02J2j58J75k5
$$ -51 40 161 -13 116 36 32 -17 89 -57 -23 -131 30 18 3 -36 20 7 -43 27 66 -9 93 105 -53 122 97
3445I7LL2k56Q3J79Rj12qo9j24J80l4n6m6J91p2J33N1q7k85R9m0J49J30j74L1
$$ 97 100 132 -124 -41 138 147 35 27 -42 -166 14 -20 -76 -122 69 -3 130 181 94 -191 -92 -132 17 147 -27 4
3471Do8O4k1o2m7J92j71L11j73q6J05o6K2P5j36O8R6j71P7Q2p1L0L9k20J98q3
$$ 4 -64 0 -21 -83 -130 62 -109 202 29 -57 48 -18 4 79 -57 11 107 -64 13 95 24 54 93 -127 71 -12
3497a2N4r4J25n0K9p5N2o4Q9j50J28Rk9P7k4j75M6J94k44n9R3Q7K00r8j91m2k
$$ -12 42 -52 73 23 52 -23 29 -35 54 -96 32 41 12 89 65 -110 -64 130 -114 -173 -80 7 207 109 -82 -124 -126
3524a26J85m3J4mk6l8K33l60K26M6l6k41J94q8K14n9q7m6j17J63Q1n6P9q3J45
$$ -126 59 16 30 26 0 -38 195 -165 61 107 71 -170 24 -64 150 91 4 -42 -159 4 85 29 108 25 170
3549A70l60K76r2o9j3K57k76K3O6J10N4k61K23Ok2L1j74J49j79J15R1O8k11r9
$$ 170 -190 86 -6 -75 -88 169 -107 -84 -18 92 146 -115 108 114 92 123 -51 98 -81 34 125 193 -18 -117
3573a17oK8J89P4j36j56J8N5M1R7k0j19J31J1j47LK15r8p8jm3L7J89Q5l11J58
$$ -117 -123 -95 94 168 32 -124 -106 -51 -10 87 67 -52 79 90 -57 -54 161 63 -15 -16 -59 -22 167 252 -59 99
3599I9k7J9k47o3L3P6L43k36J6l6k3J07j8j72r4L18j30n7Q9Q0l8K4l0q2j08K41
$$ 99 72 91 -156 -219 -186 -110 233 -3 13 -23 -46 61 43 -129 -223 95 -35 -92 -3 77 39 63 33 -49 -157 84
3625H4J09j56P6q9m8L9M4l9P4k83rJ77nlJ74j96J1R2p2K3o1O0L7o1q2Q2p1J19
$$ 84 193 37 113 24 -24 15 59 20 94 -189 -198 -21 -26 -29 145 -51 -40 52 -20 3 -58 2 39 -22 -104 -22 -93 26
3653B6K7j29J88j34Kk3J26o2J00r9Pj32J20J50j79M0j1o4K63l69K06Q7j96J12
$$ 26 53 -76 112 -22 -20 -43 83 21 121 22 29 -103 17 167 -12 28 17 -47 216 -153 53 140 -56 56
3677E6m2j26l3J53%j4J5L7K6q7k0N4j4n4J14j54L9M1r3O8J70o6o0JJ52l8j69J54
$$ 56 14 -112 -145 8 8 -6 9 46 72 -15 -35 19 5 -49 65 -89 -50 -9 -102 -34 136 70 10 11 163 125 -44 110
3705A10J6k24J55j35N2N4l4j4l4J5o3L1J01N9r2m2Q1n0j7n6N7O6M0j90J9J79j86
$$ 110 126 -98 57 -78 -26 28 -6 -20 -54 -39 -102 -71 30 89 -3 -45 36 -14 -31 -87 -30 36 76 -114 -95 84 -102
3732a02N9O6oK3P6r3mk33K86j55P0L6l8j3j67K59L4o5l0q9K37k16L2J62Q4L4k45
$$ -102 -43 23 17 40 116 23 19 -214 72 -83 -13 23 -15 -28 -195 64 98 33 3 -86 151 -65 -33 129 213 247 2
3759BL0k1n0R3q2o7M0Q1J86j96j13P4Q6J2J43l02J77j36J14j41q8J84J5n6l1l7
$$ 2 32 11 -39 54 -28 -95 -55 26 212 16 -97 -23 63 75 218 -84 93 -43 71 -70 -158 26 41 -15 -46 -83
3785h3%R4j6p2M8J5J46k07K08r9l08M26m33K74q6j8J03N5j27K18j57O7Q2j53J70
$$ -83 -83 11 -5 -77 -29 -14 132 -75 133 34 -274 152 -281 -7 -93 -111 -8 47 -80 138 -19 48 130 -23 147
3810A47m7l9R3k30K37j88l4R0Pj99J71l6jK58n2j54j06k2L50k23j29J61j22J56
$$ 147 100 61 154 -76 161 -27 -61 29 36 -163 8 -28 -29 229 177 23 -83 -105 245 22 -107 54 -68 88
3834H8r4j14k0J42J28j76J17m5j2J45r3j99N8K55k61J98o5l2q0M2k1j53J99K0
$$ 88 -6 -120 -140 2 130 -46 71 26 14 159 66 -133 -75 180 -81 117 52 20 -60 -18 -39 -192 7 27
3858B7R3j51L9N3J8N7lk88L07O3j61o6J23l68J12J48P5j27J44mj31l3K28k14M5
$$ 27 120 -31 8 61 79 136 133 -155 152 215 54 -12 111 -257 -145 3 78 -49 95 91 -40 -73 155 -59 -14
3883a4K8R2n3j84O5J41Qmj63P0l6lJ54j23qR5lK0k43K24o2L0N2k50NK15O1j40
$$ -14 14 106 53 -131 -66 75 83 79 -84 -14 -50 -53 101 -22 -30 65 62 82 -161 63 1 31 83 -167 -162 53 114 -26
3911b6j32j36M62k67O8K4J27L7L2r8j43K30q6j28O4j17J16J57j73q1KqM5K7P0
$$ -26 -158 -294 168 -99 -31 -7 120 157 189 91 -52 178 92 -36 28 -89 27 184 11 -70 -68 -76 -31 -4 66
3936F6k7r8L89k58L2k08N6J09k48J82J2K7p1J07O6j25l6n7Q1OM7l6j93J37P5P0
$$ 66 39 -59 330 72 104 -104 -48 61 -187 -5 7 34 -37 70 136 11 -25 -82 -1 5 52 16 -177 -40 35 105
3962A05m9o1k5KK7j64J04J4J08j42m0K36n4r1N3O8j77J37Q5k08K19j46p0J84q5
$$ 105 56 -5 -30 -28 -1 -165 -61 -47 61 -81 -121 115 61 -30 23 91 -86 51 136 -72 147 1 -69 115 30
3987C0q2q3J34r5O4L1k8L3j32M2oRJ39j3k6Oj4O0k92J97r1J24J07k06J36P8r1
$$ 30 -52 -135 -1 -96 -32 -1 -29 4 -128 -86 -92 -83 56 43 17 23 9 69 -223 -26 -117 7 114 -92 44 122 31
4014C1j02j42J34J99l0j35J53L6j94n0N5k28J96J87k73J37J74O5j39j51N5K0P8
$$ 31 -71 -213 -79 120 90 -45 108 144 -50 -100 -45 -273 -77 110 -163 -26 148 213 74 -77 -22 -2 76
4037G6pO7l2Jj68P9o6K42j56K5J52k59m8M0J57j84RR3J14j19J7M0k4k8%o4n6J15
$$ 76 69 136 104 105 -63 16 -50 192 36 61 213 -46 -94 -54 103 -81 -72 21 135 16 33 73 49 21 21 -43 -99 16
4065A6l7j0p1K48r3j08P0K3j2L7R5j92J79j90lN9j10J03%M1j63j75L96n3j17O4
$$ 16 -21 -31 -102 146 53 -55 15 38 26 63 158 -34 145 -45 -48 11 -99 4 4 45 -118 -293 103 50 -67 -3
4091cm5J98rj60j3J71p8m8m3L1K0m3oo7m9K07N4l9j79J38nj1l3K7p2p8o5K45J9
$$ -3 -48 150 141 -19 -32 139 61 13 -30 1 21 -22 -28 -95 -144 63 117 78 -101 37 32 21 -12 15 -57 -135 -200 45 64
4120F4j7J5O6L8k85K05j74Q6JJ60r5j77J40j11o8K39j39m1P4K00K5l41M6k3K12
$$ 64 47 62 128 166 -119 86 -88 -2 -1 159 64 -113 27 -84 -152 87 -52 -93 -19 181 206 -135 -89 -112 100
4145A00J7k24J17J06n9j06M5pj22K89k85K01L2j36J82k96J12N1l8J9k6P2j31J42
$$ 100 117 -107 10 116 57 -49 -4 -11 -133 156 -129 72 104 -32 150 -146 -34 17 -21 -2 -28 44 -87 55
4169E5J60j46j9mm8m4R7j16N4l2L6K41j32j81J10o3j6J69k70QQ9J69k11J58Nk
$$ 55 215 69 50 46 -2 -46 51 -65 -11 -43 -7 234 102 -79 31 -32 -48 121 -149 -141 -52 117 -94 64 69 67
4195F7j10O1p9q5J63k8J67p6j48p5J41Mp9k0O3l4PJ72m6R4j26j13J56r1l8L1q4
$$ 67 -43 18 -61 -146 17 -11 156 80 -68 -143 -2 2 -77 -97 -34 -68 -61 111 65 159 33 -80 76 -15 -53 -22 -106
4222a06Q3l1p7J08P7M4j70M0q6J0K8J06k14J79n7n0J71P8j82R8k8p1J78k53J79
$$ -106 -23 -54 -131 -23 54 98 -72 -32 -118 -108 -80 26 -188 -9 -66 -116 55 133 -49 49 21 -50 128 -125 54
4247E4J2j16L3J16L1j70K59j64j00J36k8j03m5K83j05j92J18k12J62J11j07j5
$$ 54 66 -50 -17 99 130 -40 219 55 -45 91 63 -40 -85 198 93 -99 19 -193 -31 80 -27 -42
4269d2j9Q9K6j56J24j20K23o5j85P6j04J45J88k37J20qJ08j18M5rj70L12j03l1
$$ -42 -61 28 54 -102 22 -98 125 60 -125 -49 -153 -8 180 -57 63 55 163 45 90 81 -89 223 120 89
4293H9j60j21K22j03j1N7j36K01j09J11j01j22K05lM3q6J88k83J25J82k96J2J21
$$ 89 -71 -192 30 -73 -84 -27 -163 38 -71 40 -61 -183 22 19 62 -24 164 -119 6 188 -108 -96 25
4316B5m6K23j09O7k76O7J25k31K65p2j98K36m4o4mO1J45j17j98j6N7P7P8m7M1
$$ 25 -21 202 93 160 -116 -49 76 -155 110 38 -160 76 32 -32 -36 25 170 53 -145 -161 -104 -27 51 4 45
4341D5j93J01k9Q4K5rr5J3%j34R2R2N7o0m7P2NO1O9j43j52J16q6k0MkJ29L3K0
$$ 45 -148 -47 -76 8 33 24 -71 -58 -58 -192 -100 -8 49 -11 -58 14 19 80 149 6 -146 -30 -116 -136 -132 -134 -5 28 48
4370D8r3J27j83R2o9J22k09m0R6R5rN9k3J00k01Q4J36L1k40KK43k30R8O7q5j82
$$ 48 -45 82 -101 -9 -78 44 -165 -205 -109 -14 -23 36 13 113 -88 -4 132 163 -77 -75 168 -62 36 103 18 -164
4396a64K86j27j93K22K1j19MJ43j70P7j0J04n0k3K4r4j21J16jJ19m2k4K33l79
$$ -164 122 -5 -198 24 45 -74 -70 73 -97 -20 -30 74 24 1 25 -69 -190 -74 -75 44 2 -22 211 -168
4420a68K68j37J55k00r2L33k33p4J86j79K12j44O0j06N7M0j59J07L5J08j32N2
$$ -168 100 -37 118 -82 -174 159 -74 -148 38 -141 71 -73 -13 -119 -62 -22 -181 -74 -39 69 -63 -11
4442a1J14m6m0k1Q8j1k82L01j26P6j3l1Q0j78J04k0l0L5J2q7K93k46p2J22j14
$$ -11 103 57 17 -4 84 73 -209 92 -34 42 29 -2 78 -100 4 -16 -46 -11 1 -86 207 -39 -111 11 -103
4467a03J39p6J12L9j42N2J3l3l7J16j50R5J83k46K3P1K5r7M5j5n6R1J6o1l7ML3
$$ -103 36 -40 72 111 -31 21 34 1 -36 80 -70 25 208 -38 -15 56 81 -16 29 14 -42 49 65 4 -33 -29 4
4494Dp6P4r6J41m0j22%J86k45K49j30LM4P9j27j09R3N2j38O6L17j41K9o4p2J42
$$ 4 -72 2 -94 47 7 -115 -115 71 -174 75 -55 -52 -8 71 -56 -165 -72 -20 -158 -92 225 84 113 49 -23 119
4520A19Q5k13J06j25P8j79Q5J17R2K9p0j92q9M33k96J9j35J14O2k03J05MK36j63
$$ 119 204 -9 97 -28 50 -129 -44 73 165 194 124 -68 -157 276 -20 -1 -136 -22 40 -163 -58 -54 182 19
4544A9k20O1N6L65k65J9j99J39O9q1j6j46K52J51qj5k19K20j86J6j05M3J6K1O2
$$ 19 -201 -140 -84 281 16 35 -164 -25 44 -37 -53 -199 53 204 196 181 -38 182 -4 12 -93 -50 -34 -13 49
4569D9j49j3J04J06L9j60J00Kj4j31M0n5M5PK3J30r0Q0j25m8J04M7k63K43k9N2
$$ 49 -100 -113 -9 97 136 -24 76 78 64 -67 -27 -82 -37 -30 -7 123 33 113 -12 -60 44 91 -172 71 42 94
4595I4K1m4Ok11K47q7K1j50kJ78m37L62j3J32pl2m8j6Kl3J1n7J61j07m1J76j86
$$ 94 115 71 77 -134 113 26 47 -103 -105 73 -364 -2 -15 117 110 78 30 14 16 -17 -6 -63 98 -9 -50 126 -60
4622f0M1r3J41k08K17M2j76J04j13J74m0J16j29q0o9J91M8n9j48J35J64k51l7
$$ -60 -19 -112 29 -179 38 80 -96 8 -105 69 29 145 16 -64 -133 58 106 47 -101 34 198 -53 -90
4645i0Q1n7J55k06N3N0M6r4P8j29O0l8M4j59J15J24K8o3MJ01j00rL8Qj54J50Q1
$$ -90 -9 -66 89 -117 -64 -14 32 -62 16 -113 -53 -91 -47 -206 -91 33 61 -2 2 103 3 -6 32 40 -114 36 117
4672A17j17oq6j8M7K1p7j2K94j43o4L6J97j76o0Q0J38j37Jj69J89j52R7Q4r4J98
$$ 117 0 -6 -92 -110 -63 -42 -119 -131 163 20 -44 -8 189 13 -47 33 171 34 35 -134 55 -97 0 84 -10 188
4698A88l9k01M5jO0J20q3j62J62P8j71m0j6MQ6L9k0j08k2J93n4J02k76K28n4j56
$$ 188 149 -52 -7 -8 52 172 89 -73 89 167 -4 -44 -60 -56 30 69 49 -59 -81 112 58 160 -116 112 58 -98
4724i8J38kQ2j10%J29m00L56k6k25j3L2N3J30j17N9Kj09J17k35J76K27j31q1J5
$$ -98 40 38 120 10 10 139 -261 95 69 -156 -169 -137 -84 46 -71 -12 -10 -119 -2 -237 -61 166 35 -46 -31
4749c1q6K86k40N8P5m2J06j99J14j52L1K30j54L4l2jL5k17K03L1j26M6k44J81
$$ -31 -117 169 -71 -13 62 20 126 -73 41 -111 -80 150 -4 30 -2 -3 32 -185 18 49 -77 -31 -275 -94
4773i4J90j5j07j33J37J79k82J21L8rO8j93N4J51j75j3P0q5J67k6k6k6n3K32l4
$$ -94 96 81 -26 -159 -22 157 -125 -4 34 25 93 -100 -46 105 -70 -83 -13 -98 69 43 17 -9 -62 170 136
4798A36l8j51p6K35j35M1P5j63J73QJ29l31j7L43k02%J3j48J84p4J2p3J01j30
$$ 136 98 -53 -129 106 -29 12 87 -76 97 105 234 -97 -114 229 27 27 40 -108 76 2 14 -59 42 -88
4822h8J39j14N9N8J22j49k04J52P2j30K2J13j91L66m7j83M7R4q2j06M5J03j70
$$ -88 51 -63 -4 54 176 27 -177 -25 47 -83 -61 52 -139 227 180 -3 44 138 56 -50 -5 98 -72
4845g2j56K83l3J78k63J38k07J00L2k8N7k66J01K33m1l50L49k01J04J67k02Q9
$$ -72 -228 55 22 200 -63 75 -132 -32 0 -28 29 -237 -136 97 56 -294 55 -146 -42 125 -77 12
4867A2p3P4n1j01J58Lj47P2o8J55J04l61K33L6r8O8%k16J56O1j49M2J40J68k4
$$ 12 -61 13 -38 -139 19 22 -125 -53 -121 34 138 -223 10 46 -52 16 16 -200 -44 17 -132 -90 50 218 194
4892A94j44j25j06J27JJ36p7p0K71j95%j0R6n5j11o3J59j5j7P7q1M2mj06K5O3
$$ 194 50 -75 -181 -54 -53 83 6 -64 207 12 12 2 98 43 -68 -131 28 13 -4 73 -8 34 30 -76 -51 12
4918A2J20k11J58j28M5j38J88K5r8K7pk5J79p2J3o2J16Q4l04J55l9Q8j20j00J88
$$ 12 132 -79 79 -49 -4 -142 46 71 -27 0 -7 -32 147 75 88 26 142 226 -78 77 38 126 6 -94 94
4943I4j73J90L5j87N1j02K62j37k8Q0R6k06M1J05q4k6k9L8K24k82J80j80j52K95
$$ 94 -79 111 146 -41 10 -92 170 33 5 85 181 -25 16 121 37 11 -18 20 244 -38 142 -38 -190 105
4967A05L3j23J7J1j8qO1k6k0M1Nk34J77Mo0NQ2j27R9r7J46j1j71L7J97J2j01J12
$$ 105 138 15 32 43 25 17 78 52 32 73 78 -156 21 25 -35 -30 52 -75 24 -73 73 62 -109 -72 125 137 36 148
4995A48j99J51j9J1p9l3K4N6J46p0n9j81J67j29j44K71l6L1J08J1k80J13o1j3
$$ 148 -51 100 81 92 13 -20 4 60 206 136 77 -104 63 -66 -210 61 25 56 164 175 -105 8 -53 -66
5019f6Q1L7j30J92p2j4j23K26j77P0j17n3M4J68k34J51R9K7r4j0k0O6j69J46o
$$ -66 15 52 -78 114 42 28 -95 131 -46 24 -93 -146 -102 66 -168 -17 82 109 15 5 -15 51 -118 28 22
5044B2q0K06l73L23j83N4l4N2M4k4J33r1J11j23L6l6r4M7k0J17o3j19J82j58L5
$$ 22 -58 148 -225 98 -85 -31 -65 -13 31 7 140 49 160 37 73 37 -57 -10 -30 87 24 -95 87 -71 -36
5069c6nL3j19K71j17k1O7q9R4j31J10Nj21J92oLK5l8k72K13k18K05k1K7J3N8j45
$$ -36 -41 -8 -127 144 27 6 73 -16 78 -53 57 62 -59 133 127 130 155 117 -155 58 -160 45 24 51 64 122 -23
5096b3m7J6P4j11R9J76j12k02J06N2j0Op6J03n0K03l30J54k17J22J3O4J51r6j0
$$ -23 -70 -54 20 -91 8 184 72 -130 -24 28 18 24 -52 51 1 204 -126 28 -189 -67 -54 10 161 65 55
5121E5N9k10K25j13j21K4J17j34J7O1J68k08NN1j31J60j30P2P2j57J1k2m7L09
$$ 55 114 -96 129 16 -105 -81 36 -98 -81 -20 148 -60 -55 -4 -135 25 -105 -33 39 -118 -107 -129 -176 133
5145A33n5k62OK23J31k85M0o8J04J83j52N1q0Q0M5o8n7J28m2j79J73nJONK2j61
$$ 133 78 -184 -178 45 176 -109 -69 -137 -33 150 -2 49 -31 49 94 26 -31 97 55 -124 49 44 45 51 56 78 -83
5172h3K60j12j96j7R9l0J57j82PQ7J10j09j37J35J19q9L7R5j87J41j24J60j5k57
$$ -83 177 65 -131 -148 -49 -79 78 -104 -97 -10 100 -9 -146 -11 108 19 56 151 -36 105 -19 141 126 -131
5196a31J1J35j05R9J1k18L19j26m6lQ8m7ko8K48k28J68J72k06k0M9j39J6Q8J5
$$ -131 -120 15 -90 9 20 -198 121 -5 -51 -54 34 -13 -15 -83 165 -63 105 277 71 51 100 -39 -23 65 80
5221H0j63J65j25NP9j23P6O0j05N7Pm7R6j50n8J19J68l8n8q2j5M6j6K2k07J86
$$ 80 -83 82 -43 -38 41 -82 -6 54 -51 6 13 -34 62 -88 -146 -27 141 103 45 -37 -52 -6 -22 0 -207 -21
5247b1J80j82N7j04p2J58o3q8J51k37L08k1j45kk5J00j57R7J58k03K67k62J56
$$ -21 159 -23 34 -70 -142 16 -47 -135 16 -221 87 66 -79 -81 -106 -6 -163 -66 92 -111 156 -106 50
5270E0L2q1Q0k09l6J85Q0j53R0m2k6j65J51l1K15p3j44J69n4PkJ7k47P9K6R5j68
$$ 50 82 1 81 -128 -164 21 101 -52 38 -4 -30 -195 -44 -75 140 67 -77 92 38 45 43 60 -187 -108 -82 13 -155
5297a55J81m6l8L3K2M7J35j02k09J46M4j69K2K27j33K6q1K8q4J36L5n3m2o6R5
$$ -155 26 -20 -58 -25 -3 44 179 77 -132 14 58 -111 -89 138 5 31 -50 -22 -106 30 65 12 -30 -96 -1
5322aL2j7p9P9k29O6K25o5J04j6j01K68l75RO6K5p4K4k4L2J47r9J5NJ59j00N0
$$ -1 31 14 -65 14 -215 -149 76 11 115 99 -2 266 -109 -100 -34 -9 -83 -59 -83 -51 96 -3 12 17 176 76 126
5349A26q2K4P7j77k8L63j82o1o5K21k64q4J3Q4O6Jk04K02J19k06J00p4o4O1N5
$$ 126 44 68 145 -32 -60 303 121 60 -5 216 -48 -132 -119 -35 31 32 -172 30 149 -57 43 -31 -95 -34 21
5374B1n6K41j69K9j77J55K7j88P4L05l85K78j47j18K03j72M7M3j46j18K54NJ03
$$ 21 -35 206 37 66 -111 44 71 -117 -43 262 -123 155 8 -110 93 -79 -32 11 -135 -253 1 6 109
5397A09j09jp3M1J41k04K22j90J24P2j58N2o7r5L5J65%m3om0q4K17J12l15K36
$$ 109 0 -1 -74 -33 108 -96 126 -64 60 132 -26 26 -41 -136 -101 64 64 21 15 -25 -109 108 220 -95 141
5422A41n9O9j05J2n8M5j23J86j21Q1o6J30q8Rn6k7j63R6L55m88K24N0q7J9K14
$$ 141 82 151 46 58 0 45 -78 108 -13 68 2 132 44 53 -3 -30 -193 -97 258 -230 -6 44 -43 -24 190
5447A90j99nk2J6KJ4N2m0j62J99k5o8J92j35L0j00R6O7j83K1Q4j3J8r9J99j35
$$ 190 -9 -14 -36 -20 -18 -4 48 8 -154 45 20 -48 144 9 39 -61 35 102 -81 -60 24 11 29 -70 129 -6
5473fLJ04j88M4J04K3l1M5k82J81m8K23j75J02j24J06J37j34M0m4L6l47K07MJ1
$$ -6 -3 101 -87 -43 61 84 53 98 -184 -3 -51 172 -3 99 -25 81 218 84 124 80 116 -231 -24 -20 -9
5498iL0P0k51K04r8j22J85j44Q9K4L2j40J83J07j63lP6L2qq6Q4jpm7j3l4KO2P
$$ -9 21 91 -160 44 -54 -176 9 -135 -46 -22 10 -130 53 160 -3 -6 70 102 94 8 92 91 84 37 24 -10 -8 54 61
5527F1j12K16j87mL9j48K33J2j42O8j7j54J60M9j7P1l02J29Mk7P8k1j4o2L2O4
$$ 61 -51 165 -22 -26 13 -135 98 110 -32 36 19 -135 25 74 57 128 -174 -45 -41 -68 10 -11 -25 -87 -55 9
5553Ik9j51n0K56q9O8j12JJ38j03r4J36J12p8l1m0N4r9L4J28j9N8j35J00J7J33
$$ 9 -20 -171 -221 35 -54 14 -98 -97 41 -62 -156 -20 92 14 -17 -57 -3 -102 -68 60 41 99 -36 64 81 214
5579B14l30J20M0j41j17Q7qJ23M3op5J66L1k55r1J66K91l83J44J8j59R6J51j81
$$ 214 -116 4 44 -97 -214 -127 -135 -12 31 25 -50 116 147 -108 -199 -33 258 -125 19 37 -122 -26 125 -56
5603e6J1O9o3N3n9Q0R4j89J6l9J56kj18p0J51J5K1j19J60Nj19O1MJ22k66O3Q3
$$ -56 -45 24 -39 14 -45 35 129 -60 -44 -83 73 71 -47 -117 34 49 70 -49 111 116 -3 58 62 184 -82 -19 64
5630F4m2k5o7J9j26L01k91Q0O3J25q8M7P1k39J20j61J28J30p2k55K91k43J55Q1
$$ 64 22 -3 -70 -51 -177 124 -167 -87 -24 101 13 60 131 -108 12 -149 -21 109 37 -218 73 -170 -15 66
5654F6j67p4L91K01k11k13M4n2O1j8p5Q0j77K41n5M9j59j5J00m6pp3K83o3k8j50
$$ 66 -101 -175 216 417 206 -7 37 -15 46 28 -47 33 -144 97 42 91 -68 -83 17 -29 -36 -109 174 111 83 -67
5680f7J78r8k10J83J76k34R0q0Q7k9J21o7j12m0j0j05K24O3q1J19j10R3p0J04
$$ -67 111 13 -197 -14 162 -72 18 -62 25 -4 117 50 -62 -102 -112 -217 7 70 -11 108 -2 91 21 125
5704A25j64j09J96j50L8J75m0l0n0J40k5j00N9oo0R0Qo0J0k69J71J11j34o8K42
$$ 125 -39 -148 48 -102 -64 111 71 41 -9 131 106 6 65 59 -1 89 97 37 47 -222 -51 60 -74 -142 100
5729A00k8j28J17j2N7j59J00q9p1J33p0o3J48m8K27p7j15j16L8J2j01k6m5J46
$$ 100 72 -56 61 49 106 -53 47 -42 -113 20 -50 -113 35 -13 214 137 22 -94 -56 -44 -145 -171 -216 -70
5753g0M8K27k79q0J51N2k79K29J38k26K56r9n0K09k33o2J29O1j16Jq6J74k34J06
$$ -70 -22 205 -74 -154 -3 49 -230 -1 137 -89 167 68 18 227 -6 -68 61 122 6 7 -79 95 -139 -33
5777c3n9K20j21mj73L10l2j42K28j57j4M4k53N4J66j6o3J44j83l2K09kK7k25J53
$$ -33 -92 128 7 3 -170 140 108 -34 194 37 23 67 -186 -132 34 18 -45 99 -84 -116 93 91 118 -107 46
5802D6k6J39j53M5K3k30K26k07l7P5K14r5j49J89P1k1o7J8p9K02k08Q3j39K7K02
$$ 46 20 159 6 51 74 -156 70 -137 -174 -99 115 20 -129 60 131 110 43 61 -18 184 -24 59 -80 -53 149
5827A49j34j2j49K67k59N5j40K71rJ26j40J5RJ14j74J47q7J21p5n6j36p7Q4M4
$$ 149 15 3 -146 121 -138 -83 -223 48 39 165 25 40 49 163 -11 136 49 170 95 39 -97 -174 -90 -46
5851d6R5j68J80L8rj6J0n7J45j72r3o4K50m2Rj05J62k47J36P6q5J31l70L64j67
$$ -46 49 -119 61 99 90 74 84 27 172 0 -93 -157 93 51 60 -45 117 -130 6 82 -3 128 -242 122 -45
5876d5O0q9nO1J49j75K3n2J28L1j86J41r6J13n3j03L19k99j1J12J17k38K04k68
$$ -45 15 -74 -79 -18 131 -44 -21 -73 55 86 -100 41 -55 58 5 -98 221 -78 -89 23 140 -98 106 -162
5900a62J25ok8L8R6k4j11K9L6m0j03J87Q1k46J83N2k29L6p0L29k62Q3J96k2j47
$$ -162 -37 -43 -71 -33 63 39 -72 -43 -7 -47 -150 37 118 -128 55 107 -122 -86 -156 173 -89 -6 190 168 21
5925B1M6r9J89l2j43K64k91K67j79q9oJ05pk0n1L0J76j85k20J32j2l6J85l4j38
$$ 21 67 -32 157 125 -18 246 -45 222 43 -46 -52 53 46 26 -25 5 181 -4 -224 -92 -104 -140 45 11 -127
5950a27N2J5J18J27j95R0O9q8J0l0K4k30K87Pj69N4N5p8K11j68k8mM8L8q4J4n1
$$ -127 -75 -60 58 185 -10 80 149 61 71 41 65 -165 122 129 -40 14 69 -9 202 34 6 2 50 88 4 18 -33
5977c3R5q5n4k6J38J09k37O1J65k00J21n0J16k07N3m6j8N5KN0j04K37p4j48Q1
$$ -33 62 -23 -77 -103 35 144 -93 -32 133 -67 54 4 120 -87 -34 -80 -98 -43 -41 9 -95 142 68 -80 1
6002Aj74K04Lr4J07r8J8K20j49j8j3j48J81k9K1j77K22l5J5M6o7n3L0jM9Qj79
$$ 1 -173 31 34 -60 47 -51 -33 187 38 20 7 -141 40 11 32 -145 77 42 57 103 36 -17 13 12 61 69 -110
6029a10K81k35j7j4K57j26j23J43J07k37KJ58j58P0pn2N3J93j85Lm2K77k17k6
$$ -110 171 -64 -81 -95 162 36 -87 56 163 -74 -72 86 -72 -2 -9 -61 -8 185 0 3 -39 238 21 -5
6053epO0n6J4q5R2q4O6k50K02j0J58j7j0k10O8R7j05P5j9r9Q9J78j49m6q7O8j06
$$ -5 -12 48 -8 6 -79 13 -71 -5 -255 -53 -63 95 78 68 -142 -74 23 -82 -7 -26 -125 -36 142 -7 -53 -140 -72 -178
6081a78J22J34Pj28pr8N2K02J5j10Jj7k9j17J00J05r1j2J09m8K0o7JN0M3q2O1
$$ -178 -56 78 85 -43 -50 -148 -96 106 121 11 12 -5 -34 -151 -51 54 -37 -49 60 12 32 -35 -34 16 59 -23 38
6108C8j04NL7J57r0j24J54J7j34J09J74k24K8ML2l5Jr0J09j29KP5R0Mq5P2j34
$$ 38 -66 -61 -24 133 43 -81 73 90 -44 65 239 15 43 47 79 44 45 -45 64 -65 -63 12 102 106 21 93 -41
6135d1J1mJ26j90J94j91r2K66l5q9N8Jj21J96O8j20l8n2J12J6j13k3P6N5r7P6
$$ -41 -30 -34 92 -98 96 -95 -187 79 44 -45 13 14 -107 89 157 37 -1 -53 59 75 -38 -61 15 70 -27 49
6161D9j19PK50k82N0J81m9j40J25L5k14J88j29J48j37l4k6l9K45j2q1n4J90q1
$$ 49 -70 -63 187 -95 -45 136 87 -53 72 107 -107 81 -48 100 -37 -71 -97 -136 109 97 16 -38 152 71
6185G1L5k79J05NO5k8L3j33J23j4n7Q2m8J39m6j16J62p8J03n7j01O3K3j20k3J97
$$ 71 106 -173 -68 -63 2 -26 7 -126 -3 -17 -74 8 -40 99 53 -63 99 21 124 67 -34 29 52 -68 -91 106
6211A06r7M3m0L9j54J40j56l8N5J3K6J20r8m1j14J61J78l15N1P9J82l1j00K9r0
$$ 106 9 52 12 51 -103 37 -119 -157 -102 -89 -63 57 -41 -82 -196 -35 143 -172 -121 -42 140 109 9 38 -52
6236e2J40q2o7K22m8j34J26j34O4M9j13P9n2k2j11Q2M9N9M0J49k97n7K2L13j48
$$ -52 88 6 -61 161 113 -21 105 -29 35 84 -29 50 -2 -24 -135 -53 -4 55 95 244 -53 -110 -88 225 77
6261G7p1MJ0L2j03P4o3p3l0%K43j09K06o1K5M1n0m9L7k84o7K9K22J7p0j7j06K19
$$ 77 6 10 20 52 -51 23 -40 -113 -143 -143 100 -9 197 136 161 202 152 103 140 -144 -211 -182 40 57 -13 -30 -136 83
6289H3p0k7R6R7l19R5J89r2kk6R4k17K73j5j88Q9l6k23J84J08j23j51K72j22j38
$$ 83 13 -14 82 179 -140 -45 144 52 50 24 118 -99 174 159 -29 60 24 -199 -15 93 -30 -181 91 -31 -169
6314a69J21%r7m0Q2K21j94L4M1J00j99O6j61J42J52j2l17L08j69lJ88K4k01L4
$$ -169 -48 -48 -145 -185 -103 118 -76 -42 -1 99 -100 -34 -195 -53 99 87 -230 78 -91 -94 94 118 -83 -49
6338d9l7J75J36l33R4k49K93n5o9Q4K35r8j48L5K6N3p0j03J37Po0K30q8k90OM3
$$ -49 -86 89 225 -108 -14 -263 30 -25 -94 -10 225 127 -21 14 40 93 23 -80 57 64 4 234 146 -144 -138 -95
6364i5K06r7L0k24J86K7n3P4l6j69J78j93J21J26j25r9N8P0j33J40J27r6J18j51
$$ -95 111 14 44 -180 6 33 -20 54 18 -151 27 -166 -45 81 -44 -143 -85 -15 -148 -8 119 23 141 -10
6388a0j2J68l34N2J88R8q4O0k15J14k6j20j73L49m2j8J64j41J14j55J1N9r6K73
$$ -10 -22 146 -188 -136 52 150 66 126 -89 25 -1 -121 -294 55 13 -5 159 18 132 -23 -12 47 -49 224
6412B24j47K6l36J50J69j53Q1P4j60k1N9Q1j03O2N1j25N4M4J65k50M3N2N0m9m5
$$ 224 77 103 -233 -83 86 -67 14 88 -72 -93 -34 47 -56 6 57 -68 -14 30 195 -55 -12 40 90 41 -4
6437dq8P8KJ03k6j12mj1J44k8m6J45k49J60K0Q0j01j76O8O5Q1j03J5j25J40j57
$$ -4 -92 -14 -12 91 65 -47 -51 -62 82 54 8 153 -96 64 84 164 63 -113 -45 20 101 -2 13 -112 28 -129
6463a29J66k71K84O8j62o9n9J81M2j16N6j49L71k68Q1k3k4j43K6J90j06R4L3j33
$$ -129 37 -234 50 118 -44 -113 -172 9 51 -65 -9 -158 213 -55 26 3 -21 -164 -138 52 -54 40 73 -60
6487f0O5m8J8J07j88J27K01k57O7j23K97k77K45j16k4l8P5q1j43JJ68Q8j72J6
$$ -60 5 -43 -25 82 -106 21 222 -35 32 -91 206 -71 174 58 34 -4 71 -10 -153 -152 16 104 -68 -52
6511e2J35N1j83O5L8M20n21j22J30L4M0n8N5J56k25K9L8Kp6J3KJ5P4j46K1R9L6
$$ -52 83 134 -49 16 54 474 -47 -169 -39 -5 35 -23 32 188 -37 -8 30 32 -44 -31 -29 -14 60 -86 -65 34 70
6538G0kp4L4l3J13l9o0K2j15N5O4M5r7On2K09k52J45n1J32J3k55J75r8q3K56P9
$$ 70 68 -6 28 -5 108 69 9 31 -84 -29 35 80 -17 -11 -63 146 -106 39 -12 120 133 -122 53 -45 -128 128 207
6565B07r7N4r1k19M1nJ69n7o3n1O2J79p6n0O5k27K34j31J66j68m3K01j83N2J6
$$ 207 110 164 73 -146 -105 -110 59 2 -61 -112 -50 129 53 3 68 -159 75 -56 110 -58 -101 100 -83 -31 -15
6590a5Q1P0k22nJ39n7J53j40M7k3mJ2l2P3o7q3J07J13j68l4J53l4k35J13J32j68
$$ -15 66 136 -86 -91 48 -9 144 4 51 28 24 36 4 77 10 -73 34 147 -21 -55 98 64 -171 -58 74 -94
6616i4J63k02O2J72L5j17n3J0q0J5p8L8K37qK9j01M7J6j9k62K39J41p5j06J34
$$ -94 69 -133 -71 101 136 19 -34 -24 -104 -89 -167 -129 108 100 129 28 75 91 72 -190 49 190 115 9 143
6641A43K4l30K74k78O7R6J28k01J02M1p2R5K8j09j74R0J38j57oJ30M3p3l4j24
$$ 143 167 -163 111 -167 -100 -4 124 -77 25 66 -6 89 117 8 -166 -76 62 -95 -101 29 72 -1 -35 -159
6665a59K31j70J49j17j7J49j13O1J27P5k01rj58J21j8J40l26J51O1O6j77Q7J85
$$ -159 72 -98 51 -66 -83 66 -47 14 141 216 15 6 -152 -31 -49 91 -235 -84 -23 43 -134 -47 138
6688A38k63K2j0j6M2N3l3o7J02j08J16Pk6j20J43m5J02J73j70M7N2j36k9r4K29
$$ 138 -125 -103 -113 -129 -87 -34 -67 -134 -32 -140 -24 -17 -43 -163 -20 -65 37 210 40 87 139 3 -26 -120 109
6713A09M0j41J7j6M7l9J00j52K28k32l3J51j63M2R7rj96K11R8j86M1r6r0K61p9
$$ 109 149 8 25 9 56 17 117 -35 193 -39 -72 79 -84 -42 55 46 -150 61 159 -27 14 -82 -172 89 10
6738A0j23K52L7j68j40J85j07K1J42L4j57j5J70j02K8rj27J25l3M7j49J9L08k70
$$ 10 -113 139 176 8 -132 53 -54 -33 109 143 -14 -29 141 39 67 58 -69 56 23 70 -79 -60 248 -22
6762b2ll1J75J3o1N3q7mk5m1J54l4j65nJ02N5J10j83M1j61K06m0k0j6O6o8J4j4
$$ -22 -25 -56 119 132 71 124 37 33 8 -33 121 87 -78 -83 19 74 184 1 42 -119 87 47 27 11 77 9 23 9
6790IJ16j73M9k0J01j36m0J14k9j56R9J16k1q0P7L6j06K72k07N8j92Q5j94L22
$$ 9 125 -48 1 -19 82 -54 -94 20 -9 -165 -66 50 29 -51 26 62 -44 228 21 79 -113 -28 -222 100
6814A00o0k8m8J29J00k76J57l0n5j37J38M5Rp0J39j19k4J8O2j04J63j28q5J03
$$ 100 40 12 -36 93 193 -83 74 44 -11 -148 -10 35 44 -26 113 -6 -30 -12 50 -54 109 -19 -104 -1
6838ar5J39J57j44j29O6Q3o2no6M4K6J41l1j24P7J05j63j44K84r2j79lK81j36
$$ -1 -96 43 200 56 -73 -7 76 14 9 -57 -13 13 154 123 -1 76 181 18 -126 158 66 -113 -116 165 29
6863B9Q6o8k9j05M7O6l9J48Nk24J37m3j92L00j30p2J80j50P6P4n9L2O4j41Mj44
$$ 29 115 47 18 -87 -40 26 -13 135 140 -84 53 10 -182 118 -12 -84 96 -54 22 96 37 69 133 -8 -4 -148
6889a48J74n3j65o2L20n3j4N6Q7q7k13K38p2jr1j8K08j32j31J44j48Q7J45J23
$$ -148 26 -27 -192 -254 66 13 -1 55 142 55 -158 80 8 7 -84 -102 106 -26 -157 -13 -161 -74 71 194
6913A94k36J2k3J8J66o9j57j6J45O6J7j87N2J6j09J34p2J38j89K92k43J6r3J01
$$ 194 -42 -30 -53 -35 131 62 -95 -111 34 100 117 -70 -18 -2 -111 23 -49 89 -100 192 -51 -35 -128 -27
6937b7M4J0R3j73N0LK1M9J42j77l1R5L0M4j51k23L02l7K4n3l0o1J3p4J6J02j81
$$ -27 17 27 120 -53 -3 0 21 70 212 35 4 99 129 173 22 -201 101 64 88 35 5 -56 -43 -117 -101 1 -180
6964a80J65p3O8J57k08j7o6J08m5J58j03M3J08j27l8P6rn3J15j19j0J35j02l2
$$ -180 -15 -88 -20 137 -71 -88 -154 -46 -91 67 -36 7 115 -12 -50 26 17 -36 79 -40 -50 85 -17 -49
6988d9J16j6J1Jj43j03K93q4j16J20j27K72k01J26n2J8j41J25L6k9j18K4K36k62
$$ -49 67 51 62 63 -80 -183 110 26 -90 30 -97 175 -26 100 48 66 -75 50 86 57 -61 -37 199 -63
7012f3J35M8j81K54j03l9J7Qj51L1J30j1o1n0J10j33n8R7k2j74L37j39O4k21J21
$$ -63 72 120 -61 193 90 51 68 76 -75 -44 86 75 14 -36 74 -59 -117 -20 -42 -216 121 -18 46 -175 -54
7037e4J57J4K7p8Q1k2j31r3L1J21l9m3J0Q0q6P1r5kJ25P5j55K03j19p7j2J81r3
$$ -54 103 117 144 66 147 125 -6 -99 -68 53 14 -29 -19 61 -25 46 -49 -51 74 149 -6 197 78 1 -11 170 77
7064G7q9p4J12o4o6nJ27j16O1J18n9J01k72J61j5Qp3L0K62l36J69n4O1j6pr1K16
$$ 77 -12 -86 26 -38 -104 -109 18 -98 -37 81 22 123 -149 12 -3 5 -68 -38 224 -112 57 3 64 48 41 -50 166
7091A66k89J77q0j4K3j23O9J32Q1r6M3P1k98K4J16N4n6n9m1K29j16J6l44L83q5
$$ 166 -123 54 -26 -40 -17 -140 -71 61 142 46 89 160 -138 -114 2 56 0 -59 -100 129 13 29 -315 68 -17
7116a7J0J45q9L0j37Q9j11K80l02N1J12n5J59k15j42K2J45j5K08j99r4J77l2m2
$$ -17 -7 138 49 79 -58 31 -80 200 -102 -51 61 6 165 -50 -192 -170 -25 -40 168 -31 -125 52 20 -22
7140b2L5q9j5M9l3o0P0K10k14J91j94J65j59O2M2k3J49j63j00J62l8K8N7o8MM7
$$ -22 13 -76 -91 -42 -75 -135 -65 145 -69 122 -72 93 -66 -4 38 15 164 1 -99 63 25 53 110 42 46 93
7166I3J2j17K84k69k4q7Q5K7p7R5Q1j88l3J24J65j26O0k63J55j32O1M1m0R2k36
$$ 93 105 -12 272 3 -21 -108 -23 4 -73 22 103 -85 -118 6 171 45 105 -158 -3 -135 -74 -33 -73 19 -217
7191b17J29P7j06J30L9j25l4L5J78j10K07j70k22J14Ol8J66k1j73K47m5j4j37
$$ -217 -88 -11 -117 13 52 -73 -107 -72 106 -4 203 33 -189 -75 -69 -107 59 38 -135 112 67 53 -84
7214h4r3J12L3M5M8j20j17K49j5R7k18L7o8M4n7J78l5n9J40j00%j3L1j75K52j28
$$ -84 -177 -65 -32 13 61 -59 -176 73 58 155 -63 -26 -94 -50 -107 71 36 -23 117 17 17 4 35 -140 112 -16
7240a6O3n8j16K10j57M2m3J62k87J60J09n5J60k25N4j8Qj10O8l2J26k7J26j15
$$ -16 47 -11 -127 83 -74 -32 -75 87 -200 -40 69 14 174 -51 3 -15 -7 -117 -49 -81 45 18 144 29
7264B9K8J2o7R0j24K09j97Q7j32J09j68K33j95j0J04n6J58j38o9K69k23JJ08p3
$$ 29 57 69 2 92 -32 177 -20 67 -65 44 -124 109 -86 -96 8 -48 110 -28 -97 172 -51 -50 58 -15
7288a5j5L4M0j68J28L8Rl8P4j33J6n5J67M1l18L04j83J63L9j54L7j22n4J66Q4
$$ -15 -30 4 44 -124 4 42 51 13 87 -46 -30 -85 82 123 -195 109 -74 89 128 -26 11 -111 -165 1 85
7313H5r6p4K1J39q1K29k39K9M8M2k32J24N1K0q4R1j12k1K35Lr3k24J67k6K5J55
$$ 85 -11 -85 -64 75 -6 223 -16 13 61 103 -129 -5 46 66 -18 73 -39 -60 175 178 85 -139 28 2 27 182
7339A82k38J71l4K06n2j59j90MJ43j69J66p2J54k47J74J0Q0o6J10p2o2lj04j8
$$ 182 -56 115 81 287 235 76 -114 -110 33 -136 30 -42 112 -135 39 49 129 63 173 101 39 36 -68 -86
7363h6R1K1m1l0L0l8j66K77j58J01k7o5J91k20K12n8k04J34J37O2q7j5j86J57
$$ -86 5 26 -15 -45 -15 -53 -219 58 -100 1 -26 -91 100 -120 92 34 -170 -36 101 163 76 61 -125 32
7387C2J27j32pK01j58j97P1J31lj07K2O2r9L9n9J54K8q8J04j73KJ50j49r9J35
$$ 32 159 27 20 221 63 -134 -63 68 65 -42 -20 42 -57 -18 -77 77 105 17 121 -52 -50 100 -49 -148 -13
7412a3j9r1K73j02L5k09K64k46R5l4M3q2k2J0J31j42J80J1n2j03M1O4j11K85l65
$$ -13 -32 -123 150 48 83 -126 138 -108 -13 -47 -4 -86 -108 -98 33 -109 71 82 30 -73 -32 32 -79 206 -159
7437a59l1L6Q1J96j31R8k13M5J88r4M2k73L92k39N6l3O8n6k8P7Q0j91P9L9O8j36
$$ -159 -190 -154 -73 123 -8 90 -123 -78 110 16 58 -215 177 -62 -6 -39 29 -27 -55 22 102 -89 -10 29 97 -39
7463c9J7L5R4m2J21l11K32p3NO0p8M0q4J16j38j02L7J35R8j43l8k2k6k3J17j13
$$ -39 -22 13 107 65 186 -125 107 34 39 99 21 61 -23 93 -45 -147 -110 25 123 -20 -58 -80 -106 -129 -12 -125
7489a25J36qp3j55L03n5m5M2k17K98j98K4M3P3n3N1m3J19l2k31J99j5J47l59j1
$$ -125 11 3 -70 -225 78 23 -22 20 -197 101 -97 -73 -30 43 -10 41 -2 117 85 -146 53 38 185 -174 -185
7514a85K20k7J5p4J14Mol9r2J71j66Q2J02k38K39j48J7qP4k6j67J35n2J70j04
$$ -185 35 8 23 -51 63 67 61 22 -70 101 -65 17 119 -119 120 -28 -11 -19 55 29 -138 -3 -55 115 11
7539A1L3L7r1J73k58J84Jj6n8j47J48n8J56j44K6J7P8k63L35j38P1L2k34J49l3
$$ 11 44 81 -10 163 -95 89 90 74 16 -131 17 -41 115 -29 -3 14 92 -171 164 26 97 129 -105 44 11
7564A1J7j81Q5J72q4kj75J68m5N5j91K89q9j20J24p1j1J61q5N3l3k93K85q7J1
$$ 11 28 -153 -68 104 20 18 -157 11 -34 21 -170 119 30 -90 34 -37 -48 113 28 81 48 -245 40 -47 -36
7589c6k1M4l8O2r4L0J56K7m8o2m0j62J49k1j7J92j16J02j7j80J1J98j15J34k33
$$ -36 -57 -13 -51 11 -83 -53 103 130 82 20 -20 -182 -33 -54 -71 121 5 107 90 -90 -79 119 4 138 -95
7614i5n9L01p4j98Q7N3r1K01j48j20K61j04O7q5J3r0N3Jm1J32l2p4K06r0j18J57
$$ -95 -154 147 73 -125 -38 15 -76 125 -23 -143 118 14 81 -4 9 -81 -28 -27 -68 64 32 -42 164 74 -44 113
7640A13k02J37Rj41J91j1j92J90j72j0M5j51K07JN2j30J76j27j09r0J89J61k26
$$ 113 -89 48 57 -84 107 96 -96 94 -78 -88 -43 -194 13 14 66 -64 112 -15 -124 -214 -25 136 -90
7663i0J67j93J94R5j27j38J6o2K27j22jJ64j81K3p8J84k0o7j01Q0j67J24O4O3
$$ -90 77 -116 78 173 46 -92 -76 -138 89 -33 -34 130 -51 -28 -106 78 58 -9 -110 -30 -197 -73 -9 54
7687E4K4N7k88K92j14%oJ35k36j7K12j50j15J17j21N0J07j4J62j35q1M9j3j05
$$ 54 78 135 -153 139 25 25 19 154 -82 -99 113 -37 -152 -35 -156 -106 1 -13 149 14 -67 -18 -31 -136
7711a36J13J49k35J67j17N6M8J28q9k00J99j28m0J16J27j76q3K20j04m8J69j01
$$ -136 -23 126 -109 58 -59 -3 45 173 84 -116 83 -45 -85 31 158 -18 -101 119 15 -33 136 35
7733C5r7J54j42L3p9K7J29k16K39k68KR6N5pK08k50O5J06Oj71j9J8LL3P2l5m5
$$ 35 -62 92 -50 -17 -96 -69 60 -156 83 -185 -183 -87 -32 -39 169 -81 -16 90 96 -75 -94 -76 -73 -40 32 -3 -48
7760d8J08k21K18q1J51j75P0j17J04l2oP9j15J22o8J23r9J51j48L0o1JJ53j81
$$ -48 60 -161 57 -24 127 -48 22 -95 9 -23 -29 50 -65 57 -11 112 13 164 16 46 -15 -14 139 -42
7784d2P6L7M2j99J72j08L9r6J1Ol5N8j3J67p5r4J74L4m34L78l23J17K12n2j43
$$ -42 34 71 113 -86 86 -22 17 -79 -68 -62 -97 -39 -52 115 40 -54 120 154 -280 98 -225 -108 104 52 -91
7809i1K02r0Mj00K14j21j29M2L2RO1K8Q8m0q6q9l1L8J83l8J5j09K7O0k20K8R2
$$ -91 111 21 25 -75 139 18 -111 -69 -37 -28 33 61 149 109 23 -66 -97 -59 124 86 101 -8 19 79 -141 -113 -21
7836b1m2K8R5j76J38Q7j2N4n6j34K5P6n2j16OK27k2k2j79L3O4j01M1J6o9J09K00
$$ -21 -63 -35 60 -116 22 109 97 151 95 -39 -14 62 10 -106 -100 127 105 83 -96 -63 1 -100 -59 -43 -112 -3 197
7863A97l39J92l1j61Q5N2R0j43J98q9j03K07k05J08q2jJ14j70RNK77j50J23Kk81
$$ 197 -142 50 19 -142 -57 -5 85 -58 140 51 -52 155 -50 58 -24 -25 89 -81 -72 -67 210 60 183 185 -96
7888i6J75l65L80j35m5J41J2j7j25j5P1o7J18J5lJ62k49j58J58J31j33M8l0q5
$$ -96 79 -286 94 -41 -86 55 67 50 -75 -90 -19 -86 32 47 44 206 -43 -201 -43 88 -45 3 -27 -112
7912a12L1o8M0l5Q9J33k6Q7k84NK07j60N6j05K74j64k7k0J10L2J0l2o2k5R8l9
$$ -112 -81 -149 -109 -144 -55 78 52 139 -145 -140 67 -93 -37 -142 132 -32 -59 -79 31 63 73 41 -21 -46 52 13
7938A3Pj18N3J69j60R4q2R6P4k80K01K3k30J56J64k59J01r5O0lM8o1j0j9rJ9K9
$$ 13 20 -98 -45 124 -36 58 -24 72 146 -134 67 90 -140 16 180 -79 22 -73 -13 -16 32 -29 -39 -58 -67 -48 -19
7965a9O4m4j6P4R0o4o1j02K21j1k60P5O4jO2K8m3j73n6R1J50n0q4P4L7K4j43M
$$ -19 45 1 -15 59 149 85 24 -78 143 132 -128 -53 11 10 72 100 57 -116 -172 -81 69 19 -65 9 46 70 -73 -69
7993f9J05P2j17q7J44N4m7o2o4n1J92l0m7P2j10m6J72j9k5J12k70J05J30j57k8
$$ -69 36 108 -9 -96 48 102 55 -7 -71 -122 70 40 -7 65 -45 -91 81 62 37 149 -121 -16 114 -43 -71
8018g1N2P8r4j6P8k5k3P5rN1q1Q3k1J13j34j18J23L2j03M4m3LJ66k7k28J6J62
$$ -71 -19 59 -35 -51 27 2 -21 54 45 96 15 98 77 190 56 -62 61 93 -10 34 -9 -6 160 133 -95 -79 83
8045H3j29j82K86K4Jl3m4l5K6p3J1O9N6N7j93J07K9q8j88M17j82J61j93j35K84
$$ 83 -46 -228 58 82 83 50 6 -29 -3 -76 -65 4 60 117 -76 31 60 -28 -216 201 19 180 -13 -148 136
8070A36j70K57j54r7J34N7k29J34l8K2k6R1j38j48K63K6k56J77k21J31p2J09l8
$$ 136 -34 223 69 -28 106 163 -66 68 30 52 26 117 -21 -169 94 120 -136 41 -180 -49 -121 -12 -50
8093e0J0J29L4j17Q4j80J9P6Q7j20K81m06J07l3L7m4J36l4R3Nj7p1J43n1j13J9
$$ -50 -40 89 123 6 90 -90 -71 5 92 -28 253 -153 -46 -79 -42 -86 50 16 109 114 97 26 169 118 5 24
8119B4J72j42j59O1j39Q6J02m8Q8j21M2j42K01O3m7n5k1o1J36qk88L73j14J44
$$ 24 196 54 -105 -44 -183 -97 5 -43 45 -76 -34 -176 25 88 41 -14 -35 -96 40 32 -256 117 3 147
8143A47m7R8j41Q7o7j30Q4n1q8J37j87J73O7j8K8n8l0l9J8o0J83l04J65J1j1P6
$$ 147 100 198 57 144 77 -53 31 -20 -108 29 -158 15 82 64 92 34 4 -35 -17 -77 106 -198 -33 -22 -33 43
8169D3k6P5l06J50o4J31L0j31M0J43k95J02J81o8j56P1L6l7R0R1k9K6
$$ 43 17 92 -214 -64 -128 3 33 -98 -58 85 -210 -108 73 5 -151 -80 -44 -81 9 100 71 97
8191I7
$$ Imaginary data points
##PAGE= N=2
##DATA TABLE= (X++(I..I)), XYDATA
0@%%%%%%%%%j6J7j7L2l2L2m8O4q0R6j12J44j76K08k40K73l21L83m46N08n74O58
$$ 0 0 0 0 0 0 0 0 0 0 -16 1 -16 16 -16 16 -32 32 -48 48 -64 80 -96 112 -128 145 -176 207 -239 269 -305 353
31C53p54Q50r62J090j228J381j544J725j927K144k385K646k924L236l580L949
$$ 353 -401 449 -513 577 -651 730 -814 911 -1016 1128 -1257 1389 -1535 1701 -1879 2070
47B070m354M801n287N825o419P074p805Q625r547J0595j1804J3208j4860J6837
$$ 2070 -2284 2517 -2770 3055 -3364 3710 -4095 4530 -5017 5578 -6226 6982 -7878 8959
61H959j9265K2328k6318L1767l9689N2316p5634J32852n27645q63056J015692
$$ 8959 -10306 12022 -14296 17471 -22218 30098 -45536 87316 -440329 -1303385 -287693
72b87693J113223P1970r85806o49604K38746O68383K31978j68811j88840m9551
$$ -287693 825530 897500 -88306 -737910 -499164 169219 401197 232386 43546 -6005
82f005j80438j77165J79749N34304K17469m75097o98597l8577P12278O36649k05787
$$ -6005 -186443 -363608 -183859 350445 567914 92817 -605780 -644357 67921 704570 498783
93D98783p32923l63730L50948N14402J11118k62183k42986o3080K9385P0021J78504
$$ 498783 -234140 -597870 -246922 267480 378598 116415 -126571 -189651 -160266 -90245 88259
104H8259J90426o6947l59678k32650K38236M42118Q0263l63397l21072R2243K94278
$$ 88259 278685 211738 -147940 -380590 -142354 299764 380027 16630 -304442 -212199 82079
115H2079P8949j64230q0287J19192M9151j76090j19543K07965K99974n2359l87992
$$ 82079 161028 -3202 -83489 35703 84854 -91236 -210779 -2814 297160 244801 -143191
126a43191k24817K44874L93761J9959l60592k28534J92948K84383l7829k37851
$$ -143191 -368008 -123134 270627 290586 -70006 -298540 -105592 178791 140962 -96889
136i6889j8550K35526Q7622k59109k48866J72138M07480O1186m22798l53272J97760
$$ -96889 -115439 120087 207709 -51400 -300266 -128128 279352 340538 -82260 -435532 -237772
147b37772M82373J39581l39009l38364P1742L14961J24687j58604j47713M4762
$$ -237772 244601 384182 45173 -293191 -221449 93512 218199 59595 -88118 -43356
157d3356P2518o3782o9538J01541J61288l3195k25616j21569J68350K57148J1694
$$ -43356 29162 -34620 -104158 -2617 158671 125476 -100140 -221709 -53359 203789 215483
168B15483k44611j75966R5251J94869L5569j17834p7591L8276M4505k8307j8931
$$ 215483 -29128 -205094 -109843 85026 120595 2761 -74830 -36554 7951 -20356 -39287
179c9287P5420P5858o9310j47935r981J61283J05605j03593j64913K661J50891
$$ -39287 36133 111991 42681 -105254 -115235 46048 151653 48060 -116853 -114192 36699
190C6699P3755j01349j08458N9537J36896l489j46735o7973J15691J30395m3561
$$ 36699 110454 9105 -99353 -39816 97080 93591 -53144 -121117 -5426 124969 81408
201H1408j57062n5759J09793J10524l6850j02913k96Q7575J4116q8391l3004J05969
$$ 81408 -75654 -131413 -21620 88904 52054 -50859 -51155 36420 50536 -37855 -70859 35110
213C5110R9337p8023j82018m0691J80252J75952o7412k26763r0880J49905J83650
$$ 35110 134447 56424 -125594 -166285 13967 189919 122507 -104256 -195136 -45231 138419
224A38419K308j41770r6297L0281P2435K5452l460Q012j7091p5821n3244P3467
$$ 138419 140727 -1043 -97340 -67059 5376 30828 27368 35380 18289 -57532 -110776 -37309
236c7309J42365L5728j31354j47101J7369J64149J12622p0081j55496n4194Q2216
$$ -37309 105056 140784 9430 -137671 -120302 43847 156469 86388 -69108 -123302 -41086
247d1086R2568J1371l9929l2118j9251j7650J1717O4847O4308l3005j23777o8661
$$ -41086 51482 62853 22924 -9194 -28445 -46095 -34378 30469 94777 61772 -62005 -130666
259a30666Q7278J41692J6688j24866j06147L4936J18457N6122n3997p3130m910
$$ -130666 -43388 98304 114992 -9874 -116021 -81085 37372 93494 39497 -33633 -38543
270c8543L6657J2312o645J2191J3851k8126n0998m926O2475O0987k2497q4716
$$ -38543 -1886 10426 3781 15972 29823 1697 -49301 -54227 8248 69235 46738 -37978
282c7978l6700O2355P5863j0988p2856l3532L7488M4112r054l8606l062L6969
$$ -37978 -74678 -12323 63540 52552 -20304 -53836 -16348 27764 18710 -19896 -22958 14011
294A4011J2693l6655k2361L5668M2366j6699n2966j5998L9051L7152j6640m5567
$$ 14011 26704 -9951 -32312 3356 45722 29023 -23943 -39941 -890 36262 19622 -25945
306b5945q013L7790K1877k4055k3113J6485K7474o259l1263j0597K7456K8682
$$ -25945 -33958 3832 25709 1654 -21459 -4974 22500 16241 -15022 -25619 1837 30519
318C0519j5557m3570p681M1341L0404k1003l5517P9L0863J7697j7791k4607N740
$$ 30519 14962 -28608 -36289 5052 35456 14453 -21064 -20985 9878 27575 9784 -14823 -9083
331i083K2931l837k8129k998L0292J4621k6065k8100J1180L8650J5962l0309l6174
$$ -9083 13848 10011 -18118 -21116 9176 23797 -2268 -30368 -19188 19462 35424 5115 -31059
344c1059P855L8957J2610k6210k2599O201J7347N378o004k980O416K591j2924
$$ -31059 -23204 15753 28363 2153 -20446 -14245 3102 8480 2476 -504 5912 8503 -4421
357d421r680J6629K2651r324l4456j3981K4180L2036J51l2805k3603J8665L4255
$$ -4421 -14101 2528 25179 15855 -18601 -32582 -8402 23634 23785 -9020 -32623 -13958 20297
370B0297L189k4675j2274R546Q771l493l914M247N371o380j4456J021K3113J4613
$$ 20297 23486 -1189 -13463 -3917 4854 1361 -2553 1694 7065 685 -13771 -12750 10363 24976
384B4976j7196k5403J571K2893J3256j0921k1428p249J5067J4980m832j3216L68
$$ 24976 7780 -17623 -16052 6841 20097 9176 -12252 -19501 -4434 10546 5714 -7502 -7134
397g134Q860J363m233R40N869K078p882j0608K935J6867N920j7167j5391R636
$$ -7134 1726 3089 -1144 -204 5665 7743 -139 -10747 -7812 9055 14975 -2192 -17583 -7947
411g947J9630M012j3372j2597K771J2586M486q820p467K870K601l690Q4P407L841
$$ -7947 11683 15695 2323 -10274 -7503 5083 9569 749 -6718 -3848 -1247 -4937 -4853 2554 6395
426F395n634p430k54R595J0716k653j5538q177R121J2076P40q713p108Q45O543
$$ 6395 761 -6669 -6923 2672 13388 10735 -4803 -12980 -3859 8217 8957 244 -6864 -6019 524
441E24M127k015p60K632l742r404J66J1883P530p314j3434n041R181J4312L693
$$ 524 4651 2636 1876 4508 766 -8638 -8472 3411 10941 3627 -9807 -14848 -5667 8645 12338
456A2338r257r201k37M748N867N111m19r475r462k2Q529J0399L262r193j4278
$$ 12338 3081 -6120 -6357 -1609 4258 9369 8950 -525 -9987 -10009 -1480 8919 12181 2988 -11290
471a1290l030J1993J3936L009r694j5292p301Q967J6151P498o469j5071j1916
$$ -11290 -14320 -2327 11609 14618 4924 -10368 -17669 -8702 7449 14947 8478 -6593 -18509
484a8509M053K1562J7371p131k3733j4709Q048K1180J2907p744j9524j1388M190
$$ -18509 -14456 7106 24477 17346 -6387 -21096 -13048 8132 21039 13295 -6229 -17617 -13427
497a3427J2183J2584N763r338j9602j0761J1001K3384J4010j0763k9576j8449
$$ -13427 -1244 11340 17103 7765 -11837 -22598 -11597 11787 25797 15034 -14542 -32991
509c2991J5156L4331J5901j7888l1815j2685J9113L0163R496j8033k2896o910
$$ -32991 -17835 16496 32397 14509 -17306 -29991 -10878 19285 28781 10748 -12148 -19058
521a9058Q415J4114J1923K6j3680j7553o149J2596K3672J2663j4146k9978j4134
$$ -19058 -10643 3471 15394 15420 1740 -15813 -21962 -9366 14306 26969 12823 -17155 -31289
534c1289J7559L1428J4337j7785l4501j4429K2424L3784Q898k0720k5396o140
$$ -31289 -13730 17698 32035 14250 -20251 -34680 -12256 21528 30426 9706 -15690 -21830
546b1830J5121J9482N661r740j2313p354k508N699J4492J1201n091k0062j8141
$$ -21830 -6709 12773 18434 8694 -3619 -10973 -13481 -7782 6710 17911 12820 -7242 -25383
559b5383M361K9039K5333j0071l7910k2163J8083L7000J5300k0774l1924p110
$$ -25383 -21022 8017 33350 23279 -14631 -36794 -18711 18289 33589 12815 -19109 -26219
571b6219K1142J9933p8r378m905m062o310k020J1057J8676N365k2602l2415j796
$$ -26219 -5077 14856 14778 5400 495 -3567 -9877 -11897 -840 17836 23201 599 -31816 -33612
585c3612L7884L5694q602m3927l1318J6338M6447K4155k3779l9833j1618K0606
$$ -33612 4272 39966 31364 -12563 -43881 -27543 18904 43059 19280 -20553 -32171 -11565
597a1565K4563P631q700j3543r554k181M456J4450J7173j187k6119k7290L223
$$ -11565 12998 20629 11929 -1614 -11168 -13349 -8893 5557 22730 21543 -4576 -31866 -28643
610b8643L3855L1468n198m1968l4998J3055M8500K9697k0015m4477k1888K0975
$$ -28643 5212 36680 31482 -10486 -45484 -32429 16071 45768 25753 -18724 -40612 -19637
622a9637L8957J4922k0849k7748o577J1819J3116P176J064m107j0361j4009m437
$$ -19637 19320 34242 13393 -14355 -20932 -9113 4003 11179 12243 8136 -2225 -16234 -20671
635b0671J8665K9470L779l4857l6184N643M3598L3496j4664m7584k4597K6165
$$ -20671 -2006 27464 31243 -3614 -39798 -34155 9443 42939 28275 -19309 -43906 -17741
647a7741M1845Q931k5315k4144m51J3887Q953o77j95M423m477j8381j0867J9280
$$ -17741 24104 33035 7720 -16424 -16875 -2988 5965 5288 5093 9516 5039 -13342 -24209 -4929
661d929L1688N686l1871l6394R44M0677L5085j2078m3889k4371J8164L5359J5958
$$ -4929 26759 32445 574 -35820 -34876 5801 40886 28808 -15081 -39452 -21288 14071 30029
674C0029j4319k5603j1257R358J5378Q956J821o070j3814j2383K210J8511J9577
$$ 30029 15710 -9893 -21150 -11792 3586 12542 14363 8293 -5521 -17904 -15694 2817 22394
687B2394J031k4406k8302J16L3131L0635n341l6877k9847Q626L8962K6767j4616
$$ 22394 23425 -981 -29283 -29167 3964 34599 29258 -7619 -37466 -28840 10122 36889 22273
700B2273l6795j8213J6423K8981J2425j1959k0257q098O481R179O719N618j491
$$ 22273 -14522 -32735 -16312 12669 25094 13135 -7122 -15220 -8739 440 7159 12777 11286
713A1286j4289j6999J247K3425K2338n473l1382k3022J3783L5137J5033k0231
$$ 11286 -3003 -20002 -18755 4670 27008 21535 -9847 -32869 -19086 16051 31084 10853
725A0853k9863o589J9695K1899J420j6168j2127K534P803L213R00K564k46o665
$$ 10853 -19010 -25599 -5904 15995 17415 1247 -10880 -8346 -543 2670 3570 6134 5888 -777
739g77q827k43J2347J2167l320j7453j0972P945J6272O890q001j3060n006P066
$$ -777 -9604 -9847 2500 14667 11347 -6106 -17078 -9133 7139 14029 6028 -7032 -12038 -4972
753d972J0027K530m816n446j958J373K862K540J228N53j435n208m204L814R361
$$ -4972 5055 7585 2769 -2677 -4635 -3262 -400 2140 3368 3921 2486 -2722 -6926 -3112 6249
768F249L895o296j1109m700P751J2785L571j0437j2149j018R834J0230O78q931
$$ 6249 10144 3848 -7261 -11961 -4210 8575 12146 1709 -10440 -11458 -1624 8606 9284 353
782C53q261J047O480M133O92q84k876n432j854N255Q661K815p340j1416k011J0449
$$ 353 -7908 -6861 -381 3752 4444 3560 684 -4748 -6602 -1347 7314 10129 2789 -8627 -10638 -189
798a89J0560j447j0849p771J626Q552P004j784p438m445J951L941L343J314k060
$$ -189 10371 8924 -1925 -9696 -8070 482 7486 5702 -1736 -6181 -4230 -289 3054 4368 2308
813B308m152k282J248L904L999M41n797n116J573N886L086k053l783k809K91K893
$$ 2308 -1844 -4126 -2878 1026 5025 5466 -331 -5447 -3874 2012 5098 3045 -738 -3547 -3256 -363
829c63K668m08j782j876j369J051L065J445j521j294p29p20R77K840J301j867
$$ -363 2305 1897 115 -1761 -3130 -2079 986 2431 910 -384 -1113 -1833 -856 1984 3285 1418
845A418k385j429N78K885K992j035m106k367Q75L071L026r3m952l695J998M016
$$ 1418 -967 -2396 -1818 1067 4059 3024 -1082 -3449 -2574 497 3523 3430 -1522 -5217 -3219 797
861G97J988l78k758k889j45L758L073P4k748l205j478L537M744j97l977l092j8
$$ 797 2785 2407 -351 -3240 -3385 373 3446 3520 772 -2433 -3911 -374 4370 4173 196 -2896 -2914
878b914K319L444J205l528l947M8K668K597Q46k167l725o78L337K474K69j145
$$ -2914 -595 2849 4054 526 -3421 -3373 -705 1892 2738 571 -3154 -3832 -495 1979 2248 1103
894A103k536j955K258M486P63l529k820j9K080L135L10l462k729J115K158J333
$$ 1103 -1433 -3388 -1130 3356 4119 590 -2230 -2249 -169 2966 3276 -186 -2915 -1800 358 1691
910A691L12j879k979K54K861J362q63j328j098l84J907K384n95j938j192O50J053
$$ 1691 2003 124 -2855 -2601 260 1622 759 -569 -1667 -2051 -144 2240 1645 -293 -1485 -835 218
927B18K227j65k739j481J527J475J14k99r71j738L70J972N49n74j135j020R9J687
$$ 218 2445 2280 -459 -1940 -413 1062 1176 877 -94 -1832 -1462 510 1059 485 -650 -1670 -1571 116
945A16J401j133j287r2O68K27J505L37j928p45J019R44J5L5j093j022L20J442
$$ 116 1517 384 -903 -995 -327 -100 1405 1742 -186 -931 88 1032 1047 1082 -11 -1033 -713 729
963G29N3p60o59l97m7J563P01j477j266R36O76l7J14K13m22k49O57r5L83N24p08
$$ 729 782 22 -637 -1034 -1081 482 1183 -294 -1560 -624 52 15 129 342 -80 -329 328 233 616 1140 432
984D32j036K08J493J89j288m00l53J09P46N02q72o14M17J49k72Q84K99p24n76
$$ 432 -604 -396 1097 1286 -2 -402 -755 -646 100 602 -270 -884 -467 -318 -590 294 593 -131 -707
1003g07M3L05Q51J013o34j847j37J782P16l71n01n67p22K38P16O13R8p23k182
$$ -707 -664 -359 492 1505 871 -976 -1113 669 1385 1014 513 -54 -776 -538 178 791 889 166 -2016
1022b016m64K439K279r34k431j260Q93K012J476n99j773r02N57R03Q15J103n66
$$ -2016 -2480 -41 2238 1304 -1127 -2387 -1494 518 1994 1395 -378 -1280 -723 180 995 2098 1532
1039A532k235j413J042K402J647r98l642k068K101L761O05k371k466m87J127K172
$$ 1532 -703 -2116 -1074 1328 2975 1977 -1665 -3733 -1632 2129 2734 363 -2103 -2590 -1463 709
1055G09J209l91j478k123o22K318L541N33l844l512R29L856K325q69k919j961
$$ 709 1918 1527 49 -2074 -2696 -378 3163 3696 -148 -3660 -2731 1125 3450 2581 -338 -2299
1071b299O65J851N62K61N31j658k755o99L013L949M40m286m876J072O037L951
$$ -2299 -1634 217 779 1040 1571 -87 -2842 -3541 -528 3421 3861 -425 -5301 -4229 1808 5759
1087E759l184n058j264L114K943M0j775p58N68r41j591J315L886Q69m130m466
$$ 5759 2575 -2483 -3747 -633 2310 2350 575 -183 385 -556 -2147 -832 3054 3923 -207 -4673
1103d673K53M919M249r69n825l785K669N128K193k136k946k133P88K882K396l55
$$ -4673 -4420 499 4748 3779 -2046 -5831 -3162 1966 4159 2023 -923 -3056 -2268 614 3010 2655
1119B655j546k321k042J902L497J644k255k720j706P1K831K924N07l194m460j317
$$ 2655 1109 -1212 -3254 -1352 2145 3789 1534 -1186 -2892 -2821 10 2934 3441 247 -4213 -5530
1135e530M223O289J571p037o898J901P663M574l122o281k273L659M435r23k843
$$ -5530 -1307 4982 6553 -484 -7382 -5481 2182 6756 3634 -2647 -4920 -1261 3174 2251 -592
1150e92Q24J637k104l465P00N537L917l719q626k948Q217R344j863j0449n484
$$ -592 232 1869 -235 -3700 -3000 2537 6454 2735 -5891 -8839 -622 8722 6859 -3590 -9074
1165i074N155Q687K074n966n358J359N018K22k511K1K910j81l893k713K407N623
$$ -9074 -3919 4768 6842 876 -4482 -3123 1895 2117 -394 -373 2537 2356 -1537 -4250 -1843 3780
1181C780K130n128o770J83O730N014j753n838m231J664N622L423k056m275k153
$$ 3780 5910 782 -5988 -5805 925 5939 4186 -1652 -5883 -4219 1403 4826 2770 -1505 -3658
1196c658J195L124K490p05l131r85J212K68K7Q41J807l25l068l671O41O442N119
$$ -3658 -2463 661 3151 2446 -685 -1670 -458 -190 -163 678 2485 2160 -908 -4579 -3938 2504 7623
1213G623m603r395k366Q415Q167j356r253n546M585Q949N08o515l333L427L590
$$ 7623 3020 -6375 -8741 -326 7841 6485 -2768 -8314 -3729 5220 5728 -787 -4120 -693 2897
1228B897j764l802R04N202J958n904o938K790J0025L441q136r185J071R694N736
$$ 2897 1133 -2669 -1765 3437 5395 -509 -7447 -4657 5368 8809 673 -8512 -7441 2253 7989
1243G989m309q577j586O323M342k171l559K48K014k03j676l27K359K837j780m771
$$ 7989 3680 -4897 -6483 -160 4182 2011 -1548 -1300 714 511 -1165 -1492 867 3704 1924 -2847
1259b847j157L807M021k10l633l299l09L632K985j00l115k850m19K850L619L56
$$ -2847 -4004 -197 3824 3614 -19 -3318 -3627 5 2990 2890 -225 -3075 -3494 -644 2975 3331
1275C331l822k979J583L243J180k015j751R06J677q01k680N94M448J574m751n380
$$ 3331 -491 -3470 -1887 1356 2536 521 -1230 -324 1353 552 -2128 -1534 2914 4488 -263 -5643
1291e643K105O834L102n076p108j36P278M723l886o182j13M926K310k703k898
$$ -5643 -3538 3296 6398 1322 -5786 -5922 1356 6079 2193 -3989 -4102 824 3134 431 -2467
1306b467J645L718m92m798j625M958M603k582o500j734N121N113j091n887k584
$$ -2467 -822 2896 2404 -2394 -4019 939 5542 2960 -3540 -5274 -153 4960 3869 -2018 -4602
1321d602L467L756n01k999n99J443R9r35o2J711J329j517k877k7L078K292j476
$$ -4602 -1135 2621 2120 -879 -1478 -35 64 -871 -933 778 2107 590 -2287 -2314 764 3056 1580
1338A580k890n35J930J072l53p11J68j71r32p99J495K453n88l327j816K580L341
$$ 1580 -1310 -1845 85 1157 804 93 261 90 -842 -1641 -146 2307 1719 -1608 -3424 -844 2497
1355B497k48l251j799J948K880p36k570k29K735P76k378j861J883K908j00l418
$$ 2497 2249 -1002 -2801 -853 2027 1291 -1279 -1508 1227 2003 -375 -2236 -353 2555 2455 -963
1371i63k590K797L870m40m073j851K762K624q90k635p29K501J525k021k306J236
$$ -963 -3553 -756 3114 2674 -1399 -3250 -488 2136 1246 -1389 -2118 383 1908 -113 -2419 -1183
1387a183L400J09l529j409K238K973l40l192j706K386K787r77l110rK161J142
$$ -1183 2217 2326 -1203 -2612 -374 2599 2259 -933 -2639 -253 2534 1557 -1553 -1562 599 1741
1403A741k224j741J591K333l30k512j698K600K656j002k886p67K546J614j060
$$ 1741 -483 -2224 -633 1700 1370 -1142 -2840 -240 2416 1414 -1472 -2239 307 1921 861
1418H61j893j47J912R76j678j481J368J949r62k493j63K300J378j294k617J46
$$ 861 -1032 -1179 733 1709 31 -1450 -82 1867 905 -1588 -1751 549 1927 633 -1984 -1838
1434a838K281J320j636k011J324J683l19j754l38J488J418j110k002J53K703R70
$$ -1838 443 1763 127 -1884 -560 1123 804 -950 -1288 200 1618 508 -1494 -1341 1362 2332
1450B332k451j882J353K101J43k103j369J343K103l52k407r73K469J347j538j985
$$ 2332 -119 -2001 -648 1453 1596 -507 -1876 -533 1570 1218 -1189 -2162 307 1654 116 -1869
1466a869N94K398Q15j900k125R30K795J45k515j094J893J960r34j958m76J578
$$ -1869 -1275 1123 1938 38 -2087 -1157 1638 1783 -732 -1826 67 2027 1093 -865 -1341 237
1482B37J493j401j922L11K086P66k133j234J168J782j30j755p18J312J531n89
$$ 237 1730 329 -1593 -1282 804 1570 -563 -1797 -629 1153 1023 -732 -1450 -138 1393 804
1498H04j989J75K014M42j482j171R17J347K92j785j015J381J489o21j866J38J251
$$ 804 -1185 -1010 1004 1446 -36 -1207 -290 1057 1349 -436 -1451 -70 1419 798 -1068 -930 321
1515C21P99j206r65J10J717K44j397j002R70J835o56j461l88J465R26p58j403
$$ 321 1120 -86 -1051 -941 776 1020 -377 -1379 -409 1426 770 -691 -1079 386 1312 554 -849
1532h49K6J469P10j150j341N43J681k82j547n98J163J120m12j624k18J701Q13
$$ -849 -823 646 1356 206 -1135 -592 1089 807 -740 -1338 -175 945 533 -1091 -1309 392 1205
1549A205r04j438O82J226K00j083o86N53J298l1j412n94J136J131q10j312J25
$$ 1205 301 -1137 -455 771 971 -112 -798 -245 1053 1022 -390 -984 152 1283 473 -839 -714
1566g14J048M42m88j037R2J062O2j011l70O34J100l70r05l41R35Q46n47q43n7
$$ -714 334 776 288 -749 -657 405 467 -544 -914 -280 820 450 -455 -796 139 985 438 -405 -462
1585d62Q05L62n50n43L59L38j01m99OL68K86m91o27J54J026J85q59n26N50M56
$$ -462 343 705 155 -388 -29 309 208 -291 -285 83 369 -122 -749 -595 431 616 -243 -769 -219 237
1605B37J00m23l01K51O14j90p87M00O95j3p94n83O09Q44L9q53p98O24Q46N9r73
$$ 237 337 -86 -387 -136 478 288 -499 -99 596 583 -211 -794 -185 659 698 -155 -953 -329 517 576 -397
1626c97l12M25L35j23j99J87K00J20k91n11L66Q71k00p69r5L07M44K22k65l48
$$ -397 -709 -284 51 -72 -271 -84 116 236 -55 -566 -200 671 471 -298 -393 -86 358 580 315 -33
1646c3n41N98J53j52j95O0O8m57J34M66R8j93k06k81L97M74p4l11j58K21q1N0
$$ -33 -574 24 177 25 -170 -110 -42 -499 -365 101 199 6 -200 -481 -84 390 316 5 -153 68 -13 37
1668C7K52N9k20j60j86o1N68L62o62o96J92N32K15J20l69n16J17M47M57n91J76
$$ 37 289 348 128 -32 -218 -279 289 651 -11 -707 -515 17 232 352 -17 -533 -416 31 488 -103 73
1689G3k15J09r5L52m7J7j0j32m59K18P06j31k65m50k04J96Q97K2p02o94K71O73
$$ 73 -142 -33 -128 224 177 194 184 52 -407 -189 517 386 121 -329 -533 -337 560 582 -120 -814 -543 130
1711A30K45m4n62k76M26O54l71l89J39N11m36k99K17K86L95n6p39o23M85R14K88
$$ 130 375 331 -231 -507 -81 573 202 -187 -48 463 27 -272 -55 231 626 570 -169 -792 -307 607 895
1732H95p77r20p3P33R49m18q90k03N19M91j9k80j62N9K65O9l63n6O29l6m29o61
$$ 895 118 -802 -875 -142 807 389 -501 -704 -185 306 287 7 -155 -96 169 238 -125 -181 448 412 -17 -678
1754f78J56Q11N07j71j003q75J078J128l59q17p17K67R75N72q15o79K11R56k8
$$ -678 -522 289 796 625 -378 -1253 -175 953 594 -223 -940 -673 302 874 59 -620 -409 547 519
1773E19p15j06M17M10J4q73n18Q61J229l50j605m86R85J321pj362j103N91J455
$$ 519 -196 -302 115 525 539 -334 -852 9 1238 888 -717 -1203 -218 1103 1096 -266 -1369 -778 677
1792F77K55j036p22N95N63J15o07k39K80P92j78q93q8N70Q44k50j001m20L74J015
$$ 677 932 -104 -826 -231 332 447 -160 -399 -119 673 495 -398 -486 84 928 678 -323 -743 -369 646
1812F46L58j253o73K57P24M32l30o17k47N17O31j57m41j67N44J49k76n53kQ20
$$ 646 1004 -249 -922 -665 59 491 161 -456 -703 -186 445 288 -153 -320 224 373 97 -456 -458 362
1832C62N23m41j188k6J097R04p64j274l91J035J067j13j364n81Q88R61l74p12
$$ 362 885 444 -744 -770 327 1231 467 -807 -1198 -163 904 791 -573 -1154 -266 695 321 -391
1850c91k54P56O30m44j058K99J027L83q56j013J67J470M58o12j573J12J041P02
$$ -391 -645 111 741 297 -761 -462 565 948 92 -921 -754 716 1174 562 -1011 -899 142 844
1868H44n10q65l1M85K87o6m86R4M21p2j22l80L39L20L1l91j37K07J39L51k77m94
$$ 844 334 -531 -562 -77 210 144 -342 -248 173 101 -21 -401 -62 258 289 -102 -239 -32 107 458 181 -313
1890c13j32L53K96J44k32m08k74M21M30pm55k37O2O16p4k39l59N38K44m64m49
$$ -313 -445 -92 204 348 116 -292 -566 -145 285 278 -177 -414 -352 264 190 -49 -408 130 374 -90 -539
1911e39J56P47M21o09p25nJ117K47n77p63q5J104J59p81l28J34N45J21m48o32
$$ -539 -383 364 785 176 -549 -554 563 810 233 -530 -615 489 648 -133 -461 -327 218 339 -109 -741
1931g41Q10N31j57q11j92O60N57k57p53k54Q84L92n40m42J41M37J26n40O8J4J76
$$ -741 69 600 443 -368 -560 100 657 400 -353 -607 277 669 129 -313 -172 265 391 -149 -81 -67 109
1952A09Ml62k24N27L79n00m30J20N62L51n06k27mN36j84j67n8L04Q8m52j37K37
$$ 109 113 -249 -473 54 433 -67 -497 -377 185 536 30 -197 -201 335 151 -16 -74 230 318 -134 -271 -34
1974c4M56r6m53j97L07L07j00n35n3M20L12k99l52L54L62j53l10m28M87N11k00
$$ -34 422 326 -127 -324 -17 290 190 -345 -398 22 334 35 -317 37 399 246 -64 -492 -5 506 306
1995C06o82r3N63N06j91p37lL20M63l70m94M3N85J48n79m36N87M45L8o12l08M02
$$ 306 -376 -469 94 600 409 -328 -331 -11 452 82 -412 -369 216 364 -215 -651 -64 381 419 -193 -501 -99
2017i9M38M2o69O1M65J16k81k53n3L85L26m31m75M26K98n2n27k3L05J06k1m21
$$ -99 339 381 -288 -227 238 354 73 -180 -233 152 478 47 -428 -2 296 244 -283 -306 -1 105 84 -337
2039c37K11P0J97k68j21J98L20r0j98m12N31L36l73l31RM94J49n02k66L19L92
$$ -337 -126 -56 141 -127 -248 -50 270 180 -18 -430 101 437 64 -267 -258 236 385 -117 -383 -64 328
2060C28l00k79j96L73L82j87m32j99P11J52j80n45K47M04J50o44K2l5N52M3m92
$$ 328 28 -251 -447 -74 308 121 -311 -510 201 353 173 -372 -125 279 429 -215 -193 -228 324 367 -125
2081a25k54M97J75j65n17R2M60o7k3m07k6N27J98n60j34L23K83k09j70j55L83
$$ -125 -379 118 293 128 -389 -297 163 96 73 -334 -360 167 365 -195 -329 -6 277 68 -102 -257 126
2102A26J87r1m43N1M05Km6n16K18M70n7l56j32LM26j13l87J3M61Pj85l19Q2M31
$$ 126 313 222 -221 -170 235 237 191 -325 -107 363 306 -50 -182 -179 247 134 -253 -240 221 228 43 -276 -194 237
2126B37K6m42j62K02M41l28J3k18M69n0p8j82N7P6J77l22j30J65Q6J26m62K19
$$ 237 263 -179 -341 -139 302 -26 -13 -231 238 188 110 -72 -15 61 238 -84 -214 -49 37 163 -299 -80
2148h0J95J13j2o03K12J27J04Ok00J14M82k17j71k29K59N5j90k46J91J40K23k40
$$ -80 115 228 216 -387 -175 -48 56 62 -138 -24 458 241 70 -159 100 155 -35 -281 -90 50 273 33
2170C3l97L7N11L1l26l60K71L84l3m39l4N21K15k14n93J69L88J51m5l47j85N98
$$ 33 -364 -327 184 215 -111 -471 -200 184 151 -288 -322 199 414 200 -393 -224 164 315 270 -77 -262 336
2192C36j46j48k27L4M44k08k34p5J2M15j30j93k23L12J39P8k54k3J49L9j28m1
$$ 336 190 42 -185 -151 293 85 -149 -224 -212 203 73 -120 -343 -31 108 186 -68 -91 58 97 -31 -72
2214g2o4L53k12j20J00K88l4k52k62J36K90j06k08j68K81N2L03l72j90L84R0j88
$$ -72 -136 217 5 -115 -15 273 239 -13 -275 -139 151 45 -163 -331 -50 2 305 -67 -257 127 217 29
2236B9l68K31K19K00l72l50M81J96K6l95k04K72K63j40j31j58J83K32k88r4R1
$$ 29 -339 -108 111 311 -61 -411 70 266 292 -103 -307 -35 228 88 -43 -201 -18 214 -74 -168 -77
2257g7J14J63l67N0J00K44r2k18n8J9L69Mj59j44O2nk40K57O2J5k8p5J0l1J53
$$ -77 37 200 -167 -117 -17 227 135 -83 -141 -122 247 251 92 -52 10 5 -235 22 84 99 71 -4 6 -25 128
2282A28Pm29p8L79j7k5p4m7J53Q7n9j12p6L91k35p1LK51j17M2l72J38J36L77l05
$$ 128 135 -294 -372 7 -10 -35 -109 -156 -3 84 25 -87 -163 228 -7 -78 -75 176 59 101 -271 -133 3 380 75
2307G5k47oL23m3o8j42J01J1j2ko5L3K16j10k20j1K90j61J68q3j03k8O5J15R9
$$ 75 -172 -178 145 102 34 -108 -7 4 -8 -10 -75 -42 174 64 -156 -167 123 -38 130 47 -56 -84 -19 96 195
2332A95l44K22o2j17J20j04N9L9Q1n7k6k8j1J97k18J07j47K52l0Lp7j79lJ70J33
$$ 195 -149 73 11 -106 14 -90 -31 8 89 32 6 -22 -33 164 -54 53 -94 158 128 131 54 -125 -128 42 175
2357A75m2k52j35L74n2O7l65N6P5K45k72N2J8M3K25k96J02m02L74N4K4k56o8M19
$$ 175 133 -119 -254 120 68 135 -230 -174 -99 146 -126 -74 -56 -13 212 -84 18 -384 -10 44 68 -188 -256 163
2381A63J72k13m34J65K49K05l06j12m2L8J76j04j87K76M7L0j03o7r9J32K74k28
$$ 163 335 122 -312 -147 102 307 1 -111 -153 -115 61 -43 -230 46 93 123 20 -47 -146 -14 260 32
2403C2k37P4J70K44j83j60k40K87L31k35j58k8J62J13l9k91K34j52J10mk80J16
$$ 32 -205 -131 39 283 100 -60 -300 -13 318 83 -75 -103 59 172 133 -158 76 -76 34 30 -250 -134
2425a34P5J86q4j05o0J79l3lj0j49R6mJ66q0j12N9l6K33r5k81K45n5k4k4r2J30
$$ -134 -59 127 43 -62 -122 57 24 21 11 -138 -42 -46 120 40 -72 -13 -49 184 89 -192 53 -2 -26 -50 -142 -12
2451a2R2O2k07j05O5J69Pm1k64J92Q7P8j1j72o9J47L0P8j56j96L26J7j35k68L8
$$ -12 80 142 -65 -170 -105 64 71 30 -234 -42 45 123 112 -60 -129 18 48 126 -30 -226 100 117 -18 -286 -248
2476b48L24K0j14j57L6M11j20k21p7K11N0P8k22k16K71R4j52L1pK3j40J49n8j4
$$ -248 76 96 -18 -175 -139 272 152 -69 -146 65 115 193 -29 -245 26 120 -32 -1 -8 15 -125 24 -34 -48
2500d8K99k07J42j69rn9J3j07J69j0j57L9K69k11O0O3J6k9N3j37k0R8Kn1j07J2
$$ -48 251 44 186 17 8 -51 -38 -145 24 14 -143 -104 165 -46 14 77 93 64 117 -20 -40 58 60 9 -98 -86
2526h6Q9M9j9P1k75L2J95o3R4j47P0O3J00l6j49q7K31l1l7j89K67n6J51m53O4
$$ -86 3 52 33 104 -171 -139 56 -7 87 -60 10 73 173 137 -12 -99 132 101 64 -125 142 86 237 -216 -152
2551a52l8K05R7l02J1L07Q3k33o7J0K26j66Q2j68L2K19l3j99J18j4nl33L46j22
$$ -152 -190 15 112 -190 -179 128 211 -22 -89 -79 147 -19 63 -105 -73 146 113 -86 32 18 13 -320 26 -96
2575i6R8p7m2k7q9L70n1N0j19j11P6j89K32j35NK24k15R0O0Jl9J1k1q9J92M6k64
$$ -96 2 -75 -117 -144 -233 137 86 136 17 -94 -18 -207 25 -110 -105 119 -96 -6 54 55 16 27 6 -83 109 155 -109
2602a09Q9J66N1l46J82P0k41J1P9k22L60K0M0m10R5K52m5l0q8j25K22o3J03j15
$$ -109 -20 146 197 -149 33 103 -138 -127 -48 -270 90 110 150 -260 -165 87 42 12 -76 -201 21 -42 61 -54
2626e4j41L72j10j41K36l91K63J2P2k73J12Ko0j9o0J91J8L3p3m4j4O1j45K09j40
$$ -54 -195 177 67 -74 162 -229 34 46 118 -155 -43 -41 -101 -120 -180 11 29 62 -11 -55 -69 -8 -153 56 -84
2651h4K01J2L5k09M0J08j09l2P1K19j31m22K54K27q3k34J94r0K41j78k1j06J79
$$ -84 117 129 164 -45 -5 103 -6 -38 33 252 121 -301 -47 180 97 -137 57 -33 208 30 9 -97 82
2674H2M6pj84r4K58K2q4L0k65Q6R5m0oJ4n8J96j69J97k84J93K0q6k04L13l5J0
$$ 82 128 121 -63 -157 101 123 39 69 -196 -110 -15 -55 -61 -47 -105 91 -78 119 -165 28 48 -38 -242 71 36 46
2700D6j3j64J23N5k2K8Ork04J49O1j01K9J5R1J7j62J76j32j9K3K13j84o8J4Kj90
$$ 46 33 -131 -8 47 25 53 59 50 -154 -5 56 -45 -16 -1 90 107 -55 121 -11 -30 -7 206 22 -46 -32 -30 -220
2727b20K47l8n9o3J68j21oR3KK2n6M3n3J28j32L0O7j25R7k2J5J8l7n4m6l3O3J35
$$ -220 27 -11 -70 -133 35 -86 -92 1 3 25 -31 12 -41 87 -45 -15 52 -73 24 2 17 35 -2 -56 -102 -135 -72 63
2755F3o0q6Q1K5q3P7k67J98N9L5J2K5n3p8%R0o8j2j9N6R0j04q0J52j2q0K3L1p1
$$ 63 3 -83 -2 23 -60 17 -250 -52 7 42 54 79 26 -52 -52 38 -30 -42 -61 -5 85 -19 -99 53 41 -39 -16 15 -56
2784e6n4R5J45pJ16k61q5J34l1q4J22rq6N0J39k61Q6J2Q2L8k2j49J52R6k44J9
$$ -56 -110 -15 130 123 239 -22 -107 27 -4 -88 34 25 -61 -11 128 -133 -47 -35 47 85 63 -86 66 162 -82 -63
2810f3K72j35r7M0o7L4O9j64J27Oj53K72o3j00P1j10Q8J34j79j4L6N8k16QJ35
$$ -63 209 74 -23 17 -50 -16 53 -111 16 22 -131 141 78 -22 49 -61 27 161 -18 -32 4 62 -154 -146 -11
2835a1Q9j23qr3R3mp8N7J07lJ2p4m9R8L0q5J03m4p6M4ML4j52nK25k13l1J81N8
$$ -11 78 -45 -53 -146 -53 -57 -135 -78 29 26 38 -36 -85 13 43 -42 61 17 -59 -15 -11 23 -129 -134 91 -122 -153 28 86
2864H6l7l8j3M3J03j84Q0jK2K0n8q8J71j2j84J61O5j15j22K7J8J9j33J52J00j37
$$ 86 49 11 -2 41 144 -40 40 39 61 81 23 -65 106 94 -90 71 136 21 -101 -74 -56 -37 -170 -18 82 -55
2890e5K04k54J11q4P1j2p2k00M56k11o0J07q8n7R9K2O3j11R7kk6j15J95L0j67
$$ -55 149 -105 6 -78 -7 -19 -91 -291 165 -46 -106 1 -87 -144 -45 -23 40 -71 26 24 -2 -117 78 108 -59
2915e9O6M2l5l4N8K50l65K5k3R2J0L9j22J06M3r4j03o5L2J92k8J25k43l4J66k08
$$ -59 7 49 14 -20 38 288 -77 -52 -75 17 27 66 -56 50 93 -1 -104 -169 -137 55 27 152 -91 -125 41 -167
2941a67L00j63P7k2n2Q4j34J62J8p7L0j94J49j62K80r0JkQ7k47N3M9RJ55q6Q9
$$ -167 133 -30 47 25 -27 57 -77 85 103 26 56 -138 11 -151 129 39 40 38 125 -122 -69 -20 -11 144 58 147
2967A47k99J24P7Qr8k6N9L4j60P7J0L4p8J74m7k9j39K16J0l3j17K3J55k40L0J28
$$ 147 -152 -28 49 57 -41 -67 -8 26 -134 -57 -47 -13 -91 83 36 7 -132 84 94 61 -56 -33 122 -118 -88 40
2993D0k29L20k09L0J13k32M3O2J26o5R9j91p0J93r5J34P8l40J51J52j8m6J46j81
$$ 40 -189 131 -78 -48 65 -167 -124 -62 64 -1 98 -93 -163 30 -65 69 147 -193 -42 110 92 46 192 11
3017A1L7j06J32K6k8j88J72j87J77L6r7M6r0J47m7N5j05J62j36J29k73M9J15j02
$$ 11 48 -58 74 100 72 -116 56 -131 46 82 -15 31 -59 88 41 96 -9 153 17 146 -127 -78 37 -65
3041f5k4P5j77K41N4j68n6J5R2p1J52J8j52K5j26K18p4J17rq3J07j23R7j8J53
$$ -65 -89 -14 -191 50 104 -64 -120 -105 -13 -84 68 86 -66 -41 -167 51 -23 94 85 2 109 -14 83 65 218
3066B18j23k11K39O9p8l06J79n4J60K7j91N0k2J39j1j36n5L25k67K2o2M0J56p8
$$ 218 95 -116 123 192 114 -192 -13 -67 93 120 -71 -21 -43 96 85 -51 -106 219 -48 -26 -88 -48 108 30
3090C0P1k7K5r5J11n9Mk20K30k4q2K8j8Q0j64R2Lk34J70L01k13P8j67n2J12J27
$$ 30 101 74 99 4 115 56 60 -160 70 46 -36 -8 -26 54 -110 -18 -15 -249 -79 222 9 87 -80 -132 -20 107
3116A07j87R2j56K23m3l1q9J62p2J69j03J28j41J6q1J10q4n7N1M7M4k45J59LJ0
$$ 107 -80 12 -144 79 36 5 -84 78 6 175 72 200 59 75 -6 104 20 -37 14 61 105 -140 19 22 32
3141C2o4%m3O0N3l9rro0MN7l1J8m1R9p4P2ko1m3P6m5J60j71J52O8k55J27o7K1
$$ 32 -32 -32 -75 -15 38 -1 -10 -19 -79 -75 -18 -49 -31 -72 27 -47 25 23 -38 -81 -5 -50 110 -61 91 159 -96 31 -36 -15
3171a5J3K17k49J27j25L3K3j8R2%j48Q6J11j81O1q0m1J19L7j33J73j59J3J67q1
$$ -15 -2 215 -34 93 -32 1 24 6 98 98 -50 36 147 -34 27 -53 -94 25 62 -71 102 -57 -44 123 42
3196D2K8j46L8P0O1k48K84j28Pk5NP2Nj50J87o8p6K3J68kk10J43j87J45o5K36
$$ 42 70 -76 -38 32 93 -155 129 1 8 -17 -12 60 65 -85 102 34 -42 -19 149 147 -63 80 -107 38 -27 209
3222B09j2j96k0K14j07j09l9q9J17J50p6j66M8r5J71r5o1J37J31k8k02M8O0p1
$$ 209 197 1 -19 195 88 -21 -60 -149 -32 118 42 -124 -76 -171 0 -95 -156 -19 112 84 -118 -70 -10 -81
3246h1O0j09q2Q7J83k08J50j68J29J8q4j17J96r7K66k59p1jJ19q0P1J99j24P5
$$ -81 -21 -130 -212 -125 58 -150 0 -168 -39 -21 -105 -222 -26 -123 143 -116 -187 -188 -69 -149 -78 121 -3 72
3270G2j88Q0J17j1OL3r8K3J30j18J2j11Q6K3l1j57J08J43j55j29K1J78Lk9k09
$$ 72 -116 -36 81 70 76 109 11 34 164 46 58 -53 33 56 25 -132 -24 119 -36 -165 -144 34 37 8 -201
3295b01K32n0J48j99R3n5K22j94M1M1K7oj91J90j1k42J71M9j78O7rK1k2J9k7n9
$$ -201 31 -19 129 -70 23 -32 190 -4 37 78 105 99 -92 98 87 -155 16 65 -113 -46 -55 -34 -56 -37 -64 -123
3321a23L06k80j46K64pK07n8j21J23k80K02k86J39P9j29K43j7j36J5m6J37j16
$$ -123 183 -97 -243 21 14 221 163 42 165 -115 87 -199 -60 19 -110 133 116 -20 -5 -51 86 -30
3343c0m3J04j9O5j40RJ83q6j64Q7%j5P8K08k37J56l12J28l1J18m9pq4K05n5j05
$$ -30 -73 31 12 77 -63 -54 129 43 -121 -34 -34 -49 29 237 0 156 -156 -28 -59 59 10 3 -81 124 69 -36
3369c6O5J63j50n0o7k3N5J18L3j10j01J59K2j18O8Q3j17J47j26lk3N0j03M4j55
$$ -36 29 192 42 -8 -75 -98 -43 75 108 -2 -103 56 78 -40 28 111 -6 141 15 12 -11 39 -64 -20 -175
3394a75K63n6J3j29r3K40P7k0j41O6m8J44j7n7O3Rp6j16mm3j42L53j45NQQ8L6
$$ -175 88 32 45 -84 -177 63 140 120 -21 45 -3 141 124 67 130 139 63 -53 -57 -100 -242 111 -34 -29 -21 67 103
3421A03j50j64J80J7q5Q0m5O6P0j13J89n5p6K0J44o1j25q4K14k26J63j12J32k9
$$ 103 -47 -211 -31 -14 -99 -19 -64 2 72 -41 148 93 17 37 181 120 -5 -89 125 -101 62 -50 82 53
$$ [...]
8191c9
##END NTUPLES=NMR FID
##END=
