##TITLE=1H ikalashn
D5
21.10.2024
##JCAMPDX= 6.0         $$ Bruker NMR JCAMP-DX V2.0
##DATA TYPE= NMR FID
##DATA CLASS= NTUPLES
##ORIGIN= UXNMR, Bruker Analytische Messtechnik GmbH
##OWNER= root
$$ TOPSPIN		Version 1.3
$$ 2024-10-21 13:40:05.843 +0400  Irina@DPX200
$$ Compression mode = diff/dup
##.OBSERVE FREQUENCY= 200.13100065
##.OBSERVE NUCLEUS= ^1H
##.DELAY= (6, 6)
##.ACQUISITION MODE= SIMULTANEOUS
##.ACQUISITION SCHEME= undefined
##.AVERAGES= 16
##.DIGITISER RES= 18
##SPECTROMETER/DATA SYSTEM= spect
##.PULSE SEQUENCE= zg
##.SOLVENT NAME= CDCl3
##.SHIFT REFERENCE= INTERNAL, CDCl3, 1, 15.99637
##AUDIT TRAIL= $$ (NUMBER, WHEN, WHO, WHERE, WHAT)
$$ ##TITLE= Audit trail, TOPSPIN		Version 1.3
$$ ##JCAMPDX= 5.01
$$ ##ORIGIN= Bruker BioSpin GmbH
$$ ##OWNER= Irina
$$ $$ F:/spectra/data/iren/nmr/1H/4/audita.txt
$$ ##AUDIT TRAIL=  $$ (NUMBER, WHEN, WHO, WHERE, VERSION, WHAT)
(   1,<2024-10-21 13:39:17.765 +0400>,<Irina>,<DPX200>,<TOPSPIN 1.3>,
      <created by zg
	started at 2024-10-21 13:38:09.906 +0400,
	POWCHK disabled, PULCHK disabled
       configuration hash MD5:
       BE 6D 3F 07 2A EA 11 49 91 17 2B D3 AF B3 58 0D
       data hash MD5: 16K
       83 81 9A 28 7A 7A 71 E9 C4 ED CF F1 A2 91 54 BD>)
$$ ##END=
$$ 
$$ $$ hash MD5
$$ $$ EF 7D 1C 7B C0 74 6B A9 05 B1 80 47 39 41 84 4D
##$RELAX= 
##$RELAX= 
##$RELAX= 
##$RELAX= 
##$RELAX= 
##$RELAX= 
##$RELAX= 
##$RELAX= 
##$RELAX= 
$$ Bruker specific parameters
$$ --------------------------
##$DU= <F:/spectra>
##$EXPNO= 4
##$NAME= <1H>
##$PROCNO= 1
##$TYPE= <nmr>
##$USER= <iren>
##$AMP= (0..31)
100 100 100 100 100 100 100 100 100 100 100 100 100 100 100 100 100 100 
100 100 100 100 100 100 100 100 100 100 100 100 100 100 
##$ANAVPT= -1
##$AQSEQ= 0
##$AQ_mod= 1
##$AUNM= <au_zg>
##$AUTOPOS= <>
##$BF1= 200.13
##$BF2= 200.13
##$BF3= 200.13
##$BF4= 200.13
##$BF5= 200.13
##$BF6= 200.13
##$BF7= 200.13
##$BF8= 200.13
##$BYTORDA= 1
##$CFDGTYP= 0
##$CFRGTYP= 5
##$CHEMSTR= <none>
##$CNST= (0..63)
1 1 145 1 1 1 1 1 1 1 1 1 1 1 1 1 1 1 1 1 1 1 1 1 1 1 1 1 1 1 1 1 1 1 
1 1 1 1 1 1 1 1 1 1 1 1 1 1 1 1 1 1 1 1 1 1 1 1 1 1 1 1 1 1 
##$CPDPRG= <>
##$CPDPRG1= <>
##$CPDPRG2= <>
##$CPDPRG3= <>
##$CPDPRG4= <mlev>
##$CPDPRG5= <mlev>
##$CPDPRG6= <mlev>
##$CPDPRG7= <mlev>
##$CPDPRG8= <mlev>
##$CPDPRGB= <>
##$CPDPRGT= <>
##$D= (0..63)
0 2 0 0 0 0 0 0 0 0.06 0 0.03 0 0 0 0 0.0002 0 0 0 0 0 0 0 0 0 0 0 0 0 
0 0 0 0 0 0 0 0 0 0 0 0 0 0 0 0 0 0 0 0 0 0 0 0 0 0 0 0 0 0 0 0 0 0 
##$DATE= 1729503554
##$DBL= (0..7)
120 120 120 120 120 120 120 120 
##$DBP= (0..7)
150 150 150 150 150 150 150 150 
##$DBP07= 0
##$DBPNAM0= <>
##$DBPNAM1= <>
##$DBPNAM2= <>
##$DBPNAM3= <>
##$DBPNAM4= <>
##$DBPNAM5= <>
##$DBPNAM6= <>
##$DBPNAM7= <>
##$DBPOAL= (0..7)
0.5 0.5 0.5 0.5 0.5 0.5 0.5 0.5 
##$DBPOFFS= (0..7)
0 0 0 0 0 0 0 0 
##$DE= 6
##$DECBNUC= <off>
##$DECIM= 32
##$DECNUC= <off>
##$DECSTAT= 4
##$DIGMOD= 1
##$DIGTYP= 9
##$DL= (0..7)
0 120 120 120 120 120 120 120 
##$DP= (0..7)
150 150 150 150 150 150 150 150 
##$DP07= 0
##$DPNAME0= <>
$$ [...]
##$SW= 21.9926370048069
##$SWIBOX= (0..15)
0 0 2 0 0 0 0 0 0 0 0 0 0 0 0 0 
##$SW_h= 4401.40845070422
##$TD= 16384
##$TD0= 1
##$TE= 300
##$TE2= 300
##$TE3= 300
##$TEG= 300
##$TL= (0..7)
0 120 120 120 120 120 120 120 
##$TP= (0..7)
150 150 150 150 150 150 150 150 
##$TP07= 0
##$TPNAME0= <>
##$TPNAME1= <>
##$TPNAME2= <>
##$TPNAME3= <>
##$TPNAME4= <>
##$TPNAME5= <>
##$TPNAME6= <>
##$TPNAME7= <>
##$TPOAL= (0..7)
0.5 0.5 0.5 0.5 0.5 0.5 0.5 0.5 
##$TPOFFS= (0..7)
0 0 0 0 0 0 0 0 
##$TUNHIN= 0
##$TUNHOUT= 0
##$TUNXOUT= 0
##$USERA1= <user>
##$USERA2= <user>
##$USERA3= <user>
##$USERA4= <user>
##$USERA5= <user>
##$V9= 5
##$VALIST= <valist>
##$VCLIST= <CCCCCCCCCCCCCCC>
##$VD= 0
##$VDLIST= <DDDDDDDDDDDDDDD>
##$VPLIST= <PPPPPPPPPPPPPPP>
##$VTLIST= <TTTTTTTTTTTTTTT>
##$WBST= 1024
##$WBSW= 25
##$XGAIN= (0..3)
0 0 0 0 
##$XL= 0
##$YL= 0
##$YMAX_a= 270130
##$YMIN_a= -474953
##$ZGOPTNS= <>
##$ZL1= 120
##$ZL2= 120
##$ZL3= 120
##$ZL4= 120
##$ABSF1= 10
##$ABSF2= 0
##$ABSG= 5
##$ABSL= 3
##$ALPHA= 0
##$AQORDER= 0
##$ASSFAC= 0
##$ASSFACI= 0
##$ASSFACX= 0
##$ASSWID= 0
##$AUNMP= <proc_1d>
##$AXLEFT= 0
##$AXRIGHT= 0
##$AXTYPE= 0
##$AXUNIT= <>
##$AZFE= 0.1
##$AZFW= 0.1
##$BCFW= 1
##$BC_mod= 2
##$BYTORDP= 1
##$COROFFS= 0
##$CY= 7568.61572265625
##$DATMOD= 1
##$DC= 2
##$DFILT= <>
##$DTYPP= 0
##$F1P= 17.9538593292236
##$F2P= -4.03888763876832
##$FCOR= 0.5
##$FTSIZE= 32768
##$FT_mod= 4
##$GAMMA= 1
##$GB= 1
##$INTBC= 1
##$INTSCL= 1
##$ISEN= 128
##$LB= 0.02
##$LEV0= 0
##$LPBIN= 0
##$MAXI= 945.577
##$MC2= 0
##$MEAN= 0
##$ME_mod= 0
##$MI= -402.1523
##$NCOEF= 0
##$NC_proc= 0
##$NLEV= 6
##$NOISF1= 8.587773
##$NOISF2= 6.764455
##$NSP= 1
##$NTH_PI= 0
##$NZP= 0
##$OFFSET= 15.99637
##$PC= 1
##$PHC0= -32.95184
##$PHC1= -4.592786
##$PH_mod= 0
##$PKNL= yes
##$PPARMOD= 0
##$PPDIAG= 0
##$PPIPTYP= 0
##$PPMPNUM= 100
##$PPRESOL= 1
##$PSCAL= 0
##$PSIGN= 0
##$REVERSE= no
##$SF= 200.13
##$SI= 32768
##$SIGF1= 18.5376
##$SIGF2= -6.396296
##$SINO= 400
##$SIOLD= 32768
##$SREGLST= <1H.CDCl3>
##$SSB= 3
##$STSI= 0
##$STSR= 0
##$SW_p= 4401.40845070422
##$SYMM= 0
##$S_DEV= 0
##$TDeff= 0
##$TDoff= 0
##$TI= <>
##$TILT= no
##$TM1= 0
##$TM2= 0
##$TOPLEV= 0
##$USERP1= <user>
##$USERP2= <user>
##$USERP3= <user>
##$USERP4= <user>
##$USERP5= <user>
##$WDW= 1
##$XDIM= 8192
##$YMAX_p= 0
##$YMIN_p= 0
$$ End of Bruker specific parameters
$$ ---------------------------------
##NTUPLES= NMR FID
##VAR_NAME=  TIME,          FID/REAL,        FID/IMAG
##SYMBOL=    X,             R,               I
##VAR_TYPE=  INDEPENDENT,   DEPENDENT,       DEPENDENT
##VAR_FORM=  AFFN,          ASDF,            ASDF
##VAR_DIM=   8192,          8192,            8192
##UNITS=     SECONDS,       ARBITRARY UNITS, ARBITRARY UNITS
##FACTOR=    0.0002272,     1,               1
##FIRST=     0,             0,               0
##LAST=      1.8609952,     24,              -25
##MIN=       0,             -474953,         -474953
##MAX=       1.8609952,     270130,          270130
$$ Real data points
##PAGE= N=1
##DATA TABLE= (X++(R..R)), XYDATA
0 0 0 0 0 0 0 0 0 0 0 0 0 0 0 1 -16 16 -16 16 -32 32 -32 48 -48 64 -65 80 -96 112 -128 145 -161 192 -209 241
34 241 -273 305 -349 386 -434 483 -537 598 -663 737 -816 900 -995 1094 -1207 1328 -1464
51 -1464 1614 -1776 1964 -2168 2400 -2662 2965 -3319 3735 -4234 4844 -5615 6618 -7993 9996
66 9996 -13196 19154 -34097 155983 162900 -210354 -354146 -352839 -155449 37341 178894 180278
78 180278 123880 47158 30483 30611 22125 -49653 -138636 -196940 -154760 -28302 138561 248573
90 248573 248516 123528 -51909 -188731 -213628 -140038 -23879 62484 96159 84573 61377 45073
102 45073 38164 17931 -28602 -92555 -128673 -100920 -12110 85681 133326 105519 27423 -48601
114 -48601 -77624 -51187 -33 27844 7757 -39369 -64743 -34873 36515 99043 106640 49389
126 49389 -41017 -111725 -118881 -58603 29714 86132 75047 13747 -45180 -54701 -10297 49331
138 49331 73487 34539 -49193 -121688 -124770 -45817 68767 145148 135110 48192 -58851 -123132
150 -123132 -115394 -51480 22783 61419 50418 13030 -12301 -6372 17076 27786 7123 -34845
162 -34845 -69846 -70818 -31033 30737 77784 80750 37357 -23462 -63726 -64321 -33197 2976 22490
175 22490 19042 3639 -5671 1793 19038 25059 6598 -28131 -52767 -45851 -8821 33391 52428
188 52428 36156 -3824 -40365 -47807 -21456 18510 41796 30968 -4530 -37369 -44552 -22357
200 -22357 12093 36295 34598 9686 -19194 -30932 -17659 7237 20930 11154 -14664 -34450
212 -34450 -29929 -351 37041 56753 41968 -2803 -50311 -70828 -50354 -3316 40467 57018
224 57018 42154 10635 -16774 -27031 -20773 -9666 -5943 -10985 -13576 -3118 19087 39177 41504
237 41504 20884 -13407 -43664 -53139 -36042 -886 32797 46369 35291 10989 -10056 -18586
249 -18586 -16102 -10470 -7874 -9392 -9643 -1724 15662 33379 36961 18891 -12460 -38269 -43427 -24939
263 -24939 4684 29501 36905 24830 3187 -13448 -15706 -7187 780 944 -4551 -8049 -3672 7034
277 7034 18139 22202 14485 -3115 -20566 -25440 -14276 5198 19705 21094 10878 -2887 -11609
290 -11609 -10184 -354 9904 11267 1700 -10095 -12695 -3978 9067 16703 13943 3216 -8826 -14521
304 -14521 -9716 2192 12274 12523 3501 -6033 -8285 -2881 4941 8944 7607 1103 -7187 -10753 -5719
319 -5719 5092 13026 11887 3006 -6405 -10192 -7035 532 7980 10289 5091 -4234 -9036 -5015 4201
334 4201 9766 7463 -684 -7690 -9196 -4655 3843 10850 11049 3590 -6614 -10927 -6783 808 5812
349 5812 5602 2950 -756 -3339 -2753 1299 4992 4033 -2124 -7841 -7821 -2087 4868 9035 8702 3546 -4500
366 -4500 -10373 -9602 -2393 5294 7413 3583 -1226 -2850 -1431 726 2310 1521 -1900 -6307 -6854 -2028
382 -2028 5481 9133 6241 -201 -5316 -7241 -6317 -2501 2568 5700 4442 287 -2920 -2737 -210 470
398 470 -556 -1888 -2678 -2500 -1104 2425 5642 5173 -293 -6351 -8471 -5118 258 4319 5749 4179
414 4179 656 -3818 -5295 -3292 -401 325 -979 -1271 505 2681 2899 1562 -757 -3031 -5397 -6201
430 -6201 -3288 1844 5880 6097 3108 -76 -3306 -5257 -5133 -2476 660 2197 1335 276 1048 2656
446 2656 2405 -143 -3182 -5078 -5009 -3425 -131 3748 5449 3862 631 -1694 -2156 -2169 -2698 -2904 -1983
463 -1983 -369 892 1859 2820 3830 2806 177 -2800 -4394 -4613 -3926 -2366 787 4249 5858 5165
479 5165 3149 795 -1978 -5247 -7477 -6949 -3085 2256 6674 8862 7866 4016 -1534 -6337 -8178 -6571
495 -6571 -4145 -1192 1990 5832 8590 8504 5295 241 -5305 -9693 -11440 -8685 -1849 6388 12163 13262
511 13262 9814 2560 -5831 -11514 -12630 -8389 -1306 4575 7889 8794 7630 5174 1494 -3000 -6449
526 -6449 -8378 -8503 -5670 -544 6117 10891 11393 8261 2545 -4164 -10229 -12566 -10137 -3195 4559 9580
542 9580 11059 8784 4017 -1345 -5193 -7025 -6159 -4494 -2725 -705 2619 5884 7993 8041 5885 1689
558 1689 -4278 -10491 -13000 -10141 -2045 6993 13195 14503 10161 2049 -6597 -11347 -10682 -6223 -1480
573 -1480 1589 3312 5072 6598 7427 6659 3800 -1626 -8413 -14374 -14179 -7416 3514 13335 18464 16244
589 16244 7515 -4668 -14649 -17458 -12678 -3927 3991 8723 9871 8861 5824 2510 -454 -3383 -6879
604 -6879 -10518 -11225 -7073 352 8635 14266 15807 11635 1827 -9587 -17773 -18273 -11421 -1129 8872
619 8872 15202 15745 10304 1646 -5995 -9491 -9677 -7718 -5179 -2016 1957 5280 7827 9660 10098 6304
635 6304 -1824 -11588 -17565 -16355 -8386 3627 14693 20097 16903 5661 -7282 -14810 -14842 -9562 -2939
650 -2939 2797 5842 5864 5044 4665 5226 4979 1248 -5867 -12321 -14478 -10454 -1959 8823 17030 18309
666 18309 10755 -1376 -12112 -16224 -13568 -6961 744 6856 9921 8666 5355 2637 492 -1848
680 -1848 -5105 -7938 -8855 -6901 -2934 3110 9369 13504 12422 5629 -3983 -11937 -15420 -13388 -6616
695 -6616 3395 12096 15192 12082 4631 -3184 -8529 -10673 -9293 -5032 102 3390 4754 5444 6314
710 6314 6456 3937 -1068 -7015 -11081 -11839 -7493 920 10219 14999 12683 4572 -4619 -10832 -11912 -8613
726 -8613 -2257 4357 7454 6652 3534 902 -126 -428 -1159 -2649 -3861 -4565 -3808 -625 3669 7321
742 7321 7178 3801 -1402 -4978 -6053 -5163 -2338 1270 3576 3801 2495 792 279 -96 -754 -960 -1028
759 -1028 -1004 -1642 -2193 -1499 680 3112 4420 3873 2098 -719 -3909 -5814 -5354 -2228 1590 4695 5578
776 5578 4743 2156 -960 -4082 -4571 -3573 -1733 -51 988 2020 3326 3694 3045 1302 -1265 -4065
792 -4065 -5767 -5116 -1541 2678 5757 6073 4029 902 -2453 -4503 -4843 -3004 -596 1668 2577 3033
808 3033 2527 1581 323 -1330 -2052 -2303 -2194 -1548 31 1824 3184 2712 1389 -105 -1285 -1777 -1789 -1180
826 -1180 -154 452 953 1077 1298 1167 493 -329 -1098 -999 -558 -417 -610 -597 384 1256 1504 1443 1061 110 -1146
847 -1146 -2077 -2263 -1329 55 1024 2153 2238 1905 284 -1084 -2041 -2008 -1344 -706 272 1502 2142 1930 963
866 963 -181 -1040 -1901 -2173 -1727 33 1573 2174 1827 870 183 -706 -1605 -1878 -1318 -314 409 1072 1532
885 1532 1718 626 -543 -1512 -1320 -789 -512 -155 663 1552 1468 486 -502 -747 -846 -909 -847 96 1034 1026 659
906 659 99 -33 -214 -870 -1243 -446 444 770 555 197 197 156 -246 -679 -662 -172 -5 -266 106 685 993 541
928 541 -567 -472 -34 -220 -478 -510 389 766 578 192 302 136 -194 -1121 -999 -256 311 26 149 692 984
949 984 503 -607 -1168 -757 -614 -316 243 782 952 640 -195 -542 -668 -485 -581 -560 454 1263 877 181
969 181 -337 -118 -377 -880 -911 -207 684 803 444 593 667 -137 -1246 -1531 -575 455 883 735 641 723 46
990 46 -883 -1078 -601 -85 -40 89 756 1220 736 62 -669 -702 -655 -770 -589 147 1230 1191 446 -77 -452 -636
1012 -636 -932 -750 -28 698 517 -59 -4 656 829 10 -772 -891 -311 -375 -31 414 841 569 98 -221 -72
1033 -72 331 294 -273 -612 -556 -363 -109 123 1068 1620 973 -264 -968 -1053 -1136 -645 -102 838 1440 1109 553
1054 553 304 323 -523 -1498 -2115 -1259 291 1441 1998 2105 1156 -134 -1765 -1987 -1527 -452 141 398 943
1073 943 1442 1379 941 527 -566 -1511 -2504 -2430 -1003 1416 2897 2901 1800 -234 -1757 -2486 -2024 -476 1032
1092 1032 1147 291 -29 113 717 1076 937 136 -916 -1982 -2244 -1326 536 2123 2389 1646 187 -791
1110 -791 -1267 -1474 -1236 -353 237 262 328 723 1416 1314 695 -306 -1346 -1620 -1892 -1431 -329 1059 1933
1129 1933 2374 1882 1474 -120 -1958 -3881 -3767 -1685 1090 3412 4239 3296 739 -1908 -3480 -2952 -1313
1146 -1313 392 1062 781 271 463 1042 1702 1812 902 -1590 -4091 -4703 -2590 1015 4237 5451 3840
1163 3840 546 -3022 -4683 -3888 -802 1810 2538 1673 -43 -832 -495 616 1628 1467 332 -1932
1179 -1932 -3210 -2730 -473 1902 3216 3449 1858 -19 -2171 -3179 -2702 -1205 231 1026 1403 1772
1195 1772 1827 775 -316 -827 -1132 -971 -1167 -874 -635 119 707 1818 2788 2885 1473 -1661 -4262 -5108
1213 -5108 -3218 299 3610 5454 4642 1423 -2659 -4773 -3911 -1048 1312 2282 1521 -32 -1009 -813
1229 -813 824 2768 2818 396 -3112 -5093 -3824 -665 2922 5302 4933 1663 -2424 -4460 -3761 -1228
1245 -1228 1340 2161 1691 108 -515 -869 -95 1599 1972 680 -1399 -2566 -2351 -910 806 1967 2484
1262 2484 2041 603 -1080 -1815 -1629 -1216 -1128 -272 879 1921 2334 1117 -133 -1224 -1866 -1528 -654 389
1280 389 853 340 -637 -71 1091 2262 1764 186 -1910 -3233 -3455 -1529 1736 4205 4430 1836 -1522
1297 -1522 -3505 -3144 -1495 788 2453 2141 234 -1367 -1792 24 1982 2329 992 -1248 -2759 -2858
1313 -2858 -1314 1431 3337 3192 974 -1496 -2625 -1862 -171 900 1162 555 -372 -1075 -477 777 1684
1330 1684 1336 -367 -1598 -1876 -1215 122 1141 1363 1297 163 -467 -567 28 98 -604 -1205 -1244 -221 963
1349 963 1885 2009 1061 -712 -2041 -2332 -798 994 1689 1198 94 -642 -532 247 919 830 -79 -1562
1367 -1562 -1985 -1327 700 2223 2167 988 -806 -1976 -2320 -1032 686 2016 1560 97 -1579 -1519 -288
1384 -288 926 1405 913 -233 -1516 -1661 -642 1121 2041 1433 -370 -1508 -1278 -411 786 1354 903
1401 903 -354 -1592 -1478 -595 1082 2102 1404 -111 -1516 -1787 -949 369 1275 1143 453 -670 -1046
1418 -1046 -276 599 870 285 -499 -1232 -1084 46 1170 1759 1324 -290 -1780 -1852 -774 568 1437 1190
1436 1190 209 -687 -836 -229 480 886 484 -523 -1065 -785 90 1062 1215 563 -467 -1425 -1377 -422 934
1455 934 1680 1116 -232 -1227 -1320 -455 608 1116 898 46 -988 -1097 -435 739 1120 638 -410 -1114 -924
1474 -924 126 846 1462 867 -177 -1437 -1646 -443 873 1404 1121 58 -869 -1156 -932 92 776 912
1492 912 338 -641 -873 -229 647 850 335 -233 -810 -829 -130 660 1411 985 -238 -1383 -1134 -256 562 1054
1512 1054 750 232 -744 -878 -684 320 837 685 -79 -617 -518 188 596 749 226 -248 -762 -1029 -220 975
1532 975 1207 900 -396 -982 -914 -457 112 901 997 230 -576 -936 -223 447 527 98 -256 -442 -503 -47 572
1553 572 885 518 -481 -1069 -974 -63 781 950 644 182 -692 -831 -583 -53 747 741 129 -509 -344 -55 125
1574 125 368 143 78 -289 -577 -223 585 1031 459 -261 -687 -613 -381 122 383 541 280 -361 -555 -218 241
1595 241 473 135 -124 -127 -131 -205 -105 79 286 -84 -349 -234 76 700 362 -139 -308 -552 -492 -161 270 673
1617 673 756 168 -546 -566 -349 -18 168 86 391 145 -42 -158 25 376 112 -458 -510 -88 168 563 567 684
1639 684 209 -347 -831 -728 -150 312 327 300 285 295 -162 -151 -218 -214 -178 -76 -105 151 318 356 -22 -133 -180 -334
1663 -334 -145 -43 277 301 -145 -359 -65 42 365 196 66 140 -39 -138 -233 -87 138 248 215 39 308 -56
1685 -56 14 -255 -52 -158 -83 -197 -21 168 561 542 154 -143 -377 -473 -540 -253 159 835 744 427 111 -313
1707 -313 -554 -539 -703 41 354 527 327 -25 30 -190 -311 -220 -36 -98 -333 -184 111 460 593 289 135
1728 135 -174 -464 -470 -510 -209 338 634 633 5 -248 -274 -311 -72 151 326 17 -37 -188 -190 6 50 470 490 372
1752 372 -221 -747 -600 -397 46 606 814 664 308 -412 -716 -609 -165 21 220 279 -101 131 -39 62
1772 62 416 358 47 -359 -942 -841 -254 439 1122 1180 659 -229 -1031 -1422 -949 158 861 1163 481 -137 -323
1793 -323 -648 -386 64 362 327 164 -368 -278 125 399 347 517 366 -142 -501 -812 -136 175 442 562 292
1814 292 123 -391 -315 -259 158 249 142 -41 -182 -376 -381 -91 275 689 709 -24 -404 -733 -792 -358 353 874
1836 874 921 791 -73 -803 -916 -483 68 235 434 312 74 -388 -331 172 638 484 -52 -590 -681 -394 307
1857 307 540 855 738 51 -865 -1129 -578 292 709 841 598 195 -546 -765 -384 174 515 257 32 -112
1877 -112 -292 -88 -96 146 398 321 -208 -490 -171 -46 -186 -108 -30 179 170 -93 1 10 -4 -117 -165 36 80 52 -97
1902 -97 -245 -65 409 462 200 -58 -449 -523 -560 -54 738 805 749 2 -539 -642 -736 -51 435 479 478 109 -329
1925 -329 -244 -50 319 293 71 -157 -432 -349 72 585 689 302 -263 -639 -723 -332 141 624 713 149 -206 -490
1947 -490 -368 96 210 375 -33 -295 -212 -219 20 189 284 34 -269 -224 124 214 318 77 -168 -132 -205 -60 344
1970 344 387 340 73 -312 -358 131 101 226 109 22 -128 -132 -8 143 332 -220 -503 -409 -173 265 591 689 207
1993 207 -369 -702 -791 -308 254 571 344 -82 -399 -223 -63 24 178 276 -5 -462 -283 86 554 550 144 -164
2015 -164 -776 -429 12 309 656 384 20 -523 -712 -225 246 440 401 67 -255 -303 -155 -11 256 418 123
2036 123 -75 -69 -119 354 216 -113 -329 -309 -365 26 490 585 376 -66 -618 -521 -248 118 161 233 170 -114 -197 -51
2060 -51 65 152 40 -417 -326 -219 152 494 372 259 -243 -659 -537 -121 244 746 361 -2 -59 -518 -69
2081 -69 56 255 258 214 -168 -281 46 429 361 30 -21 -372 -203 6 207 411 104 -30 -500 -548 -147 144
2103 144 313 363 180 -316 -377 -271 -132 142 220 40 -290 -159 161 311 173 105 -133 -284 -350 -5 325 564
2125 564 238 -268 -196 -545 -162 266 307 222 60 -53 -135 -133 190 297 -156 130 -216 65 221 125 164 171 -78
2148 -78 -476 -437 -163 241 539 275 148 -253 -275 -210 31 419 385 8 -509 -306 -130 189 240 -26 -292 -114
2170 -114 -143 -17 217 456 131 -211 -489 -387 -100 390 317 261 88 -195 -481 -486 35 376 341 4 -105 -255
2192 -255 -90 -102 69 205 13 -404 -362 52 475 430 286 -115 -349 -527 -329 159 277 435 135 -199 -332
2213 -332 -54 -35 42 -208 -42 -44 -17 116 272 412 170 -272 -448 -309 159 268 290 400 -59 -456 -283 -111
2235 -111 265 548 383 -217 -390 -279 -207 -1 270 224 230 -173 -177 -155 306 250 3 -132 -420 -315 -153 221 447
2258 447 227 17 -210 -399 -259 -156 269 233 249 94 -56 -2 -98 158 35 -131 -209 -111 186 323 341 171
2280 171 -79 -305 -403 -33 178 351 207 74 -121 -208 32 -26 23 -137 136 -211 -180 67 59 255 -7 -94 -116
2303 -116 -272 -210 64 129 272 133 -189 -383 -160 61 265 248 22 32 -326 -276 -62 -26 181 189 116 115 86 -8
2327 -8 -175 -113 -188 -165 160 64 218 77 26 -92 -328 -148 19 70 12 30 108 127 114 154 3 -182 -358 -281 -229
2352 -229 225 297 357 280 -43 -145 -407 -538 -240 110 452 284 -29 -211 -290 -48 -139 189 23 -91 -86 -231
2374 -231 -267 -75 198 244 174 26 -123 -20 -109 -30 47 73 -155 -246 61 19 107 -215 419 209 -167 -271 -274 -254
2398 -254 -32 222 430 326 267 11 -432 -601 -70 278 338 358 -47 73 -304 -293 -186 5 269 57 -142
2419 -142 -36 -18 36 87 59 111 -120 -239 -350 -70 199 435 248 183 -137 -7 -284 -193 -169 197 147 234 87
2442 87 -65 -173 -175 -113 226 189 276 8 -105 -158 -12 -88 -79 316 210 306 -165 -102 -246 -16 196 208 193 132 -292
2467 -292 -179 -170 240 243 205 -177 -135 -382 -31 339 280 513 262 -94 -433 -329 27 21 297 414 339 -165 -375
2490 -375 -305 -258 -49 99 87 -169 92 139 -76 45 79 65 -331 -256 -11 191 183 219 -39 100 -142 -184 -152 30
2514 30 221 8 51 -100 18 165 78 -97 -33 69 215 123 136 20 -171 -172 -177 -171 230 293 211 20 -218 -345 -274
2539 -274 97 218 241 182 -221 -172 -34 139 275 117 163 10 -214 -293 33 410 487 89 8 -417 -161 -78 285
2562 285 333 403 150 -151 -73 -191 -68 91 120 -1 -100 90 -41 19 286 149 -48 -170 -9 109 346 210
2584 210 81 -38 -132 -343 -171 -49 341 146 29 78 -90 44 141 -244 -33 -82 -100 162 100 212 118 -65
2606 -65 -152 -290 -34 199 118 374 58 -255 -176 -358 -162 215 376 112 -172 -322 -210 -121 170 260 217 -27
2628 -27 -188 -86 -98 347 70 115 -103 -322 -93 -136 36 284 382 30 -65 -374 -183 33 280 260 -122 -81 -68
2651 -68 48 -51 -57 -47 2 -189 -23 139 136 164 -141 -218 -175 -87 73 247 438 125 49 -222 -367 -15 -27 181 123
2676 123 112 -98 -222 -144 129 141 116 -176 -317 -88 35 246 299 294 -80 -206 -276 -46 206 273 141 -13 -249
2699 -249 -67 -43 -87 198 222 -71 45 -16 -96 103 235 -11 -144 -47 -89 -86 70 342 -72 37 -403 -159 143
2722 143 148 215 160 2 -50 -101 -50 131 40 -105 56 -9 15 119 212 104 31 -51 -213 -281 -104 276 253 173 -37
2747 -37 -328 -118 -207 -133 231 171 207 62 -203 36 -146 -36 -56 -84 -101 14 -8 198 205 -61 -164 -379 -171 -192
2771 -192 225 53 20 65 25 -91 -29 38 122 -25 -111 -156 24 74 29 113 65 -161 -120 -267 55 342 156 -5
2795 -5 -73 -234 -179 -61 35 144 71 -12 -254 -245 -172 40 156 112 39 -188 -100 -13 34 7 197 -74 -301 -243 201 177
2821 177 43 124 65 -38 -165 -131 14 4 104 -13 -12 12 92 -32 -287 -80 -95 -89 123 144 150 228 -150 -228 -231 -55
2847 -55 -160 119 209 101 -10 -86 -177 -187 323 143 111 150 -49 -130 -169 20 122 131 -4 -110 -121 -50 146 -15
2871 -15 -59 -63 -49 -34 -106 31 182 157 -45 -36 -5 -240 230 16 -40 105 5 -124 20 61 -53 -64 -78 -72 -77 67
2897 67 107 82 -6 -136 -51 -293 -170 123 201 247 11 13 139 17 119 -118 0 31 -77 -94 -78 271 81 64
2921 64 -47 -198 -151 -171 -14 251 77 -83 -97 -60 -74 -68 -140 164 43 -21 -228 -75 -49 -13 12 52 6 17 -22 8
2947 8 -142 -6 -24 101 43 -53 96 120 55 66 -113 -26 -113 -63 30 17 30 -22 164 -110 -19 -97 49 -347 -79 164
2973 164 175 201 20 -119 -222 -279 -341 -7 111 341 183 180 -168 -177 -208 -109 -125 274 -14 61 -75 149 72 167 76
2998 76 -113 10 -19 35 6 170 40 -23 -177 134 -177 -33 67 -103 2 -21 68 -96 -129 19 -81 66 80
3021 80 230 150 -94 -165 -240 9 -18 -115 160 83 42 -292 -214 -102 64 44 -83 -38 32 -12 -205 142 75 233 55
3046 55 -21 -188 0 288 283 138 166 48 155 -269 -180 -99 131 192 -35 210 -113 -185 -25 -183 -75 48 214
3069 214 11 62 89 -40 -77 -89 8 142 108 14 -102 109 -73 -160 33 -60 -29 49 -151 -66 150 143 90 -89 -36
3094 -36 -66 -81 -48 100 343 58 72 -51 -66 -69 -135 -16 80 114 25 -151 10 52 136 -187 87 102 69 29 -63 93
3120 93 -62 -100 -127 0 21 45 -21 32 12 -56 -129 -7 -97 120 1 31 74 -172 187 176 -56 -325 -245 -211 122
3145 122 172 241 134 71 -167 -181 -95 -131 196 104 88 -142 -69 -232 -98 72 234 209 19 98 -51 55 183 189
3169 189 -50 -186 -68 -234 -28 198 201 17 131 -67 -118 -58 58 88 46 141 22 -21 -67 -37 -90 -27 269 -90
3193 -90 -137 -24 -31 223 4 22 -13 5 -60 142 138 33 95 -149 25 -146 51 251 -112 -108 -59 -169 -145 107 82
3218 82 -6 -167 -73 -173 -1 144 51 -6 -29 -144 -159 -210 36 121 -7 14 -266 -233 -121 -51 94 225 -82 29
3242 29 -18 -157 21 146 60 -7 100 56 104 24 8 14 44 -78 -45 59 67 112 258 54 134 44 -57 62 130 -35
3268 -35 -49 -158 55 -40 45 -106 -22 -155 -190 -189 -4 122 47 134 -262 -140 -248 -8 11 101 61 -46 100 -74
3292 -74 -153 -20 74 66 104 -129 -180 185 75 -23 6 -64 -46 -97 21 44 180 -70 146 -150 -26 -85 -35 9 49 49
3318 49 -27 -204 -231 37 -73 22 17 -133 -95 193 178 66 -126 -114 -71 3 -127 170 21 184 -54 -79 -116 29
3342 29 -21 25 29 183 -66 22 121 -118 8 91 -82 -93 141 -26 186 250 -14 -63 -201 -99 -24 0 82 129 23
3367 23 -105 -134 -104 -27 -34 34 -38 -33 48 61 40 -113 -49 106 -8 -40 31 108 242 104 -311 -186 -83 2 77 89 372
3394 372 -98 17 -32 -82 12 40 33 29 54 180 -39 144 38 114 33 -125 -35 11 -54 181 214 -3 -23 -101 -78 -19
3420 -19 -17 162 141 -30 -153 -177 -144 48 140 13 -97 63 103 -1 112 136 -55 -129 -221 7 182 12 333 -257
3444 -257 -41 -84 -185 187 39 33 -8 -179 88 -40 -10 22 71 -6 -144 2 -126 186 156 32 -2 -200 -129 8
3468 8 25 69 188 -145 -168 -134 -54 22 -63 104 91 7 22 -75 -94 191 67 31 35 10 -206 6 -151 165 -108 -113 -164
3495 -164 -137 51 105 21 61 -126 12 -138 -138 29 70 79 10 147 -43 -4 -45 -17 -159 -108 -51 138 188 34 -68
3520 -68 -54 144 -140 105 -58 56 53 -71 -182 -41 47 -151 47 77 162 -233 19 -107 33 89 64 94 -193
3543 -193 -50 -101 171 28 64 51 49 -86 -232 -4 97 133 184 -58 13 -110 -139 -33 157 -100 -60 68 -27 146
3567 146 81 -130 132 55 -252 -78 168 13 -52 25 54 29 -212 -92 -98 -60 -39 44 -73 -41 115 -234 -226 -6 16
3592 16 -54 70 266 184 -27 -128 -233 -70 -98 52 111 79 -149 -13 -48 -118 -17 42 127 84 -241 24 43 -1
3616 -1 -53 86 -134 -53 -29 -174 -9 -54 61 -105 -87 -94 71 200 97 -75 189 107 -109 -100 -35 -18 -90 51 80
3641 80 32 8 19 -33 -211 -97 -1 -65 11 292 224 -93 -52 -264 90 115 -44 159 34 143 -64 -246 -127 -99
3665 -99 6 -199 69 6 38 -131 75 239 56 24 -83 -222 -30 96 -1 45 32 29 -169 -91 -135 -137 44 -63
3689 -63 17 83 102 -108 122 144 137 -10 144 64 114 108 -39 -194 206 -100 93 123 55 -21 24 68 113 113 -147 -87 11
3716 11 183 -34 38 178 132 159 -109 -158 -6 28 56 192 81 163 73 -139 -31 -68 89 250 58 -4 118 -4
3740 -4 -93 -189 126 108 29 70 8 235 -83 -123 102 -16 -29 -93 -124 -201 105 49 26 -157 97 -2 -55 -293 24 -6
3766 -6 120 66 173 42 -15 -12 20 163 -21 127 130 -117 -324 -88 46 -244 -125 -11 139 -80 -98 -120 -133 -66
3790 -66 -17 -4 -31 -95 46 85 -73 -97 -24 -94 -152 151 -4 -16 48 103 228 -89 -11 -203 -60 -37 -27 -17 12 -34
3816 -34 10 -136 91 250 134 -79 136 -37 61 -19 -68 -156 -59 141 46 -32 -21 57 -69 -115 42 117 -206 -96
3840 -96 -21 -115 95 -81 -57 160 75 28 83 -79 -71 219 176 101 -51 44 -144 -82 0 56 62 49 -133 67 9 -89 92
3867 92 -121 116 -103 43 72 67 111 -89 -33 -39 47 -19 139 113 45 86 247 65 -49 -117 -19 26 46 36 136 -25
3893 -25 -87 -37 22 -66 -48 -32 99 -39 130 -29 -183 -95 -143 -23 31 74 18 -22 236 -39 39 170 -3 50 89
3918 89 -5 12 60 67 145 8 -112 -155 -184 -74 57 45 -132 -90 -110 -156 33 -121 197 216 62 -76 -183 -165 -44
3943 -44 -33 36 -1 -17 10 45 97 -113 123 2 -74 -36 200 -30 81 -94 -84 -57 -11 -128 -102 -35 -159 -7 -109
3968 -109 20 -12 -64 -34 4 -85 -76 46 90 99 246 64 30 -366 -135 -69 125 163 -81 -237 -186 -139 -6 -35 19 -87
3994 -87 -52 105 110 7 -155 74 83 -214 32 24 -83 162 82 -79 170 -20 -45 -72 67 269 50 197 4 11
4018 11 -97 152 -101 83 -4 89 -72 53 102 37 -81 -150 53 -102 176 143 117 -17 3 -63 -210 -164 60 -61
4042 -61 45 -47 -101 40 -114 31 -34 -75 145 -138 -132 -5 19 -45 26 -60 -138 -60 45 137 14 32 61 0 214 39
4068 39 138 115 -84 125 67 28 53 -14 27 82 -178 39 -6 48 21 106 67 32 22 -72 91 140 -37 16 43 -12 -52
4095 -52 -100 0 -22 -74 -54 -22 23 57 -46 -31 41 -184 -69 -108 -24 54 134 -83 -39 18 -35 61 221 -15 169 147
4121 147 173 -201 -148 -72 54 54 -73 -132 124 -172 -125 174 -159 70 -48 159 84 125 -104 -133 -107 -186 -11 -39
4145 -39 84 18 80 8 64 60 -25 -8 -17 -95 -82 -168 44 -69 88 99 -132 -132 10 47 107 38 115 63 -132 -62 -25 -3
4173 -3 -133 -35 51 152 -2 133 -60 -106 -46 -41 128 -126 102 -7 16 44 -83 -49 40 65 -126 -96 97 127 -31
4198 -31 -26 -190 16 -141 -30 103 -12 -48 -37 50 128 54 -101 -250 -177 -14 20 34 -1 -171 -193 183 57 -134
4222 -134 104 -140 -102 -13 101 -68 -100 33 -43 52 60 18 103 54 118 25 -31 77 -116 103 78 56 -65 -61 79 45
4248 45 -57 18 8 91 -73 112 63 -49 -1 -107 -84 -67 -89 18 54 -59 14 35 -28 -97 -184 40 -92 65 -123
4273 -123 -77 40 79 148 -113 -35 -63 108 43 -98 -26 -154 -51 28 14 -80 74 -236 -10 160 2 -69 -243 -41
4297 -41 -49 -25 -28 10 -82 59 -66 -89 -27 -117 -162 -33 51 87 66 -139 -86 -327 52 -17 -65 152 81 181 -78 10 139
4324 139 -82 -94 -12 -73 -105 22 11 106 93 -56 -9 160 129 63 -152 -48 -70 109 90 1 -49 -76 11 -110 57
4349 57 84 52 -4 -36 -5 322 66 92 21 -15 56 62 1 -80 31 -55 -139 95 90 -113 12 -8 84 79 -126 -125 42 116
4377 116 93 -77 -44 -1 -24 -139 -143 -101 -111 98 -163 45 -47 -126 2 -1 -28 176 99 -185 64 121 69 76 -7 -291
4403 -291 -96 -1 12 96 -48 -2 -55 -79 127 110 125 -29 -107 177 34 -22 51 137 -38 107 177 8 53 94 -126
4428 -126 101 26 -65 1 -160 115 237 -34 -93 -35 -243 -23 -143 -115 -70 27 -37 2 -105 -150 -17 83 -55 71
4452 71 -101 -93 -20 17 -29 -83 -50 6 48 68 11 -25 21 -42 -15 -40 42 -71 44 -12 -5 -59 -73 -114 122 -2 -5 -60 58
4481 58 112 162 -110 -97 48 -5 -46 -168 76 -41 -12 67 -102 -50 46 -220 -79 86 316 -30 -11 65 113 89 -45
4506 -45 -142 -52 166 115 -101 -27 -98 74 15 -107 68 -66 -166 -221 -25 145 93 -12 -135 -98 109 -85 82
4529 82 313 -12 -6 -63 50 101 -140 73 65 64 -88 9 6 -58 49 59 24 37 -1 34 -77 71 -135 -107 -22 42 -130
4556 -130 100 289 -44 -99 -185 -256 -78 -63 39 -27 -22 -65 7 15 -111 -36 71 11 -54 -28 219 36 5 99 93 2 -90
4583 -90 68 -100 -164 -51 44 10 66 178 -61 -136 141 11 -153 189 83 -40 -119 132 89 -118 59 -56 205
4606 205 110 -64 -71 -37 -39 -22 4 68 35 34 86 -56 71 -104 -82 -342 -152 110 -144 -62 74 -39 -153 -193 -183 6
4632 6 -62 110 157 -105 -230 14 102 114 183 -2 158 102 2 90 30 -70 -98 -23 66 46 -14 -34 -39 262 -105 -179
4658 -179 -92 -12 -55 -194 135 65 197 -89 52 86 192 -29 50 -82 29 -194 63 1 -113 -116 -70 81 -44
4681 -44 219 87 -54 -133 76 -14 -57 145 -74 -39 -49 -47 119 53 24 -144 -122 52 -58 -66 -69 71 52 169 -155
4706 -155 -28 10 -90 67 167 13 -47 144 38 -64 35 78 -50 -108 -144 -152 -51 -183 18 23 13 -72 174 94
4730 94 11 -96 -111 0 -149 -28 78 48 -111 -12 9 88 -185 177 -46 -96 -101 -2 -86 251 73 -66 24 30 -73
4755 -73 -129 78 -5 -21 43 82 -137 -63 16 62 26 65 -57 -52 39 8 -77 -119 88 21 -36 201 229 175 -45 56 38
4782 38 -6 -30 -105 57 261 126 248 81 -8 -20 -303 36 -139 114 16 80 28 -130 115 16 24 186 -32 -125
4806 -125 -90 -10 -6 -99 35 -217 -204 87 -58 -77 51 33 -103 46 128 -47 70 -76 97 -26 -7 -91 -81 45
4830 45 -44 -145 165 85 -84 -52 100 119 2 192 -67 -219 -18 168 -7 47 -144 -93 3 -1 -24 -92 220 29
4854 29 65 -75 103 -117 -65 -115 38 -169 107 47 -33 168 -185 -4 63 -36 -16 33 106 32 -33 181 6 -164
4878 -164 -136 6 91 -232 0 114 -94 50 1 19 -231 -93 69 -8 -121 85 -64 1 44 155 76 -36 -10
4901 -10 8 -13 -52 -14 -146 -139 -168 114 -21 -137 -73 -130 -171 39 29 -140 61 -69 154 -18 67 -120 -4 -6 -6 -123
4927 -123 116 51 0 14 69 -54 10 -7 -172 -11 -36 -103 14 186 -25 189 81 56 126 6 -75 0 -20 -55 108
4952 108 -114 -67 -6 5 -89 -5 236 -150 18 0 7 -196 -49 -130 53 81 -27 146 -62 -21 -97 -161 -14 8 16
4977 16 5 47 23 160 12 -76 -20 -34 14 171 33 55 -125 140 -82 -104 -71 27 -147 68 -49 44 -136 -148 36
5002 36 74 -17 50 3 10 90 61 34 -1 -125 66 -162 18 9 147 42 -177 125 -162 -47 75 112 -49 -63 65
5027 65 103 162 -74 46 2 -38 -31 47 -15 -16 -19 -24 -120 -29 64 50 118 -15 66 -101 11 -68 45 140 13 -24 55 10 11
5056 11 -120 90 -170 -32 164 23 -12 -58 -77 84 66 -56 28 23 71 -27 96 113 117 60 8 -58 0 -6 68 -20 -56
5083 -56 -48 76 5 -3 -209 59 -91 -181 16 -162 18 -4 110 -213 -16 116 98 -205 -169 58 -88 2 -131 -54
5107 -54 -63 -54 35 30 83 5 96 79 191 -181 202 -11 -208 69 -31 129 163 -38 -47 -24 -74 -35 136 -113 33 185
5133 185 15 -19 -56 -157 -100 66 -16 75 58 99 -178 -132 -43 -78 40 123 81 16 -163 109 63 -85 42 -47 -88
5158 -88 108 -17 139 -95 -25 101 -70 -39 -30 54 81 155 66 -190 -97 -97 -105 41 29 71 -32 124 38 -177 101 79
5184 79 -78 -128 -22 -104 6 40 41 -271 -91 -152 88 27 -26 102 73 30 142 -99 -125 -74 -115 83 100 15 8 -96
5210 -96 -109 85 120 86 -26 73 163 91 -4 36 -92 22 -4 41 -123 280 3 -3 148 -145 -58 -101 -60 23 -112 107
5236 107 -11 -38 11 24 -152 86 228 48 -131 -2 -188 31 -5 -39 -137 -89 -200 70 81 119 108 7 -5 -99
5260 -99 -235 -23 69 203 107 69 34 -32 94 84 -150 -117 -113 138 186 96 50 -3 207 -200 -51 39 43 141 111 100 -39
5287 -39 -50 -39 -127 34 101 282 -182 67 17 151 -76 -231 -35 92 81 -110 66 124 69 89 -60 20 51 47 -44
5312 -44 68 66 -26 65 -33 178 14 30 -55 -9 116 -5 24 -152 -83 -123 5 -25 -55 15 8 16 -10 21 50 -103 -107 -18
5340 -18 -20 -70 39 47 7 53 -104 182 -35 -119 99 -168 -69 29 -40 104 283 8 13 -44 50 21 91 -91 -31 53 78
5367 78 -136 -39 65 43 99 -18 138 113 -29 30 -1 15 48 157 6 93 -27 -152 -249 44 121 -9 101 20
5391 20 -111 103 47 80 -81 74 95 -44 50 -117 222 -34 -40 -43 -107 -74 10 -88 5 -214 137 -22 76 -40 1
5416 1 4 -82 -163 -77 -57 -33 247 60 85 -130 -157 76 -77 -3 -8 -201 78 31 -95 17 -103 -98 57 -84 -30 -36 -84
5443 -84 -104 33 -158 203 32 -29 -65 -59 75 -28 47 101 -84 -112 81 71 -5 -69 -66 -15 19 73 105 0 -95 165
5469 165 -115 133 -46 112 -45 -78 54 -220 54 -25 -151 49 -6 46 -96 48 105 116 -78 48 -144 -116
5491 -116 40 -69 -66 -57 108 14 77 47 -313 17 -152 25 -128 -29 24 41 22 -44 47 -82 57 179 -1 71 106
5516 106 -20 -18 35 -198 -54 -93 -40 -73 -22 20 -146 130 -13 20 111 -136 -158 -37 31 150 113 -84 -61 99 -9
5541 -9 38 -62 -222 80 109 -17 -46 -18 36 0 -160 -62 -24 6 85 16 95 -60 -145 4 -181 -77 -119 -74 -234 -121
5567 -121 49 -102 -208 166 -25 5 3 25 -8 -72 -1 -57 8 -26 127 47 102 63 104 40 2 48 33 -217 -89 -59
5593 -59 10 -51 -119 83 -88 157 -68 189 76 -82 72 148 -163 -206 -120 6 148 14 68 31 -3 200 108 -96
5617 -96 -2 -16 -53 -183 113 -36 89 -16 -129 -65 -118 -31 201 -21 -42 -171 56 -119 -57 97 9 0 -150 36
5641 36 140 -41 152 72 125 -39 -89 -18 -13 48 47 -88 -254 -78 75 39 97 15 -82 156 80 34 -164 -214 -95 39
5667 39 271 89 -18 -181 17 134 93 109 202 94 -10 -31 47 124 -63 27 -54 90 115 45 99 43 59 -74 -103
5692 -103 -171 -16 -225 53 48 -60 11 14 -35 -166 9 31 -33 54 73 132 10 -48 149 29 102 49 121 54 -48 43
5718 43 -148 108 -58 -40 122 -67 -10 -53 -189 -34 5 -8 90 57 119 -188 85 -114 77 -3 -172 42 -94
5741 -94 97 40 -4 -73 -70 -122 101 97 -17 214 51 126 -240 14 -8 15 -107 27 70 -86 51 -73 148 -67
5765 -67 -56 135 44 -21 26 -104 -74 14 -5 -26 -50 48 -184 -59 -172 -129 -57 192 -11 75 -186 -71 -23 -6 38 16
5791 16 20 -84 2 22 -86 -140 -111 -127 56 -64 36 -93 77 -88 86 42 86 51 79 2 -43 49 196 33 -118
5816 -118 26 75 -34 -215 -60 -62 -106 -101 -144 51 -142 137 -71 -28 -64 30 -2 -4 8 109 85 -43 31 -134 -33
5841 -33 -7 -4 6 -189 -172 6 -279 -98 7 -27 -28 -71 -172 -70 -60 -108 19 36 71 33 2 135 -2 11 -39 -143
5867 -143 -43 68 158 154 -150 184 78 -140 12 68 26 -37 169 59 187 85 -85 -39 52 69 44 56 -105 64
5891 64 43 93 -13 38 -32 38 0 21 -35 -143 174 15 159 42 108 -76 -115 24 52 -30 38 -93 -98 89 -2 -83
5917 -83 59 -36 101 71 -67 102 55 185 -37 118 109 -100 156 -105 -130 -117 -11 5 -56 73 -40 -101 41 135
5941 135 -43 -10 81 28 28 -20 -167 -19 -164 11 82 -43 -18 61 77 -34 -91 -59 120 -88 -95 47 -100 -24 -64
5966 -64 34 209 18 214 -83 -105 157 -139 59 43 119 62 11 -75 73 -49 49 -28 185 -133 -8 -29 -222 140
5990 140 70 16 138 -126 -20 69 67 127 199 68 -137 23 -23 62 12 -91 10 -100 117 -9 -16 158 51 -26
6014 -26 -52 -59 128 -56 -28 86 110 17 -104 115 -26 -21 21 -75 140 86 -2 52 33 -67 114 13 77 73 36 24 -118
6041 -118 133 -40 133 204 -32 72 51 -51 136 26 99 -242 47 -3 9 122 -60 134 6 -51 6 38 120
6064 120 -25 52 13 -6 87 18 -78 -6 -112 -121 -55 -140 98 -36 -38 -39 -8 41 51 27 18 126 7 64 -41 -95 -165 39
6092 39 96 -38 106 97 -6 8 -32 163 44 -14 26 156 62 47 -10 -3 99 -44 -88 -62 -68 67 -30 7 51 106 -38
6119 -38 135 -38 22 -57 111 54 -70 -27 -92 4 -114 44 138 93 38 86 1 28 35 -121 53 -45 -13 -41 10 64 182
6146 182 -37 94 -1 -106 -6 -45 215 12 4 109 -16 -127 -104 8 23 -41 4 42 -123 -91 26 2 -60 31
6170 31 -63 -112 138 42 -125 14 -94 22 96 -39 113 -112 41 80 176 -58 -72 -74 -54 184 60 107 108 40 31 -12
6196 -12 -103 -88 -7 -72 53 6 94 6 1 154 -29 -122 -88 -26 31 85 -55 44 -113 5 88 -39 25 106 86 -39 -31
6223 -31 118 50 -108 -68 -73 -33 -84 -77 137 5 45 86 -37 69 -118 -100 10 87 -16 23 99 84 229 -111 23
6248 23 27 182 -72 -130 10 86 97 56 114 80 -108 -53 -97 -133 73 -20 -38 39 -43 -91 136 57 51 -32 -110 -28 95 55
6276 55 53 68 52 26 103 -29 -43 -29 -36 60 171 -11 -46 91 -96 7 9 -26 26 -10 -9 82 -173 -82 -168 -24 79 -12
6304 -12 -29 35 -136 22 -8 -256 75 81 91 51 -20 191 115 281 3 -117 106 -149 71 114 175 186 25 41 -102
6329 -102 -35 -8 -19 141 120 -25 105 41 -115 -5 -9 -6 -6 0 97 86 67 -19 35 -31 21 112 13 -50 19 -175 19 35
6357 35 44 187 -75 8 34 36 -44 -207 -18 41 -119 -166 46 62 63 -55 74 22 -209 -119 22 -63 -8 184 84 120
6383 120 -145 -8 21 124 53 35 15 -173 -225 177 74 -10 -122 142 20 -104 167 -97 -107 161 -69 -121 -5
6406 -5 -53 -7 93 67 72 114 4 70 -175 37 -103 -90 99 -159 -45 -39 27 75 -82 -33 -86 26 -45 182 -147 83
6432 83 33 27 35 28 -78 180 144 75 102 44 -15 -124 -9 -300 49 50 81 60 -13 120 73 90 26 154 -87 52 -50
6459 -50 6 31 -34 127 83 -63 37 -163 -100 -29 18 237 -28 12 -25 35 -46 12 22 -29 257 74 -250 -88 -147
6484 -147 -58 -43 1 -103 -17 0 -4 -143 -123 -189 -93 -77 -1 136 81 157 -39 -11 11 -49 149 -114 -56 51 10 -125
6510 -125 165 178 18 114 -18 32 97 -192 34 -69 -61 -45 11 53 -7 -41 -91 -95 164 128 73 -105 55 -43 63 -14
6536 -14 129 28 -28 -1 111 84 101 -74 157 73 53 175 73 -100 -191 -38 -114 10 76 -121 -193 -128 3 -203
6560 -203 46 37 96 97 -107 150 -44 -36 125 40 68 63 205 16 -150 208 206 120 96 39 -25 73 97 17 -207 111 -19
6587 -19 46 -36 -144 -13 -141 -32 54 21 -19 -146 44 45 -40 -121 76 62 -24 148 -31 -102 110 47 137 146 -76 9
6613 9 -41 15 -19 -168 -161 145 45 -80 -21 -74 66 -81 4 70 -89 80 108 28 3 -21 -225 25 -71 50 -200
6638 -200 -21 -25 -175 114 -62 -25 -6 -168 33 -177 90 198 137 8 -111 19 43 105 119 -93 -40 -18 57 239
6662 239 -56 166 116 -32 16 53 -38 -186 86 147 -39 35 -35 72 47 42 -64 38 2 -163 -4 27 71 172
6686 172 -106 68 65 86 -13 90 -13 159 101 70 88 87 58 27 7 -30 90 130 -54 51 123 -143 -52 144 51 116
6712 116 106 84 -77 154 -137 258 -20 132 -77 -95 -33 92 -24 -31 59 -95 -25 -151 63 76 16 135 66 -28
6736 -28 72 28 -127 -114 17 63 156 -50 -29 -46 70 9 49 -2 -59 89 109 27 -55 196 261 118 194 50 -132
6761 -132 84 -125 46 35 19 97 -113 -152 -67 -97 4 202 -47 2 -183 28 -134 -225 73 -6 47 58 69 -72
6785 -72 40 -6 -32 -3 -134 -42 -76 -128 -125 -74 -71 -92 -87 126 -125 -205 44 91 223 26 59 -64 100 -49 -129 -257
6811 -257 7 -158 -115 -13 -7 -8 -177 10 51 -129 106 28 90 38 -33 32 -2 -193 23 -43 -42 -53 -27 20 -224 -26
6837 -26 -14 2 -4 -24 -32 15 36 -93 -10 37 -79 102 119 1 205 -144 36 51 62 82 168 181 90 72 246 66 -39
6864 -39 19 -133 121 -100 42 -50 70 123 22 -61 -6 50 80 90 -39 -4 19 -8 24 -44 -49 -43 -41 -20 11 -16 169 59
6892 59 120 85 -34 62 86 -50 32 36 -9 -42 -214 -64 73 -98 15 -16 44 -86 -134 -33 156 72 60 -12 33 -28
6918 -28 -4 -114 0 15 -21 -61 -112 59 -76 -47 25 -77 -4 38 -100 86 -5 32 187 75 7 -41 -194 -62 -30
6943 -30 14 -25 -227 -3 68 -66 28 142 93 -48 69 -27 191 5 11 -159 42 116 -6 62 -58 48 38 -11
6967 -11 157 -50 18 42 19 99 77 29 59 -71 -250 9 -185 53 -71 23 48 256 141 -4 -53 97 -85 -111
6991 -111 -69 -13 40 -8 58 140 74 -13 25 -36 49 13 -75 -114 11 36 148 -90 -26 -8 5 14 27 -20 0 159 3 57
7019 57 -18 123 65 -171 145 -46 -7 -26 -43 26 27 -14 -192 143 77 -43 47 -44 148 23 -56 40 70 -18 53 94
7045 94 47 -20 -26 -8 -44 10 50 -124 105 80 -110 83 -34 -31 -52 -13 63 -76 203 72 81 -142 -14 16 93 205
7071 205 -150 -17 16 15 24 88 69 46 -8 -34 -157 -38 -19 -159 -68 57 -165 -100 25 9 83 -263 27 49 -15 -39
7097 -39 27 131 39 -80 6 51 -83 -38 -176 91 -88 52 404 -35 -142 13 56 91 -122 -100 33 -117 2
7120 2 91 -143 -26 52 -153 -35 -9 85 -60 169 -10 -17 109 1 38 33 48 90 72 32 85 89 96 -90 16 -57 -47
7147 -47 -51 -135 46 110 64 103 26 -51 -156 -13 -38 48 21 -35 -60 -107 -75 -66 -86 -56 -10 38 145 -83 86 -79 -147 23
7175 23 -168 43 24 126 33 -57 99 -1 -21 -67 -3 -6 37 -106 93 -112 -86 -9 27 142 163 90 -8 52 165 -82
7201 -82 -47 -93 40 115 -57 -152 -64 25 -66 10 -75 -10 98 -26 30 66 43 133 52 51 38 -133 -21 -73 202 -116 77
7228 77 -127 -83 -13 91 123 -86 64 112 91 -20 -48 -53 -27 65 10 106 -8 -159 11 -26 82 130 -142 -54 126
7253 126 24 -16 -63 -30 106 40 -4 250 219 39 -111 -139 4 169 80 62 -39 51 121 124 -5 -45 -87 50 -21
7278 -21 38 37 -148 156 16 114 -59 -138 -83 46 -253 -132 -39 27 45 -39 -49 60 -17 -78 36 91 65 -69 -19 18
7304 18 11 -8 -22 -279 94 36 -52 188 54 199 109 -128 -6 229 -29 -4 -31 80 135 -1 30 18 44 22 206
7329 206 74 33 32 59 5 37 76 95 150 -19 32 -31 -83 -69 198 -17 -39 77 91 -75 -207 -54 -98 -28 -131 -37
7355 -37 -101 25 53 -88 -74 40 72 38 -74 -85 138 46 -117 66 -34 24 1 89 -37 -54 -52 -67 112 10 -2
7380 -2 -26 -34 -60 -37 -8 48 43 -48 -120 -99 -159 68 -14 -70 25 -82 -106 -43 -10 -33 4 -133 -48 101 5 138 141 80 14 -69
7410 -69 50 -39 54 24 -111 -21 73 31 -99 30 171 8 -76 -117 33 -46 -67 43 67 -8 -35 4 -233 35 -17
7435 -17 -67 -47 9 68 -232 43 139 72 28 45 177 68 83 -124 -146 -26 -85 -12 -21 -48 -67 21 -109 19 1 50 45
7462 45 102 -64 -82 50 -59 -47 208 48 33 -60 -29 214 -44 47 -101 -59 -87 145 13 -166 80 -57 49
7485 49 74 -102 -20 40 -32 -82 57 26 -101 38 -30 -67 55 -16 35 204 19 28 -6 -81 -20 -16 126 -67 -22 -29 98
7512 98 43 32 56 52 153 -42 41 19 -88 69 -136 81 -102 52 165 107 196 -20 -15 -69 -24 -184 -133 162 21
7537 21 9 65 -3 -33 107 -98 -97 65 -57 24 -162 -1 -8 -99 -35 -201 -84 -75 -139 10 57 -71 -152 50 -150 111
7563 111 -131 4 33 175 92 155 -54 28 14 -133 -107 21 84 110 -126 -68 -125 62 -8 83 4 7 30 149 -3
7588 -3 -124 133 -48 -74 -93 132 20 -110 -97 15 -26 58 -71 -7 -81 63 82 -40 55 75 -105 -85 143 46 4
7613 4 -111 -31 88 -21 -69 104 94 -222 145 17 20 23 180 87 -49 123 -57 -53 -30 17 -108 147 40 17 45
7638 45 -53 -48 -15 58 37 140 -40 78 -163 -51 130 67 88 -28 31 19 89 59 42 7 76 -28 4 55 -97 153
7664 153 -17 -48 -53 -25 40 -52 2 2 -36 45 -63 103 8 -69 -8 8 -210 -39 -25 36 275 -136 116 -159 121 18
7690 18 183 168 -56 123 33 84 -61 102 -236 3 -15 -49 -14 88 4 34 76 -175 -62 -18 52 -70 75 9
7714 9 40 -100 39 -44 -14 9 129 -7 50 15 113 143 26 -52 -45 48 -18 17 -150 -92 -130 136 86 85 -75 9 122
7741 122 -26 31 -107 150 -85 64 26 81 -43 37 -156 15 117 122 -42 -64 162 60 -126 194 -78 -21 61
7764 61 -103 52 24 150 187 -46 -125 55 -13 -22 -209 -77 -20 -2 54 -95 -16 -128 -33 -49 147 -79 -66 -26 -86
7789 -86 -146 33 79 -18 -7 -138 83 67 -42 49 -107 -13 -137 -127 140 66 31 80 50 -4 -23 33 -60 40 53 -194
7815 -194 -51 -85 33 -15 7 -10 68 -101 -9 -107 163 -54 4 24 -102 -112 -104 145 -5 -81 90 74 -30 87 141
7840 141 -20 45 92 175 -18 -23 -30 -49 116 -105 104 236 56 -54 -175 -45 -19 -29 -34 -33 9 -51 -18 -44 160 -56
7866 -56 60 -108 -31 199 -15 -24 167 71 -114 -41 -104 -24 121 51 -130 -107 152 -99 44 -37 241 24 -106 -35
7890 -35 55 133 22 -79 -245 -179 -30 -203 -76 17 60 -13 -27 78 30 -61 4 82 66 -56 -179 16 149 -56
7914 -56 -14 2 47 -125 -93 -85 -81 -20 41 -13 -92 -118 -46 50 174 210 -71 174 -76 99 -94 -96 -67 14 114 -23 -135
7941 -135 22 -145 182 29 135 7 8 -35 -41 72 25 97 134 -69 -94 33 -64 -38 57 103 -63 7 103 -101 3
7966 3 -152 117 43 34 -54 20 32 -28 5 -67 -65 -69 52 -18 -11 4 36 -145 11 44 111 -158 -10 -24 0 61 42 33 23 -141
7996 -141 59 -107 -73 -26 -66 1 12 107 -69 12 -72 44 177 74 168 -19 -85 12 54 -133 81 58 -20 2 -78
8021 -78 129 -35 23 64 3 -56 -98 -28 -20 -50 -84 14 119 -135 -20 -217 -30 90 38 -118 140 9 -163 9
8045 9 11 74 -26 -62 -155 -150 -84 -34 -140 36 33 -169 5 -76 -56 -70 -168 28 -10 81 -88 -75 -109 234 -115 3 -105
8072 -105 170 -140 202 -89 -42 63 104 -50 -78 -133 -65 113 -188 -164 78 136 150 188 -18 31 -43 268 -62 87
8096 87 6 111 -14 6 -37 42 -5 10 -78 -8 -45 79 -28 -242 -9 150 -76 -31 138 -131 65 -49 -47 69
8120 69 66 -41 -146 -32 26 -141 94 -40 -55 48 -34 79 -141 3 -149 -86 -22 -24 140 -50 -122 -148 144 -3
8144 -3 28 -286 -176 -60 39 67 125 -56 -85 -115 47 93 -119 39 -122 47 90 142 112 -150 157 -25 7 -111
8168 -111 6 96 -9 -29 -25 -105 -113 126 144 -25 -1 -149 64 128 -113 68 60 -21 -100 54 94 -140 24
8191B4
$$ Imaginary data points
##PAGE= N=2
##DATA TABLE= (X++(I..I)), XYDATA
0 0 0 0 0 0 0 0 0 0 0 0 0 0 0 0 16 -16 16 -16 16 -16 32 -32 33 -48 48 -64 71 -80 96 -112 128 -144 161 -183 209
35 209 -232 257 -289 326 -365 403 -450 498 -552 609 -674 745 -822 904 -997 1097 -1210 1335
53 1335 -1471 1626 -1803 2005 -2235 2503 -2822 3207 -3681 4286 -5080 6183 -7826 10525 -15770
68 -15770 29880 -150560 -474953 -371617 -154011 129733 270130 269429 134254 -727 -86276
79 -86276 -82582 -58518 -51884 -93120 -121670 -95757 10646 138961 224452 201582 77233 -98023
91 -98023 -225937 -243645 -142360 6139 119890 148510 109030 43545 -4395 -25969 -33105 -49154
103 -49154 -77320 -98434 -76988 -4531 86690 137294 111446 25571 -65726 -109630 -88241 -28092
115 -28092 24449 33290 612 -34255 -28818 21652 77321 87837 35438 -51238 -118715 -124502 -62035
128 -62035 33054 103438 105211 41620 -38085 -75914 -50818 9238 51260 38813 -21236 -84543
140 -84543 -97977 -39595 60327 134809 128694 41341 -71338 -139489 -126915 -48738 41942 93655
152 93655 83426 30142 -21599 -36867 -16351 10136 11527 -15314 -46276 -52131 -22123 30153
164 30153 72911 77726 37751 -24133 -69868 -72449 -36375 10443 38749 37499 17200 -2389 -6063
177 -6063 5344 16093 9762 -15852 -41528 -42797 -12502 30978 56927 47198 8846 -31946 -48750
190 -48750 -30995 7192 37590 37542 8479 -26113 -38620 -20172 14144 39535 39172 13729 -18434
203 -18434 -35919 -26298 1834 26047 26754 4723 -20390 -26192 -6445 25486 46635 38776 3226
216 3226 -40105 -62136 -46181 -261 46114 64614 47336 9201 -25009 -37860 -28422 -8823
228 -8823 5297 6790 1647 2359 14704 30417 34062 16852 -14331 -42078 -49678 -31628 4095
241 4095 38956 54297 42214 11786 -17625 -31101 -26587 -13529 -2846 2228 4043 8279 17033
254 17033 27370 28238 13016 -15398 -40690 -44892 -24219 10027 38265 45719 30603 3188 -20935
267 -20935 -29000 -19843 -3809 6183 6113 2239 2355 8082 14326 14883 6512 -8163 -21936 -25323 -13529
282 -13529 7487 24605 26537 13001 -5630 -18292 -18418 -7743 5994 13969 9683 -2151 -11130
295 -11130 -8930 2141 11418 11223 2218 -8076 -12922 -9315 906 10679 12259 3894 -7875 -12794
309 -12794 -7421 3426 10522 9542 2377 -6902 -12484 -10773 -1218 9626 12951 6632 -3770 -10711
323 -10711 -9179 -3189 3364 6583 4264 -1977 -7231 -6072 1787 8454 7598 -889 -10110 -12443 -7038
338 -7038 2623 10641 12479 6291 -5216 -13765 -13114 -4461 4486 7834 5364 1415 -1759 -3317 -2388
353 -2388 -436 239 -2243 -6581 -7038 -1398 6614 10551 8090 668 -7446 -12977 -12374 -4615 5907 12194
369 12194 9444 1062 -5324 -6364 -4218 -1598 -159 -149 -1552 -2206 -685 4264 7056 4454 -2674 -8593
385 -8593 -9338 -5047 669 5348 7392 5613 32 -5704 -7429 -4252 552 2721 2042 607 -442 -926
401 -926 -552 830 1906 69 -3830 -6007 -3152 2441 6105 5358 1667 -2328 -5184 -5525 -2657 1991
417 1991 4579 3598 4 -1910 -846 628 556 -346 -1211 -1520 -1981 -1253 903 3836 4431 1946 -1327
434 -1327 -3156 -2790 -1970 -444 1556 2647 1575 -348 -597 1301 3379 2555 -732 -3911 -4620 -3331
450 -3331 -518 3243 5607 5953 3119 -553 -2937 -3221 -3063 -2964 -2163 575 3542 4927 5106 3969 1955
467 1955 -1497 -5240 -6857 -5385 -1899 2006 5032 7368 7381 4467 -380 -4321 -6076 -5970 -4907 -2204
483 -2204 1745 6433 9233 7976 4059 -1227 -5840 -8564 -7794 -3818 1361 4841 6054 5833 5445 3765
499 3765 895 -3201 -6342 -7536 -6650 -3583 1607 7324 10838 10409 5491 -1232 -7525 -10953 -10524 -5769
515 -5769 1198 7171 9598 8208 5382 2206 -1136 -4627 -7213 -7933 -6764 -3440 1887 7519 11479
530 11479 11330 6550 -728 -8015 -12282 -12951 -8673 -838 7962 13782 13211 8312 1093 -5829 -9973 -10584
546 -10584 -7609 -2634 1913 5018 6705 7524 6796 3976 -441 -5007 -8283 -10070 -9087 -4619 3112 10667
562 10667 13974 11581 4513 -4129 -11304 -13321 -10212 -3039 4139 7460 6811 4721 3260 2265 1283 -619
578 -619 -3572 -7051 -10015 -9711 -4146 5179 13239 16351 12443 3250 -7756 -15892 -17845 -11931 -1097
593 -1097 8208 12277 11528 8131 3427 -1130 -5031 -7244 -8505 -9132 -7687 -3054 4665 12163 15620 13448
609 13448 6131 -4236 -14270 -20051 -17888 -7776 5373 15697 19308 15869 6789 -4110 -12817
622 -12817 -16030 -12320 -5529 903 5602 7993 8722 7448 5073 2074 -1432 -6128 -11442 -13599 -10289
637 -10289 -1661 8831 16315 17567 11646 292 -11698 -17981 -15849 -6864 2834 8588 9547 7393
651 7393 3797 1118 -76 163 -912 -4863 -9542 -11347 -7002 1280 10536 16495 15863 8530 -3860
666 -3860 -14919 -18604 -14193 -4665 5027 11090 12804 10552 5023 -857 -4707 -6407 -7342 -7692 -6672
681 -6672 -2895 2846 8110 11425 11726 8198 414 -8933 -15556 -15727 -9647 194 9666 15966 16214 9851
697 9851 -444 -9888 -13936 -12349 -6974 -206 5856 9014 8285 5173 1942 357 -1165 -3756 -6787
712 -6787 -7990 -6670 -2332 4093 10111 13014 10282 1705 -7419 -12368 -11374 -5950 1197 6670 8848
727 8848 7138 2779 -1172 -2652 -2206 -1273 -1686 -2931 -3207 -2310 137 3440 6697 7446 3888 -1706 -6338
744 -6338 -7554 -5921 -2204 1758 4872 5815 4423 1463 -932 -2109 -2413 -2675 -2349 -1255 -62 794
760 794 1252 2207 3189 3146 1580 -874 -3234 -4409 -4406 -2707 487 4040 5736 4921 2273 -921 -3309 -4743
778 -4743 -4327 -2029 906 2504 2645 1914 1249 1337 965 -125 -1420 -2789 -3693 -3326 -1019 2371 5224
795 5224 5277 3190 -240 -2971 -4253 -4276 -2657 -150 2056 3092 3067 2004 1348 176 -1443 -2742 -3037
812 -3037 -2493 -1353 427 2330 3688 3794 1928 -561 -2472 -3316 -3133 -1828 -2 1995 2721 2502 1731
829 1731 505 -485 -1836 -2519 -2306 -663 739 1261 1315 1335 1087 414 -396 -912 -1084 -1079 -934 -498 202 938
849 938 1405 865 533 214 -384 -997 -1336 -1050 -206 469 253 424 795 728 520 -89 -471 -876 -1276 -1183 -612
870 -612 639 1597 1400 1031 214 -179 -792 -1568 -1657 -915 290 1028 1546 1736 1428 173 -1267 -1997 -1723
889 -1723 -942 -125 530 1604 2384 1689 234 -1393 -1806 -1654 -1358 -427 1009 2081 1992 927 -35 -691
907 -691 -1570 -2049 -1649 -52 1615 2235 1589 489 192 -586 -1418 -1809 -1054 129 1021 1128 1314 1384 618
926 618 -986 -2044 -1625 -461 212 787 1234 1559 1131 -19 -1196 -1616 -820 -494 -121 928 1531 1441 339
945 339 -544 -574 -526 -857 -906 -202 750 1480 900 379 -127 -562 -1088 -1022 -506 856 1011 673 404 219 42
966 42 -650 -1040 -441 445 698 545 292 200 116 -443 -647 -365 503 281 -279 -190 563 705 -46 -742 -412 -46
988 -46 163 -17 163 387 424 -208 -610 -143 342 446 89 -65 213 119 -513 -762 -119 611 786 259 -109
1009 -109 -119 91 -550 -791 -519 -45 168 299 895 1608 1033 -250 -1209 -1586 -907 -171 179 1153 1656 1367
1029 1367 133 -806 -1063 -697 -714 -935 -216 567 1267 1364 1118 846 -18 -1277 -2245 -1982 -521 969 1529
1048 1529 1498 1380 468 -604 -1242 -1203 -643 -449 -404 -144 729 1547 1610 631 -328 -813 -1446 -1446 -634 465 1076
1069 1076 740 157 17 281 529 136 -351 -747 -1232 -1511 -965 644 2108 2603 1759 -71 -1513 -2145
1087 -2145 -1876 -817 457 885 768 290 58 859 1450 943 -138 -1727 -2670 -2293 -911 1146 3129
1104 3129 3447 2131 30 -2082 -2730 -2596 -1494 -88 1284 1990 1845 1169 617 -78 -731 -1582 -2075 -1502
1122 -1502 -523 457 1290 1740 1756 1071 117 -653 -1260 -1742 -2079 -1723 -403 1679 3293 3247 1716 -431 -2442
1141 -2442 -3393 -2447 -345 1629 1927 1390 67 -420 -49 927 1520 1128 -769 -2743 -3952 -2757 632
1158 632 3941 5400 3813 479 -3001 -4729 -4263 -1543 1457 2939 2388 700 -430 -387 306 929 337
1175 337 -851 -2308 -3135 -2301 248 3080 4453 3620 967 -1625 -3652 -4069 -2955 -435 1932 3228
1191 3228 2584 1708 417 -543 -1601 -2236 -1703 -762 456 779 687 813 683 777 816 1079 422 -1112 -3047
1210 -3047 -3367 -2109 851 3456 4564 3401 654 -2666 -4589 -3887 -1060 2089 2975 2033 -38 -1177
1226 -1177 -996 474 1989 2551 871 -2565 -4808 -4009 -1004 2988 5444 5111 2139 -1945 -5166 -5196
1242 -5196 -2348 1115 3176 2722 1367 -205 -629 -455 254 652 -127 -1524 -2600 -1872 179 2132 3074
1259 3074 2503 1203 -736 -2439 -2968 -2324 -437 975 1284 1655 1875 1231 152 -1376 -2214 -1847 -877
1276 -877 357 1222 1516 1069 -402 -1057 -437 1014 1696 912 -1088 -2347 -2532 -1354 1067 3333 3867
1293 3867 2021 -1240 -3504 -3383 -1535 976 1991 2161 597 -732 -1798 -556 1504 2373 1062 -1356
1309 -1356 -3209 -3284 -1388 1483 3828 4114 2069 -1427 -3415 -3343 -1200 783 1716 1286 821 65 -209
1326 -209 -18 678 621 -542 -1940 -1783 -489 1162 2117 1961 1136 -278 -1221 -1654 -848 480 665 288
1344 288 -188 -257 521 1017 817 214 -873 -1536 -1731 -391 1181 1816 1325 -231 -1320 -1265 -199 1001
1362 1001 1190 740 -653 -1839 -1825 -496 1530 2260 1667 -218 -1471 -1860 -1114 28 1426 1436 231
1379 231 -979 -1161 -346 1220 1592 711 -739 -1892 -2055 -806 1005 2390 2176 419 -1524 -2072 -1369
1396 -1369 -105 1315 1169 512 -393 -852 -588 731 1271 844 -423 -1408 -1493 -333 1047 1790 1532 585
1414 585 -1297 -1827 -1080 207 1390 1215 297 -635 -1204 -674 273 1112 1301 295 -909 -1535 -641 536
1432 536 1211 970 -79 -933 -1012 -293 699 1241 1040 -180 -1389 -1518 -667 789 1598 1151 251 -783 -1168
1451 -1168 -750 163 942 1088 9 -827 -845 -216 772 1092 447 -411 -1142 -1396 -703 753 1658 1637 79
1470 79 -1332 -1709 -771 201 1077 1408 575 -664 -1124 -729 256 894 756 10 -943 -995 -338 464 901 891
1490 891 159 -1074 -1524 -657 474 1452 1128 284 -649 -1317 -674 -210 746 922 469 -475 -1084 -359 430
1509 430 823 316 -318 -687 -836 -284 616 1144 1111 -143 -1267 -1318 -586 572 928 878 418 -199 -918 -786
1529 -786 -97 588 765 66 -638 -534 37 224 743 356 -78 -744 -880 -534 540 1557 1019 39 -896
1548 -896 -812 -537 244 885 986 630 -361 -874 -657 -78 599 277 -171 -321 -431 -231 158 654 738 -98 -715
1569 -715 -926 -302 590 698 606 251 -425 -1036 -900 -346 507 934 399 -416 -312 -287 -119 117 -7 99 -141
1590 -141 -295 -217 488 678 313 -368 -838 -555 -67 96 551 831 477 -169 -379 -591 -151 284 232 -61 -188
1611 -188 75 270 190 229 243 -407 -461 -768 -30 465 666 473 -69 -398 -643 -440 -101 600 607 86 -265 -549
1633 -549 -216 -70 80 114 253 261 -280 -319 -70 303 210 48 -197 -39 70 105 93 36 50 -256 -514 -179 41
1656 41 526 475 222 123 51 -354 -411 -357 -141 5 80 137 429 422 109 -362 -570 -674 -492 61 199 537 770
1679 770 375 -156 -420 -456 -221 -206 30 435 593 312 102 -161 -89 -22 -77 -73 -97 28 -67 -50 156 299 231 96
1703 96 -111 -316 -191 -206 -42 162 269 443 -12 -258 4 164 116 160 80 -100 -294 -534 -238 333 604 557
1725 557 406 30 -503 -743 -705 -245 108 603 797 347 59 -342 -469 -403 -369 7 126 257 194 -31 278
1746 278 196 105 -79 -246 -494 -400 -309 118 499 751 707 277 -324 -864 -715 -493 49 453 886 643 -12 -530
1768 -530 -591 -145 120 520 490 246 -327 -693 -466 192 575 782 426 -104 -503 -941 -552 -70 662 1100 461
1789 461 -154 -515 -436 -124 243 331 187 -145 -657 -686 17 648 854 800 182 -153 -920 -1058 -452 106 821
1810 821 1030 546 43 -303 -715 -841 -517 137 498 407 298 -21 -15 156 -66 -77 155 157 -236 -565 -256 -82
1832 -82 426 554 422 28 -374 -904 -689 -273 393 733 745 -12 -442 -636 -592 -55 616 962 479 -338 -869
1853 -869 -586 -152 640 762 766 279 -466 -1061 -718 -150 509 618 371 69 -152 -270 -118 58 415 109 -173
1874 -173 -483 -346 397 367 535 306 269 -31 -786 -672 -324 315 324 254 379 263 -126 -457 -585 -450 28 8
1896 8 236 419 481 64 -427 -508 -263 123 310 97 192 -15 -128 -35 193 449 390 -121 -336 -537 -339 173
1918 173 531 426 391 -283 -743 -543 28 550 543 337 -151 -639 -545 -277 122 780 752 395 -332 -709 -440 -163
1940 -163 196 385 158 -103 -203 -266 46 274 158 -211 -509 -633 49 441 435 369 138 -185 -660 -601 -288 361
1962 361 416 -12 -50 194 40 8 3 -55 -27 -407 -355 136 491 522 136 -287 -453 -555 -86 97 273 257 -98
1985 -98 -502 -346 -58 262 350 231 -61 -170 -295 -122 115 415 228 -77 -403 -446 206 439 556 190 -139
2006 -139 -742 -629 -112 216 629 563 109 -251 -556 -275 94 281 196 270 -58 -58 -206 96 308 56 -191 -454
2028 -454 -430 -173 250 423 397 62 -280 -523 -315 36 223 396 236 -13 -224 -128 -76 93 192 137 -202 -198 215
2051 215 365 269 242 -331 -344 -297 -145 278 384 317 -206 -465 -360 -47 149 322 374 129 -146 -382 -197 50
2073 50 270 257 -10 -372 -366 58 342 549 240 -234 -452 -546 -261 272 586 603 80 -352 -335 -320 -11 193 101
2096 101 27 -107 -251 -91 237 116 40 -137 -231 -238 -65 226 401 434 -11 -381 -552 -296 440 452 464 246 -127
2119 -127 -359 -295 -19 375 212 -64 -158 -150 76 44 226 -18 -194 -118 -261 -206 268 371 456 93 -382 -597 -169
2142 -169 106 367 295 233 -35 -266 -306 -73 219 265 -189 -64 89 -65 133 357 146 -36 -502 -641 -71
2163 -71 322 542 649 52 -331 -496 -461 -123 387 524 12 -187 -244 11 198 243 64 -37 13 -420 -179 137
2185 137 578 159 -1 -345 -371 -350 122 288 458 254 -88 -475 -521 -161 322 247 58 -260 -188 -15 42 94
2207 94 77 77 -231 -174 1 350 142 251 -122 -231 -504 -273 46 323 401 361 -162 -235 -322 87 127 0 -95 -41
2231 -41 -102 178 119 386 43 -327 -308 -335 -70 379 528 401 100 -247 -430 -247 67 407 371 70 34 -268
2253 -268 -264 -102 112 89 164 -162 -249 41 224 251 138 -124 -119 -246 -249 49 119 266 21 10 -380 -73 -20 179
2277 179 170 198 11 -241 84 -94 35 193 -62 -113 -197 145 229 275 161 -198 -307 -259 -78 67 500 228 97
2300 97 -286 -406 -362 -85 -101 259 319 175 -20 106 -253 4 -177 -72 -165 -64 -137 31 220 350 91 -100
2322 -100 -410 -283 -105 85 167 186 242 29 58 -252 -21 -254 -40 150 278 252 -7 122 -161 -180 -259 -139
2344 -139 121 -7 35 -89 -299 -274 -305 -76 259 349 97 -106 -225 -186 -104 21 150 49 98 -143 -136 20 297
2367 297 101 -14 138 -316 -352 -136 91 458 315 268 -129 -219 -466 -395 -195 111 459 462 259 -188 -368 -279
2389 -279 -230 82 255 163 -5 45 -106 -17 199 273 41 -68 -208 -265 -217 -41 223 209 257 -132 -316 -244 -101
2412 -101 -6 248 338 196 -84 -188 -365 35 146 347 142 196 -91 -331 -157 -39 110 56 253 117 -64
2433 -64 -71 -266 -183 -79 117 -25 25 2 105 53 10 -79 57 79 -43 -101 -115 276 -3 236 53 159 59 -164
2457 -164 -303 -374 191 438 248 244 -6 -133 -262 -418 -134 70 403 163 -18 -269 73 -14 128 182 86 -47
2479 -47 -328 -291 -5 131 299 245 53 -53 5 -113 -103 259 299 81 -205 -316 -56 -204 256 395 132 -144
2501 -144 -266 -254 -183 134 106 277 190 83 -107 -36 -222 -42 -47 -163 1 135 195 356 70 -183 -130 -321 -7
2524 -7 102 -74 44 -28 13 -15 27 51 -156 -77 -110 -167 27 216 310 272 138 -289 -472 -314 16 413 293 214
2548 214 -163 -243 -246 -111 99 192 136 186 -310 -108 -154 -14 197 280 -206 -132 -282 -109 186 366 191 68 -316
2571 -316 -89 -94 112 212 296 88 -157 -142 -125 -23 -29 154 40 84 106 50 -39 10 -67 -82 -54 -23 163 80 261 96
2597 96 -156 -256 -260 -106 179 288 162 -153 -247 -258 -146 269 -34 -1 -51 -215 -187 154 316 384 209 -192 -234
2620 -234 -419 -16 458 166 204 -84 -168 -333 -366 94 198 104 114 -87 -63 -130 -25 -7 24 105 -20 -101 -53 120
2644 120 139 139 -65 -227 -1 58 102 194 260 73 -247 -183 -151 83 -56 86 105 44 -107 -304 -52 -39 40 41 -209
2669 -209 -77 202 267 214 109 -67 -71 -340 -134 228 417 256 -39 -107 -237 -26 19 104 71 80 -81 -218 -261 159
2693 159 92 13 -69 -190 -68 -148 -124 219 168 9 -94 -291 22 33 125 380 101 52 -143 -136 -51 64 141 136 -57
2718 -57 -164 -99 145 248 -141 -199 -257 -103 50 133 212 185 19 -94 -236 52 156 310 164 212 -233 -261 -171
2741 -171 163 228 5 -19 -300 70 -34 138 203 -96 -52 -189 -57 -86 29 258 325 -110 -10 -119 15 13 149
2764 149 172 -15 104 -71 189 17 -21 237 -103 5 30 77 139 63 -38 -150 -175 -186 113 174 291 264 112
2787 112 -210 -262 9 -175 428 334 -34 -94 44 32 24 229 -69 -100 -162 -76 -74 207 438 300 -34 -176 -233 -270
2811 -270 -17 2 107 76 -53 -146 9 -68 129 7 131 -164 76 -87 -167 14 -30 -137 -189 -151 44 125 61
2834 61 167 -190 11 -182 -127 84 101 335 43 -120 -99 115 -102 106 24 -13 -49 -159 26 177 57 -17 -220
2857 -220 -59 147 -20 159 311 150 14 -176 -154 -134 198 49 43 -15 44 90 75 -127 -137 -37 179 -57 -197
2880 -197 161 89 66 110 2 -114 -108 -52 -61 43 379 -14 -79 105 208 89 -17 -122 -115 165 -202 -7 71 27
2904 27 -23 -244 -133 -67 165 -106 131 -8 -67 96 -105 150 -56 194 139 110 -229 -42 -139 70 24 67 20
2927 20 19 64 -10 115 101 -184 -183 -37 -45 -65 143 79 235 100 -121 -96 -17 -1 24 102 20 76 246 59 -236 -156 14
2954 14 -55 79 25 -89 100 147 104 -77 -80 -61 65 97 166 -35 97 -118 -25 -166 51 156 -158 -170 -201 167
2978 167 -70 238 121 -65 28 -61 -112 48 56 194 15 37 -133 -212 -28 108 307 84 176 -33 -21 -268 -193
3001 -193 -103 106 172 120 -35 -186 1 -79 -178 -65 143 -65 21 72 93 199 -139 21 1 81 -173 151 -47
3024 -47 44 86 -9 20 -262 -48 -59 -193 30 163 82 4 -97 -176 64 -83 -41 42 105 188 -5 -36 72 86 -19
3049 -19 127 -15 284 68 -73 -101 -134 130 39 -154 -89 -160 90 24 -203 129 45 -56 -49 84 -30 64 -166 59
3073 59 267 66 -21 73 -98 -112 -54 148 78 -22 230 -257 -214 -363 0 41 20 229 100 146 -100 -178 75 165
3097 165 98 -144 46 -125 -57 143 63 -55 41 -96 -181 -32 58 133 60 62 -168 43 -171 -106 -15 202 36 38 -44
3122 -44 1 -10 101 -57 108 -75 -11 374 58 92 -133 -67 -63 -91 172 176 -82 -21 21 -180 -180 -18 -91 35 141
3147 141 136 48 -239 95 79 -79 54 42 -168 -44 17 151 301 56 35 -13 -83 69 103 38 261 -5 -11 -332
3171 -332 -183 -151 152 23 106 -79 -130 93 -17 27 -23 147 95 -188 -1 196 60 92 -7 -105 -192 84 106 -25
3195 -25 165 -13 70 41 -87 -73 81 -115 28 73 -143 -6 70 220 8 -30 2 43 -13 120 216 227 -16 -44
3219 -44 -92 -63 25 43 201 224 -48 -88 -134 42 48 115 -50 -55 -84 96 116 69 31 -3 -74 -226 40 33 178 170 88 -38
3247 -38 -144 -127 -76 129 62 -14 -59 -68 -95 60 -29 20 -38 -20 150 90 83 51 62 -249 -25 -74 -129 154 118 196 188 -75
3275 -75 -5 -130 -174 70 91 193 -61 -118 24 152 222 136 -134 -161 -61 -129 177 165 138 95 -90 -92 -200 -25 62
3300 62 292 -142 -45 -79 -67 -202 -48 87 125 119 -28 -219 93 269 83 -171 32 -292 -50 40 220 119 -19
3323 -19 -78 -236 -49 95 -61 99 216 -91 7 -48 -155 191 48 -48 4 9 69 280 104 -18 -136 -102 -57 -112
3347 -112 206 312 305 7 -76 105 -153 -54 1 204 247 -44 -117 -251 65 74 -59 -168 -5 13 112 123 37 9 18
3372 18 -197 -140 16 81 168 63 56 -78 -296 -119 -117 -13 84 23 -193 -46 35 -97 188 109 -10 -25 -128 -45 116
3397 116 56 195 -219 -120 -178 49 56 264 127 -69 -68 -158 -81 87 65 -14 -97 -63 -120 -40 140 -73 61 109 -246
3422 -246 -222 -20 -3 252 -72 35 -140 -372 -65 -84 209 71 -85 34 -225 -69 37 61 10 52 61 130 -96
3445 -96 149 221 91 88 -76 -87 -130 7 86 56 146 -131 -110 -28 -16 213 74 -80 -136 203 55 -180 -169 153 2
3470 2 34 22 -103 53 -21 -3 171 -157 -181 -9 182 121 39 38 -172 -88 -140 -76 -45 129 -62 192 -59 -6 -184
3495 -184 -66 -70 16 8 -51 -37 -87 84 -75 117 -150 -267 -163 141 22 -28 140 -241 -6 -101 84 63 -108 -66
3519 -66 99 49 -119 64 78 -7 -39 -13 33 -84 4 51 49 127 -62 108 -109 81 -81 186 89 -128 -326 13
3543 13 4 129 15 55 123 32 153 93 263 -162 -15 -138 -142 -56 36 46 40 147 -86 -57 138 -17 50 -25 67 127
3569 127 -144 -51 -33 -28 -31 4 188 17 154 -115 132 -103 29 -110 69 96 57 268 128 -19 -90 32 -28 -33
3593 -33 6 22 51 -4 -145 -38 179 43 -70 -22 -117 -95 114 124 32 53 293 -30 -175 32 31 81 207 92 114
3618 114 32 -137 -73 12 39 46 99 45 103 -199 -258 78 -117 14 43 -7 66 46 -15 67 -160 12 -52 64 -44 213
3644 213 155 138 -36 60 18 21 -52 -90 18 95 -6 -68 84 50 205 -15 1 54 18 151 172 -34 115 26 -143
3669 -143 -119 -62 -23 219 -39 136 -18 -48 -42 1 111 64 27 -115 -72 17 85 36 -82 6 -49 -156 -33 150 -8
3694 -8 78 169 119 15 -63 -23 -137 145 213 -37 223 -69 -115 100 168 104 126 69 159 -87 -8 94 -119 50 73
3719 73 34 6 -3 -15 15 85 34 -62 -62 -66 43 65 -80 0 119 -85 -105 144 -123 4 82 30 65 155 -123 -41 -57 54
3747 54 119 0 -11 -108 -84 11 -141 -115 -56 69 31 -32 -162 -61 -135 -123 -3 -11 -24 0 -32 76 -107 -86 -2 47 -54
3774 -54 129 -213 -39 -314 50 231 15 44 75 59 -139 63 -124 446 123 -24 -73 -50 -132 73 98 -24 68
3797 68 -133 76 -54 -106 -120 296 6 -50 111 17 49 19 -127 -5 -8 -71 -32 31 -93 149 45 -95 5 63
3821 63 39 103 -12 20 -79 21 22 118 50 -65 -236 -100 44 -21 199 170 17 -125 -100 -205 17 121 44 -64
3845 -64 -149 -143 -90 -80 89 -18 52 3 -97 -98 55 176 -7 -128 -28 -12 29 175 135 16 160 21 -14 -71 -52
3870 -52 -39 57 67 179 -36 -24 -70 131 -148 -78 -12 -175 48 142 67 -89 154 3 -60 37 -34 76 -1 124 29
3895 29 -114 4 17 74 51 -90 -48 8 -43 81 118 -7 7 93 41 65 -10 61 68 -4 -15 -39 43 -62 -15 208 118
3922 118 54 -24 -45 69 18 130 74 -12 -83 87 -90 168 46 -54 -112 -28 -50 137 68 154 90 -18 -131 32
3946 32 32 -99 -13 45 43 106 -77 -2 128 39 -85 -215 104 63 -120 17 -95 -112 -71 -38 148 109 9 132 3
3971 3 0 -12 46 134 62 98 -4 22 -42 23 -4 -31 -124 -75 86 -158 204 8 39 22 -18 33 -77 77 29 10 118
3998 118 153 -4 -30 68 -22 -168 90 0 -1 120 124 103 76 -84 143 -65 -57 -47 -43 68 -119 -68 -1 27 -123 106
4024 106 -77 37 53 -46 -80 33 -37 112 -131 35 -80 97 21 -68 -59 -77 97 0 -100 -17 33 -17 80 77 18 -75
4050 -75 -86 -28 2 57 119 109 -84 -182 49 -144 -96 -184 151 -51 53 -1 -52 103 37 -46 -23 28 51 -14 130 151
4076 151 68 -59 -227 -57 121 -38 89 33 0 -120 -53 -94 -68 45 55 -180 -112 -7 247 36 24 89 126 2
4100 2 -52 39 -15 -31 65 -34 -158 -69 75 -16 217 -20 37 -154 -21 -6 -232 -112 27 -51 -180 51 101 56 37
4125 37 69 64 -90 39 -78 -90 96 92 99 -52 14 6 17 87 126 130 30 58 123 16 -96 -42 -106 -13 -10 -20 51 -58 -99
4154 -99 -158 -38 -137 17 -98 159 148 -89 64 -51 -138 -127 28 69 -14 109 127 -160 92 55 -150 13 57 38
4178 38 156 105 22 21 28 -94 52 141 143 -168 -32 79 48 55 72 -26 -13 -23 67 -23 121 -51 65 13 47 46 -89 9
4206 9 -43 -193 111 33 -131 -193 -187 -209 138 94 -92 52 -88 -73 -3 -9 -33 61 225 -64 36 -14 186 -20 25 -96
4232 -96 99 -179 62 22 36 -257 200 84 15 -134 185 77 -190 56 6 -134 91 -60 103 39 -71 -19
4254 -19 76 11 17 -53 24 -63 -99 -97 -34 123 47 97 -6 42 138 -172 -39 72 -49 -5 40 86 8 71 -103 -136 -43 76
4282 76 0 18 -58 159 -34 -13 -146 -24 -170 31 78 58 14 -167 88 -45 127 71 -109 -223 10 25 -32 59
4306 59 19 -90 -74 53 -31 44 43 129 -12 -35 -80 -139 -23 -165 23 214 133 115 -132 -73 1 -81 -153 3 -34 128
4332 128 100 5 -138 -79 -117 48 -78 28 94 -104 28 -180 88 -175 18 131 78 81 234 39 -134 -46 -123
4355 -123 -25 -4 15 36 73 -30 96 -12 -122 -39 -39 -179 9 107 -38 29 -49 -213 34 -124 -26 -25 -174 4 174
4380 174 111 -108 -125 -95 51 -150 -164 -9 199 -53 8 -40 15 221 -62 61 0 15 -97 30 -107 89 5
4403 5 -72 30 -40 76 -58 -34 116 71 -84 -42 40 -83 54 1 -52 202 108 -165 -78 76 -4 104 12 51 -135
4428 -135 59 1 -117 -53 92 204 -113 -4 77 50 33 -47 -26 41 -39 249 -37 42 27 -122 186 -139 -123 86
4452 86 -36 94 153 102 -180 36 32 57 102 105 118 -82 2 256 162 -45 -111 -71 62 50 -76 151 160 -12 49 69
4478 69 -28 -74 -57 -159 -144 -8 -28 18 145 -83 82 -62 96 14 -90 -96 -34 133 52 -51 -62 22 -47 -123 85
4503 85 61 -159 -74 -3 -20 56 16 139 94 -8 -6 -43 -127 -18 77 82 27 -3 101 -73 -58 103 -102 49 -8 -49 77
4530 77 -73 -69 -45 -57 -28 -21 -216 -48 -35 -58 -60 48 3 139 -9 -27 33 -25 77 44 -48 -8 -12 -121 2 -74 36
4557 36 34 -224 49 126 -31 130 93 -14 60 -51 57 92 -94 16 224 -7 -44 -68 -23 -93 53 45 -72 -57 -113
4582 -113 168 -52 -58 -136 -39 -52 66 8 -5 24 -52 -5 -64 144 -29 -208 -30 -11 -135 -212 -116 -65 -130 -89 -168 -184
4608 -184 82 -75 4 3 -43 -186 -48 -82 13 97 83 19 -19 -131 1 -102 207 -35 64 -26 -47 -45 -65 61 -2 69
4634 69 -54 12 126 23 -184 269 -11 -246 -36 4 158 19 -51 -12 -65 42 64 223 -21 72 -77 -19 201
4657 201 -16 -32 85 -56 -129 -92 114 163 29 0 138 -58 53 134 69 51 13 141 103 85 -52 200 76 69
4681 69 136 5 -77 -75 144 126 11 -123 25 -50 -64 -70 92 299 51 226 41 -34 53 18 6 173 -93 -54 -14
4706 -14 130 119 136 -55 65 -4 26 103 128 34 10 -1 -27 -96 31 91 101 86 98 -79 64 122 -80 11 -77 -131 46
4733 46 73 -35 -110 159 57 -1 117 -175 30 -75 116 1 118 -130 90 -12 -101 125 12 -78 23 70
4755 70 -4 204 -103 -15 -69 -154 83 7 -6 44 -32 88 -109 16 51 24 163 109 -67 -138 -139 -53 -115 197 124 87
4781 87 153 -89 92 43 -94 172 -71 -128 93 -8 -29 -125 -133 74 68 -278 187 42 -244 186 -35 -24 -93 -39
4805 -39 -71 70 106 17 43 -64 15 -54 37 171 -25 -3 11 84 96 123 34 -78 -55 -102 75 109 5 0 184 -132
4831 -132 -169 -60 -102 116 3 -30 113 51 97 40 20 -22 196 -59 125 -46 -55 120 172 -14 -25 76 -79 -114
4855 -114 127 -134 9 152 91 54 -29 28 -116 -52 -17 162 -47 -116 58 54 -53 -123 72 45 116 47 -52 36 48
4880 48 24 -128 -52 -11 54 57 132 76 49 -5 -68 102 -23 -22 7 -25 140 82 -93 -68 90 -90 -200 -174 29 83 32
4907 32 133 10 150 -81 75 124 -43 -141 14 -13 -122 -83 -53 89 14 -30 -89 187 -66 -188 -63 54 -4
4930 -4 127 106 3 -2 -47 67 118 -29 -8 219 -35 62 -117 -119 1 -69 14 -69 -264 -6 -5 -111 -9 5 208 137
4956 137 -77 -228 -273 163 286 72 138 -95 -126 20 -174 -104 -117 -111 50 168 145 32 30 -157 -120 -49 2 -90 -165
4981 -165 107 117 200 -43 34 -55 -27 -190 -53 -56 -113 51 -110 -140 -56 -79 2 1 -199 19 199 155 -54 14 -139
5006 -139 63 132 -33 -85 -77 -24 121 -21 -131 -62 -103 74 -58 -145 34 62 12 36 -109 -10 -47 -18 97 -54 43
5031 43 -63 -109 -59 175 -9 77 236 123 -37 -99 -12 11 4 -62 70 -40 -138 81 -67 -67 75 -9 31 -137 -260
5056 -260 54 -81 21 -9 -28 129 -162 -15 32 6 5 44 -48 -125 -54 42 -106 -54 -56 3 78 63 -110 85 -34 -70
5082 -70 -75 10 8 4 55 27 181 -11 57 143 15 -141 -49 33 106 193 -8 29 89 -71 -32 2 141 170 -23 -105 14
5109 14 -40 -97 -74 -105 147 88 19 -133 -26 98 -15 -147 123 278 36 -41 44 21 -24 93 46 -120 -162 -56
5133 -56 -131 -11 -47 -66 166 146 224 24 -116 101 130 -98 178 -100 -60 17 -144 -49 -88 219 -142 106 122 37
5157 37 -25 19 13 75 -56 26 -234 159 -129 9 -11 -25 -37 -111 4 -3 82 2 -125 31 3 -4 162 66 0 -13 -19 -157
5185 -157 25 -112 -42 -90 19 0 -62 -34 -152 -224 137 -152 52 -26 100 16 30 96 -145 30 -353 -139 66
5208 66 -24 -110 -97 43 -55 -68 -22 91 95 -69 -1 159 -14 55 13 -39 94 29 -68 69 110 14 -33 33 -12 -9 101
5235 101 90 182 -48 57 82 138 -43 26 2 -96 -32 -1 -25 -108 22 29 57 -1 207 -121 35 -17 48 3 -60 167
5261 167 107 -192 -50 165 4 16 42 121 39 44 155 9 28 -48 165 316 35 -17 -12 31 81 -85 -161 2 126
5286 126 134 -51 19 88 -53 -169 -203 22 -5 13 -8 22 -217 136 -10 -78 84 37 49 -9 8 59 53 -190 -78 -256
5312 -256 85 154 -62 -75 -179 46 -10 -56 -160 67 -20 -84 62 17 -38 -55 -22 90 78 -2 -101 -52 -42 0 -2 -154
5338 -154 61 -1 55 71 17 -98 49 -5 -78 11 -164 108 4 -69 272 227 49 69 103 62 -28 123 -29 46 -53
5363 -53 55 -41 -112 91 67 62 -117 106 14 177 -141 -209 202 -5 8 69 -97 248 16 65 101 -11 -48 -85 -32
5388 -32 -25 109 -16 46 41 -13 -81 -222 82 -1 -39 -13 54 244 112 -100 125 69 -168 24 0 103 -47 78 -72
5413 -72 -65 -38 -155 -10 -19 -42 131 86 198 -17 87 13 38 -68 76 -174 -238 70 -8 -68 -62 -22 -67 15 -11 -116
5439 -116 132 69 136 161 -139 -52 -40 -2 122 37 -17 -109 -66 -172 -54 113 79 -23 -49 -2 208 -6 23 83 -215
5464 -215 -5 64 -20 65 -34 58 128 31 52 102 95 1 91 65 6 -221 -195 -13 94 15 10 41 -25 59 67 56 17 -81 -113
5493 -113 19 -29 48 -39 172 -178 135 -85 -47 116 44 59 69 133 60 100 -28 51 30 -68 -204 20 5 -13 -32
5518 -32 45 25 92 -115 141 -172 -2 165 128 132 -98 -131 -26 -37 140 -40 101 77 -201 145 -19 -43 -85 -151
5542 -151 -49 -100 33 -52 51 -12 -44 34 76 -41 -3 -101 -11 -36 49 -20 -72 -136 -54 30 -62 77 97 -186 21 -96
5568 -96 5 -133 -125 -116 -56 120 129 -28 111 -151 -29 -66 195 125 -16 164 10 70 -89 -105 -28 -75 -89 24 -14
5593 -14 -24 3 21 22 -151 88 41 73 144 -14 165 1 -102 -122 33 31 122 -85 42 -3 -169 96 -20 38 -31
5618 -31 -49 52 -13 271 201 -111 26 59 118 56 93 94 -11 -223 25 135 -71 -19 -198 12 208 -53 33 34 -36
5643 -36 -81 4 11 -80 -223 25 28 12 19 -131 6 -104 187 135 -69 47 -84 -12 -139 35 -17 -12 -85 17 85 114
5669 114 -31 -16 81 13 -159 -220 66 -146 108 57 7 109 51 -19 -27 -176 53 -6 205 -188 -143 -55 -77 -63 -74
5694 -74 24 171 50 92 -66 -26 69 97 243 -41 112 37 -86 -22 158 23 130 -151 -31 -48 233 31 -164
5717 -164 76 109 25 -102 -179 -166 52 8 -99 -34 -69 -142 -125 174 -87 -4 129 83 -32 102 -5 34 107 -27
5741 -27 -40 -64 -57 -113 139 128 -68 -7 50 135 27 -142 137 -182 146 -31 17 -62 -8 215 -196 -10 40 -28 -8
5766 -8 4 -3 -111 -165 -90 84 45 224 54 64 1 -67 -68 150 -336 55 114 -2 -121 -40 82 -9 22 142 -14 125
5792 125 33 -228 146 -73 -31 -30 -95 -27 64 92 -21 80 58 135 -118 -35 92 35 26 77 75 166 -85 -162 68 -50
5818 -50 98 -2 -52 -12 -153 93 113 163 -74 61 -75 -18 137 103 109 -158 57 57 72 99 53 18 -161 188 -72
5843 -72 -87 -10 -155 -81 177 78 7 -203 -53 45 114 162 -103 12 -56 39 36 -206 51 40 -100 -100 10 -37 -121 -51
5869 -51 31 6 55 13 -80 -22 -57 34 196 -112 4 207 -229 -45 35 171 -67 115 -85 59 40 38 -83 82
5893 82 220 32 -26 13 154 -88 28 -108 43 -178 -140 133 22 -2 -15 97 -37 -89 -63 -165 156 122 -19
5916 -19 -118 -125 -116 -85 36 -5 47 -184 -252 48 -14 82 35 -71 -47 -64 90 49 -126 33 -1 -11 123 -168 68 -54
5942 -54 81 38 37 145 25 -80 221 -22 -36 187 121 0 4 -68 -79 130 70 141 -127 -18 31 -108 32 -19 -14
5967 -14 -129 43 76 -81 -148 -125 -11 80 63 -57 35 -85 -23 108 -47 -130 95 54 124 -45 95 -137 96 -130
5991 -130 -214 169 103 139 60 -46 -67 -44 35 -60 -73 -8 169 -45 -173 31 109 -15 -159 -49 41 -47 100 143 -63
6016 -63 64 10 23 165 107 48 -119 56 -35 -80 -188 -73 -148 -15 -19 80 145 46 -75 -34 27 -163 149 34 -135
6041 -135 -139 29 212 -47 -182 91 210 -36 -75 63 38 19 -15 -5 145 88 86 -97 -64 82 59 39 29 -93 87
6066 87 -211 -158 120 122 -138 -52 -1 149 15 55 54 -1 35 26 -40 -74 -46 -173 -46 -79 161 51 -46 27 69 2 65
6093 65 23 -15 109 -49 -29 35 -390 59 79 101 -14 -103 -21 -124 -149 29 4 46 32 76 105 -91 178 -41 57
6118 57 -187 -73 23 -68 134 -111 -88 134 -81 17 85 -133 5 24 106 -53 59 -156 21 -60 120 85 43 -111
6142 -111 143 142 68 -91 55 -14 -248 5 -97 0 55 234 26 -8 15 -65 -64 9 -16 107 -101 -91 137 165 92
6167 92 126 122 -76 43 56 156 -79 -115 -101 55 264 -99 -46 16 -151 -248 -55 37 184 60 74 97 -151 37
6191 37 -131 11 177 -45 55 145 12 100 -91 76 82 -62 86 138 132 -96 78 -8 -15 -24 -23 178 -184 -192 106 48
6217 48 -37 -118 77 40 58 97 -24 -2 173 148 -149 97 -10 -192 84 -27 175 46 77 -73 -67 64 -60 88
6241 88 -138 105 42 -7 41 124 56 95 103 -116 2 35 -50 66 -110 -94 -31 186 0 62 197 52 -181 156 81
6266 81 122 162 -108 89 -110 -96 6 -39 -165 54 25 223 59 73 17 -17 -37 -32 130 58 -60 169 -26 -10 32
6291 32 -1 3 -54 14 -101 -79 -25 -28 225 52 -112 99 -47 92 -5 14 119 159 133 79 -31 -84 -39 -61 -132 15
6317 15 105 83 88 160 4 -137 99 -61 -49 -44 -65 79 -29 79 -33 -46 -130 -20 -5 -26 26 -23 149 -28 -59 57
6343 57 -2 -108 222 41 -124 11 72 -154 32 23 30 -5 -22 -137 -126 78 19 -116 -35 -90 -203 97 125 40 101
6368 101 -52 -64 151 78 -29 -38 43 104 -15 40 85 -81 -88 -148 -60 44 53 33 112 43 -80 52 31 -133 80 110
6394 110 -41 83 9 -141 -146 112 -158 -8 -60 -2 173 105 112 145 56 107 -106 -71 35 -33 75 -56 15 -13 -38
6419 -38 60 -98 99 173 41 -23 88 110 -80 119 -100 -5 27 95 77 -6 -21 35 -103 -202 155 4 9 51 7 88
6445 88 -100 -72 -37 142 149 -139 96 88 -137 17 -77 -23 -18 -32 174 -126 32 34 -123 -27 -35 151 128 -7 -19 -87 -167
6472 -167 -68 113 -68 3 114 60 -59 125 126 43 -38 -73 39 117 10 145 -21 -32 76 12 22 38 -37 -41 45 -112
6498 -112 17 -113 192 76 41 -24 -69 -10 81 -65 128 -201 -112 -69 62 -104 -18 10 -50 -67 98 -21 -224 122
6522 122 143 65 75 -2 125 -48 3 102 154 -8 23 -166 -37 38 -274 -16 70 8 -44 -112 58 -130 31 -10 171
6547 171 88 -135 139 61 89 -112 -27 104 130 -41 53 -223 -59 112 69 -55 285 115 -154 24 64 -127 -38
6570 -38 11 38 -51 -68 -5 170 7 -25 56 -36 45 -93 49 -56 -114 -50 15 100 -107 41 -120 3 -7 54 28 150
6596 150 -35 85 -98 -101 -70 -79 -81 71 25 -216 -99 -20 112 -14 -44 -128 -73 -45 60 131 82 -16 10 -41 75 -113
6622 -113 -70 -85 74 43 -8 -81 49 -72 -39 163 113 26 43 -62 -127 -203 -155 109 121 -10 -68 -24 -41 307 -73
6647 -73 -90 -68 8 14 -15 -75 7 -164 -152 94 31 -53 -57 0 173 82 48 -22 105 14 -48 -5 -61 23 65 65 83 77 -11 75
6677 75 71 74 -83 -130 85 -49 20 -83 -217 51 85 43 -162 -24 58 149 -174 -81 -70 -99 27 -221 46 57 -130
6702 -130 -42 177 -138 55 -23 47 -22 -1 -43 -71 -34 -81 11 -92 45 50 -153 -7 94 79 -110 -12 167 95 91 47
6728 47 141 100 -53 48 -33 -123 25 -8 31 36 14 -84 20 -73 -169 59 -8 -55 -104 34 -11 135 -93 45 13 4 -36
6755 -36 -25 98 105 -101 -83 109 101 -19 35 6 -77 127 -61 29 -62 -126 211 42 -47 -63 -129 150 0 -63 -10 -37
6781 -37 2 83 114 -186 39 -188 -58 -13 25 -113 8 8 41 -30 242 108 -25 42 -26 53 60 143 -80 131 70 135
6807 135 -163 -100 51 58 -166 -20 -172 23 -35 -133 153 -14 248 193 -9 -15 -18 183 -25 93 65 37 79 58 1
6832 1 207 69 -18 67 -58 57 -207 122 -44 85 49 98 -45 14 -284 -220 -62 69 138 95 21 -61 -13 63 -61
6857 -61 2 -52 59 -18 4 -72 42 138 -34 101 -9 -234 -170 55 31 -18 171 -9 43 41 50 83 69 39 -63 -58 85
6884 85 -30 42 -42 -94 31 33 207 -32 -78 43 5 -92 -131 46 -7 54 -3 73 -88 21 -80 81 130 24 77
6909 77 9 21 75 132 89 80 -9 35 10 10 76 16 139 -169 -58 119 60 168 72 -40 -4 4 -50 76 209 140 -19
6936 -19 -15 -36 -49 58 67 -50 -156 -10 147 52 33 86 89 45 -88 36 12 28 -65 -63 209 11 174 -40 -14 174
6962 174 234 71 -135 82 -59 -100 57 -114 6 72 -19 136 -139 -78 114 -86 71 1 2 -21 -2 24 51 102
6986 102 -65 145 37 85 -162 -56 -100 102 15 27 77 31 -50 14 47 79 -8 -12 91 57 101 -75 4 68 47 -101
7012 -101 -50 -51 -57 90 -27 29 143 -26 36 -58 167 -45 -38 41 63 146 6 -148 -144 -187 -2 -156 10 -70 51 -39
7038 -39 -37 -61 -119 -291 -13 218 -46 143 -97 -182 60 -49 56 -15 95 -71 69 108 -9 -3 -26 -57 20 105 88
7063 88 39 -122 39 -60 -14 -38 66 -109 -37 -3 -36 98 71 -39 154 49 164 43 -84 -71 173 -53 -117 19
7087 19 -1 44 -39 -44 -14 -2 99 32 -44 19 219 47 151 247 -40 24 -167 42 -23 37 -167 25 93 129 -78 -62
7113 -62 185 50 -91 11 26 -15 89 -113 -173 -32 132 -6 -50 148 -1 14 24 22 38 -203 14 -194 55
7136 55 24 -56 35 7 -59 -60 178 69 -70 60 151 -167 -80 -137 93 118 51 123 45 249 -49 -72 11 86 12 -52 4
7163 4 -42 -150 -263 43 30 129 -22 -15 -152 31 -190 62 -191 -255 99 -53 32 101 -33 -60 -123 128 16 50
7187 50 26 159 123 278 58 -53 128 -47 -98 63 222 -18 -118 24 -61 6 146 71 -176 -74 131 49 -26
7210 -26 5 -51 185 69 -68 245 25 -9 -95 -66 -62 136 138 11 -50 88 125 16 110 -80 89 17 108 80 88 -25
7236 -25 25 147 -64 -161 -132 5 100 -62 17 98 36 147 -41 -27 -143 -44 -105 -18 -110 -33 177 -43 63 23 152
7261 152 -4 50 -19 136 91 18 -89 -109 -24 57 61 9 -86 -48 -171 -92 -24 149 -104 -135 -148 -100 30 35 -85 -324
7287 -324 -27 -53 -109 -37 -4 220 -27 -37 -17 -23 117 1 -80 -127 -5 217 -23 -53 -70 -18 48 37 122 -145 -73 -28
7313 -28 45 77 66 -110 -88 -5 -70 -86 -40 -45 78 -24 -131 -57 105 -1 61 -164 19 116 -14 156 35 48 -136
7338 -136 -234 140 103 165 68 10 -53 -141 -21 70 -183 28 -20 179 114 65 36 -38 143 50 54 -57 -35 -82 51 116
7364 116 32 -109 -17 6 87 -18 40 98 94 -84 52 -3 83 34 -81 136 35 194 13 -38 26 -38 81 -47 93
7389 93 44 3 -47 -14 -5 -81 -96 34 6 -56 -123 -106 64 111 46 115 -40 41 72 143 38 -113 20 -34 -135 53 0
7416 0 296 -29 -188 -83 23 179 29 -148 -43 106 24 53 -130 50 -8 -187 -148 -73 -165 -40 94 -16 218
7439 218 68 17 -41 -47 8 28 -10 -16 75 -96 -11 -89 -94 -34 110 -17 70 -25 104 20 -15 21 7 -64 -116 95 0 -126
7467 -126 -78 76 34 -31 -87 111 44 -40 -14 -83 -26 117 92 64 -151 22 11 -53 -52 89 -125 -29 4 38 110 107 -10
7494 -10 118 84 -100 -185 182 78 -153 -39 -31 65 24 -16 63 89 -30 7 33 -30 12 144 34 -105 -116 -75 160
7519 160 17 -25 -63 151 49 -183 27 -15 153 103 26 -106 78 -95 125 4 -77 -15 -3 -14 -78 -73 126 133 -252
7544 -252 -96 13 -124 -106 -155 114 -85 -57 -110 -162 63 -39 40 14 115 178 -91 19 35 12 -77 -44 101 18
7568 18 26 -14 80 -76 0 53 -33 21 -345 -164 103 168 -104 -62 103 24 -29 4 148 186 114 -84 170 134 -86 41
7594 41 40 8 60 19 -34 13 154 -109 -83 -44 -213 76 -95 -100 69 25 14 -147 -114 29 100 -72 260 91 90 35
7620 35 1 -76 50 76 -39 130 114 28 -127 0 -16 40 22 -52 -100 34 -101 -82 -21 -42 55 -16 -66 -32 -79 -234
7646 -234 -3 61 -216 265 -1 120 -10 -116 -96 44 -39 126 -8 172 9 -54 77 96 44 36 69 -35 -28 90
7670 90 34 -54 70 -61 10 -103 -52 22 -133 -24 -269 -50 52 36 107 -174 119 -36 -18 -28 -97 -170 -63 48
7694 48 -64 53 3 0 -89 31 46 43 82 5 -41 74 -97 -17 101 -5 -51 -53 238 164 12 -14 -47 114 102 -95
7720 -95 21 -162 44 -5 -68 38 48 60 -10 -114 71 -56 83 112 -91 15 101 -9 -37 205 35 131 -12
7743 -12 -81 14 118 76 86 108 155 12 -14 59 -49 109 23 -119 148 -46 -50 44 1 -74 65 92 66 18 -30 65 -29
7770 -29 103 10 78 -92 62 -122 -220 112 169 -61 80 -27 141 -33 -51 -26 54 3 -17 86 -275 76 -17 -116
7794 -116 -202 -27 -42 -17 96 -145 -18 -1 93 -84 171 99 165 22 118 34 -16 -5 -100 109 -76 -5 47 83 -1
7819 -1 -95 153 95 27 37 12 166 39 6 -85 165 10 -67 -126 21 -153 -68 -125 -54 38 45 140 -130 116 16 -15
7845 -15 -212 205 -30 6 -7 -55 45 83 -31 -15 230 -5 243 -66 -108 35 -1 34 -2 -74 -5 91 -22 28 42
7870 42 -4 -149 -270 97 26 113 61 -99 -71 31 -134 2 -91 -79 -37 128 -41 -87 -9 65 43 -103 22 -95
7894 -95 -153 -13 57 172 -59 -143 62 -123 125 -57 172 -77 16 48 51 -30 4 129 72 59 8 133 -48 90
7918 90 118 143 197 -86 10 69 -6 -90 25 63 -58 36 25 -17 81 -44 -114 111 43 23 -95 -49 -141 64 182 35
7944 35 -33 -64 -37 54 121 28 192 -2 -20 63 8 111 161 11 270 -99 91 -108 -36 159 -75 -20 -14 92 -116
7969 -116 115 -140 76 -123 37 -33 -37 137 23 -104 -11 29 52 -80 1 10 82 -119 16 -144 -80 192 -27 -7
7993 -7 -82 73 -179 24 108 -3 74 -24 33 -22 91 41 146 218 62 62 103 65 -28 -19 -178 26 138 110 -117 100
8019 100 44 -71 -77 -131 -63 -33 -160 -1 -99 130 154 106 -85 -58 37 174 -76 24 50 9 -75 129 -24 -35 -40 -132
8045 -132 -67 -122 -36 115 106 -126 -74 15 -140 -38 -70 -67 54 -148 -25 -75 -5 -83 0 -77 -48 53 30 212 1 -26
8071 -26 161 -29 187 52 17 12 26 165 17 8 56 14 -134 88 132 23 -108 116 23 -74 -108 -119 -104 173 127
8096 127 -77 30 86 150 -12 -78 -25 48 -26 -89 182 -105 112 0 104 119 -27 36 114 -11 69 -30 126 142
8120 142 71 -35 9 25 -11 -155 34 86 -50 -30 -14 -240 15 102 -76 136 86 151 226 70 71 72 10 33 -43 -97
8146 -97 -119 -29 2 13 -161 84 61 44 -72 39 40 76 33 -10 -118 -20 69 127 78 -146 -4 -31 118 -98 49 -7
8172 -7 -19 -109 72 -58 149 170 62 123 92 -8 67 16 -24 85 -93 116 -49 75 -25
8191b5
##END NTUPLES=NMR FID
##END=
