##TITLE=1H ikalashn
D-L
19.12.2024
##JCAMPDX= 6.0         $$ Bruker NMR JCAMP-DX V2.0
##DATA TYPE= NMR FID
##DATA CLASS= NTUPLES
##ORIGIN= UXNMR, Bruker Analytische Messtechnik GmbH
##OWNER= root
$$ TOPSPIN		Version 1.3
$$ 2024-12-19 14:26:19.265 +0400  Irina@DPX200
$$ Compression mode = diff/dup
##.OBSERVE FREQUENCY= 200.131300845
##.OBSERVE NUCLEUS= ^1H
##.DELAY= (6, 6)
##.ACQUISITION MODE= SIMULTANEOUS
##.ACQUISITION SCHEME= undefined
##.AVERAGES= 16
##.DIGITISER RES= 18
##SPECTROMETER/DATA SYSTEM= spect
##.PULSE SEQUENCE= zg
##.SOLVENT NAME= CDCl3
##.SHIFT REFERENCE= INTERNAL, CDCl3, 1, 17.49637
##AUDIT TRAIL= $$ (NUMBER, WHEN, WHO, WHERE, WHAT)
$$ ##TITLE= Audit trail, TOPSPIN		Version 1.3
$$ ##JCAMPDX= 5.01
$$ ##ORIGIN= Bruker BioSpin GmbH
$$ ##OWNER= Irina
$$ $$ F:/spectra/data/iren/nmr/1H/4/audita.txt
$$ ##AUDIT TRAIL=  $$ (NUMBER, WHEN, WHO, WHERE, VERSION, WHAT)
(   1,<2024-12-19 14:25:37.531 +0400>,<Irina>,<DPX200>,<TOPSPIN 1.3>,
      <created by zg
	started at 2024-12-19 14:24:30.281 +0400,
	POWCHK disabled, PULCHK disabled
       terminated by command 'halt'
       configuration hash MD5:
       BE 6D 3F 07 2A EA 11 49 91 17 2B D3 AF B3 58 0D
       data hash MD5: 16K
       86 97 55 A0 CB 72 97 1A 31 E8 E3 DE EF F4 19 E9>)
$$ ##END=
$$ 
$$ $$ hash MD5
$$ $$ A3 94 26 94 3C 7F 9C FA DC F0 2D A6 A5 DA 2D 27
##$RELAX= 
##$RELAX= 
##$RELAX= 
##$RELAX= 
##$RELAX= 
##$RELAX= 
##$RELAX= 
##$RELAX= 
##$RELAX= 
$$ Bruker specific parameters
$$ --------------------------
##$DU= <F:/spectra>
##$EXPNO= 4
##$NAME= <1H>
##$PROCNO= 1
##$TYPE= <nmr>
##$USER= <iren>
##$AMP= (0..31)
100 100 100 100 100 100 100 100 100 100 100 100 100 100 100 100 100 100 
100 100 100 100 100 100 100 100 100 100 100 100 100 100 
##$ANAVPT= -1
##$AQSEQ= 0
##$AQ_mod= 1
##$AUNM= <au_zg>
##$AUTOPOS= <>
##$BF1= 200.13
##$BF2= 200.13
##$BF3= 200.13
##$BF4= 200.13
##$BF5= 200.13
##$BF6= 200.13
##$BF7= 200.13
##$BF8= 200.13
##$BYTORDA= 1
##$CFDGTYP= 0
##$CFRGTYP= 5
##$CHEMSTR= <none>
##$CNST= (0..63)
1 1 145 1 1 1 1 1 1 1 1 1 1 1 1 1 1 1 1 1 1 1 1 1 1 1 1 1 1 1 1 1 1 1 
1 1 1 1 1 1 1 1 1 1 1 1 1 1 1 1 1 1 1 1 1 1 1 1 1 1 1 1 1 1 
##$CPDPRG= <>
##$CPDPRG1= <>
##$CPDPRG2= <>
##$CPDPRG3= <>
##$CPDPRG4= <mlev>
##$CPDPRG5= <mlev>
##$CPDPRG6= <mlev>
##$CPDPRG7= <mlev>
##$CPDPRG8= <mlev>
##$CPDPRGB= <>
##$CPDPRGT= <>
##$D= (0..63)
0 2 0 0 0 0 0 0 0 0.06 0 0.03 0 0 0 0 0.0002 0 0 0 0 0 0 0 0 0 0 0 0 0 
0 0 0 0 0 0 0 0 0 0 0 0 0 0 0 0 0 0 0 0 0 0 0 0 0 0 0 0 0 0 0 0 0 0 
##$DATE= 1734603935
##$DBL= (0..7)
120 120 120 120 120 120 120 120 
##$DBP= (0..7)
150 150 150 150 150 150 150 150 
##$DBP07= 0
##$DBPNAM0= <>
##$DBPNAM1= <>
##$DBPNAM2= <>
##$DBPNAM3= <>
##$DBPNAM4= <>
##$DBPNAM5= <>
##$DBPNAM6= <>
##$DBPNAM7= <>
##$DBPOAL= (0..7)
0.5 0.5 0.5 0.5 0.5 0.5 0.5 0.5 
##$DBPOFFS= (0..7)
0 0 0 0 0 0 0 0 
##$DE= 6
##$DECBNUC= <off>
##$DECIM= 32
##$DECNUC= <off>
##$DECSTAT= 4
##$DIGMOD= 1
##$DIGTYP= 9
##$DL= (0..7)
0 120 120 120 120 120 120 120 
##$DP= (0..7)
150 150 150 150 150 150 150 150 
$$ [...]
##$SW= 21.9926040160658
##$SWIBOX= (0..15)
0 0 2 0 0 0 0 0 0 0 0 0 0 0 0 0 
##$SW_h= 4401.40845070422
##$TD= 16384
##$TD0= 1
##$TE= 300
##$TE2= 300
##$TE3= 300
##$TEG= 300
##$TL= (0..7)
0 120 120 120 120 120 120 120 
##$TP= (0..7)
150 150 150 150 150 150 150 150 
##$TP07= 0
##$TPNAME0= <>
##$TPNAME1= <>
##$TPNAME2= <>
##$TPNAME3= <>
##$TPNAME4= <>
##$TPNAME5= <>
##$TPNAME6= <>
##$TPNAME7= <>
##$TPOAL= (0..7)
0.5 0.5 0.5 0.5 0.5 0.5 0.5 0.5 
##$TPOFFS= (0..7)
0 0 0 0 0 0 0 0 
##$TUNHIN= 0
##$TUNHOUT= 0
##$TUNXOUT= 0
##$USERA1= <user>
##$USERA2= <user>
##$USERA3= <user>
##$USERA4= <user>
##$USERA5= <user>
##$V9= 5
##$VALIST= <valist>
##$VCLIST= <CCCCCCCCCCCCCCC>
##$VD= 0
##$VDLIST= <DDDDDDDDDDDDDDD>
##$VPLIST= <PPPPPPPPPPPPPPP>
##$VTLIST= <TTTTTTTTTTTTTTT>
##$WBST= 1024
##$WBSW= 25
##$XGAIN= (0..3)
0 0 0 0 
##$XL= 0
##$YL= 0
##$YMAX_a= 1599122
##$YMIN_a= -1557355
##$ZGOPTNS= <>
##$ZL1= 120
##$ZL2= 120
##$ZL3= 120
##$ZL4= 120
##$ABSF1= 10
##$ABSF2= 0
##$ABSG= 5
##$ABSL= 3
##$ALPHA= 0
##$AQORDER= 0
##$ASSFAC= 0
##$ASSFACI= 0
##$ASSFACX= 0
##$ASSWID= 0
##$AUNMP= <proc_1d>
##$AXLEFT= 0
##$AXRIGHT= 0
##$AXTYPE= 0
##$AXUNIT= <>
##$AZFE= 0.1
##$AZFW= 0.1
##$BCFW= 1
##$BC_mod= 2
##$BYTORDP= 1
##$COROFFS= 0
##$CY= 7568.61572265625
##$DATMOD= 1
##$DC= 2
##$DFILT= <>
##$DTYPP= 0
##$F1P= 17.9538593292236
##$F2P= -4.03888763876832
##$FCOR= 0.5
##$FTSIZE= 32768
##$FT_mod= 4
##$GAMMA= 1
##$GB= 1
##$INTBC= 1
##$INTSCL= 1
##$ISEN= 128
##$LB= 0.05
##$LEV0= 0
##$LPBIN= 0
##$MAXI= 945.577
##$MC2= 0
##$MEAN= 0
##$ME_mod= 0
##$MI= -402.1523
##$NCOEF= 0
##$NC_proc= 0
##$NLEV= 6
##$NOISF1= 8.587773
##$NOISF2= 6.764455
##$NSP= 1
##$NTH_PI= 0
##$NZP= 0
##$OFFSET= 17.49637
##$PC= 1
##$PHC0= 104.8987
##$PHC1= -9.885818
##$PH_mod= 0
##$PKNL= yes
##$PPARMOD= 0
##$PPDIAG= 0
##$PPIPTYP= 0
##$PPMPNUM= 100
##$PPRESOL= 1
##$PSCAL= 0
##$PSIGN= 0
##$REVERSE= no
##$SF= 200.13
##$SI= 32768
##$SIGF1= 18.5376
##$SIGF2= -6.396296
##$SINO= 400
##$SIOLD= 32768
##$SREGLST= <1H.CDCl3>
##$SSB= 3
##$STSI= 0
##$STSR= 0
##$SW_p= 4401.40845070422
##$SYMM= 0
##$S_DEV= 0
##$TDeff= 0
##$TDoff= 0
##$TI= <>
##$TILT= no
##$TM1= 0
##$TM2= 0
##$TOPLEV= 0
##$USERP1= <user>
##$USERP2= <user>
##$USERP3= <user>
##$USERP4= <user>
##$USERP5= <user>
##$WDW= 1
##$XDIM= 8192
##$YMAX_p= 0
##$YMIN_p= 0
$$ End of Bruker specific parameters
$$ ---------------------------------
##NTUPLES= NMR FID
##VAR_NAME=  TIME,          FID/REAL,        FID/IMAG
##SYMBOL=    X,             R,               I
##VAR_TYPE=  INDEPENDENT,   DEPENDENT,       DEPENDENT
##VAR_FORM=  AFFN,          ASDF,            ASDF
##VAR_DIM=   8192,          8192,            8192
##UNITS=     SECONDS,       ARBITRARY UNITS, ARBITRARY UNITS
##FACTOR=    0.0002272,     1,               1
##FIRST=     0,             0,               0
##LAST=      1.8609952,     -83,             3
##MIN=       0,             -1557355,        -1557355
##MAX=       1.8609952,     1599122,         1599122
$$ Real data points
##PAGE= N=1
##DATA TABLE= (X++(R..R)), XYDATA
$$ plain form
0 0 0 0 0 0 0 0 0 0 0 0 0 0 0 0 16 -9 16 -16 16 -26 32 -32 48 -48 59 -72 80 -95 112 -126 146 -168 196 -216
34 -216 248 -280 320 -357 400 -448 503 -557 625 -693 766 -848 939 -1034 1140 -1259 1385
51 1385 -1524 1681 -1850 2039 -2248 2482 -2748 3045 -3389 3786 -4250 4794 -5449 6234 -7150
66 -7150 8128 -8521 3752 81319 1599122 1582433 -362830 -1433607 -756589 539773 875418
77 875418 192339 -495172 -402702 -68392 -16505 101241 509104 446023 -324537 -884186 -463077
88 -463077 494961 993069 412560 -691895 -971529 -22288 843390 559058 -263127 -555802
98 -555802 -237559 181875 323086 164929 -19360 -91993 -253815 -358890 55709 638525
108 638525 446952 -364815 -653246 -113692 410100 314129 -127713 -304639 -19068 242787
$$ packed form
0@%%%%%%%%%%%%%%J6k5K5l2L2m2N8o4Q0r6J07j31J52j75K07k38K72l14L64m12
34b16M64n28O00o77P57q48R51j060J182j318J459j614J787j973K174k399K644
51A385k909L205l531L889m287M730n230N793o434P175q036R044j0243J1683j3384
66g150J5278j6649J2273P7567J517803j6689j945263j070777O77018J296362L35645
77H75418o83079o87511R2470L34310N1887J17746M07863o3081p70560n59649M21109
88d63077R58038M98108n80509j104455k79634R49241Q65678k84332q22185k92675
98e55802L18243M19434J41211j58157j84289p2633j61822j05075M14599N82816
108F38525j91573q11767k88431N39554N23792r5971m41842j76926K85571K61855
$$ plain form
118 242787 40888 -198602 48793 304787 -38669 -469583 -238733 343973 494560 72005
128 72005 -412188 -390673 128994 427021 63374 -339301 -128660 261172 161005 -203553
138 -203553 -229881 124707 367375 84879 -447522 -412421 314729 688506 68015 -660398
148 -660398 -474170 276722 581772 165542 -365376 -348860 124095 315773 -28365 -259983
158 -259983 -965 206741 -10126 -206794 -27266 225874 180846 -117101 -318583 -128021
168 -128021 256056 285201 -74827 -239924 -13155 154792 37592 -98686 -67972 47653
178 47653 102262 -2523 -139760 -38250 185593 112189 -183824 -201051 81960 211343 49706
189 49706 -129134 -118158 41926 125977 -28008 -181129 -10139 240746 121193 -183838
$$ packed form
118B42787k01899k39490K47395K55994l43456m30914K30850N82706J50587m22555
128G2005m84193K1515N19667K98027l63647m02675K10641L89832j00167l64558
138b03553k6328L54588K42668k82496n32401L5101P27150L73777o20491p28413
148f60398J86228P50892L05050m16230n30918J6516M72955J91678l44138k31618
158b59983K59018K07706k16867j96668J79528K53140m5028k97947k01482J90562
168a28021L84077K9145l60028j65097K26769J67947j17200j36278L0714J15625
178D7653N4609j04785j37237J01510K23843p3404k96013j7227K83011J29383j61637
189D9706j78840J0976J60084Q4051j53985j53121J70990K50885j19553l05031
$$ plain form
199 -183838 -182828 68337 166661 27852 -130955 -113907 74125 172601 6150 -145560 -10642
210 -10642 125977 -31535 -195453 -48431 193866 199781 -24575 -235349 -174206 136551 273156
221 273156 1352 -264922 -129163 148590 178525 20545 -98274 -95702 1036 57007 -12260
232 -12260 -30546 98452 106499 -109744 -196791 8382 181337 100288 -80463 -157138 -51526
243 -51526 139758 152769 -56199 -156921 -19841 64388 -6443 -5295 83396 62166 -54517
254 -54517 -115131 -69657 67094 165491 36596 -177566 -123956 121996 168353 -6899 -121559
265 -121559 -92454 770 89070 67677 -43220 -46402 44388 9499 -86833 -22499 92220 50949
277 50949 -47321 -56186 -10347 51453 76879 -22300 -119979 -22779 109348 42551 -66225 -19499
$$ packed form
199a83838J010K51165R8324j38809j58807J7048J88032R8476j66451j51710J34918
210a0642J36619j57512j63918J47022K42297N915k24356k10774O1143L10757J36605
221B73156k71804k66274J35759K77753K9935j57980j18819K572R6738N5971o9267
232a2260j8286J28998Q047k16243q7047K05173J72955q1049j80751p6675J05612
243e1526J91284J3011k08968j00722J37080Q4229p0831J148Q8691k1230j16683
254e4517o0614M5474J36751R8397j28895k14162N3610K45952M6357j75252j14660
265a21559K9105R3224Q8300k1393j10897l182R0790l4889r6332O4334J14719m1271
277E0949r8270q865M5839O1800K5426r9179r7679R7200J32127o6797j08776M6726
$$ plain form
289 -19499 46783 10340 -36806 -44837 -17764 64949 88208 -42965 -120339 8741 107244 12596
301 12596 -75580 -36138 17281 40020 42007 -15402 -53496 14693 45758 -41952 -55773 52262
313 52262 71947 -19021 -50425 -18307 5700 37346 28416 -54468 -59669 51579 72705 -26942
325 -26942 -48762 9789 8235 -16146 1404 5747 7583 37029 3319 -72478 -25062 80941
337 80941 40777 -65729 -47835 30326 48183 29914 -14915 -70330 -32418 60550 41315 -39343
349 -39343 -19124 29038 -4454 -24507 13839 12192 -15310 -2209 -2180 -16866 29331 56896 -25437
362 -25437 -77851 -3952 53756 22141 -6077 -15086 -27111 8421 47996 -3679 -54666 -1562
374 -1562 38051 -8378 -20071 23998 17187 -19734 -17195 -12603 -8001 33950 36650 -33146 -43426
$$ packed form
289a9499O6282l6443m7146q031K7073Q2713K3259j31173p7374J29080R8503r4648
301A2596q8176L9442N3419K2739J987n7409l8094O8189L1065q7710j3821J08035
313E2262J9685r0968l1404L2118K4007L1646q930q2884n201J11248K1126r9647
325b6942k1820N8551j554k4381J7550M343J836K9446l3710p5797M7416J06003
337H0941m0164j06506J7894P8161J7857j8269m4829n5415L7912R2968j9235q0658
349c9343K0219M8162l3492k0053L8346j647k7502J3101K9j4686M6197K7565q2333
362b5437n2414P3899N7708l1615k8218r009j2025L5532L9575n1675n0987N3104
374a562L9613m6429j1693M4069o811l6921K539M592M602M1951K700o9796j0280
$$ plain form
387 -43426 28741 38809 -16965 -22432 446 -4212 8859 29191 -3227 -27599 7169 12475 -25142
400 -25142 -8610 32520 8326 -23193 -2985 7587 -2931 9827 3055 -35726 -14996 45854
412 45854 28203 -29958 -20805 10672 2254 1266 11252 -8270 -12332 19661 12270 -21710 -2026
425 -2026 22409 -13731 -30613 12261 25776 -779 -2306 -2346 -23387 -6712 28870 7232 -23684
438 -23684 179 15433 -8101 -3567 16467 -4041 -17254 6683 5041 -12013 15809 31083
450 31083 -16474 -38538 1699 19507 4412 7628 1959 -23723 -9314 22837 5073 -16256
462 -16256 4025 3106 -22590 557 35441 9731 -20262 -7414 -5933 -14553 13954 30556 -3090
475 -3090 -17692 1390 -4869 -10431 21790 23136 -22985 -28125 5189 9295 10166 26261 -2889 -49948
$$ packed form
387d3426P2167J0068n5774n467K2878m658J3071K0332l2418k4372L4768N306l7617
400b5142J6532M1130k4194l1519K0208J0572j0518J2758o772l8781K0730O0850
412D5854j7651n8161R153L1477q418r88R986j9522m062L1993p391l3980J9684
425b026K4435l6140j6882M2874J3515k6555j527m0k1041J6675L5582k1638l0916
438b3684K3863J5254k3534M534K0034k0508j3213K3937j642j7054K7822J5274
450C1083m7557k2064M0237J7808j5095L216n669k5682J4409L2151j7764k1329
462a6256K0281r19k5696K3147L4884k5710k9993J2848J481q620K8507J6602l3646
475c090j4602J9082o259n562L2221J346m6121n140L3314M106Q71J6095k9150m7059
$$ plain form
489 -49948 -23021 31779 27611 4695 72 -21677 -31872 10441 35534 6889 -5204 -640 -27002
502 -27002 -25531 36283 51935 -9053 -43988 -29186 -8912 30185 62354 11681 -62672 -46333
514 -46333 13821 31317 28870 12932 -38616 -52384 12147 49925 18918 -767 -7661 -42287
526 -42287 -36875 32522 58763 14656 -20556 -36817 -40619 13313 73980 34465 -48260 -56942 -16836
539 -16836 18534 55050 44501 -37935 -73985 -6040 46414 27155 6558 -7970 -37459 -26569
551 -26569 21428 27386 8661 15466 -2232 -48305 -29350 37722 47084 9317 -19394 -48835 -43776
564 -43776 37054 86269 15133 -64477 -50379 -1385 30142 45666 13298 -43283 -35874 9973
576 9973 10561 7429 39167 23217 -45750 -56067 -791 37267 47296 26264 -46193 -82361 -931
$$ packed form
489d9948K6927N4800m168k2916m623k1749j0195M2313K5093k8645j2093M564k6362
502b7002J471O1814J5652o0988l4935J4802K0274L9097L2169n0673p4353J6339
514d6333O0154J7496k447j5938n1548j3768O4531L7778l1007j9685o894l4626
526d2287N412O9397K6241m4107l5212j6261l802N3932O0667l9515q2725q682M0106
539a6836L5370L6516j0549q2436l6050O7945N2454j9259k0597j4528k9489J0890
551b6569M7997N958j8725O805j7698m6073J8955O7072R362l7767k8711k9441N059
564d3776Q0830M9215p1136p9610J4098M8994L1527J5524l2368n6581P409M5847
576I973N88l132L1738j5950o8967j0317N5276L8058J0029k1032p2457l6168Q1430
$$ plain form
589 -931 87769 61774 -20462 -68963 -65369 1902 80306 57665 -34829 -54883 -7354 10799 14720
602 14720 32516 9662 -40667 -39675 -2723 20996 45421 45833 -20620 -74915 -33997 34654 51906
615 51906 31863 -17617 -72316 -42989 57337 79965 -1138 -57222 -40090 -2382 31326 37818
627 37818 -5407 -34847 -4892 13868 -10742 -6900 27987 22425 -10370 -22555 -24910 -8927 40661
640 40661 49024 -23791 -67759 -13142 50341 48344 6188 -41106 -54532 -4136 44159 18943
652 18943 -16377 2980 14100 -17196 -22674 10260 23361 11102 -9258 -39448 -34489 33399
664 33399 74352 20462 -48343 -52155 -14088 30661 52558 10660 -52131 -40280 22038 37352
676 37352 12155 -1099 -14873 -30024 -10968 18147 17099 10428 7489 -20215 -37159 2809 43284
$$ packed form
589i31Q8700k5995q2236m8501L594O7271P8404k2641r2494k0054M7529J8153L921
602A4720J7796k2854n0329R92L6952K3719K4425M12o6453n4295M0918O8651J7252
615E1906k0043m9480n4699K9327J00326K2628q1103n6084J7132L7708L3708O492
627C7818m3225k9440K9955J8760k4610L842L4887n562l2795j2185k355J5983M9588
640D0661Q363p2815m3968N4617O3483j997m2156m7294j3426N0396M8295k5216
652A8943l5320J9357J1120l1296n478L2934J3101j2259k0360l0190M959O7888
664C3399M0953n3890o8805l812L8067M4749K1897m1898o2791J1851O2318J5314
676C7352k5197j3254j3774j5151J9056K9115j048o671k939k7704j6944L9968M0475
$$ plain form
689 43284 26065 -9345 -27131 -33487 -6830 44609 43077 -18619 -47483 -15558 19266 32372
701 32372 22864 -16403 -40737 -9574 19734 2287 -5795 17361 13461 -16968 -19416 214 12849
714 12849 22275 8258 -36518 -42749 16370 54211 24313 -15406 -30569 -26480 7524 39774 12711
727 12711 -33869 -23309 11154 12981 9244 15692 -486 -22801 -17216 -6344 1562 25039 26654
740 26654 -18650 -38137 3166 30636 13173 -1537 -10699 -26920 -12517 26272 27064 -2761 -11799
753 -11799 -10784 -11643 8943 24101 -2152 -21209 -1010 4922 -10230 3252 21132 -426 -18588
766 -18588 -2582 4967 -224 10001 8940 -16297 -16662 6936 8942 5232 14973 1237 -24988 -7921
780 -7921 19727 3300 -13212 3642 5271 -12882 -3522 15816 10055 1716 -5202 -25418 -19659
$$ packed form
689D3284j7219l5410j7786o356K6657N1439j532o1696k8864L1925L4824J3106
701C2372r508l9267k4334L1163K9308j7447q082K3156l900l0429k448J9630J2635
714A2849R426j4017m4776o231N9119L7841k9898l9719j5163M089L4004L2250k7063
727A2711m6580J0560L4463J827l737O448j6178k2315N585J0872P906K3477J615
740B6654m5304j9487M1303K7470j7463j4710r162j6221J4403L8789P92k9825r038
753a1799J015q59K0586J5158k6253j9057K0199N932j5152J3482J7880k1558j8162
766a8588J6006P549n191J0225j061k5237l65K3598K006l710R741j3736k6225J7067
780g921K7648j6427j6512J6854J629j8153R360J9338n761q339o918k0216N759
$$ plain form
793 -19659 23707 32017 -7315 -19887 -1632 -512 2942 20852 6353 -27112 -17745 11457 12747
806 12747 8615 8882 -11446 -22005 4490 17334 -1264 -3203 4104 -13593 -15377 17479 21107
819 21107 -9682 -13541 1218 -2761 40 15418 4247 -14540 -4115 3698 -5779 5787 19668
832 19668 -3713 -20824 2240 12851 -4486 -3215 6350 -6806 -9521 9299 7773 -5660 2416
845 2416 4147 -13316 -6962 13442 3049 -10150 4645 7574 -8993 -1807 13088 -774 -10846
858 -10846 2832 2498 -8291 4348 12396 -4418 -7996 4626 -2038 -7544 9695 8970 -14606 -10466
872 -10466 10995 5973 -3965 3706 -613 -11888 1418 12437 -2167 -6287 5865 -1085 -9264
885 -9264 7761 12741 -7886 -9765 6057 2276 -4416 5659 2758 -10525 -1435 9732 -2376
$$ packed form
793a9659M3366Q310l9332j2572J8255J120L454J7910j4499l3465R367K9202J290
806A2747m132K67k0328j0559K6495J2844j8598j939P307j7697j784L2856L628
819B1107l0789l859J4759l979K801J5378j1171j8787J0425P813r477J1566J3881
832A9668k3381j7111K3064J0611j7337J271R565j3156k715J8820j526j3433Q076
845B416J731j7463O354K0404j0393j3199J4795K929j6567P186J4895j3862j0072
858a0846J3678l34j0789J2639Q048j6814l578J2622o664n506J7239p25k3576M140
872a0466K1461n022r938P671m319j1275J3306J1019j4604m120J2152o950q179
885i264J7025M980k0627j879J5822l781o692J0075k901j3283R090J1167j2108
$$ plain form
898 -2376 -6296 6321 850 -10232 2469 9604 -5277 -5764 7553 696 -8251 4503 8089 -5728
912 -5728 -3948 5431 -1957 -4030 7621 2553 -9955 284 9025 -3840 -6212 6653 962 -9893
926 -9893 1303 8459 -3225 -3859 4328 -2099 -4628 7538 4165 -9880 -1817 9417 -1123 -5533
940 -5533 6441 2769 -8515 531 7766 -3570 -4641 5886 -31 -7205 3611 5465 -6285 -2445
954 -2445 6376 -3311 -6425 7640 4716 -9718 -1842 8688 -1556 -4950 5926 1789 -7008 2532
968 2532 6629 -5073 -2753 6776 -2242 -7525 6376 6292 -8495 -3469 7258 -1836 -5570 6155
982 6155 1935 -9339 889 8689 -2952 -4696 5140 -1106 -6420 6530 7045 -8176 -3598 8598
996 8598 -792 -6544 6239 4389 -8634 -1433 7776 -2594 -4488 5992 -571 -8914 3625 7282
$$ packed form
898b376l920J2617n471j1082J2701P135j4881m87J3317o857q947J2754L586j3817
912e728J780R379p388k073J1651n068j2508J0239Q741j2865k372J2865n691j0855
926i893J1196P156j1684o34Q187o427k529J2166l373j4045Q063J1234j0540m410
940e533J1974l672j1284R046P235j1336j071J0527n917p174J0816J854j1750L840
954b445Q821r687l114J4065k924j4434P876J0530j0244l394J0876m137q797R540
968B532M097j1702K320R529r018n283J3901q4j4787N026J0727r094l734J1725
982F155m220j1274J0228P800j1641j744R836o246n314J2950N15j5221M578J2196
996H598r390n752J2783j850j3023P201R209j0370j894J0480o563q343J2539L657
$$ plain form
1010 7282 -6537 -3166 8446 -1918 -9040 5401 6709 -6396 -930 6729 -4977 -5677 9689
1023 9689 5163 -8412 -782 4462 -5422 -86 11049 -2441 -12390 2934 7033 -5758 -332 8646
1037 8646 -5118 -10111 5216 5840 -3738 3051 3560 -11070 -4473 13872 5228 -8327 139 1968
1051 1968 -8316 1734 14115 -811 -11578 364 2304 -3577 6844 8723 -10684 -11741 6273
1064 6273 5556 -1781 5424 841 -14391 -3483 14654 4028 -7674 1650 894 -8610 2139 11620
1078 11620 -470 -5210 2025 -5051 -7556 11540 13066 -10284 -12835 3546 3263 125 7696 278
1092 278 -13409 -2042 10339 -400 -4201 6206 -511 -10383 1451 8461 -1461 1109 7427 -7548
1106 -7548 -13891 6932 14442 -1420 -6165 -2511 -6523 1200 15007 3493 -14210 -5723 4602
$$ packed form
1010G282j3819L371J1612j0364p122J4441J308j3105N466P659j1706p00J5366
1023I689m526j3575P630N244r884N336J1135j3490r949J5324M099j2791N426Q978
1037H646j3764m993J5327O24r578O789N09j4630O597J8345q644j3555Q466J829
1051A968j0284J0050J2381j4926j0767J1942J940n881J0421J879j9407j057J8014
1064F273p17p337P205m583j5232J0908J8137j0626j1702R324p56r504J0749R481
1078A1620j2090m740P235p076k505J9096J526k3350k551J6381k83l138P571p418
1092B78j3687J1367J2381j0739l801J0407o717r872J1834P010r922K570O318j4975
1106g548o343K0823P510j5862m745L654m012P723J3807j1514j7703Q487J0325
$$ plain form
1119 4602 -1738 1670 10189 -2186 -12099 1367 7310 -2570 481 6633 -5008 -9746 3249 6251
1133 6251 1463 6565 1511 -16088 -9021 15612 12682 -7228 -9384 -4024 -1711 8476 11356 -6640
1147 -6640 -13493 2710 7238 -3199 -673 4845 -2348 -2917 3674 -3133 -6128 10865 13281 -9948
1161 -9948 -16885 1485 11423 7235 134 -10760 -11735 8570 17262 -3311 -13464 732 4590 -5629
1175 -5629 -2149 5293 876 1259 4764 -5292 -10034 5867 12618 -1916 -10408 -6081 -1325 9818
1189 9818 17902 -1044 -22632 -8449 14346 8422 -4735 -3644 -3257 -3687 5326 7256 -2655 -2572 2766
1204 2766 -5121 -8040 4925 8204 -935 369 1336 -10145 -6426 15495 14417 -9946 -16029 -1748
1218 -1748 8227 10656 3467 -13106 -12383 9418 13609 -4618 -6960 4028 -146 -6836 203 1629
$$ packed form
1119D602o340L408Q519j2375r913J3466N943r880L051O152j1641m738J2995L002
1133F251m788N102n054j7599P067K4633k930j9910k156N360K313J0187K880j7996
1147f640o853J6203M528j0437K526N518p193n69O591o807k995J6993K416k3229
1161i948o937J8370R938m188p101j0894r75K0305Q692k0573j0153J4196L858j0219
1175e629L480P442m417L83L505j0056m742J5901O751j4534q492M327M756J1143
1189I818Q084j8946k1588J4183K2795n924j3157J091L87m30R013J930r911Q3N338
1204B766p887k919J2965L279r139J304R67j1481L719K1921j078k4363o083J4281
1218a748R975K429p189j6573P23K1801M191j8227k342J0988m174o690P039J426
$$ plain form
1232 1629 -2516 6129 9550 -7303 -12764 5107 12817 2222 -7128 -11983 -8288 12693 22004 -2167
1246 -2167 -18616 -1138 10008 -2769 -6190 2573 692 -2361 1867 -732 -2280 9301 8161 -11795
1260 -11795 -14387 2196 7095 4213 6971 -1860 -14831 -1325 17709 6618 -10926 -7704 -1781
1273 -1781 -444 8521 8737 -6156 -8120 2998 566 -3542 7167 6507 -9945 -8515 4732 1637
1287 1637 -1750 7954 4771 -9798 -5992 6390 4935 2651 1767 -10284 -12393 9106 16706 -2234
1301 -2234 -8580 2402 1092 -3913 2284 798 -7334 -82 6731 -3147 -2990 10307 5732 -9471
1315 -9471 -7245 -802 -1834 5374 10813 -4412 -12708 4559 12280 -874 -4925 -775 -5307 -3689
1329 -3689 7107 4223 -3370 3568 3791 -10431 -6622 10499 6352 -7340 -4429 69 -1886 4725
$$ packed form
1232A629m145Q645L421j6853n461J7871P710j0595r350m855L695K0981R311k4171
1246b167j6449J7478J1146j2777l421Q763j881l053M228k599j548J1581j140j9956
1260a1795k592J6583M899k882K758q831j2971J3506J9034j1091j7544L222N923
1273a781J337Q965K16j4893j964J1118k432m108J0709o60j6452J430J3247l095
1287A637l387R704l183j4569L806J2382j455k284q84j2051k109K1499P600j8940
1301b234o346J0982j310n005O197j486q132P252O813r878J57J3297m575j5203
1315i471K226O443j032P208N439j5225q296J7267P721j3154m051M150m532J618
1329c689J0796k884p593O938K23j4222L809J7121m147j3692K911M498j955O611
$$ plain form
1343 4725 8310 -4515 -8652 3363 3948 -3280 3138 5770 -6945 -7619 5596 5098 -2081 2341 1648
1358 1648 -6832 -1266 8563 173 -8029 -1168 1039 -2658 4231 7435 -3044 -4286 3731 -1882 -8362
1373 -8362 2973 8718 -2872 -5454 3869 3740 213 2484 -2063 -8098 430 6474 -3257 -4596 7063
1388 7063 4954 -5810 -2180 3089 -2415 -2543 2748 -1882 -4214 5313 6158 -4333 -3470 3243 -463
1403 -463 -2315 3564 649 -5010 2018 5216 -4580 -3776 7223 3769 -6865 -3353 2741 487 854
1418 854 1675 -4710 -4001 6035 4079 -5571 -1073 5419 -1491 -5392 1784 2031 -2566 1630 3325 -3076
1434 -3076 -799 6105 272 -6699 -420 3296 -1618 -506 3163 -1684 -2091 4686 985 -6591 -640
1449 -640 5406 -2425 -5380 3363 4297 -1120 184 469 -3746 448 5353 -2087 -5605 3630 5262 -3438
$$ packed form
1343D725L585j2825m137J2015N85p228O418K632j2715o74J3215m98p179M422o93
1358A648q480N566R829q390q202O861K207l697O889L204j0479j242Q017n613o480
1373h362J1335N745j1590k582R323j29l527K271m547o035Q528O044r731j339J1659
1388G063k109j0764L630N269n504j28N291m630k332R527Q45j0491Q63O713l706
1403d63j852N879k915n659P028L198r796Q04J0999l454j0634L512O094k254L67
1418H54Q21o385P09J0036j956r650M498O492o910l901P176K47m597M196J695o401
1434c076K277O904n833o971O279L716m914J112L669m847m07O777l701p576N951
1449f40O046p831k955Q743R34n417J304K85m215M194M905p440l518R235J632q700
$$ plain form
1465 -3438 -2244 3639 -420 -2442 2261 -297 -4855 2131 5278 -3854 -4744 3906 2828 -3254 -398
1480 -398 1080 -2227 1836 4520 -3918 -5392 5397 4999 -5218 -2266 4888 430 -2620 1575 -614
1495 -614 -3253 3313 3352 -5394 -2276 6176 735 -5334 747 2462 -3055 120 3769 -2900 -3137 5550
1511 5550 2500 -5601 -164 4741 -1800 -2912 2931 291 -2465 3447 1497 -5942 12 6771 -1952
1526 -1952 -6638 2600 4002 -3215 -964 2451 -2467 -761 4707 -1291 -5656 3275 5154 -4205 -2818
1541 -2818 4674 412 -2879 2898 980 -4783 1496 5301 -3605 -4595 4771 2230 -4615 59 2866
1556 2866 -2591 -152 3719 -3139 -4426 5488 3953 -6365 -2022 5522 292 -2720 2230 -115 -3279
1571 -3279 3364 3678 -5148 -2230 5795 242 -5202 1740 3182 -3195 -728 3049 -2854 -2587 5089
$$ packed form
1465c438J194N883m059k022M703k558m558O986L147r132q90Q650j078o082K856
1480c98J478l307M063K684q438j474J0789l98j0217K952P154m458l050M195k189
1495f14k639O566L9q746L118Q452n441o069O081J715n517L175L649o669k37Q687
1511E550l050q101N437M905o541j112N843k640k756N912j950p439N954O759q723
1526a952m686R238J402p217K251L415m918J706N468n998m365Q931J879r359J387
1541b818P492m262l291N777j918n763O279L805q906r90R366k541o845M674K807
1556B866n457K439L871o858j287R914j535j0318M343P544n230l012M950k345l164
1571c279O643L14q826K918Q025n553n444O942J442o377K467L777n903K67P676
$$ plain form
1586 5089 1201 -6108 -192 4718 -1440 -1967 3037 -986 -3555 3674 3136 -4368 -715 4653 -1505
1601 -1505 -3784 3879 2468 -4119 -540 2758 -2255 -1139 4091 -980 -5002 2119 3620 -3456 -1245
1616 -1245 3946 -945 -3769 2545 2266 -2828 921 2860 -3416 -2160 5277 1790 -4452 -17 2527
1631 2527 -2042 -509 3456 -1982 -3819 3042 2238 -4270 -777 4260 -854 -3151 1609 448 -2040
1646 -2040 2549 2603 -4262 -2193 4814 1482 -3042 802 1383 -2824 190 3828 -1173 -2916 2261 929
1662 929 -3506 572 3556 -1836 -2576 2110 -196 -2821 2307 3014 -3110 -2056 2780 122 -1664 2553
1678 2553 1202 -3713 -494 3608 -219 -1452 2344 -306 -3803 1176 3794 -1713 -2604 1753 -172
1693 -172 -2391 1893 1998 -2560 -720 2565 -1829 -2447 3656 2833 -3165 -1247 2207 -680 -133 3603
$$ packed form
1586E089l888p309N916M910o158n27N004m023k569P229n38p504L653N368o158
1601a505k279P663j411o587L579L298n013J116N230n071m022P121J501p076K211
1616a245N191m891k824O314k79n094L749J939o276J256P437l487o242M435K544
1631B527m569J533L965n438j837O861q04o508L493N037n114k297M760j161k488
1646b040M589N4o865K069P007l332m524L844N81m207L014L638n001j743N177j332
1662I29m435M078K984n392p40M686k306k625N128P07o124J054M836k658j786M217
1678B553j351m915L219M102l827j233L796k650l497M979K618n507q91M357j925
1693a72k219M284J05m558J840L285m394o18O103q23n998J918L454k887N47L736
$$ plain form
1709 3603 -668 -4942 513 4052 -446 -979 1168 -1941 -2395 2977 1687 -3727 -330 3608 -1623
1724 -1623 -3427 2518 2839 -1890 -717 302 -2586 479 5273 89 -4805 -28 2489 -825 1027
1739 1027 2842 -3025 -4193 3199 3265 -2900 -1080 2178 -1595 -1862 2265 501 -2040 1882 942 -4628
1755 -4628 -1317 5097 1237 -2989 1088 873 -2957 1625 4981 -2109 -5362 645 2340 202 2192
1770 2192 831 -4300 -663 4486 -1049 -4907 1885 3189 -3320 -1806 3203 951 -506 1965 -1864
1785 -1864 -5603 1656 5885 -484 -3010 616 -750 -580 4661 1747 -6330 -2400 5007 754 -3372
1800 -3372 1090 1945 -1989 -257 1001 -2268 473 4797 -1616 -6247 1240 4831 -952 -1405 1927
1815 1927 -1499 -1863 4170 2760 -4030 -2246 1407 -1134 110 3956 -184 -3668 1708 2610 -3639
$$ packed form
1709C603m271m274N455L539m498n33K147l109m54N372j290n414L397L938n231
1724a623j804N945L21m729J173J019k888L065M794n184m894M777K517l314J852
1739A027J815n867j168P392O6o165J820L258l773k67M127j764k541L922r40n570
1755d628L311O414l860m226M077k15l830M582L356p090l253O007J695k138J990
1770B192j361n131L637N149n535l858O792J304o509J514N009k252j457K471l829
1785a864l739P259M229o369k526L626j366J70N241k914q077L930P407m253m126
1800c372M462Q55l934J732J258l269K741M324o413m631P487L591n783m53L332
1815A927l426l64O033j410o790J784L653k541J244L846m140l484N376R02o249
$$ plain form
1830 -3639 -2133 3409 -391 -3860 1097 2273 -881 1501 2814 -3182 -3771 1721 1083 -1241 2363
1845 2363 1620 -3769 -85 5723 -221 -5793 -583 2651 -983 -557 1528 -707 -109 2354 -1859 -4194
1861 -4194 2667 4318 -3147 -3892 2407 1807 -868 1811 1011 -3646 -970 3597 758 -1632 645 -556
1877 -556 -2366 1422 2138 -2397 -172 4321 -623 -5045 805 3829 -1975 -3548 708 1285 628 1995
1893 1995 250 -2089 968 857 -3703 -1215 4437 903 -4134 957 4895 -241 -2880 -373 -683
1908 -683 -1581 854 879 -855 1588 2127 -2181 -1965 2395 332 -3282 316 2259 -2037 -1201 4445 2230
1925 2230 -3524 -1965 1671 865 17 -340 -1650 466 3352 -1032 -4441 1602 4997 -2088 -4698 1509
1941 1509 3104 -1553 -2128 -68 -202 1119 2164 -703 -1523 1400 334 -2822 164 2761 -1323 -2143
$$ packed form
1830c639J506N542l800l469M957J176l154K382J313n996n89N492o38k324L604
1845B363p43n389L684N808n944n572N210L234l634M26K085k235N98K463m213k335
1861d194O861J651p465p45O299o00k675K679q00m657K676M567k839k390K277j201
1877e56j810L788P16m535K225M493m944m422N850L024n804j573M256N77o57J367
1893A995j745k339L057j11m560K488N652l534n037N091L938n136k639K507l10
1908f83q98K435K5j734K443N39m308K16M360k063l614L598J943m296Q36N646k215
1925B230n754J559L636q06q48l57j310K116K886m384l409O043L395p085k610O207
1941A509J595m657n75K060j34J321J045k867q20K923j066l156K986K597m084q20
$$ plain form
1957 -2143 2683 2080 -2060 224 2721 -1743 -3918 -212 1358 549 1292 318 -1578 1126 2009 -3213
1973 -3213 -3445 3010 2423 -3385 -1008 4384 1754 -2137 -690 74 -459 1077 34 -2755 348 3913
1989 3913 -399 -3153 1495 2147 -2755 -1594 1932 -458 -1528 2048 647 -2913 -228 2816 -296
2004 -296 -1168 1079 -460 -1216 2131 762 -3517 89 4513 -440 -3892 1298 3123 -1166 -1526 -149
2020 -149 -1534 110 2721 -830 -2744 2764 3248 -3066 -2757 2153 307 -2096 1074 1364 -1290 1092
2036 1092 2423 -2052 -2371 2127 828 -2655 427 1872 -1468 -308 2755 -876 -2876 1490 1397 -3263
2052 -3263 -1097 3100 376 -1588 992 97 -1542 1796 1531 -3059 -975 3831 299 -3539 803
2067 803 2847 -967 -1105 1056 -755 -503 2282 -764 -3549 1112 3184 -1744 -2240 2243 839 -1888
$$ packed form
1957b143M826o03m140K284K497m464k175L706J570q09P43r74j896K704Q83n222
1973c213k32O455n87n808K377N392k630l891J447P64n33J536j043k789L103L565
1989C913m312k754M648O52m902J161L526k390j070L576j401l560K685L044l112
2004b96q72K247j539p56L347j369m279L606M424m953l452N190J825m289l60J377
2020a49j385J644K611l551j914N508M84o314L09M910j846k403L170K90k654K382
2036A092J331m475l19M498j299l483L082J445l340J160L063l631k000M366r3m660
2052c263K166M197k724j964K580q95j639L338k65m590K084M806l532l838M342
2067H03K044l814j38K161j811K52K785l046k785M661K072m928m96M483j404k727
$$ plain form
2083 -1888 874 1035 -2445 -168 2665 -741 -2161 2097 1907 -1879 -362 1002 -1603 -309 2760
2098 2760 -670 -3170 1661 2956 -2256 -1887 1948 376 -1666 320 154 -1168 1510 1925 -2429 -1630
2114 -1630 3241 850 -3210 -141 2423 -587 -729 1270 -504 -1416 1734 943 -2433 -121 2473 -753
2130 -753 -2052 1057 515 -1359 967 1143 -2449 -949 2982 476 -2664 358 1798 -795 -460 1252
2146 1252 -647 -498 1950 -132 -2757 790 2642 -1403 -2190 1610 1024 -1476 75 554 -1344 -56
2162 -56 1585 -1178 -1830 2056 1479 -2189 -658 1910 -84 -951 963 -281 -1431 1568 1914 -2013
2178 -2013 -1456 2187 873 -1767 -123 730 -712 327 1149 -1895 -1354 2500 1225 -2744 -961 2037
2194 2037 405 -881 464 -349 -975 1742 1430 -2179 -761 2511 303 -2099 447 1216 -1008 -123
$$ packed form
2083a888K762J61l480K277K833l406j420M258j90l786J517J364k605J294L069
2098B760l430k500M831J295n212L69L835j572k042J986j66j322K678M15m354P99
2114a630M871k391m060L069K564l010j42J999j774r12L150p91l376K312K594l226
2130g53j299L109n42j874K326J76l592J500L931k506l140L022J440k593L35J712
2146A252j899J49K448k082k625L547J852m045p87L800n86k500J551M79j898J288
2162e6J641k763o52L886n77l668J531K568j994q67J914j244j150K999L46l927
2178b013N57L643j314k640J644Q53j442J039Q22l044N41L854j275l969J783K998
2194B037j632j286J345q13o26K717l12l609J418L272k208k402K546P69k224Q85
$$ plain form
2210 -123 1020 -1270 -1045 1985 515 -2349 -20 1900 -873 -1091 1552 29 -1494 845 997 -1548
2226 -1548 143 2284 -1099 -1951 1564 1640 -1668 -475 1235 -619 -699 1374 -393 -1876 1392 1739
2242 1739 -2290 -1418 2256 622 -1692 175 365 -1206 1089 1961 -2086 -1910 2422 1546 -1816 -199
2258 -199 1547 -796 -461 1544 -690 -1671 2044 1296 -2835 -1007 2515 275 -1548 694 149 -1355
2274 -1355 1141 1802 -1928 -1239 2315 277 -2150 1066 1918 -1507 -631 1578 -373 -977 1730 344
2290 344 -2570 289 2352 -1102 -1475 1583 7 -1979 726 1390 -1684 -304 2106 -1141 -2084 2034
2306 2034 1979 -1968 -728 1333 -719 -520 2122 -334 -2365 1156 1976 -1799 -1139 2240 20 -2129
2322 -2129 818 885 -1470 585 1684 -1734 -1716 2166 951 -1787 333 1283 -1577 -420 2280 -27
$$ packed form
2210a23J143k290K25L030j470k864K329J920k773k18K643j523j523K339J52k545
2226a548J691K141l383q52L515P6l308J193J710j854q0K073j767j483L268L47
2242A739m029Q72L674j634k314J867J90j571K295Q72m047J76M332q76l362J617
2258a99J746k343L35K005k234r81L715p48m131J828L522k240j823K242n45j504
2274a355K496O61l730O89L554k038k427L216Q52l425Q76K209j951o04K707j386
2290C44k914K859K063l454l73L058j576j986K705O64l074J380K410l247r43M118
2306B034n5l947J240K061k052J99K642k456k031L521Q20l775O60L379k220k149
2322b129K947O7k355K055J099l418J8L882j215k738K120R50k860J157K700k307
$$ plain form
2338 -27 -1900 1059 1071 -1688 -9 2111 -1030 -1758 1285 655 -1560 691 1423 -1623 -1140 1732 -282
2355 -282 -2025 1246 1406 -2070 -620 2071 160 -730 1148 -261 -2134 992 2231 -1282 -1474 1768
2371 1768 497 -1331 816 819 -1623 -506 1559 -849 -1519 1539 1183 -1738 -437 1162 -874 -218
2387 -218 1983 -359 -2341 913 2186 -888 -918 1111 -258 -903 1297 723 -1865 -295 1455 -739
2403 -739 -1428 1013 580 -1061 604 796 -1847 -438 2220 -149 -2427 -13 1663 99 297 991
2419 991 -958 -1123 1431 487 -1768 143 1776 -359 -800 1164 170 -1505 504 602 -1804 -820 2028
2436 2028 593 -1149 228 475 -1032 303 1083 -1331 -1261 1497 866 -1033 546 1369 -1472 -1179 1391
2453 1391 339 -1364 317 881 -858 -318 1008 -495 -612 1563 26 -2349 98 2185 -617 -1849
$$ packed form
2338b7j873K959J2k759J679K120l141p28L043o30k215K251P32l046M83K872k014
2355b82j743L271J60l476J450K691j911q90J878j409j873L126J239l513j92L242
2371A768j271j828K147Lk442J117K065k408o70L058l56k921J301J599k036O56
2387b18K201k342j982L254J273l074l0K029j369o45K200n74k588J570J750k194
2403g39o89K441m33j641J665J92k643J409K658k369k278K414J676j564J98O94
2419I91j949j65K554r44k255J911J633k135m41J964r94j675K009R8k406R84K848
2436B028j435j742J377K47j507J335P80k414P0K758o31j899J579Q23k841K93K570
2453A391j052j703J681N64j739N40J326j503j17K175j537k375K447K087k802j232
$$ plain form
2469 -1849 554 646 -542 1132 1108 -1463 -628 1717 -142 -1867 351 1069 -458 499 1192 -1176 -845
2486 -845 1731 -91 -3122 -398 2343 376 -872 452 98 -408 1137 -92 -2538 -475 2257 -250
2502 -250 -1425 1415 1605 -1094 -541 471 -1340 -709 1752 38 -1735 749 1442 -1129 -773 1314
2518 1314 -601 -1586 1058 738 -1547 163 1856 -1029 -1220 1753 908 -1571 283 1173 -822 -308
2534 -308 1172 -870 -1323 1727 1307 -1921 -212 2384 -458 -2231 -56 344 -593 1091 893 -1505
2550 -1505 -25 2546 -266 -2844 253 1510 -889 -268 1329 -255 -156 1845 5 -2685 -272 1712
2566 1712 -846 -1069 1287 339 -742 1155 265 -2442 -335 2375 -571 -2106 1057 1686 -849 -176
2582 -176 789 -585 60 1387 -833 -1797 1595 1678 -1935 -1018 1949 186 -1504 388 827 -778 126
$$ packed form
2469a849K403R2j188J674k4k571Q35K345j859j725K218P18j527R57O93k368L31
2486h45K576j822l031K724K741j967j248J324l54n06J545j229k446K063K732k507
2502b50j175K840J90k699N53J012j811O31K461j714j773K484O93k571L56K087
2518A314j915r85K644l20k285J710J693k885j91K973q45k479J854Q90j995N14
2534c08J480k042m53L050m20l228J709K596k842j773K175M00r37J684j98k398
2550a505J480K571k812k578L097J257k399O21J597j584R9K001j840k690K413J984
2566A712k558k23K356r48j081J897q90k707K107K710k946j535L163O29k535O73
2582a76R65j374O45J327k220r64L392Q3l613R17K967j763j690J892M39j605R04
$$ plain form
2599 126 523 -1626 -752 1921 417 -1462 617 1501 -925 -586 738 -905 -1124 1669 1127 -1729 -226
2616 -226 2103 249 -1463 -263 -182 -510 857 -2 -1953 383 2914 -318 -2852 133 1490 -763
2632 -763 -975 477 183 229 1180 -283 -1510 760 1316 -1230 -1047 1013 349 -896 676 832 -1107
2649 -1107 -364 1165 -473 -1485 635 950 -812 -426 500 -451 3 925 -516 -1115 1195 1087 -1620
2666 -1620 -1159 1905 874 -1246 -298 803 133 236 -4 -1258 -278 1730 -20 -2073 -46 1925
2682 1925 -26 -1031 252 -74 -736 372 371 -1391 -127 1915 370 -1257 -58 594 -345 263 392
2699 392 -1024 -260 1796 274 -1936 -128 1561 -335 -1246 72 279 -241 530 7 -1014 362 1405
2716 1405 -692 -1472 1032 1129 -870 -421 748 -207 -275 637 -271 -972 914 1029 -1271 -970 1280 366
$$ packed form
2599A26L97k149Q74K673j504j879K079Q84k426L39J324j643k19K793n42k856J503
2616b26K329j854j712J200Q1l28J367q59j951K336K531l232k534K985J357k253
2632g63k12J452k94M6R51j463j227K270N56k546J83K060o64j245J572J56j939
2649a107P43J529j638j012K120L15j762L86R26r51M54R22j441n99K310j08k707
2666a620M61L064j031k120R48J101o70J03k40j254R80K008j750k053K027J971
2682A925j951j005J283l26o62J108jj762J264K042j545j627J199O52r39O08J29
2699C92j416P64K056j522k210J808J689j896r11J318K07n20P71n23j021J376J043
2716A405k097p80K504R7j999M49J169r55o8R12r08p01J886J15k300L01K250r14
$$ plain form
2734 366 -924 226 273 -804 444 1075 -1077 -1148 1322 885 -1326 -188 1153 36 -273 618 -571
2751 -571 -842 1372 823 -1834 -483 1702 146 -1333 284 452 -584 297 481 -1127 -515 1548 -67
2768 -67 -1631 668 1294 -819 -629 766 -259 -519 997 286 -1435 290 1439 -774 -1117 1074 489
2785 489 -1097 144 421 -936 80 1240 -787 -1482 1138 1386 -1324 -656 956 -123 -169 853 -234
2802 -234 -1153 1029 1065 -1547 -715 1521 260 -1408 167 646 -672 212 939 -1157 -1002 1445 526
2819 526 -1561 -60 989 -705 -405 1072 -218 -854 934 543 -1398 -63 1568 -298 -1155 758
2835 758 506 -754 274 713 -937 -386 1184 -311 -1283 882 922 -1117 -625 902 -15 -586 568
2852 568 -187 -1100 779 1300 -766 -904 1126 460 -916 299 581 -584 -33 977 -587 -885 1119
$$ packed form
2734C66j290J150M7j077J248O31k152p1K470m37k211J138J341j117l09Q91j189
2751e71k71K214n49k657J351K185j556j479J617J68j036Q81J84j608O12K063j615
2768f7j564K299O26k113J90J395j025k60J516p11j721J725J149k213l43K191n85
2785D89j586J241K77j357J016J160k027o95K620K48k710O68J612j079m6J022j087
2802b34r19K182L6k612Q32K236j261j668J575M79j318Q84P27k096J55K447r19
2819E26k087J501J049j694L00J477j290o36J788l91j941J335J631j866q57J913
2835G58k52j260J028M39j650N51J570j495r72K165M0k039M92J527r17n71J154
2852E68p55r13J879N21k066j38K030o66j376J215K82j165N51J010j564k98K004
$$ plain form
2869 1119 568 -1222 -478 856 -202 -291 550 -230 -924 760 951 -836 -398 1159 32 -922 503
2886 503 772 -508 -65 683 -515 -284 1100 244 -1185 114 920 -653 -485 785 85 -738 347
2903 347 223 -650 101 914 -530 -1056 687 727 -474 -146 534 -435 -17 992 -71 -1073 406 885
2921 885 -721 -525 727 93 -613 178 70 -513 301 919 -679 -906 672 617 -616 154 509 -521
2939 -521 -332 777 265 -607 414 554 -744 -237 781 -135 -525 582 288 -850 68 836 -340 -666
2957 -666 295 -9 -559 455 720 -548 -581 727 90 -325 424 131 -960 121 1142 -308 -858 581
2975 581 567 -793 -238 628 -131 -313 522 -335 -839 591 981 -867 -671 742 64 -427 674 317 -1077
2994 -1077 10 1195 -119 -559 691 246 -682 156 386 -895 -156 1104 -237 -1233 455 1006 -635
$$ packed form
2869A119n51j790P44J334j058q9Q41p80o94J684J91j787M38J557j127r54J425
2886E03K69j280M43P48j198K31J384q56j429J299Q06j573J68J270p00q23J085
2903C47j24q73P51Q13j444n26J743M0j201L28O80r69M18J009j063j002J479M79
2921H85j606J96J252o34p06P91j08n83Q14O18j598k27J578n5j233P70L55j030
2939e21J89J109n12q72J021J40j298N07J018r16l90J107k94j138R18P68j176l26
2957f66R61l04n50J014K65j268l3J308o37m15P49k93j091J081J021j450n50J439
2975E81j4j360N55Q66p59j82Q35q57n04J430L90j848J96J413o78m91J101l57j394
2994a077J087J185j314m40J250m45r28Q38K30j281P39J260j341r96J688N51j641
$$ plain form
3011 -635 -395 342 -572 -565 816 315 -785 59 708 -493 -180 746 -599 -971 881 1016 -846 -386 1111
3030 1111 50 -776 101 20 -466 413 780 -969 -501 1330 216 -1080 158 501 -813 -97 1156
3047 1156 -149 -983 671 664 -679 23 622 -403 -93 784 -403 -1163 745 1005 -1142 -727 1178 254
3065 254 -689 279 217 -959 -75 615 -310 -319 859 -92 -689 885 610 -1321 -639 1131 137 -855 362
3084 362 894 -421 -190 197 -686 -362 849 -152 -978 393 854 -450 -339 777 -452 -1035 624
3101 624 885 -745 -315 720 147 -344 248 -216 -492 705 531 -1022 -288 1265 130 -1233 166
3118 166 810 -348 -331 486 -286 -501 359 86 -752 256 555 -473 -140 932 119 -856 74 493 -824
3137 -824 -325 790 266 -337 406 378 -690 -341 214 -588 -94 661 65 -448 577 708 -756 -620 704
$$ packed form
3011f35K40P37r14PJ381n01j100Q44O49j201L13R26j345l72J852J35j862M60J497
3030A111j061q26Q77q1m86Q79L67j749M68J831j114j296J238L43j314P16J253
3047A156j305q34J654pj343P02N99j025L10Q77j187p60J908K60k147M15J905r24
3065B54r43R68o2j176Q84O90r25rJ178r51n97J574k75j931O82J770r94r92J217
3084C62N32j315K31L87q83L24J211j001q26J371M61j304J11J116j229n83J659
3101F24K61j630M30J035n73m91N92m64k76J197j74j553P34J553j135j363J399
3118A66O44j158J7Q17p72k15Q60k73q38J008K99j028L33J072q13r75R30M19j317
3137h24M99J115n24o03P43k8j068L49N55q02M94P55n96n13J025J31j464J36J324
$$ plain form
3156 704 190 -684 30 351 168 397 467 -758 -483 731 33 -1015 65 856 -88 -374 332 -56 -509
3175 -509 353 399 -648 -280 389 154 -421 236 121 -464 311 689 -526 -476 750 288 -794 35 494
3194 494 -187 -274 366 161 -269 357 -39 -806 -78 799 -362 -518 658 761 -679 -443 414 -234 -185 368
3214 368 -141 -263 778 621 -606 -375 740 -58 -636 213 206 -340 293 748 -545 -771 370 278 -630
3233 -630 -199 330 -124 131 465 -487 -569 870 705 -808 -485 725 172 -448 176 235 -445 271 432 -623
3253 -623 -273 880 51 -881 167 464 -681 -84 801 -36 -469 522 261 -707 -13 546 -289 -342 645
3272 645 213 -686 197 351 -614 -176 852 -351 -943 720 720 -488 -318 495 -188 -323 275 -182 -594
3291 -594 684 715 -697 -536 810 311 -599 134 337 -374 342 800 -540 -626 715 516 -680 -79 610
$$ packed form
3156G04n14q74P14L21j83K29P0j225K75J214o98j048J080P91r44k86P06l88m53
3175e09Q62M6j047L68O69k35n75O57j15n85P75L78j215N0J226m62j082Q29M59
3194D94o81q7O40k05m30O26l96p67P28Q77j161j56J176J03j440K36Q57o48M9N53
3214C68n09j22J041j57j227K31J115p98n78Q49pn46O33M55j293k26J141r2r08
3233f30M31N29m54K55L34r52q2J439j65j513L23J210n53o20O24N9o80P16J61j055
3253f23L50J153q29r32J048K97j145N97Q85q37m33R91k61r68O94N59q35n3R87
3272F45m32q99Q83J54r65M38J028j203n92J663%j208J70Q13o83j35N98m57m12
3291e94J278L1j412J61J346m99r10P33K03p11P16M58j340q6J341j99j196O01O89
$$ plain form
3310 610 -446 -134 555 -324 -652 635 454 -1051 -241 879 -84 -544 301 24 -535 320 593 -594
3328 -594 -123 772 -60 -739 353 520 -674 -181 646 -196 -428 374 104 -750 211 582 -744 -501 532
3347 532 178 -433 185 349 -551 103 747 -510 -561 817 448 -612 -217 511 -166 -283 400 -292 -654
3366 -654 479 477 -743 -395 733 22 -521 212 229 -414 218 431 -486 -354 650 312 -790 12 591
3385 591 -143 -46 139 -306 -423 414 210 -692 -125 617 -140 -533 211 256 -277 149 388 -465 0 688 -77
3406 -77 -649 322 451 -364 -301 361 79 -414 409 -2 -550 218 527 -377 -532 281 236 -364 33 197 -322
3427 -322 -91 401 -54 -531 478 473 -533 -42 420 -17 -376 209 94 -407 286 492 -444 -324 527 128
3447 128 -543 51 458 -265 -221 325 -179 -163 414 272 -663 13 664 31 -279 137 211 -338 113 362 -497
$$ packed form
3310F10j056L12O89q79l28J287j81j505Q10J120r63m60Q45k77n59Q55K73j187
3328e94M71Q95q32o79J092J67j194M93Q27q42k32Q02k70q54R61L71j326K43J033
3347E32l54o11O18J64r00O54O44j257n1J378l69j060L95P28o77j17O83o92l62
3366f54J133kj220L48J128p11n43P33J7o43O32K13r17J32J004l38j102Q02N79
3385E91p34R7J85m45j17Q37k04r02N67P42p57l93P44M5n33M26K39q53M65O88p65
3406g7n72R71J29q15O3O62k82m93Q23m11n48P68L09r04j55Q13m5o00L97J64n19
3427c22K31M92m55m77J009nj006M91M62m37l59N85j15n01O93K06r36J20Q51l99
3447A28o71N94M07p23M4N46n04J6N77j42r35O76O51o33l10M16P4n49M51K49q59
$$ plain form
3468 -497 -191 649 86 -705 233 491 -299 -199 164 -265 -184 554 -23 -773 -1 551 -136 -327 315 107
3488 107 -292 132 244 -453 62 611 -268 -542 431 343 -302 -123 359 -410 -239 511 20 -603 73 454
3508 454 -381 -201 632 -75 -573 459 485 -409 -7 459 -176 -426 604 289 -751 124 474 -494 -402 382
3528 382 -77 -327 358 98 -701 -81 925 42 -740 282 496 -261 153 276 -529 -128 730 -45 -767
3547 -767 194 461 -396 -257 439 -285 -304 620 55 -804 69 787 -352 -558 324 58 -325 443 339 -517
3567 -517 -139 765 -89 -452 416 420 -639 24 517 -347 -264 522 128 -519 180 378 -467 -94 494 -230 -667
3588 -667 521 404 -573 -218 457 -157 -252 545 114 -613 145 593 -292 -277 493 -117 -408 277 313 -657 103
3609 103 782 -279 -599 300 228 -264 136 108 -280 -20 683 -74 -627 358 373 -426 -154 542 -188 -302 483
$$ packed form
3468d97L06Q40n63p91R38K58p90J00L63m29Q1P38n77p50P72N52o87j91O42k08
3488A07l99M24J12o97N15N49q79k74R73q8o45J79M82p69J71P50m91o23O76L81
3508D54q35J80Q33p07m98J032K6q94M02M66o35k50J030l15j040Q75L50r68R2P84
3528C82m59k50O85k60p99O20J006q83p82J022K14p57M14J23q05M01Q58p75p22
3547g67R61K67q57J39O96p24j9R24n65q59Q73P18j139k06Q82k66l83P68j04q56
3567e17L78R04q54l63Q68Mj059O63M93q64Q3P86l94o47O99J98q45L73N88p24m37
3588f67J188j17r77L55O75o14r5P97m31p27P58M48q85J5P70o10k91O85L6r70P60
3609A03O79j061l20Q99p2m92M00k8l88K60P03p57n53R85J5p99K72O96p30j14P85
$$ plain form
3630 483 197 -387 40 557 -339 -341 147 20 -295 118 309 -562 -91 668 -34 -533 209 185 -425 -112 287
3651 287 -159 -262 373 -39 -406 330 295 -337 -152 461 -140 -612 384 624 -302 -150 246 -94 -259 191
3671 191 -61 -426 137 403 -310 -185 289 26 -490 145 404 -272 -47 461 31 -313 60 130 -316 -83
3691 -83 175 -259 -205 468 128 -627 78 436 -159 -381 266 19 -278 224 355 -176 -43 227 -226 -113 391
3712 391 218 -390 67 470 -351 -545 356 304 -277 -29 235 -172 -11 250 -269 -295 182 197 -526 191 426
3733 426 -233 -338 423 59 -593 -127 502 1 -137 326 -37 -202 109 33 -629 -16 682 -252 -443 372
3753 372 243 -559 -56 408 -207 -375 311 139 -262 173 192 -308 77 478 -289 -462 618 465 -670 -311
3773 -311 469 -153 -171 331 135 -411 40 286 -493 -398 360 -98 -304 572 275 -632 41 749 -338 -688
$$ packed form
3630D83k86n84M27N17q96kM88j27l15M13J91q71M71P59p02m99P42k4o10L13L99
3651B87m46j03O35m12l67P36l5o32J85O13o01m72R96K40r26J52L96l40j65M50
3671A91k52l65N63K66p13J25M74k63n16O35K59o76K25N08m30l44L73P0m46K33
3691h3K58m34N4O73l40p55P05L58n95k22O47k47k97N02J31n31J33K70m53J13N04
3712C91j73o08M57M03q21j94R01n2n81K48K64m07J61K61n19k6M77J5p23P17K35
3733D26o59j05P61l64o52M66O29n01j38M63l63j65L11p6o62O13O98r34j91Q15
3753C72j29q02N03M64o15j68O86j72m01M35J9n00L85M01p67j73J080j53j135L59
3773c11P80o22j8N02j96n46M51K46p79R5P58m58k06Q76k97r07O73P08j087l50
$$ plain form
3793 -688 240 271 -229 137 323 -235 44 299 -293 -611 295 333 -511 -24 638 -130 -381 252 64 -462 -20
3814 -20 316 -137 14 561 -106 -288 419 292 -565 -143 662 -14 -363 363 177 -404 -74 364 -318 -274 336
3835 336 -37 -188 222 -25 -499 40 587 -358 -454 466 352 -471 -191 246 -167 -59 334 88 -368 271
3855 271 349 -492 -246 215 -48 -302 282 66 -298 205 569 -227 -428 334 66 -264 177 277 -261 144
3875 144 581 -17 -469 220 373 -222 -130 244 -112 -51 296 5 -338 14 88 -343 -133 335 -121 -359 250
3896 250 280 -237 -179 460 -35 -224 100 -32 -305 166 308 -167 -185 373 138 -356 -69 147 -232 -163 303
3917 303 -55 -388 137 221 -150 -69 183 -221 -61 172 -65 -292 273 462 -331 -416 254 125 -294 4 78
3938 78 -200 -41 287 -78 -124 108 84 -343 -61 241 -186 -71 328 48 -378 23 380 -126 -149 159 -70
$$ packed form
3793f88R28L1n00L66J86n58K79K55n92l18R06L8q44M87O62p68k51O33j88n26M42
3814b0L36m53J51N47o67j82P07j27q57M22Q05o76l49P26j86n81L30M38o82M4O10
3835C36l73j51M10k47m74N39N47r45r6R20j14q23K80M37m13J08L93k46m56O39
3855B71P8q41K46M61k63k54N84k16l64N03L64p96k01P62k68l30M41J00n38M05
3875A44M37n98m52O89J53n95R2L74l56O1L47k91l43L52P4m31K10M68m56k38O09
3896B50L0n17N8O39m95j89L24j32k73M71J42m75j8N58k35m94K87K16l79O9M66
3917C03l58l33N25Q4l71Q1K52m04J60K33k37k27N65J89p93q5O70j29m19K98P4
3938G8k78J59L28l65m6K32k4m27K82L02m27J15L99k80m26M01L57n06k3L08k29
$$ plain form
3959 -70 -163 184 100 -214 11 296 -79 -234 273 187 -415 -133 416 -109 -285 194 63 -191 58 111 -175 -15
3981 -15 344 -101 -273 346 428 -330 -50 142 -150 -233 380 94 -444 102 314 -163 -223 218 -12 -255 111
4002 111 114 -476 20 515 -279 -420 374 219 -275 105 196 -222 -122 356 -35 -259 93 215 -389 -186 308
4023 308 -129 -420 292 50 -149 145 269 -246 -213 270 90 -311 215 257 -284 -153 386 -174 -233 416 211
4044 211 -448 107 509 -233 -301 327 -7 -380 170 221 -416 -241 392 -117 -340 201 259 -343 -2 320 -153
4065 -153 -194 375 3 -383 218 380 -310 -124 475 -102 -246 207 92 -413 -49 442 -253 -202 319 206 -464
4086 -464 51 300 -227 39 288 -98 -344 253 86 -300 -48 441 -114 -240 204 105 -261 124 202 -406 -124
4107 -124 339 7 -420 60 268 -202 -85 236 -193 -139 326 67 -362 105 427 -85 -265 79 -64 -205
$$ packed form
3959g0r3L47q4l14K25K85l75j55N07q6o02K82N49n25j76M79j31k54K49N3k86J60
3981a5L59m45j72O19Q2p58K80J92k92q3O13k86n38N46K12m77o0M41k30k43L66
4002A11Ln90M96M95p94j41P94j55m94L80R1m18J00M78l91k24L52J22o04K03M94
4023C08m37k91P12k42j99K94J24n15L3M83j80m01N26M2n41J31N39n60n9O49k05
4044B11o59N55M02p42o8O28l34l73N50N1o37J75O33n09k23N41N8o02L41L22m73
4065a53m1N69l72l86O01J62o90J86N99n77j44M53j15n05L64M91o95N1N21j13o70
4086d64N15K49n27K66K49l86k46N97j67l86K52M89n55j26M44r9l66L85P8o08K82
4107a24M63l32m27M80K08m70J17L21m29N4M65k59m29M67L22n12j80L44j43j41
$$ plain form
4127 -205 208 201 -332 -194 278 -108 -285 107 124 -276 28 181 -113 -116 159 144 -253 147 192 -386 -187 226
4149 226 -99 -182 125 84 -151 -121 246 -83 -188 150 109 -333 -38 296 -165 -129 84 -233 -227 177 156 -176 -62
4172 -62 333 -145 -128 186 166 -174 41 205 -225 -160 359 117 -299 -45 170 -107 -54 212 9 -177 146 31
4194 31 -111 -48 222 9 -296 105 148 -322 -87 41 -159 -136 381 120 -222 -11 241 -4 -70 186 -63 -274
4216 -274 44 102 -278 39 217 -1 -246 245 131 -271 -31 247 -60 -42 248 81 -268 203 262 -286 24
4237 24 285 -87 -190 72 13 -388 55 290 -182 -207 193 46 -228 125 231 -166 -83 239 -81 -221 263
4258 263 154 -354 49 170 -200 -185 144 166 -161 139 155 -122 -250 122 -53 -329 78 162 -266 0 263
4279 263 -27 -138 219 33 -227 96 357 -206 -174 303 -31 -240 38 170 -218 11 217 -251 -398 183
$$ packed form
4127b05M13pn33J38M72l86j77L92J7m00L04J53k94lK75j5l97M00M5n78J99M13
4149B26l25q3L07m1k35L0L67l29j05L38m1m42K95L34m61L6K13l17OM04k1l32J14
4172f2L95m78J7L14k0l40K15J64m30O5N19k42m16K54K15k77N3K66k03j86L23j15
4194C1j42O3K70k13l05M01M3m70K35J28k00K3N17k61l42K11K52k45o6K56k49k11
4216b74L18N8l80L17J78k18k45M91j14m02K40K78l07J8K90j67l49M71N9n48L10
4237B4K61l72j03K62n9m01M43K35m72k5M00j47k74L53J06l97Q3L22l20j40M84
4258B63j09n08M03J21l70J5L29K2l27L00J6k77j28L72j75k76M07Q4m28K66K63
4279B63k90j11L57j86k60L23K61n63L2M77l34k09K78J32l88K29K06m68j47N81
$$ plain form
4299 183 172 -439 -9 235 -76 -123 207 -91 -289 243 294 -215 -127 358 -71 -313 156 -30 -394 -53 408
4320 408 -42 -77 158 -35 -308 131 162 -298 -130 454 -217 -228 194 275 -238 -167 184 -231 -168 221 -23 -185
4342 -185 90 202 -235 -42 247 -181 -211 194 90 -285 -135 267 -159 -232 130 25 -231 89 153 -325 2
4363 2 234 -43 -239 78 36 -293 -44 401 -30 -231 159 66 -209 40 163 -46 62 334 -185 -298 145
4384 145 199 -276 -64 491 5 -211 231 143 -200 -40 119 -37 -80 127 -9 -160 159 4 -258 -61 150
4405 150 -92 -195 139 179 -116 -98 1 -151 -138 198 42 -172 -15 193 -238 35 188 -70 -253 135 242
4426 242 -165 -64 174 89 -199 0 157 -6 130 157 -88 -99 227 -69 -269 38 258 -47 -43 165 -45 -36
4448 -36 -9 146 -86 -115 41 -103 -78 201 64 -239 53 249 -168 -154 66 24 -93 0 128 -184 -135 197 -101
$$ packed form
4299A83j1o11M30K44l11m7L30k98j98N32N1n09Q8M85m29k42M69j86l64L41M61
4320D08m50l5K35j93k73M39L1m60J68N84o71j1M22Q1n13P1L51m15O3L89k44j62
4342a85K75J12m37J93K89m28l0M05j04l75J50M02m26p3L62j05k56L20O4m78L27
4363BK32k77j96L17m2l29K49M45m31k01L90r3k75K49J23k09J08K72n19j13M43
4384A45N4m75K12N55m86k16M42q8l43J60J59j56m3K07j36j51L19j55k62J97K11
4405A50k42j03L34M0k95J8R9j52J3L36j56k14J57K08m31K73J53k58j83L88J07
4426B42m07J01K38q5k88J99J57j63J36K7k45j1L26k96k00L07K20l05MK08k10R
4448c6K7J55k32k9J56j44K5K79j37l03K92J96m17J4K20m2j17R3J28l12M9L32k98
$$ plain form
4471 -101 -88 240 135 -154 -96 253 -126 -55 318 27 -372 -11 304 -55 -178 136 162 -130 127 -78 -265
4492 -265 145 278 -139 -275 224 83 -285 8 199 -106 -55 256 86 -143 58 92 -153 157 239 -75 -223
4513 -223 147 110 -199 -21 290 -162 -33 139 32 -169 152 152 -220 -39 233 -47 -18 224 215 -316 68 401
4535 401 -134 -174 195 70 -149 72 204 -159 52 278 -156 -333 57 184 -163 -32 115 -162 -89 195 76
4556 76 -168 135 271 -50 -34 152 -67 -242 218 -31 -172 143 199 -132 -150 177 195 -173 77 172 -175 -79
4578 -79 265 40 -217 181 109 -199 42 372 -89 -223 263 90 -171 -34 176 -212 -114 193 -125 -276 109
4599 109 124 -81 -37 305 -27 -86 56 68 -125 19 172 -3 -126 152 76 -223 100 242 -351 57 206 -72
4621 -72 -151 77 37 -231 21 103 9 -132 155 53 -179 216 101 -151 41 306 45 -14 215 88 -206 6
$$ packed form
4471a01J3L28j05k89N8L49l79P1L73k91l99L61L15l59j23L14K6k92K57k05j87
4492b65M10J33m17j36M99j41l68K93J91l05N1L11j70k29K01L4k45L10Q2l14j48
4513b23L70l7l09J78L11m52J29J72j07k01L21%l72J81K72k80K9K42rn31L84L33
4535D01n35m0L69j25k19K21J32l63K11K26m34j77L90J27l47J31J47k77P3K84j19
4556G6k44L03J36l21J6J86k19j75M60k49j41L15N6l31j8L27J8l68K50R5l47R6
4578g9L44k25k57L98p2l08K41L30m61j34M86j73k61J37K10l88R8L07l18j51L85
4599A09J5k05M4L42l32n9J42J2j93J44J53j75j23K78p6k99L23J42n93M08J49k78
4621g2p9K28m0k68K52Q2r4j41K87j02k32L95j15k52J92K65k61n9K29j27k94K12
$$ plain form
4643 6 135 -8 -108 131 99 -168 247 85 -147 -42 -30 -123 -204 125 82 -199 -119 209 -173 -178 -43 -28 -57 120
4667 120 24 -69 2 149 79 -275 58 175 8 22 115 71 -77 88 27 -141 -9 284 -56 -35 -28 6 -170 74
4691 74 201 -53 -91 67 67 -155 80 220 -31 -88 289 -80 -153 155 67 -157 -12 112 -173 -121 12 -37 -16
4714 -16 45 169 -110 -106 106 -123 -56 174 145 -223 28 201 -12 -103 103 54 -126 181 156 14 -18 189 92 -101
4738 -101 -17 87 -112 64 185 20 -197 193 -14 -193 34 229 -118 -181 335 156 -240 -49 44 -139 -29
4759 -29 134 -145 -176 231 137 -209 -122 78 -155 -55 153 30 -167 128 156 -151 -88 235 54 -124 49 131
4781 131 -72 43 245 -177 -35 258 48 -320 89 232 -106 -101 82 64 -159 -2 69 -243 -4 272 -83
4802 -83 -190 162 115 -205 103 113 -200 -59 319 -10 -106 143 105 -138 -52 7 -90 -165 82 77 -219 88 174 -167
$$ packed form
4643FJ29j43j00K39l2k67M15j62k32J05J2r3q1L29m3k81Q0L28l82nJ35J5k9J77
4667A20r6r3P1J47p0l54L33J17j67J4R3m4j48J65o1j68J32K93l40K1PL4j76K44
4691G4J27k54l8J58%k22K35J40k51n7L77l69p3L08q8k24J45J24k85N2J33m9K1
4714a6O1J24k79MK12k29O7K30k9l68K51J73k13r1K06m9j80L07k5j42l2K07r7j93
4738a01Q4J04j99J76J21j65k17L90k07j79K27J95l47o3N16j79l96J91R3j83J10
4759b9J63k79l1M07r4l46Q7K00k33J00K08j23j97K95K8l07O3L23j81j78J73Q2
4781A31k03J15K02m22J42K93k10l68M09J43l38NJ83j8k23J57P1l12K39K76l55
4802h3j07L52m7l20L08J0l13J41L78l29r6K49l8k43Q6N9r7p5K47nk96L07Q6l41
$$ plain form
4826 -167 -161 107 49 -149 120 179 -123 6 109 -94 -36 238 132 -208 41 210 -93 -54 274 -53 -150 119
4848 119 69 -86 -111 133 -3 -89 103 198 -162 125 207 -34 -41 60 131 -85 92 130 -234 82 10 -63 21 58
4872 58 54 -232 39 106 -80 -201 156 95 3 -75 106 -16 18 176 -57 -160 93 91 -175 -38 272 61 -16 114
4896 114 169 -77 106 113 -132 -76 93 -33 23 68 49 -129 -54 221 -70 -84 201 147 -109 -86 37 33 -83 7 73
4921 73 -86 117 102 -47 37 146 12 -222 8 98 -187 22 87 55 -134 44 28 -205 111 170 -23 23 91
4944 91 1 -53 12 142 -41 -62 90 -106 -106 135 128 -130 -92 169 -145 -182 65 -34 -156 69 240 -54 -124 61
4968 61 179 -159 69 105 -108 -111 20 -9 -86 48 30 -180 -6 -41 -108 -57 112 -100 -66 -6 49 -34 40 145 31
4993 31 -48 58 18 -196 72 132 -165 -57 91 60 -115 84 290 -148 146 207 56 -159 188 114 -68 -96 208
$$ packed form
4826a67OK68n8j98K69N9l02J29J03k03N8K74j06l40K49J69l03L9L28l27r7K69
4848A19n0j55k5K44j36q6J92R5l60K87Q2k41pJ01P1k16J77L8l64L16p2p3Q4L7
4872E8mk86K71O7j86j21L57o1r2p8J81j22L4J58k33j03K53kk66J37L10k11p7J30
4896A14N5k46J83Pk45N6J69j26N6M5j9j78P5K75k91j4K85n4k56K3J23mj16R0O6
4921G3j59K03j5j49Q4J09j34k34K30R0k85K09O5l2j89J78j6k33L16N9j93M6O8
4944I1r0n4O5J30j83k1J52j96%K41pk58L8K61l14l7K47r9j22K25J71k94p0J85
4968F1J18l38K28L6k13lJ31k9p7J34j8k10J74l5o7N1J69k12L4O0N5q3P4J05j14
4993C1p9J06m0k14K68O0k97J08J48l1j75J99K06m38K94O1j51k15L47p4j82k8L04
$$ plain form
5016 208 -109 -59 79 8 -138 119 239 -189 -123 46 82 -135 69 -49 -189 -114 196 -112 -106 205 58 -93
5038 -93 41 29 -227 -145 163 -65 -184 14 83 -87 -52 272 -92 -110 173 115 -4 39 150 -130 -67 119 69
5061 69 -26 -44 86 -113 20 105 6 -123 -12 144 -51 -50 262 -32 -166 -5 140 -42 -67 46 -251 -87 86
5084 86 -154 -191 107 54 -133 11 147 -175 -158 97 93 -159 -33 243 -187 -77 145 101 -109 130 -78 -188
5106 -188 77 132 -121 48 168 123 -138 15 71 -35 -207 130 -28 -121 141 41 -97 -100 104 10 -114 148
5128 148 25 -106 88 -37 -214 -19 64 41 -94 32 109 -145 0 91 -75 -169 123 33 -135 60 150 -117
5150 -117 -81 40 18 -110 51 105 -67 64 121 -218 -127 68 57 16 -20 102 -56 -40 96 -71 -174 -23 17
5173 17 -122 -48 57 -1 -117 -29 9 -148 -30 45 -72 -95 -15 62 -139 -68 -23 -18 -65 63 -54 -120 183 138 -56
$$ packed form
5016B08l17N0J38p1j46K57J20m28O6J69L6k17K04j18j40P5L10l08OL11j47j51
5038i3J34j2k56Q2L08k28j19J98O9j70L5L24l64j8K83n8j19M3J11k80O3J86n0
5061F9r5j8J30j99J33Q5r9j29J11J56j95JL12k94j34J61J45j82k5J13k97J64J73
5084H6k40l7K98n3j87J44J36l22J7K55mk52J26K76m30J10K22m4k10K39k08j10
5106a88K65N5k53J69J20m5k61J53N6j06j72L37j58r3K62j00j38lK04r4j24K62
5128A48j23j31J94j25j77J95Q3k3j35J26P7k54J45R1j66r4K92r0j68J95R0k67
5150a17L6J21k2j28J61N4j72J31N7l39R1J95j1m1l6J22j58J6J36j67j03J51M0
5173A7j39P4J05n8j16Q8L8j57J18P5j17k3Q0P7k01P1M5Nm7J28j17o6L03m5j94
$$ plain form
5198 -56 -43 101 63 -88 54 49 -35 75 -42 -100 -33 -41 -71 -161 41 132 18 -12 145 -100 -49 74 187 -75 -138
5223 -138 161 64 -154 94 111 -26 -80 -9 -118 -155 12 1 -109 -87 172 -77 -128 91 149 -213 78 151 -117
5246 -117 75 14 -28 -93 179 51 -126 66 58 68 -232 18 -15 -142 93 187 -106 -74 75 38 -120 82 -80
5269 -80 -108 -5 113 -52 -67 205 3 -145 37 75 -117 -73 -18 -102 -108 8 63 -55 -70 40 -97 -177 138 0
5293 0 -64 -56 43 -149 -181 -28 52 -180 165 79 -22 -157 98 -83 -113 30 24 -87 26 112 -15 -26 75 -53 -174
5318 -174 6 -65 -11 91 82 49 -79 138 61 -112 54 88 17 -105 131 -35 -114 153 22 -125 -50 113 -61
5341 -61 -45 -36 -21 -50 -7 191 -36 -65 127 46 -97 100 92 -89 -44 72 -81 -11 45 24 55 44 17 -160 -143 -34
5367 -34 78 49 32 88 -144 -6 -13 -3 -155 -27 26 -75 -42 151 -63 -164 67 47 -142 0 67 -110 -73 64
$$ packed form
5198e6J3J44l8j51J42nq4J10j17n8O7ql0r0K02R1j14l0J57k45N1J23J13k62o3
5223a38K99r7k18K48J7j37n4P1j09l7J67j1j10K2K59k49n1K19N8l62K91P3k68
5246a17J92o1m2o5K72j28j77J92qJ0l00K50l3j27K35R4k93L2J49l7j58K02j62
5269h0k8J03J18j65j5K72k02j48J82L8j92M4N5q4oJ16N5j18j5J10j37q0L15j38
5293@o4QR9j92l2J53Q0k32L45q6j01j35K55j81l0J43oj11J13Q6j27j1J01j28j21
5318a74J80p1N4J02rl3j28K17p7j73J66L4p1j22K36j66p9K67j31j47P5J63j74
5341f1J6RJ5k9M3J98k27k9J92q1j43J97qj81M5J16j53P0N6k1L1j1k7j77J7J09
5367c4J12k9j7N6k32J38pJ0j52J28N3j01L3J93k14j01K31k0j89J42O7j77L7J37
$$ plain form
5391 64 52 -169 30 19 -149 56 -23 -58 -169 66 -61 -108 -73 199 -16 -7 -20 18 -11 79 79 -136 -126 118 91 -116
5417 -116 17 99 -63 50 53 36 -59 117 23 99 -46 -82 17 282 122 -74 -33 28 64 -36 -93 146 -92 -94 46
5442 46 -4 -45 17 73 13 9 69 35 -112 -2 6 -171 14 -105 -1 14 35 164 -126 40 148 -138 -130 149 89 35
5468 35 1 96 -48 -65 44 -34 -144 16 34 -51 -66 46 -150 -112 168 103 -79 -56 -23 -155 -144 121 -25 -134
5492 -134 -89 230 -72 98 108 -47 -49 83 78 -129 88 108 27 -46 118 60 -71 107 15 -105 -51 140 39 -115
5516 -115 219 8 -57 88 53 -142 -11 148 119 -176 23 135 37 -53 70 -3 -57 -14 110 -19 -21 10 -27 -62
5540 -62 122 18 -81 26 58 -84 20 106 7 -136 -27 119 -84 -61 -16 -22 -36 99 120 -22 29 44 -122 -52 6
5565 6 -43 -155 73 59 29 -27 34 104 8 41 176 5 113 97 -123 -82 109 -19 -226 0 47 -144 -179 87 -117
$$ packed form
5391F4j2k21J99j1j68K05p9l5j11K35j27m7L5K72k15Rj3L8k9R0%k15J0K44k7k07
5417a16J33Q2j62J13Lj7r5J76r4P6j45l6R9K65j60j96M1O1L6j00n7K39k38kJ40
5442D6n0m1O2N6o0mO0l4j47J10Qj77J85j19J04J5K1J29k90J66J08k86QK79o0n4
5468C5l4R5j44j7J09p8j10J60J8q5j5J12j96L8K80o5j82K3L3j32J1K65j46j09
5492a34M5L19l02J70J0j55kJ32nk07K17K0q1p3J64n8j31J78r2j20N4J91j01j54
5516a15L34k11o5J45l5j95J31J59k9k95J99J12r8r0J23p3n4M3J24j29kL1l7l5
5540f2J84j04r9J07L2j42J04Q6r9j43J09J46k03K3M5oj4J35K1j42N1J5j66P0N8
5565Fm9j12K28j4l0n6O1P0r6L3J35j71J08j6k20M1J91j28k07K26M7j91l5K66k04
$$ plain form
5590 -117 -44 75 -22 -26 -3 46 28 -37 119 51 -107 40 27 -21 -69 44 92 -216 223 61 15 26 131 -71 -35
5615 -35 104 12 -243 49 212 -127 26 42 -2 -51 -17 -6 73 -100 40 -34 -43 24 -35 -268 -58 -12 -123 -99 38
5640 38 -8 -109 -125 13 -102 24 -2 58 -79 45 18 -13 61 -8 -8 28 41 104 -53 12 48 30 -35 9 -86 -17 29
5667 29 -89 62 -27 69 75 -73 8 27 -47 -61 14 18 -161 -6 -8 -99 7 0 22 -73 -90 -17 -85 43 71 -54 -22 51
5695 51 -115 -78 30 -15 -104 -162 53 -45 30 -9 -11 -146 -73 10 27 -29 89 -125 117 151 -57 60 -37 67 -5 80
5721 80 82 -26 -37 -12 47 -56 -37 27 -135 -48 -1 69 -19 -33 123 38 -81 73 88 2 112 -119 -116 44 68 74 -120
5748 -120 41 128 -68 -11 -39 -62 -9 130 35 -119 3 94 93 -42 6 -72 -21 22 94 -83 -77 107 -35 2 92 -49
5774 -49 -28 100 78 60 -102 134 50 -152 38 20 -113 2 108 -95 -215 -52 -13 -104 -34 177 39 -60 70
$$ packed form
5590a17P3J19r7mK3M9j8o5J56o8j58J47j3m8m8J13M8l08M39j62m6J1J05k02L6
5615c5J39r2k55K92J63l39J53J6m4m9L4J1P9j73J40p4rO7n9k33K10M6j11K4J37
5640C8m6j01j6J38j15J26k6O0j37J24k7l1P4o9%L6J3O3j57O5L6j8o5M4r5O9M6
5667B9j18J51q9R6Oj48Q1J9p4j4P5Mj79J55kr1J06pK2r5j7P3o8J28K8j25L2P3
5695E1j66L7J08m5q9n8K15r8P5l9kj35P3Q3J7n6J18k14K42L4k08J17r7J04p2Q5
5721H0Kj08j1K5N9j03J9O4j62Q7M7P0q8j4J56q5j19J54J5q6J10k31LJ60K4Oj94
5748a20J61Q7j96N7k8k3N3J39r5j54J22R1jj35M8p8N1M3P2j77OJ84j42L7R0j41
5774d9K1J28k2j8j62K36q4k02J90j8j33J15J06k03j20J63L9r1P0K11j38r9J30
$$ plain form
5797 70 53 -172 -29 91 -25 -98 -31 99 21 -55 60 -6 -61 35 -94 -76 105 12 -49 -4 137 -8 44 165 34
5822 34 -99 -36 -49 31 -22 99 -39 27 52 -35 -3 81 -58 -17 -34 0 10 -82 -76 81 -83 -36 165 48 113 143 -4
5849 -4 25 -6 146 -45 -105 -12 1 -98 -32 0 -90 5 93 80 -18 35 56 -73 -92 50 -49 -18 42 15 5 41 21 -74 -104
5878 -104 61 -16 -39 -17 188 -96 53 28 129 -56 110 30 -40 -23 78 -106 -46 9 -21 -62 45 71 13 -5 -36
5903 -36 55 -117 15 -63 74 -39 -50 -107 -104 130 18 -148 19 -5 -146 48 1 -58 -31 -22 103 -94 68 111 122
5928 122 -46 126 -1 67 -24 10 57 -10 -43 -119 -107 -27 114 -77 -95 29 -135 -39 -41 -56 -10 -80 0 14 -96 -67
5954 -67 -70 -69 49 -20 -31 56 53 -33 15 -26 149 108 45 102 112 14 19 102 -78 -88 -154 11 -68 46 22 -141 55 178
5982 178 -25 -16 -1 47 88 -136 -31 -112 -2 113 53 -119 67 -13 -66 -51 -6 -83 -37 25 15 -78 10 -3 12 -35 67
$$ packed form
5797G0j7k25J43J20j16p3O7J30p8p6J15o6n5R6j29J8J81r3o1M5J41j45N2J21j31
5822C4j33O3j3Q0n3J21j38O6K5q7L2Q4j39M1j7L4J0r2OJ57j64M7K01j17O5L0j47
5849dK9l1J52j91o0R3J3r9O6L2r0R5Q8j3r8N3K1j29j9J42r9L1O0k7j0L6k0r5l0
5878a04J65p7k3K2K05k84J49k5J01j85J66q0p0J7J01j84O0N5l0m1J07K6n8j8l1
5903c6R1j72J32p8J37j13j1n7LK34j12j66J67k4j41J94m7n9K7RJ25j97J62M3J1
5928A22j68J72j27O8r1L4M7o7l3p6J2Q0J41j91j8J24j64R6kj5M6p0Q0J4j10K9
5954f7lJJ18o9j1Q7lq6M8m1J75m1o3N7J0r8NQ3j80j0o6J65p9J14k4j63J96J23
5982A78k03RJ5M8M1k24J05q1J10J15o0j72J86q0n3J5M5p7M6O2j0r3Q8j3J5m7J02
$$ plain form
6009 67 27 -109 2 68 28 -88 18 -29 20 -24 -3 13 92 9 -112 -99 -53 4 -53 58 93 -61 -83 1 58 -41 177
6036 177 -7 -9 72 134 89 -56 26 107 -32 84 102 18 13 -67 26 -51 34 -21 -55 -49 -10 47 -109 66 5 -27 71 -10
6064 -10 16 53 96 -54 -1 -73 19 -2 -10 -55 29 28 144 51 -48 -44 151 -60 -79 70 120 5 29 96 -33 87 49 -67
6092 -67 -15 115 -27 -101 -74 50 23 132 111 -92 -118 -93 98 -153 -21 -26 -49 -68 26 19 -110 -47 148 24 78 195
6118 195 -70 -138 106 19 -67 -67 -56 73 -125 21 8 -80 -49 -11 -63 77 100 -12 -73 -31 -53 -22 -27 53 99 -96 29
6145 29 40 -115 16 42 -91 128 36 -65 -145 53 52 -105 -20 26 108 13 27 -71 -15 43 0 -74 -110 46 81 0 -30
6172 -30 57 -49 19 8 -20 11 84 -14 -49 32 -104 -38 -66 102 32 -11 47 -29 32 2 -38 -76 -63 105 -86 -27 66 18
6200 18 -15 -51 -39 -21 -154 -27 101 -48 -67 103 84 -81 -82 21 123 -100 87 43 31 -50 148 -94 -9 45 50
$$ packed form
6009F7m0j36J11O6m0j16J06m7M9m4K1J6P9q3j21J3M6N7n7J11L5j54k2Q4N7r9K18
6036A77j84kQ1O2m5j45Q2Q1j39J16J8q4nq0R3p7Q5n5l4OL9N7j56J75o1l2R8q1
6064a0K6L7M3j50N3p2R2k1qm5Q4jJ16r3r9MJ95k11j9J49N0j15K4O7j29J20l8j16
6092f7N2J30j42p4K7J24k7J09k1k03k6K5J91k51J32nk3j9R4pj29O3J95j24N4J17
6118A95k65o8K44q7q6%J1J29j98J46j3q8L1L8n2J40K3j12o1M2k2L1nQ0M6j95J25
6145B9J1j55J31K6j33K19r2j01q0J98jj57Q5M6Q2r5J4r8N6N8m3p4l6J56L5q1l0
6172c0Q7j06O8j1k8L1P3r8l5Q1j36O6k8J68p0m3N8p6O1l0m0l8J3J68j91N9R3m8
6200A8l3l6J2J8j33J27J28j49j9J70j9j65jJ03J02k23J87m4j2q1J98k42Q5N4N
$$ plain form
6225 50 18 54 19 33 -111 106 -65 -51 15 113 -53 80 112 -91 -32 9 13 -82 1 -159 52 -103 56 20 45 56
6251 56 27 -50 -21 26 -49 -133 -39 13 -76 -120 32 34 -15 224 -34 -110 30 66 -27 -79 2 -61 25 -86 -59 45 -36 34
6279 34 70 -60 114 -7 -38 66 90 -23 25 -65 -86 -64 41 -64 -193 25 53 -23 61 -90 -193 23 -43 62
6303 62 82 61 54 -166 -25 -156 27 -188 69 6 -55 -87 23 46 30 -8 52 -62 -48 8 12 -125 27 43 -2 77
6329 77 40 29 17 -151 -67 -87 69 15 16 -22 77 71 10 50 45 18 3 9 -84 -34 -40 64 -58 -41 -89 -111 -123 115 -111 -81
6359 -81 102 30 -46 40 15 -5 83 -2 156 -75 30 11 86 -134 44 69 -207 -21 -36 -112 -10 87 -19 39 67
6384 67 101 76 -36 16 39 -82 54 137 115 -23 5 -42 44 71 78 -79 -10 -40 -59 -10 -61 -33 -135 42 124 -62 -34
6411 -34 -48 -35 -54 16 -39 -133 58 58 -100 68 31 41 48 112 121 13 17 -29 92 -44 84 65 -173 158 44 8 -65
$$ packed form
6225E0l2L6l5J4j44K17j71J4O6R8j66J33L2k03N9M1Mr5Q3j60K11j55J59l6K5J1
6251E6k9p7K9M7p5q4R4N2q9m4J52Km9K39k58p6J40L6r3n2Q1o3Q6j11K7J04q1P0
6279C4L6j30J74j21l1J04K4j13M8r0k1K2J05j05j29K18K8p6Q4j51j03K16o6J05
6303F2K0k1pk20J41j31J83k15K57o3o1l2J10K3j6l8O0j14J4N6Mj37J52J6m5P9
6329G7l7j1j2j68Q4k0J56n4Jl8R9oo1M0nk7j5Or3N0oJ04j22J7m8k2j2K38k26L0
6359h1J83p2p6Q6k5k0Q8q5J58k31J05j9P5k20J78K5k76J86j5p6J02R7j06N8K8
6384F7L4k5j12N2K3j21J36Q3k2j38K8m7Q6K7Pj57O9l0j9M9n1K8j02J77Q2j86K8
6411c4j4J3j9P0n5r4J91%j58J68l7J0PO4Rj08Mm6J21j36J28j9k38L31j14l6p3
$$ plain form
6438 -65 36 7 -13 162 -54 -31 -35 -7 -24 -43 45 -21 -79 77 76 -64 -19 36 65 21 87 110 -22 104 -56 6 -109
6465 -109 -57 32 5 91 -66 -56 -50 3 -20 7 38 33 77 -62 60 153 1 -67 24 88 -92 104 -79 -10 57 69 -131
6492 -131 18 1 -104 -84 -41 137 -101 -36 -33 -38 -59 -30 -94 -110 -30 7 80 116 100 -168 3 32 33 -16 2 67 -20 -82
6520 -82 -18 99 -67 -25 40 -48 -54 82 156 97 153 58 38 -48 -55 2 33 114 54 -42 -24 23 53 5 -146 -26 13 -29 104
6549 104 21 63 45 17 53 90 -157 -65 -11 39 14 -47 53 -136 5 -55 -40 65 -13 -59 -174 -134 -26 -44 -93 199
6575 199 -11 -52 63 -25 -60 -24 165 -85 -16 -37 128 -36 -47 -25 98 108 -54 42 23 24 -28 42 -39 -17 -104 -46
6601 -46 -57 70 11 -9 29 -87 14 1 144 -167 -170 28 10 -104 32 98 17 -94 -27 -104 -144 -40 102 -2 0
6626 0 43 51 -125 67 -74 -35 -36 211 -18 -58 134 -57 27 6 -59 -169 -64 127 -160 -21 99 67 -109 -1
$$ packed form
6438f5J01k9k0J75k16K3mK8j7j9Q8o6n8J56jj40M5N5K9m4O6K3j32J26j60O2j15
6465a09N2Q9k7Q6j57J0ON3k3K7L1nM4j39J22R3j52o8R1O4j80J96j83O9O7J2k00
6492a31J49j7j05K0M3J78k38O5Lnk1K9o4j6Q0L7P3L6j6k68J71K9Jm9J8O5q7o2
6520h2O4J17j66M2O5q8oJ36P4n9N6r5k0q6pN7L1Q1o0r6J8M7L0m8j51J20L9m2J33
6549A04q3M2j8k8L6L7k47R2N4N0k5o1J00j89J41o0J5J05p8m6j15M0J08j8m9K92
6575A99k10m1J15q8l5L6J89k50O9k1J65j64j1K2J23J0j62R6j9Jn2P0q1K2q7N8
6601d6j1J27n9k0L8j16J01j3J43l11lJ98j8j14J36O6q1j11O7p7m0J04J42j04K
6626@M3Qj76J92j41L9jK47k29m0J92j91Q4k1o5j10J05J91k87J39J20l2j76J08
$$ plain form
6650 -1 -28 -59 -54 114 -28 -22 97 -27 68 27 -8 62 -51 49 25 -25 -196 -41 -22 15 -54 -132 35 -106 4 -165
6676 -165 -11 -5 0 -115 112 28 -40 24 -47 -109 -12 -32 86 -105 159 89 8 -61 -50 64 -104 20 -16 -59 -94 -35
6702 -35 173 -57 20 25 -67 22 69 27 -37 -3 67 -103 -106 -15 173 -87 29 -36 87 -49 -30 -25 107 13 -104 -74 76
6729 76 105 -50 -8 -44 -70 -38 60 73 -12 104 -76 -46 12 67 -11 3 -3 -19 -44 -94 -4 3 44 57 16 -61 1 -10 -18 59
6759 59 -116 -68 -33 32 58 -62 1 33 92 -63 -139 -95 15 -5 -19 39 8 -14 26 55 -97 88 34 89 -12 -71 11
6786 11 120 96 0 -16 83 -90 -18 100 13 -49 148 -65 0 64 -3 161 14 137 -51 -127 41 -6 -34 34 18
6811 18 101 -90 -81 -31 -154 -98 -40 -173 -15 -120 57 -144 116 34 5 61 -19 -57 -3 -14 -80 -34 -82 -48 64 48
6837 48 19 17 49 -38 20 11 6 1 -26 71 46 -62 84 -82 -30 41 67 169 10 83 -59 18 -33 89 -77 -113 8 7
$$ packed form
6650ak7l1NJ68j42OJ19j24R5m1l5P0j13J00k4n0j71J55J9L7o9p8J67j41J10j69
6676a65J54ONj15K27q4o8O4p1o2R7k0J18j91K64p0q1o9J1J14j68J24l6m3l5N9
6702c5K08k30P7Nr2Q9M7m2o4L4P0j70lR1J88k60J16o5J23j36J9NJ32r4j17L0J50
6729G6K9j55M2l6k6L2R8J3q5J16j80L0N8N5p8J4oj6k5n0R0PM1J3m1p7O2j1qP7
6759E9j75M8L5O5K6j20O3L2N9j55p6M4J10k0j4N8l1k2M0K9j52J85n4N5j01n9Q2
6786A1J09k4r6j6R9j73P2J18q7o2J97k13O5O4o7J64j47J23j88p6J68m7k8O8j6
6811A8Q3j91RN0j23N6N8j33J58j05J77k01K60q2k9N6q0l8N4j1o6M6m8L4J12j6
6837D8k9kL2q7N8rnnk7R7k5j08J46j66N2P1K6J02j59P3j42P7n1J22j66l6J21j
$$ plain form
6865 7 1 109 -39 28 -98 -58 -65 -43 152 -44 100 48 -43 43 58 -10 2 169 -23 -62 58 -24 -8 -54 66 73 -1
6892 -1 8 16 -72 -19 -109 -62 35 21 52 22 38 -20 -2 19 -42 127 -13 0 64 69 24 74 14 21 130 -50 89 2 29 -40
6922 -40 -123 -24 -87 93 57 -156 12 -35 -222 -55 -7 -28 32 62 -42 194 150 87 5 60 59 60 46 -21 1 -105 96
6949 96 -56 52 -39 28 -63 -1 -34 66 38 26 27 -138 40 -69 -7 -55 -125 -77 64 -129 -91 69 21 -19 -11 -22 66
6976 66 -60 -19 -10 -135 -70 -67 47 -39 -61 80 -4 -27 0 92 -56 -95 13 87 124 33 43 -8 -64 -14 36 65 -5 96
7004 96 -10 67 93 -125 14 82 -23 36 66 110 22 30 22 -46 -94 -36 92 86 97 -17 57 29 -18 -29 -113 59 -8 -45
7032 -45 -31 71 -35 -147 145 32 -46 -95 46 40 45 33 -111 62 -8 62 66 12 119 70 -38 84 11 -87 40 -65
7058 -65 -21 -15 -35 50 -133 84 -4 -3 58 75 73 -1 -47 -19 41 61 94 -70 -103 -58 -18 -83 -39 -50 59 -122 48 19 55
$$ packed form
6865GoJ08j48O7j26M0pK2J95j96J44n2r1Q6J5o8J2J67j92l9J20q2J6m6J20Pp4
6892aRQq8N3r0M7R7j4L1l0J6n8J8K1o1J69j40J3O4Nm5N0o0PJ09j80J39q7K7o9
6922d0q3R9o3J80l6k13J68m7j87J67M8k1O0L0j04K36m4o3q2N5jJj4o7K2j06K01
6949I6j52J08r1O7r1O2l3J00k8j2Jj65J78j09O2m8p0M8J41j93L8J60m8m0Qj1Q8
6976F6j26M1Rj25O5LJ14q6k2J41q4k3K7R2j48l9J08P4L7r1J0n1n6N0N0K9p0J01
7004I6j06P7K6k18J39O8j05N9L0M4q8Qqo8m8N8J28oJ1j14P4k8m7j1q4J72o7l7
7032d5J4J02j06j12K92j13p8m9J41oNj2j44J73p0P0Mn4J07m9j08J22p3r8J27j05
7058f5M4Ok0Q5j83K17q8JO1J7kp4m6K8O0K0L3j64l3M5M0o5M4j1J09j81J70k9L6
$$ plain form
7087 55 35 21 174 94 34 112 83 14 29 -116 80 -1 31 -8 -21 209 31 72 5 118 79 -96 47 -21 39 35 73
7114 73 207 78 -38 -5 35 -14 -43 -116 34 -17 -64 -47 -24 -2 -81 -42 12 -143 34 -53 -83 -127 16 26 -130 -2
7140 -2 -126 -106 -10 35 23 48 94 -103 9 98 -134 118 28 -57 35 -29 57 -33 42 99 46 92 22 91 106 115 70 3 -50
7169 -50 96 -97 -41 -27 25 77 -129 -36 -121 -84 7 50 -1 -79 75 -81 82 -37 -28 38 -217 -41 -56 0 -13 69
7195 69 -31 -63 59 90 51 -85 96 -72 -38 -10 160 -29 20 9 53 24 67 6 -12 149 16 28 60 99 -222
7220 -222 -57 149 -10 44 21 -64 -11 33 -77 -26 63 40 104 -61 -21 -20 -105 89 -97 -84 34 63 122 166 -4 21
7246 21 1 11 5 -16 51 -33 4 -27 50 59 8 -88 -3 23 0 -15 -2 78 33 139 67 -5 -44 60 108 -39 8 2 74 -72
7276 -72 -59 120 29 36 27 -69 -25 -49 -82 -35 -39 27 -157 -4 5 -23 31 29 -80 106 28 28 -49 82 55 -147 11 -1 46
$$ packed form
7087E5k0j4J53q0o0P8k9o9J5j45J96q1L2l9j3K30j78M1o7J13l9j75J43o8O0mL8
7114G3J34j29j16L3M0m9k9p3J50n1m7J7K3K2p9L9N4j55J77q7l0m4J43J0j56J28
7140bj24K0R6M5j2K5M6j97J12Q9k32K52r0q5R2o4Q6r0P5N7n3M6p0O9J5Rm5o7n3
7169e0J46j93N6J4N2N2k06R3q5L7R1M3n1p8J54j56J63j19RO6k55J76j5N6j3Q2
7195F9j00l2J22L1l9j36J81j68L4K8J70j89M9j1M4k9M3o1j8J61j33J2L2L9l21
7220b22J65K06j59N4k3q5N3M4j10N1Q9k3O4j65M0Jq5J94j86J3J18K9N9M4j70K5
7246B1k0J0ok1O7q4L7l1P7Rn1r6Q5K6k3j5J3Q0m5J06p2p2l9J04M8j47M7oP2j46
7276g2J3J79r1Prr6M4k4l3M7mO6j84J53Rk8N4kj09J86p8%p7J31k7k02J58j2M7
$$ plain form
7305 46 -18 139 4 40 18 54 -21 43 38 -8 -142 181 52 -6 -44 10 12 -88 31 60 113 29 47 -65 54 -10 -151
7332 -151 82 -44 -66 -88 -26 60 -141 -63 76 -45 14 74 17 38 -1 -3 33 -95 30 53 -17 29 124 37 99 5 -58
7359 -58 12 1 73 -20 85 116 85 34 10 39 -82 -12 90 16 -129 -3 -102 -3 -98 -16 26 -53 24 -146 -9 -67 -24
7386 -24 -40 8 72 -71 47 -1 -64 -72 44 163 23 25 222 -43 -52 54 -31 4 -31 109 -110 5 59 -131 -32 19
7412 19 133 2 -33 -19 25 -2 -102 34 28 -53 158 -11 75 -20 -101 -42 125 -50 -10 -147 -54 -1 35 42 -9 -24 -13
7439 -13 19 53 10 -28 11 -28 14 -149 27 77 -11 -50 -14 -33 43 -75 -78 91 -31 0 83 19 -17 23 98 19 21 20 29 87
7469 87 106 -28 66 -3 -5 60 -192 17 12 -3 -16 -14 55 145 4 21 -43 16 9 -26 -40 -46 -56 -20 94 -62 -29 -94 30
7498 30 52 31 -13 -93 -54 -40 50 13 14 71 -66 -98 42 80 -27 -85 33 96 -23 -98 -25 -1 0 -44 75 -84 -12 113
$$ packed form
7305D6o4J57j35L6k2L6p5O4nm6j34L23j29n8l8N4Kj00J19K9N3q4J8j12J19o4j41
7332a51K33j26k2k2O2Q6k01P8J39j21N9O0n7K1l9kL6j28J25K3p0M6R5q7O2r4o3
7359e8P0j1P2r3J05L1l1n1k4K9j21P0J02p4j45J26r9R9r5Q2M2p9P7j70J37n8M3
7386b4j6M8O4j43J18m8o3qJ16J19j40KJ97k65rJ06q5L5l5J40k19J15N4j90R9N1
7412A9J14j31l5J4M4k7j00J36oq1K11j69Q6r5q1N9J67j75M0j37R3N3L6Pn1j5J1
7439a3L2L4m3l8L9l9M2j63J76N0q8l9L6j9P6j18lJ69j22L1Q3o4l6M0P5p9KjRN8
7469H7J9j34R4o9kO5k52K09nj5j3KO9R0j41J7o4N9pl5j4oj0L6J14j56L3o5J24
7498C0K2k1m4q0L9J4R0l7JN7j37l2J40L8j07n8J18O3j19p5P3K4Jm4J19j59P2J25
$$ plain form
7526 113 -78 -3 121 -12 46 -21 -50 65 -91 -59 -18 74 -140 -8 -48 -89 -92 44 13 81 -189 -21 -19 -96 -110 -56
7552 -56 154 -33 -75 27 19 -85 125 139 -14 80 77 26 -106 -39 40 51 -6 44 5 -34 44 59 -30 25 121 10 -42
7579 -42 115 37 -26 -39 -111 -85 -144 -30 -2 -25 45 -18 27 5 -33 -28 -60 68 47 -91 -27 -125 -19 -3 -71 -65 -65 -3 1 -6
7609 -6 46 177 -3 53 7 -40 29 -104 92 29 -100 -169 -5 52 14 133 -9 83 -27 53 -90 9 82 -13 63 62
7635 62 -65 22 -11 16 -25 -59 27 -49 -78 -22 -38 -24 93 18 -75 10 52 -58 51 -34 -33 50 80 -61 -26 -44 -101 32
7663 32 -7 79 -82 -74 -78 54 -84 -43 4 82 13 125 -117 -11 18 6 -120 -31 -42 -95 -73 35 93 17 -33 -94 -86 -147
7691 -147 -43 29 -108 49 -12 -74 84 -39 -1 -69 55 -36 -87 -65 16 -26 15 24 105 -6 33 49 -73 -44 -57 7
7717 7 -131 88 -2 -116 -57 -65 -126 60 78 11 -5 -50 88 11 -66 68 44 -9 -65 -37 129 -135 -45 78 -22 -89
$$ packed form
7526A13j91P5J24j33N8o7k9J15j56L2M1R2k14J32m0m1lJ36l1O8k70J68Kp7j4N4
7552e6K10j87m2J02qj04K10J4j53R4ln1j32O7P9J1n7N0l9l9P8J5q9N5R6j11n2
7579d2J57p8o3j3p2K6n9J14K8k3P0o3M5k2l8Nl2J28k1j38O4r8J06J6o8O%O2Mp
7609fN2J31j80N6m6m7O9j33J96o3j29o9J64N7l8J19j42R2j10Q0j43R9P3r5P6j
7635F2j27Q7l3K7m1l4Q6p6k9N6j6J4J17p5r3Q5M2j10J09q5JQ3L0j41L5j8n7J33
7663C2l9Q6j61QmJ32j38M1M7P8o9J12k42J06K9j2j26Q9j1n3K2J08N8p6n0o1Qo1
7691a47J04P2j37J57o1o2J58j23L8o8J24r1n1K2Q1m2M1RQ1j11L9J6j22K9j3O4
7717Gj38K19r0j14N9qo1J86J8o7j6m5J38p7p7J34k4n3n6K8J66k64R0J23j00o7
$$ plain form
7743 -89 16 91 8 26 -40 -40 -179 1 47 87 -5 -108 72 6 37 -80 87 -3 -16 -67 -91 -151 84 10 -16 66 8
7770 8 56 -99 30 -25 19 22 -1 161 36 22 112 -55 -26 -63 71 9 3 -56 41 -24 -17 17 25 17 17 16 -43 14 -55 48 -4
7801 -4 61 -31 -94 73 27 -61 -18 -67 51 -60 -46 -45 -86 70 -11 122 -137 -58 33 46 12 172 0 -42 -60 158 -14
7828 -14 -20 42 -24 -68 61 -12 68 -12 -135 -77 -37 -3 -78 5 -48 -164 -162 22 -20 -90 -57 40 -67 -31 -17 -13 -44 -1 85
7857 85 -57 -120 70 122 32 93 97 -34 95 -44 -39 8 87 66 -2 51 53 21 -43 94 -13 -109 -39 -23 27 68 30 -47
7885 -47 30 60 -31 -95 17 1 88 -37 21 84 -173 -20 69 -87 -69 -12 -30 -6 18 53 -49 -58 28 74 28 58 -10 49
7913 49 6 36 -23 -42 62 13 -55 41 -67 -61 -24 22 -32 48 -20 63 -35 -89 -43 -31 -58 157 -36 -40 10 1 -3 -58 -136 -71
7943 -71 68 113 -26 136 -39 -73 40 99 -5 -23 -103 -24 -46 8 -47 -64 -8 -74 -46 55 -22 -42 64 -89 25
$$ packed form
7743h9J05P5q3J8o6%j39J80M6M0r2j03J80o6L1j17J67r0j3n1k4o0K35p4k6Q2n8
7770HM8j55J29n5M4Lk3J62j25j4R0j67K9l7J34o2on9R7o5PL4Qq%jn9N7o9J03n2
7801dO5r2o3J67m6q8M3m9J18j11J4Jm1J56q1J33k59P9R1J3l4J60j72m2j8K18j72
7828a4oO2o6m4J29p3Q0q0j23N8M0L4p5Q3n3j16KJ84m2p0L3R7j07L6J4Ml1M3Q6
7857H5j42o3J90N2r0O1Mj31J29j39NM7P9k1o8N3Kl2o4J37j07r6P0J6N0M1l8p7
7885d7P7L0r1o4J12j6Q7j25N8O3k57J53Q9j56J8N7j8K4K4L5j02rQ6M6m6L0o8N9
7913D9m3L0n9j9J04m9o8R6j08OL7M6n4Q0o8Q3r8n4M6J2k7K15j93mN0rmn5p8O5
7943g1J39M5j39J62j75l4J13N9j04j8q0P9k2N4n5j7N6o6K8J01p7k0J06j53J14
$$ plain form
7968 25 -30 -30 2 50 164 19 52 12 -46 17 -80 -41 21 15 23 -25 78 -37 13 98 -18 27 8 -53 188 95 33 -19 -22
7997 -22 -55 27 40 -45 -79 -97 41 -26 32 -32 0 -37 -127 22 -36 24 121 133 -44 1 0 19 31 30 48 77 38 -12 17 140
8027 140 -7 -152 73 162 12 -52 10 56 109 -54 58 12 -12 -98 28 -23 -121 -33 -153 -55 29 -76 28 6 91
8052 91 78 -25 -20 -12 92 -24 -70 -37 -32 6 0 1 -35 -3 -6 -10 -11 -4 -103 10 31 -70 -53 54 -30 190 -36 -5 87 105 -112
8083 -112 -2 -136 -69 -34 37 82 -46 -13 -52 39 -12 12 26 56 62 126 -21 39 -86 126 4 -20 -93 -30 28 38 108
8110 108 -145 -126 -46 -148 59 -60 55 -54 17 202 -2 57 93 -5 4 26 19 23 81 -7 -3 85 -1 -45 6 89 160 -41
8138 -41 109 78 61 -65 62 -9 0 7 -8 -38 -50 10 -8 7 132 18 -43 -68 -20 107 96 30 14 -15 -81 -43 -44 104
8166 104 56 -33 -42 -91 71 -195 -179 34 83 -132 -33 -75 19 8 -10 2 -5 96 58 -43 81 -125 -43 -3 -83
$$ packed form
7968B5n5%L2M8J14j45L3m0n8O3r7L9O2oQm8J03j15N0Q5j16M5j9o1K41r3o2n2l
7997b2l3Q2J3q5l4j8J38o7N8o4L2l7r0J49n8O0R7J2j77M5jJ9J2jJ8K9l9n0K9J23
8027A40j47j45K25Q9j50o4O2M6N3j63J12m6k4q6J26n1r8Q8j20R8Q4j05J04k2Q5
8052I1j3j03NQJ04j16m6L3NL8oJl6L2lmjPr9J13K1j01J7J07q4K20k26L1R2J8k17
8083a12J10j34O7L5P1M5j28L3l9R1n1K4J4L0OO4j47O0j25K12j22k4p3O3N8J0P0
8110A08k53J9Q0j02K07j19J15j09P1J85k04N9L6r8RK2pMN8q8MQ8q6m4N1Q3P1k01
8138d1J50l1j7j26J27p1RPj5l0j2O0j8J5J25j14o1k5M8J27j1o6j6k9o6L8jJ48
8166A04m8q9rm9J62k66J6K13M9k15R9m2R4j1j8J2pJ01l8j01J24k06Q2M0q0
8191h3
$$ Imaginary data points
##PAGE= N=2
##DATA TABLE= (X++(I..I)), XYDATA
$$ plain form
0 0 0 0 0 0 0 0 -16 16 0 16 -20 32 -32 48 -64 80 -96 112 -144 176 -208 256 -289 339 -403 468 -545 641
28 641 -734 833 -961 1092 -1237 1406 -1587 1783 -2005 2246 -2509 2799 -3114 3460 -3840 4245
44 4245 -4699 5196 -5728 6316 -6963 7668 -8448 9309 -10261 11324 -12515 13859 -15391
57 -15391 17153 -19200 21620 -24535 28114 -32645 38585 -46739 58697 -77995 114295 -206528
69 -206528 938349 1349704 -1129491 -1557355 -349957 1070020 878551 -90479 -766440
78 -766440 -361557 159854 262459 147069 312557 101858 -523260 -763444 -39486 781414
88 781414 820209 -62691 -933374 -783132 351233 984220 352068 -580005 -617709 -25527
98 -25527 401020 342706 32106 -198219 -185297 -153041 -107337 223542 562872 195152 -563409
$$ packed form
0@%%%%%%j6L2j6J6l6N2o4Q0j12J44j76K08k56L20l84M64n45O28p42Q71j013J186
28F41j375J567j794K053k329K643k993L370l788M251m755N308n913O574p300Q085
44D245q944R895j0924J2044j3279J4631j6116J7757j9570K1585k3839K6374k9250
57a5391L2544l6353M0820m6155N2649o0759P1230q5324J05436j36692J92290l20823
69b06528J144877M11355k479195m27864J207398J419977j91469r69030o75961
78g66440M04883N21411J02605j15390J65488k10699o25118k40184P23958Q20900
88G81414L8795q82900q70683J50242J134365O32987o32152r32073l7704N92182
98b5527M26547n8314l10600k30325J2922L2256M5704L30879L39330l67720p58561
$$ plain form
109 -563409 -617178 111071 564015 255395 -254087 -321755 37479 276129 45647 -211056
119 -211056 -3348 227968 -76163 -402161 -74830 457137 397803 -150642 -498287 -266541
129 -266541 272405 436763 -14155 -387932 -107422 295278 142754 -232182 -187949 172485
139 172485 293506 -40273 -425641 -240481 416058 574883 -144429 -721058 -287217 504703
149 504703 580922 -33858 -495914 -293656 230839 346051 -60454 -286561 8069 229871
159 229871 -4051 -200115 2548 219613 89190 -198418 -270120 -2532 312504 230760
169 230760 -165323 -281237 15054 193225 27418 -123174 -49059 76083 88540 -20153
179 -20153 -116193 -13305 166128 71977 -194232 -159483 143773 219382 -14179 -179749 -97379
$$ packed form
109e63409n3769P28249M52944l08620n09482o7668L59234K38650k30482k56703
119b11056K07708K31316l04131l25998L27331N31967n9334n48445l47645K31746
129b66541N38946J64358m50918l73777K80510M02700j52524l74936M4233L60434
139A72485J21021l33779l85368J85160O56539J58825p19312n76629M33841P91920
149E04703P6219o14780m62056K02258N24495J15212m06505k26107K94630K21802
159B29871k33922j96064K02663K17065j30423k87608p1702K67588L15036q1744
169B30760l96083j15914K96291J78171j65807j50592P4115J25142J2457j08693
179b0153r6040J02888J79433r4151k66209L4749L03256P5609k33561j65570Q2370
$$ plain form
190 -97379 75875 120281 -31052 -147223 17941 218497 61172 -228421 -164897 125925
200 125925 180854 -16271 -147900 -68935 109687 153942 -29663 -166501 -20838 125583
210 125583 -15374 -154736 11428 215821 127582 -126323 -239991 -84003 194792 236374
220 236374 -70137 -283655 -70292 219292 169289 -61419 -150808 -75483 42432 85719 10819
231 10819 -31395 56946 59169 -118960 -158616 68537 204596 51352 -137590 -137069 14138
242 14138 157014 108968 -105393 -171854 8290 115112 19749 -22163 48408 22706 -87171
253 -87171 -98699 -3056 104446 128695 -14933 -179284 -82173 160123 156054 -67933 -157425
264 -157425 -51790 63447 103376 46014 -64810 -65971 34134 22178 -67010 -11628 95860
$$ packed form
190i7379J73254M4406j51333j16171J65164K00556j57325k89593O3524K90822
200A25925N4929j97125j31629P8965J78622M4255j83605j36838J45663J46421
210A25583j40957j39362J66164K04393q8239k53905j13668J55988K78795M1582
220B36374l06511k13518K13363K89584n0003k30708q9389P5325J17915M3287p4900
231A0819m2214Q8341K223j78129l9656K27153J36059j53244j88942N21J51207
242A4138J42876m8046k14361o6461J80144J06822r5363m1912P0571k5702j09877
253h7171j1528R5643J07502K4249j43628j64351R7111K42296m069k23987q9492
264a57425J05635J15237L9929n7362j10824j161J00105j1956q9188N5382J07488
$$ plain form
275 95860 37349 -74710 -56981 18432 54783 43270 -40475 -103689 556 122715 40028
286 40028 -86064 -32310 53730 10558 -43499 -23717 16138 60665 55013 -58536 -111780 23601
298 23601 116082 1011 -95394 -25961 48396 41554 15442 -29165 -54283 9548 48937 -26632
310 -26632 -47044 53387 67743 -38187 -65264 -622 29292 30147 13539 -45758 -44054 56823
322 56823 69900 -41196 -66360 14042 25862 -13091 -76 14461 2712 12540 -5755 -58308
334 -58308 -14523 80092 34617 -74740 -43663 52730 51672 -353 -35009 -54911 -9646 71204
346 71204 43506 -48490 -31701 32645 5288 -28068 9584 17794 -17286 -8252 8385 -5742
358 -5742 16190 35020 -33141 -72868 11565 71296 17014 -28994 -19182 -11637 12064 39747 -5322
$$ packed form
275I5860n8511j12059J7729P5413L6351j1513q3745o3214J04245J22159q2687
286D0028j26092N3754Q6040m3172n4057J9782L9855M4527n652j13549n3244J35381
298B3601R2481j15071r6405O9433P4357o842k6112m4607k5118O3831L9389p5569
310b6632k0412J00431J4356j05930k7077O4642K9914Q55j6608n9297J704J00877
322E6823J3077j11096k5164Q0402J1820l8953J3015J4537j1749R828j8295n2553
334e8308M3785R4615m5475j09357L1077R6393j058n2025l4656j9902M5265Q0850
346G1204k7698r1996J6789O4346k7357l3356L7652Q210l5080R034J6637j4127
358e742K1932J8830o8161l9727Q4433N9731n4282m6008R812P545K3701K7683m5069
$$ plain form
371 -5322 -53066 947 49048 -670 -27326 17033 16149 -26667 -19895 4182 6804 25726 23272
384 23272 -36199 -43615 30166 41493 -24331 -32370 8798 10556 6979 19708 -5851 -30973 3684
397 3684 20818 -14739 -7970 32210 9610 -28968 -6401 15307 -1368 -598 1800 -23756 -8363
410 -8363 43455 22255 -41031 -28108 18764 11456 -3690 6325 -4277 -12131 14963 13667 -21025
423 -21025 -7856 22154 -5862 -25547 16258 31290 -5997 -15733 -2896 -12466 -2649 27558 7636
436 7636 -27948 -4897 19080 -5121 -10405 11705 -1505 -18530 5776 13427 -7299 6890 21607
449 21607 -18515 -37067 10356 32605 4230 -4634 -1540 -17473 -6520 24558 8058 -20823
461 -20823 -1920 8974 -13243 65 30802 3234 -32136 -12226 5907 -2479 13165 25647
$$ packed form
371e322m7744N4013M8101m9718k6656M4359q84m2816O772K4077K622J8922k454
384B3272n9471p416P3781J1327o5824q039M1168J758l577J2729k5559k5122L4657
397C684J7134l5557O769M0180k2600l8578K2567K1708j6675P70K398k5556J5393
410h363N1818k1200o3286J2923M6872p308j5146J0015j0602p854K7094j296l4692
423b1025J3169L0010k8016j9685M1805J5032l7287r736J2837r570R817L0207j9922
436G636l5584K3051K3977k4201n284K2110j3210j7025K4306P651k0726J4189J4717
449B1607m0122j8552M7423K2249k8375q864L094j5933J0953L1078j6500k8881
461b0823J8903J0894k2217J3308L0737k7568l5370J9910J8133q386J5644J2482
$$ plain form
473 25647 -8648 -26450 1166 7116 -4299 15780 17821 -23966 -26929 16113 22387 4711 7796
486 7796 -10412 -42470 -10612 44974 29066 -13909 -17367 -17906 -18682 18166 38120 -472 -23074
499 -23074 -7252 -12280 -10449 36513 41461 -25733 -53288 -10756 22534 37287 40478 -11729 -70518
512 -70518 -33891 40842 44562 10319 -11316 -39443 -36382 27803 57064 5307 -29523 -20527 -25833
525 -25833 -13520 44746 54763 -9270 -45584 -30709 -9669 31123 64426 11104 -67931 -51778
537 -51778 17274 45023 42905 13996 -52839 -66654 15367 65549 20743 -20803 -22888 -28407 -11304
550 -11304 34117 33209 -4510 -8701 -10755 -36194 -12267 49569 43201 -15765 -38829 -32497 -9588
563 -9588 51068 72172 -12533 -83672 -38813 32839 45971 28470 -8901 -50924 -30509 27170
$$ packed form
473B5647l4295j7802K7616N950j1415K0079K041m1787k963M3042O274j7676L085
486G796j8208l2058L1858N5586j5908m2975l458n39p76L6848J9954l8592k2602
499b3074J5822n028J831M6962M948o7194k7555M2532L3290J4753L191n2207n8789
512g0518L6627P4733L720l4243k1635k8127L061O4185K9261n1757l4830Q996n306
525b5833J2313N8266J0017o4033l6314J4875K1040M0792L3303n3322p9035J6153
537e1778O9052K7749k118k8909o6835j3815Q2021N0182m4806m1546k085n519J7103
550a1304M5421r08l7719m191k054k5439K3927O1836o368n8966k3064O332K2909
563i588O0656K1104q4705p1139M4859P1652J3132j7501l7371m2023K0415N7679
$$ plain form
575 27170 28384 3411 14626 2701 -50899 -43960 26689 54567 28481 -7329 -52826 -57468 28202
588 28202 94651 34199 -61234 -75330 -26181 41258 84025 34481 -61208 -64407 9666 34447
600 34447 14771 12073 -6672 -43763 -27947 23406 38567 29882 11131 -41310 -69274 -7641
612 -7641 62249 50659 -320 -39394 -56874 -11227 72899 68303 -30903 -76159 -25104 27551
624 27551 40617 24742 -18634 -41022 -3799 24008 -1020 -7567 21431 13224 -24110 -26820 -7607
637 -7607 10145 37248 30678 -35019 -61350 7689 65168 34096 -24756 -51380 -35692 19501
649 19501 56058 18105 -28474 -10104 11431 -13596 -19748 15092 23502 -2073 -19953 -26684 -9623
662 -9623 43623 59811 -8836 -69800 -42776 17577 47241 39061 -9327 -56061 -27685 40284
$$ packed form
575B7170J214k4973J1215j1925n3600O939P0649K7878k6086l5810m5497m642Q5670
588B8202O6449o0452r5433j4096M9149O7439M2767m9544r5689l199P4073K4781
600C4447j9676k698j8745l7091J5816N1353J5161q685j8751n2441k7964O1633
612g641O9890j1590n0979l9074j7480M5647Q4126m596r9206m5256N1055N2655
624B7551J3066j5875m3376k2388L7223K7807k5028o547K8998q207l7334k710J9213
637g607J7752K7103o570o5697k6331O9039N7479l1072n8852k6624J5688N5193
649A9501L6557l7953m6579J8370K1535k5027o152L4840Q410k5575j7880o731J7061
662i623N3246J6188o8647o0964K7024O0353K9664q180m8388m6734K8376O7969
$$ plain form
674 40284 44205 -2829 -21855 -18921 -18860 2309 28561 17967 -3863 -8063 -19415 -23947 14081
687 14081 44295 12061 -30816 -31872 -14085 13334 45019 28183 -34126 -49319 1581 37383
699 37383 28372 2749 -27923 -36853 1431 32816 10257 -9540 8477 7680 -20772 -18741 9035
712 9035 17042 10137 -5267 -32540 -25450 31532 54618 5452 -38844 -32940 -8202 20667 37164
725 37164 4450 -38052 -18819 24904 22098 1853 990 -8885 -24741 -11271 9670 13141 18740
738 18740 13000 -24451 -35562 11008 36511 5589 -18500 -15506 -14955 392 31373 23679 -14524
751 -14524 -21785 -5813 44 11807 20231 -5449 -24445 -638 13553 -3240 672 16671 -2978
764 -2978 -22394 -2170 11856 1192 2216 3514 -15332 -13798 13376 15696 860 3162 -3501
$$ packed form
674D0284L921m7034j9026K934O1K1169K6252j0594k1830m200j1352m532L8028
687A4081L0214l2234m2877j056J7787K7419L1685j6836o2309j5193N0900L5802
699C7383r011k5623l0672q930L8284L1385k2559j9797J8017p97k8452K031K7776
712I035Q007o905j5404k7273P090N6982K3086m9166m4296N904K4738K8869J6497
725C7164l2714m2502J9233M3723k806k0245q63r875j5856J3470K0941L471N599
738A8740n740l7451j1111M6570K5503l0922k4089K994N51J5347L0981p694l8203
751a4524p261J5972N857J1763Q424k5680j8996K3807J4191j6793L912J5999j9649
764b978j9416K0224J4026j0664J024J298j8846J534K7174K320j4836K302o663
$$ plain form
777 -3501 -22428 -5501 23758 7154 -15835 623 9951 -7523 -2687 16310 6614 -9930 -10804
790 -10804 -15661 -6809 27692 28721 -15972 -28570 1073 9550 3088 11190 252 -26655 -12732
803 -12732 21913 18484 347 -2008 -11695 -17088 8500 21974 -1882 -10929 1763 -5885 -9246
816 -9246 17426 19487 -14794 -19534 4411 5249 -5 9906 1424 -17169 -5446 9887 592 2430
830 2430 13623 -5336 -21911 2967 17982 -2629 -7628 5925 -1689 -7618 9352 9843 -7856
843 -7856 -3891 3796 -9301 -6132 13953 5800 -11974 496 8709 -7439 -5172 11208 -11
856 -11 -12914 1762 7394 -4719 2327 11539 -4425 -10698 4760 3561 -5738 6437 8371 -12830
870 -12830 -9987 13593 8772 -7947 -1894 492 -8916 771 12757 -1910 -10184 3764 2627 -7454
$$ packed form
777c501j8927J6927K9259j6604k2989J6458R328j7474M836J8997r696j6544q74
790a0804m857Q852L4501J029m4693j2598K9643Q477o462Q102j0938k6907J3923
803a2732L4645l429j8137k355r687n393K5588J3474k3856r047J2692p648l361
816i246K6672K061l4281m740K3945Q38n254R911q482j8593J1723J5333r295J838
830B430J1193j8959j6575K4878J5015k0611m999J3553p614n929J6970M91j7699
843g856L965P687j3097L169K0085q153j7774J2470Q213j6148K267J6380j1219
856a1j2903J4676N632j2113P046R212j5964o273J5458j199r299J2175J934k1201
870a2830K843K3580m821j6719O053K386r408R687J1986j4667q274J3948j137j0081
$$ plain form
884 -7454 5178 11671 -8212 -11744 7400 6712 -4682 2181 3967 -8163 -1908 10856 -211 -8305
898 -8305 4034 3248 -8890 431 9962 -4410 -8509 6255 2886 -8381 2015 8407 -5611 -6372
912 -6372 6096 1344 -4551 5520 3941 -8847 -909 10345 -1831 -7715 5207 3631 -8585
925 -8585 431 9589 -2458 -6789 3499 537 -4915 4518 4234 -9337 -3451 10004 461 -7642
939 -7642 4055 4172 -7625 -876 8958 -1686 -6288 5249 2711 -6478 2092 6775 -5095 -4349
953 -4349 6234 -663 -6758 5420 5307 -9512 -3752 9263 -42 -7310 3676 3324 -6792 487
967 487 7351 -3731 -4891 6467 743 -6805 5156 7465 -7613 -4956 8311 1010 -6560 3831
981 3831 3697 -8168 -965 8956 -2268 -7366 3725 1511 -6318 3852 6993 -7820 -5691 8759
$$ packed form
884g454J2632O493j9883l532J9144o88j1394O863J786j2130O255J2764j1067q094
898h305J2339p86j2138R321R531j4372m099J4764l369j1267J0396O392j4018p61
912f372J2468m752n895J0071j579j2788P938J1254j2176n884J2922j576j2216
925h585R016R158j2047m331J0288k962n452R433k84j3571N886J3455r543q103
939g642J1697J17j1797O749R834j0644m602J1537k538r189Q570M683j1870P46
953d349J0583o897o095J2178j13j4819N760J3015r305p268J0986l52j0116P279
967D87O864j1082j160J1358n724p548J1961K309j5078K657J3267p301p570J0391
981C831j34j1865P203R921j1224n098J1091k214p829J0170L141j4813K129J4450
$$ plain form
995 8759 1842 -7323 4027 5890 -7658 -2727 8988 -40 -6184 4427 1974 -7619 2272 8583
1009 8583 -5242 -5787 7293 176 -9431 3578 7918 -6464 -4258 6659 -2079 -6263 7956 5734
1023 5734 -9296 -3114 6993 -1762 -1622 8903 -1140 -12277 2844 10550 -4006 -3591 7117
1036 7117 -3196 -10184 5311 8262 -4758 -2122 3095 -7709 -4004 13206 5275 -12003 -3280
1049 -3280 5031 -4017 911 12362 -1230 -13552 722 7778 -1049 3026 6327 -9728 -11063 8946
1063 8946 9684 -3808 -516 518 -10945 -2505 15236 4009 -11760 -1992 3665 -5340 1183 11093
1077 11093 -1335 -9159 1202 424 -4081 9611 11012 -11631 -13882 7291 8880 -1159 2527
1090 2527 -629 -11700 -1533 12507 1090 -7778 2686 1128 -9098 1121 10285 -1178 -4139
$$ packed form
995H759o917r165J1350J863j3548M931J1715r028o144J0611k453r593R891O311
1009H583j3825n45J3080p117r607J3009M340j4382K206J0917q738m184J4219k222
1023E734j5030O182J0107q755J40J0525j0043j1137J5121P706j4556M15J0708
1036G117j0313o988J5495K951j3020K636N217j0804L705J7210p931j7278Q723
1049c280Q311r048M928J1451j3592j2322J4274P056q827M075L301j6055j335K0009
1063H946P38j3492L292J034j1463Q440J7741j1227j5769R768N657r005O523R910
1077A1093j2428p824J0361p78m505J3692J401k2643k251K1173J589j0039L686
1090B527l156j1071J0167J4040j1417q868J0464j558j0226J0219R164j1463k961
$$ plain form
1103 -4139 3883 -5103 -10894 8301 15594 -4071 -10933 -625 315 2739 11813 1226 -15894 -5587
1117 -5587 9739 2736 -866 6315 -2856 -12562 1313 9968 -2154 -3874 4297 -3576 -8701 4865
1131 4865 9244 -314 -60 -690 -12190 -4852 17433 11958 -11608 -11561 1568 4470 7330 7106 -8299
1146 -8299 -14050 4074 10595 -2771 -4048 3870 -1674 -4626 2992 289 -4524 7313 9437 -11535
1160 -11535 -15837 6557 15835 3533 -5761 -9368 -6050 10659 15769 -5926 -16732 1069 8838
1173 8838 -3145 -2545 6091 1628 -2485 1263 -4332 -8200 5671 11525 -4536 -12343 -1688 6173
1187 6173 9603 10311 -6343 -21978 -4296 19721 9853 -9069 -6236 454 145 5142 6340 -4315
1201 -4315 -6238 1532 -2203 -5664 5828 9098 -3101 -4910 314 -5591 -3492 13923 10603 -13977
$$ packed form
1103d139Q022q986n791J9195P293j9665o862J0308R40K424R074j0587j7120J0307
1117e587J5326p003l602P181r171r706J3875Q655j2122j720Q171p873n125J3566
1131D865M379r558K54o30j1500P338K2285n475k3566M7J3129K902K860k24j5405
1146h299n751J8124O521j3366j277P918n544k952P618k703m813J1837K124k0972
1160a1535m302K2394R278j2302r294l607L318J6709N110k1695j0806J7801P769
1173H838j1983O00Q636m463m113L748n595l868J3871N854j6061p807J0655P861
1187F173L430P08j6654j5635J7682K4017r868j8922K833O690l09M997J198j0655
1201d315j923P770l735l461J1492L270j2199j809N224n905K099J7415l320k4580
$$ plain form
1215 -13977 -16282 4451 13286 7293 -2053 -12230 -8213 11940 14368 -6647 -10947 3412 2606 -6057
1229 -6057 499 4999 -752 2485 5734 -7828 -12019 6456 12935 -2413 -11039 -7292 593 14658
1243 14658 16907 -7509 -21823 -668 14043 -540 -7666 3349 3869 -2223 1310 1516 -1916 4431
1257 4431 3999 -12678 -12826 7503 12258 1839 53 -3651 -11696 331 17088 3878 -15613 -8113
1271 -8113 4792 4757 6862 5798 -7572 -9349 4655 4837 -2890 3712 4767 -9695 -8411 7589
1285 7589 5861 -2629 3437 2843 -10216 -6075 8459 5732 -2524 -2381 -6960 -6870 11211 16403 -5123
1300 -5123 -13161 1766 4389 -3462 776 2600 -4792 89 8071 -760 -4783 6523 3443 -11998
1314 -11998 -7965 4399 3585 3973 7096 -5122 -12386 4462 12719 -3151 -9521 -596 -361 -742 8042
$$ packed form
1215a3977k305K0733Q835n993r346j0177M017K0153K428k1015m300J4359q06q663
1229f057O556M500n751L237L249j3562m191J8475O479j5348q626L747P885J4065
1243A4658K249k4416j4314K1155J4711j4583p126J1015N20o092L533K06l432O347
1257D431m32j6677j48K0329M755j0419j786l704q045J2027J6757j3210j9491P500
1271h113J2905l5K105j064j3370j777J4004J82p727O602J055j4462J284J6000
1285G589j728q490O066n94j3059M141J4534k727q256J43m579R0J8081N192k1526
1300e123q038J4927K623p851M238J824p392M881P982q831m023J1306l080j5441
1314a1998M033J2364q14L88L123j2218p264J6848Q257j5870o370Q925K35l81Q784
$$ plain form
1329 8042 5527 -4966 -643 2988 -7582 -5242 11003 6833 -9612 -6008 3778 1388 2852 5413
1343 5413 -5323 -9602 3560 6691 -3125 -270 4276 -5658 -6820 7024 7307 -3395 -1079 1896
1357 1896 -4835 -1488 8103 495 -8826 -592 4953 -237 2337 5446 -4305 -7256 2341 633 -6311
1372 -6311 2680 9191 -2769 -7040 3850 4847 -2160 -1201 -1754 -5791 1554 8311 -940 -4705 5902
1387 5902 4860 -7074 -4157 4209 -552 -3048 2803 427 -3408 3996 5422 -5332 -5478 3226 1182
1402 1182 -3002 2165 1702 -4318 806 5449 -2876 -4264 6213 3871 -7270 -3559 5188 2391 -915
1417 -915 570 -2915 -2969 5630 4259 -6141 -3087 5112 -858 -5951 1598 3803 -2089 14 3199
1432 3199 -2207 -2250 4662 248 -6919 -325 5587 31 -1351 2960 -385 -2657 3059 1392 -6064
$$ packed form
1329H042k515j0493M323L631j0570K340J6245m170j6445L604R786k390J464K561
1343E413j0736m279J3162L131r816K855M546r934j162J3844K83j0702K316K975
1357A896o731L347R591p608r321Q234N545n190K574L109r751k951R597j708o944
1372f311Q991O511j1960m271J0890R97p007R59n53m037P345O757r251l765J0607
1387E902j042j1934K917Q366m761k496N851k376l835P404J426j0754j46Q704k044
1402A182m184N167m63o020N124M643q325j388J0477k342j1141L711Q747k797l306
1417i15J485l485n4Q599j371j0400L054Q199n970n093P549K205n892K103L185
1432C199n406m3O912m414p167O594N912n556j382M311l345k272N716j667p456
$$ plain form
1447 -6064 -1107 5972 -997 -5220 3165 4884 -2692 -2542 513 -2425 -208 4459 -1053 -5343 3124
1462 3124 5778 -3400 -3683 3767 1071 -3036 1478 1333 -3547 1464 5329 -3122 -5297 3938 3752 -4069
1478 -4069 -1839 1972 -1220 251 3399 -3100 -5372 4945 5438 -5266 -3482 5369 1371 -3762 704
1493 704 1152 -2329 2297 3673 -4161 -2693 5966 1503 -6203 -134 3813 -2256 -1411 3656 -1695 -3704
1509 -3704 4148 2564 -6010 -1571 5201 -900 -3895 2846 1966 -2515 1836 2150 -4631 -764 6626
1524 6626 -807 -6817 2472 5572 -2995 -2569 2932 -1054 -2004 3390 -409 -5460 2213 5540 -3887
1539 -3887 -4272 4610 1638 -3797 1405 2091 -3785 435 5402 -2471 -5004 4512 3712 -4681 -1118 3940
1555 3940 -1383 -1763 3108 -1619 -4411 4204 4038 -6383 -3395 5993 993 -4433 806 1268 -2884
$$ packed form
1447f064M957P079o969m223Q385J719p576J50L055k938K217M667n512m290Q467
1462C124K654r178k83P450k696m107M514j45m880N011L865q451k175R235j86p821
1478d069K230L811l192J471L148o499k272J0317M93j0704J784Q851l998n133M466
1493G04M48l481M626J376p834J468Q659m463p706O069L947o069Q45N067n351k009
1509c704P852j584q574M439O772o101k995O741q80m481M351L14o781L867P390
1524F626p433o010R289L100q567M26N501l986r50N394l799n051P673L327r427
1539c887l85Q882k972n435N202O86n876M220M967p873k533R516q00q393L563N058
1555C940n323l80M871m727k792Q615j66j0421K988R388n000n426N239M62m152
$$ plain form
1570 -2884 1976 3771 -4172 -2873 5889 1472 -5479 992 4440 -2712 -1945 3249 -1149 -2961 4171
1585 4171 1794 -6121 -799 5357 -857 -3668 2223 159 -3449 2355 3491 -4071 -2080 4713 -246
1600 -246 -4172 2984 3400 -3990 -1498 3836 -813 -1968 3393 -7 -4839 1558 4380 -2884 -2616 3773
1616 3773 -124 -4328 1772 3199 -2877 -750 2697 -2423 -2664 4566 2263 -4944 -910 3825 -818
1631 -818 -1170 3018 -709 -3608 2771 3167 -3832 -1593 4254 -284 -3998 1051 1895 -1852 935 2168
1647 2168 -3699 -2696 4724 1932 -4040 -449 2343 -1773 -434 3614 -447 -3369 1884 2330 -2800
1662 -2800 -193 3632 -1156 -3119 1858 1064 -2560 1248 2827 -3191 -2955 2950 1108 -2415 1039
1677 1039 1395 -3330 -868 3964 193 -2486 1502 694 -3056 981 4292 -1357 -3330 1900 1263 -2114
$$ packed form
1570b884M860J795p943J299Q762m417o951O471L448p152P67N194m398j812P132
1585D171k377p915N322O156o214k811N891k064l608N804J136p562J991O793m959
1600b46l926P156M16p390K492N334m649j155N361l400m832O397K822p264K68O389
1616C773l897m204O100J427o076K127L447n120k41P230k303p207M034M735m643
1631h18l52M188l727k899O379L96o999K239N847m538l714N049Q44l747K787J233
1647B168n867J003P420k792n972L591K792m116J339M048m061k922N253M46n130
1662b800K607L825m788j963M977p94l624L808J579o018K36N905j842l523L454
1677A039L56m725K462M832l771k679L988q08l750M037L311n649j973N230o37l377
$$ plain form
1693 -2114 1090 2242 -2553 -1592 2420 -589 -2659 2603 2413 -3862 -2282 2797 329 -1075 2275
1708 2275 -207 -4366 919 5028 -37 -2526 769 -378 -1908 2766 2343 -3487 -1192 3661 -680
1723 -680 -3635 2062 3007 -2715 -2246 869 -931 165 4109 -246 -5414 -159 3906 -171 -579 1891
1739 1891 -2042 -3498 3541 4216 -2946 -2233 2510 -340 -2065 2123 1219 -2451 226 1278 -3653 -1315
1755 -1315 5141 1431 -4349 -414 1714 -2008 513 3917 -2036 -5425 1653 4482 191 248 536 -3609
1771 -3609 -961 4483 -159 -4815 1543 4228 -2701 -2675 3423 1486 -2151 91 -1346 -4197 2044
1786 2044 6293 -1002 -4547 462 1182 -299 3019 1293 -5840 -2167 5917 2063 -3945 408 2696
1801 2696 -1725 -979 1582 -1195 -454 3344 -1431 -6018 1357 5782 -1048 -3272 1367 -141 -2015
$$ packed form
1693b114L204J152m795R61M012l009k070N262j90o275J580N079k468j404L350
1708B275k482m159N285M109n065k489L295j147j530M674m23n830K295M853m341
1723f80k955N697R45n722M69L115j800J096L944m355n168N255M065m077m08K470
1739A891l933j456P039O75p162P13M743k850j725M188r04l670K677J052m931K338
1755a315O456l710n780L935K128l722K521L404n953l389P078K829m291N7K88m145
1771c609K648N444m642m656O358K685o929K6O098j937l637K242j437k851O241
1786B044M249p295l545N009P20j481L318j726p133L673Q084l854o008M353K288
1801B696m421P46K561k777P41L798m775m587P375M425o830k224M639j508j874
$$ plain form
1816 -2015 2891 2359 -4396 -2755 2910 1079 -196 3311 84 -4124 797 3085 -2927 -2595 3612
1831 3612 855 -3821 971 3481 -1162 -682 1244 -3002 -3848 2364 2727 -1367 757 1790 -2868 -817
1847 -817 4813 -178 -6004 -160 4538 180 -1277 1463 123 -1067 1505 -983 -3601 2169 4311
1862 4311 -3299 -4404 2847 2978 -1623 78 711 -3063 -1166 3873 983 -2600 -111 486 -1507 1217
1878 1217 2700 -1568 -1065 3281 -326 -5014 601 4370 -1655 -3684 1474 2712 56 159 -541 -2611
1894 -2611 -221 1247 -2483 -886 4531 1380 -4026 448 4633 -917 -4298 -336 1114 -484 1217
1909 1217 1917 -549 355 1330 -2230 -2617 1939 863 -3122 -15 2785 -1054 -1481 3382 1525 -4398
1925 -4398 -2423 2490 1479 -572 -175 -675 485 2612 -593 -3731 1610 4876 -1908 -5136 1658
$$ packed form
1816b015M906n32o755J641N665j831j275L507l227m208M921K288o012L32O207
1831C612k757m676M792K510m643M80J926m246q46O212L63m094K124J033m658K051
1847h17N630m991n826N844M698m358j457K740j340j190K572k488k618N770K142
1862D311p610j105P251J31m601J701O33l774J897N039k890l583K489N97j993K724
1878A217J483m268N03M346l607m688N615L769o025k029N158J238k656J03p00k070
1894b611K390J468l730J597N417l151n406M474M185n550l381L962J450j598J701
1909A217P00k466R04R75l560l87M556j076l985L107K800l839m27M863j857n923
1925d398J975M913j011k051L97n00J160K127l205l138N341L266o784l228O794
$$ plain form
1940 1658 3937 -1684 -2643 776 1036 821 1317 -1094 -2340 703 680 -2502 14 3145 -374 -2156
1956 -2156 2394 2424 -2443 -1032 2258 -1178 -3395 1158 3222 760 349 100 -1616 155 1462 -2653
1972 -2653 -3260 3050 3152 -3208 -1607 4101 1383 -3583 -1378 934 42 459 583 -1631 442 3639
1988 3639 -222 -3643 890 2595 -2205 -1913 2464 810 -1767 1176 961 -2801 -462 2992 -221
2003 -221 -2183 511 145 -1330 1228 1015 -2841 -54 4404 -76 -4166 1036 3692 -1436 -2431 492
2019 492 278 288 2374 -363 -2730 1673 2787 -3211 -3362 2445 1540 -2055 579 1883 -1275 -188
2035 -188 1857 -1764 -2741 2027 1774 -2248 123 2736 -606 -871 2255 -404 -3139 1211 2078 -2480
2051 -2480 -1168 3334 806 -2585 236 662 -1513 779 1599 -2454 -1427 3696 855 -3706 436
$$ packed form
1940A658K279n621r59L419K60k15M96k411j246L043k3l182K516L131l519j782
1956b156M550L0m867J411L290l436k217M553K064k462m11k49j716J771J307m115
1972b653o07O310J02o360J601N708k718m966K205K312q92M17J24k214K073L197
1988C639l861l421M533J705m800K92M377j654k577K943k15l762K339L454l213
2003b21j962K694l66j475K558k13l856K787M458m480m090N202K656n128r95K923
2019D92k14J0K086k737k367M403J114n998j51N807r05l595K634J304l158J087
2035a88K045l621r77M768k53m022K371K613l342k65L126k659k735M350Q67m558
2051b480J312M502k528l391K821M26k175K292Q20m053J027N123k841m561M142
$$ plain form
2066 436 3473 -744 -1992 1291 184 -930 1808 -23 -2977 885 3714 -1430 -2894 2072 1339
2081 1339 -2213 -138 1339 -1914 -858 2683 -202 -2494 1526 2106 -2215 -1140 1503 -555 -612 2375
2097 2375 68 -2830 1360 3268 -1977 -2462 2103 1057 -2102 -61 933 -770 606 1447 -2180 -1864
2113 -1864 2914 1195 -3276 -546 2958 -122 -1615 1049 113 -1405 1322 1312 -2210 -474 2691 -258
$$ packed form
2066D36L037m217j248L283j107j114K738j831k954L862K829n144j464M966p33
2081A339l552K075J477l253J056L541k885k292M020N80m321J075K643k058n7K987
2097B375k307k898M190J908n245m85M565j046l159K041R94j703J376Q41l627L16
2113a864M778j719m471K730L504l080j493K664r36j518K727j0l522J736L165k949
$$ [...]
8191C
##END NTUPLES=NMR FID
##END=
