##TITLE=1H ikalashn
D-D
19.12.2024
##JCAMPDX= 6.0         $$ Bruker NMR JCAMP-DX V2.0
##DATA TYPE= NMR FID
##DATA CLASS= NTUPLES
##ORIGIN= UXNMR, Bruker Analytische Messtechnik GmbH
##OWNER= root
$$ TOPSPIN		Version 1.3
$$ 2024-12-19 14:41:01.296 +0400  Irina@DPX200
$$ Compression mode = diff/dup
##.OBSERVE FREQUENCY= 200.131300845
##.OBSERVE NUCLEUS= ^1H
##.DELAY= (6, 6)
##.ACQUISITION MODE= SIMULTANEOUS
##.ACQUISITION SCHEME= undefined
##.AVERAGES= 32
##.DIGITISER RES= 18
##SPECTROMETER/DATA SYSTEM= spect
##.PULSE SEQUENCE= zg
##.SOLVENT NAME= CDCl3
##.SHIFT REFERENCE= INTERNAL, CDCl3, 1, 17.49637
##AUDIT TRAIL= $$ (NUMBER, WHEN, WHO, WHERE, WHAT)
$$ ##TITLE= Audit trail, TOPSPIN		Version 1.3
$$ ##JCAMPDX= 5.01
$$ ##ORIGIN= Bruker BioSpin GmbH
$$ ##OWNER= Irina
$$ $$ F:/spectra/data/iren/nmr/1H/4/audita.txt
$$ ##AUDIT TRAIL=  $$ (NUMBER, WHEN, WHO, WHERE, VERSION, WHAT)
(   1,<2024-12-19 14:40:37.281 +0400>,<Irina>,<DPX200>,<TOPSPIN 1.3>,
      <created by zg
	started at 2024-12-19 14:38:24.921 +0400,
	POWCHK disabled, PULCHK disabled
       configuration hash MD5:
       BE 6D 3F 07 2A EA 11 49 91 17 2B D3 AF B3 58 0D
       data hash MD5: 16K
       D4 72 63 A3 84 5C 10 55 11 2F 99 18 D1 C9 01 FE>)
$$ ##END=
$$ 
$$ $$ hash MD5
$$ $$ C1 45 1A D3 9C B5 A2 CF 8D 50 B2 E2 01 80 B3 7A
##$RELAX= 
##$RELAX= 
##$RELAX= 
##$RELAX= 
##$RELAX= 
##$RELAX= 
##$RELAX= 
##$RELAX= 
##$RELAX= 
$$ Bruker specific parameters
$$ --------------------------
##$DU= <F:/spectra>
##$EXPNO= 4
##$NAME= <1H>
##$PROCNO= 1
##$TYPE= <nmr>
##$USER= <iren>
##$AMP= (0..31)
100 100 100 100 100 100 100 100 100 100 100 100 100 100 100 100 100 100 
100 100 100 100 100 100 100 100 100 100 100 100 100 100 
##$ANAVPT= -1
##$AQSEQ= 0
##$AQ_mod= 1
##$AUNM= <au_zg>
##$AUTOPOS= <>
##$BF1= 200.13
##$BF2= 200.13
##$BF3= 200.13
##$BF4= 200.13
##$BF5= 200.13
##$BF6= 200.13
##$BF7= 200.13
##$BF8= 200.13
##$BYTORDA= 1
##$CFDGTYP= 0
##$CFRGTYP= 5
##$CHEMSTR= <none>
##$CNST= (0..63)
1 1 145 1 1 1 1 1 1 1 1 1 1 1 1 1 1 1 1 1 1 1 1 1 1 1 1 1 1 1 1 1 1 1 
1 1 1 1 1 1 1 1 1 1 1 1 1 1 1 1 1 1 1 1 1 1 1 1 1 1 1 1 1 1 
##$CPDPRG= <>
##$CPDPRG1= <>
##$CPDPRG2= <>
##$CPDPRG3= <>
##$CPDPRG4= <mlev>
##$CPDPRG5= <mlev>
##$CPDPRG6= <mlev>
##$CPDPRG7= <mlev>
##$CPDPRG8= <mlev>
##$CPDPRGB= <>
##$CPDPRGT= <>
##$D= (0..63)
0 2 0 0 0 0 0 0 0 0.06 0 0.03 0 0 0 0 0.0002 0 0 0 0 0 0 0 0 0 0 0 0 0 
0 0 0 0 0 0 0 0 0 0 0 0 0 0 0 0 0 0 0 0 0 0 0 0 0 0 0 0 0 0 0 0 0 0 
##$DATE= 1734604832
##$DBL= (0..7)
120 120 120 120 120 120 120 120 
##$DBP= (0..7)
150 150 150 150 150 150 150 150 
##$DBP07= 0
##$DBPNAM0= <>
##$DBPNAM1= <>
##$DBPNAM2= <>
##$DBPNAM3= <>
##$DBPNAM4= <>
##$DBPNAM5= <>
##$DBPNAM6= <>
##$DBPNAM7= <>
##$DBPOAL= (0..7)
0.5 0.5 0.5 0.5 0.5 0.5 0.5 0.5 
##$DBPOFFS= (0..7)
0 0 0 0 0 0 0 0 
##$DE= 6
##$DECBNUC= <off>
##$DECIM= 32
##$DECNUC= <off>
##$DECSTAT= 4
##$DIGMOD= 1
##$DIGTYP= 9
##$DL= (0..7)
0 120 120 120 120 120 120 120 
##$DP= (0..7)
150 150 150 150 150 150 150 150 
##$DP07= 0
##$DPNAME0= <>
$$ [...]
##$SW= 21.9926040160658
##$SWIBOX= (0..15)
0 0 2 0 0 0 0 0 0 0 0 0 0 0 0 0 
##$SW_h= 4401.40845070422
##$TD= 16384
##$TD0= 1
##$TE= 300
##$TE2= 300
##$TE3= 300
##$TEG= 300
##$TL= (0..7)
0 120 120 120 120 120 120 120 
##$TP= (0..7)
150 150 150 150 150 150 150 150 
##$TP07= 0
##$TPNAME0= <>
##$TPNAME1= <>
##$TPNAME2= <>
##$TPNAME3= <>
##$TPNAME4= <>
##$TPNAME5= <>
##$TPNAME6= <>
##$TPNAME7= <>
##$TPOAL= (0..7)
0.5 0.5 0.5 0.5 0.5 0.5 0.5 0.5 
##$TPOFFS= (0..7)
0 0 0 0 0 0 0 0 
##$TUNHIN= 0
##$TUNHOUT= 0
##$TUNXOUT= 0
##$USERA1= <user>
##$USERA2= <user>
##$USERA3= <user>
##$USERA4= <user>
##$USERA5= <user>
##$V9= 5
##$VALIST= <valist>
##$VCLIST= <CCCCCCCCCCCCCCC>
##$VD= 0
##$VDLIST= <DDDDDDDDDDDDDDD>
##$VPLIST= <PPPPPPPPPPPPPPP>
##$VTLIST= <TTTTTTTTTTTTTTT>
##$WBST= 1024
##$WBSW= 25
##$XGAIN= (0..3)
0 0 0 0 
##$XL= 0
##$YL= 0
##$YMAX_a= 286546
##$YMIN_a= -260446
##$ZGOPTNS= <>
##$ZL1= 120
##$ZL2= 120
##$ZL3= 120
##$ZL4= 120
##$ABSF1= 10
##$ABSF2= 0
##$ABSG= 5
##$ABSL= 3
##$ALPHA= 0
##$AQORDER= 0
##$ASSFAC= 0
##$ASSFACI= 0
##$ASSFACX= 0
##$ASSWID= 0
##$AUNMP= <proc_1d>
##$AXLEFT= 0
##$AXRIGHT= 0
##$AXTYPE= 0
##$AXUNIT= <>
##$AZFE= 0.1
##$AZFW= 0.1
##$BCFW= 1
##$BC_mod= 2
##$BYTORDP= 1
##$COROFFS= 0
##$CY= 7568.61572265625
##$DATMOD= 1
##$DC= 2
##$DFILT= <>
##$DTYPP= 0
##$F1P= 17.9538593292236
##$F2P= -4.03888763876832
##$FCOR= 0.5
##$FTSIZE= 32768
##$FT_mod= 4
##$GAMMA= 1
##$GB= 1
##$INTBC= 1
##$INTSCL= 1
##$ISEN= 128
##$LB= 0.05
##$LEV0= 0
##$LPBIN= 0
##$MAXI= 945.577
##$MC2= 0
##$MEAN= 0
##$ME_mod= 0
##$MI= -402.1523
##$NCOEF= 0
##$NC_proc= 0
##$NLEV= 6
##$NOISF1= 8.587773
##$NOISF2= 6.764455
##$NSP= 1
##$NTH_PI= 0
##$NZP= 0
##$OFFSET= 17.49637
##$PC= 1
##$PHC0= 112.7257
##$PHC1= -18.3583
##$PH_mod= 0
##$PKNL= yes
##$PPARMOD= 0
##$PPDIAG= 0
##$PPIPTYP= 0
##$PPMPNUM= 100
##$PPRESOL= 1
##$PSCAL= 0
##$PSIGN= 0
##$REVERSE= no
##$SF= 200.13
##$SI= 32768
##$SIGF1= 18.5376
##$SIGF2= -6.396296
##$SINO= 400
##$SIOLD= 32768
##$SREGLST= <1H.CDCl3>
##$SSB= 3
##$STSI= 0
##$STSR= 0
##$SW_p= 4401.40845070422
##$SYMM= 0
##$S_DEV= 0
##$TDeff= 0
##$TDoff= 0
##$TI= <>
##$TILT= no
##$TM1= 0
##$TM2= 0
##$TOPLEV= 0
##$USERP1= <user>
##$USERP2= <user>
##$USERP3= <user>
##$USERP4= <user>
##$USERP5= <user>
##$WDW= 1
##$XDIM= 8192
##$YMAX_p= 0
##$YMIN_p= 0
$$ End of Bruker specific parameters
$$ ---------------------------------
##NTUPLES= NMR FID
##VAR_NAME=  TIME,          FID/REAL,        FID/IMAG
##SYMBOL=    X,             R,               I
##VAR_TYPE=  INDEPENDENT,   DEPENDENT,       DEPENDENT
##VAR_FORM=  AFFN,          ASDF,            ASDF
##VAR_DIM=   8192,          8192,            8192
##UNITS=     SECONDS,       ARBITRARY UNITS, ARBITRARY UNITS
##FACTOR=    0.0002272,     1,               1
##FIRST=     0,             0,               0
##LAST=      1.8609952,     131,             -64
##MIN=       0,             -260446,         -260446
##MAX=       1.8609952,     286546,          286546
$$ Real data points
##PAGE= N=1
##DATA TABLE= (X++(R..R)), XYDATA
$$ plain form
0 0 0 0 0 0 0 0 0 0 0 0 0 0 0 0 0 0 0 0 0 0 0 0 0 0 0 -7 32 -32 32 -32 32 -32 32 -43 64 -64 64 -70 96 -96 102 -128
42 -128 130 -155 162 -187 198 -226 247 -269 298 -329 363 -398 437 -485 534 -595 659 -734 821
61 821 -924 1049 -1198 1382 -1608 1885 -2132 1701 9967 285383 286546 -50351 -229776 -141118
75 -141118 65643 160024 70308 -72895 -76132 -22662 -39798 -30951 82518 117634 -3472 -113295
87 -113295 -90306 22059 142168 131324 -51313 -180180 -68022 100196 103093 6134 -55070
98 -55070 -64445 -21473 36263 37628 18898 34635 -3264 -101359 -80999 65183 108964 1812
110 1812 -78174 -56544 5661 56926 47380 -12604 -16444 29122 -766 -63404 -14580 74053 48329
123 48329 -38312 -67359 -35174 31832 82958 28917 -72377 -56128 39539 44952 -19222 -32344
$$ packed form
0@%%%%%%%%%%%%%%%%%%%%%%%%%pL9o4O4o4O4o4O4p5J07j28J28j34J66j92J98k30
42a28K58k85L17l49L85m24M73n16N67o27O92p61Q35r22J019j129J254j393J555
61H21j745J973k247K580k990L493m017L833Q266K75416J163l36897j79425Q8658
75a41118K06761R4381q9716j43203l237N3470j7136Q847J13469L5116j21106j09823
87a13295K2989J12365J20109j0844j82637j28867J12158J68218K897r6959o1204
98e5070r375M2972N7736J365j8730J5737l7899r8095K0360J46182M3781j07152
110A812p9986K1630O2205N1265r546n9984l840M5566k9888o2638M8824Q8633k5724
123D8329q6641k9047L2185O7006N1126n4041j01294J6249R5667N413o4174j3122
$$ plain form
135 -32344 -5296 8034 3871 -25305 -37192 36244 99523 12677 -103553 -55931 72098 92332
147 92332 9613 -71361 -83833 -5245 79877 48578 -39099 -38678 11179 8062 -5211 15068 12504
160 12504 -11502 -12133 -17581 -28657 9343 46222 2439 -44085 -9194 33094 24088 6780 -5792
173 -5792 -19265 1605 28329 -2590 -33476 2228 24600 -13810 -24171 14765 22433 -1642
185 -1642 -8623 -12307 -9801 17964 17448 -29190 -32115 19524 26500 -10649 -14018 3190 5908 20291
199 20291 25738 -13198 -31981 6829 22417 -7236 -9992 8538 -3136 -13895 -419 2511 6904
212 6904 26358 4384 -47249 -29482 34626 33711 -14979 -28150 -15384 823 27468 27041 -13769
225 -13769 -21533 13561 16172 -5898 4132 10787 -13747 -15920 5083 783 -3493 15414 5588
$$ packed form
135c2344K7048J3330m163k9176j1887P3436O3279q6846j16230M7622J28029K0234
147I2332q2719q0974j2472P8588Q5122l1299q7677M21M9857l117j3273K0279k564
160A2504k4006o31n448j1076L8000L6879m3783m6524L4891M2288r006j7308j2572
173e792j3473K0870K6724l0919l0886L5704K2372l8410j0361L8936P668k4075
185a642o981l684K506K7765n16m6638k925N1639O976l7149l369J7208K718J4383
199B0291N447l8936j8783L8810J5588k9653k756J8530j1674j0759J3476K930M393
212F904J9454k1974n1633J7767O4108r15m8690j3171J2766J6207K6645m27m0810
225a3769p764L5094K611k2070J0030O655k4534k173K1003m300m276J8907r826
$$ plain form
238 5588 -25058 -10139 21890 10108 -9267 -4484 -8916 -14242 6245 11017 -10951 -2853 19430
251 19430 66 -17653 10015 24389 -80 -9073 -1090 -6890 -1256 14678 -2287 -21235 2195
264 2195 17233 -6220 -11096 8375 2862 -7956 4038 208 -16863 -1034 16615 -4231 -14827
277 -14827 7341 10212 -3740 6069 11641 -5449 -3185 10642 -4417 -12098 11516 10438 -18535
290 -18535 -13255 11484 7108 -1788 3847 -6579 -14702 7699 14459 -11760 -13768 7616 1449 -9193
304 -9193 6478 9871 -5121 1891 11931 -3876 -5836 13920 5671 -15384 -3652 9379 -4018
317 -4018 -5088 6462 -3234 -9117 8408 6807 -13074 -3593 12069 -4071 -13343 3355 4226 -6150
331 -6150 3483 7086 -7967 -960 16890 3497 -11056 4526 9349 -6569 -3324 6088 -5521
$$ packed form
238E588l0646J4919L2029j1782j9375M783m432n326K0487M772k1968Q098K2283
251A9430j9364j7719K7668J4374k4469q993P983n800N634J5934j6965j8948K3430
264B195J5038k3453m876J9471n513j0818J1994l830j7071J5829J7649k0846j0596
277a4827K2168K871j3952R809N572j7090K264J3827j5059p681K3614j078k8973
290a8535N280K4739m376q896N635j0426q123K2401O760k6219k008K1384o167j0642
304i193J5671L393j4992P012J0040j5807j960J9756q249k1055J1732J3031j3397
317d018j070J1550r696n883J7525j601j9881R481J5662j6140r272J6698Q71j0376
331f150R633L603j5053P007J7850j3393j4553J5582M823j5918L245R412j1609
$$ plain form
344 -5521 -7329 8444 1318 -12599 2324 11326 -6576 -8220 6881 -105 -9441 3268 4051 -9545
358 -9545 -208 11385 -3012 -6714 11830 8474 -7821 361 8353 -4224 -2536 8414 -3887
371 -3887 -12306 5567 8614 -8720 -4611 7574 -2757 -6867 6412 1599 -10611 895 6971
384 6971 -7955 -5118 11366 2591 -8220 4702 8612 -3766 1237 9076 -4300 -7292 7873
397 7873 2984 -10823 -335 7609 -5685 -5538 6835 -234 -7869 4271 4297 -9996 -3153 8714
411 8714 -2790 -7903 6005 4440 -6113 3329 9259 -3723 -2251 10243 776 -8560 3992 5953
425 5953 -7831 -3188 6808 -3598 -6875 5897 2165 -9102 1422 7406 -7058 -7033 6909 984
439 984 -7414 3351 4668 -6623 738 11058 -479 -5183 7172 3475 -7580 1984 8226 -5495
$$ packed form
344e521j808J5773p126j3917J4923R002j7902j644J5101o986r336J2709P83j3596
358i545R337J1593j4397l702J8544l356j6295Q182P992j2577J688J0950j2301
371c887q419J7873L047j7334M109J2185j0331m110J3279m813j2210J1506O076
384F971j4926K837J6484q775j0811J2922L910j2378N003P839j3376k992J5165
397G873m889j3807J0488P944j3294J47J2373p069p635J2140K6j4293O843J1867
411H714j1504n113J3908j565j0553R442N930j2982J472J2494r467r336J2552J961
425E953j3784M643R996j0406l277J2772l732j1267J0524N984j4464K5J3942n925
439I84q398J0765J317j1291P361J0320j1537m704J2355l697j1055R564O242j3721
$$ plain form
453 -5495 -6355 5298 -1046 -7581 4439 5599 -8073 -3792 6058 -2634 -5337 6135 1402 -9486
467 -9486 721 7865 -3094 -2278 9329 1360 -7441 4200 7915 -3238 -856 5247 -4788 -6488
481 -6488 6570 3171 -7952 147 4756 -7178 -4771 8527 1495 -8397 385 2546 -6639 -111
495 -111 9153 -896 -5652 4555 2339 -4163 5819 9292 -5154 -5313 6131 -274 -6763 5121
509 5121 6089 -8181 -6247 3545 -884 -1935 6128 -1231 -10842 -28 7438 -2654 -2136 5828 -3539
524 -3539 -8992 6478 11273 -1935 -2407 3530 -3345 -3228 8907 5339 -6321 -2597 -199 -7053 570
539 570 11984 70 -12030 -2014 3107 -4296 1576 8691 -3196 -9853 629 3237 -108 5887
553 5887 4335 -7681 -3252 9062 2785 -4435 4273 3071 -9213 -2790 9016 1548 -6101 -204
$$ packed form
453e495q60J1653o344o535J2020J160j3672M281R850q692k703J1472m733j0888
467i486J0207P144j0959Q16J1607p969q801J1641L715j1153K382O103j0035j700
481f488J3058l399j1123Q099M609j1934K407J3298p032r892Q782K161r185O528
495a11R264j0049m756J0207k216o502R982L473j4446j59J1444o405o489J1884
509E121R68j4270J934R792m429j051Q063p359r611J0814P466j0092N18P964r367
524c539n453J5470M795j3208m72N937o875J17J2135l568j1660L724K398o854P623
539E70J1414j1914j2100J0016N121p403N872P115j1887o657J0482K608l345N995
553E887j552j2016M429J2314o277p220Q708j202j2284O423J1806p468p649N897
$$ plain form
567 -204 -1453 -5636 3326 6145 -4761 -4086 2903 -4123 -5798 8429 8124 -7104 -4740 5064 -778
582 -778 -2549 8682 6529 -4445 -2790 31 -3975 2700 9693 -2559 -10690 268 2702 -5201
596 -5201 1994 8551 -4694 -10883 1730 5225 -1746 912 1019 -5856 -1140 7968 1658 -2952 4807
611 4807 1281 -8382 1728 12661 919 -8505 -1602 -856 -4230 4641 7936 -3901 -7632 -1638
625 -1638 -2840 -309 9175 3021 -10453 -4302 5680 -1004 -2026 8323 3946 -7605 -2091 5532
639 5532 1022 318 3936 -2028 -3811 5013 1759 -7523 -753 5922 -4119 -6123 5170 2630 -7069
654 -7069 -1207 4409 -2750 -2617 4305 528 -3253 2354 306 -5103 4037 10191 -1396 -5219 3504
669 3504 -137 -6507 3758 9724 -2524 -8064 -1247 -1024 -1050 5496 2481 -6048 -1913 1773 -5562
$$ packed form
567b04j249m183Q962K819j0906O75O989p026j675J4227l05j5228K364R804n842
582g78j771J1231k153j0974J655K821m006O675O993j2252q131J0958K434p903
596e201P195O557j3245o189J2613L495o971K658J07o875M716R108o310m610P759
611D807l526r663J0110J0933j1742r424O903P46l374Q871L295j1837l731N994
625a638j202K531R484o154j3474O151R982o684j022J0349m377j1551N514P623
639E532m510p04L618n964j783Q824l254r282O770O675j0041k004J1293k540r699
654g069N862N616p159J33O922l777l781N607k048n409R140O154j1587l823Q723
669C504l641o370J0265N966j2248n540O817K23k6O546l015q529M135L686p335
$$ plain form
684 -5562 -2047 9776 3267 -9309 -2533 5983 639 -15 4904 -402 -4701 3042 4844 -1900 -294
699 -294 1030 -5735 -1531 8711 1981 -8960 -2008 3075 -4586 -2307 7678 2720 -6958 -3518 209
714 209 -84 5221 5455 -4963 -4182 5404 1341 -4690 4351 7880 -3652 -5232 3446 420 -3936 2198
730 2198 2943 -3788 -1691 1265 -3802 -1585 5290 -895 -6744 2459 5588 -4486 -3391 5448 901
745 901 -4386 3154 5899 -1594 -1811 1053 -1968 944 6670 -424 -6971 1087 3009 -5626 -2349 7676
761 7676 1731 -7049 -2407 745 -2087 2020 4794 -2459 -3757 2235 499 -2034 4872 4260 -5096
776 -5096 -2047 6789 755 -4838 2201 3465 -3581 -1433 3601 -1001 -3338 425 -1706 -2732 4683
791 4683 3099 -7078 -3869 5118 785 -3982 3171 3840 -3648 -1262 3641 -674 -784 4800 1054
$$ packed form
684e562L515J1823o509j2576O776Q516n344o54M919n306m299P743J802o744J606
699b94J324o765M204J0242o730j0941O952N083p661K279R985m958r678L440L727
714B09k93N305K34j0418P81R586m063o031R041L529j1532j580Q678l026m356O134
730B198P45o731K097K956n067K217O875o185n849R203L129j0074J095Q839m547
745I01n287P540K745p493k17K864l021K912N726p094o547Q058J922q635L277J0025
761G676n945q780M642L152k832M107K774p253j298N992j736k533O906o12r356
776e096L049Q836o034n593P039J264p046K148N034m602k337L763k131j026P415
791D683j584j0177L209Q987m333m767P153O69p488K386M903m315j10N584l746
$$ plain form
806 1054 -3962 1520 2363 -4061 -625 5345 -1530 -5469 2063 1870 -5362 -905 4718 -1271 -3734 1752
822 1752 326 -2937 2127 2458 -3109 614 5863 -1385 -4593 3923 4238 -3290 -774 3996 -1162 -2507
838 -2507 2266 -343 -3970 1796 2852 -3832 -2476 2292 -1862 -2929 3867 2034 -5078 -637 4204
853 4204 -1186 -2241 4201 1983 -3258 903 3007 -1497 356 3623 -2216 -3367 4107 1904 -5677
868 -5677 -1471 3812 -1724 -2988 2245 68 -4181 927 2459 -2874 -598 4032 -957 -3255 3012
883 3012 2388 -2803 1526 4495 -2462 -2698 4025 1390 -3627 788 2524 -3013 -1617 2552 -1495 -3046
899 -3046 2387 553 -4626 465 3985 -2709 -3252 3244 1488 -2528 1982 2716 -2753 -363 4353 -250
915 -250 -2569 3055 1543 -3456 254 3287 -2329 -2572 2997 -452 -4411 900 2663 -3217 -1829 2950
$$ packed form
806A054n016N482Q43o424L436N970o875l939P532j93p232M457N623n989k463N486
822A752j426l263N064L31n567L723N249p248l208Q516L15p528K516M770n158j345
838b507M773k609l627N766J056o684J356M768m154j067O796j833p112M441M841
853D204n390j055O442k218n241M161K104m504J853L267n839j151P474k203p581
868e677M206N283n536j264N233k177m249N108J532n333K276M630m989k298O267
883C012o24n191M329K969o957k36O723k635n017M415J736n537J396M169m047j551
899c046N433j834n179N091L520o694n43O496j756m016M510P34n469K390M716m603
915b50k319N624j512m999L710L033n616k43N569l449l959N311J763n880J388M779
$$ plain form
931 2950 -953 -2768 2654 1440 -3326 1042 3977 -1987 -1749 4513 1306 -3546 1412 3049 -2242
946 -2242 -631 3366 -1778 -3613 2385 1484 -3881 -586 2586 -2744 -2239 3105 -36 -3762 1532 2559
962 2559 -2718 -565 4157 -493 -2566 2949 2190 -2664 842 3176 -2115 -1972 3409 133 -3628 1021
978 1021 2281 -3259 -1397 3094 -1329 -3156 2328 925 -3581 526 3580 -1720 -1840 3271 687
993 687 -2520 2357 2889 -2588 -421 3594 -516 -2553 2586 1408 -3536 -141 2537 -2382 -2021 2403
1009 2403 -532 -3983 1312 2275 -3175 -941 3265 -801 -2507 3005 1964 -2573 904 3414 -1799
1024 -1799 -1423 3745 587 -3031 1516 2138 -2996 -774 3186 -1600 -3371 1977 793 -3553 312
1039 312 2791 -2558 -2023 3084 215 -2602 2055 2505 -2544 -41 3882 -518 -1975 2790 1470 -2943
$$ packed form
931B950l903j815N422j214m766M368K935n964K38O262l207m852M958J637n291
946b242J611L997n144j835N998r01n365L295L172n330N05N344l141l726N294J027
962B559n277K153M722m650k073N515p59m854L506K334n291J43N381l276l761M649
978A021J260n540J862M491m423j827N484j403m506M107L054n300j20N111k584
993F87l207M877N32n477K167M015m110k037N139j178m944L395K678m919L61M424
1009B403k935l451N295R63n450K234M206m066j706N512j041m537L477K510n213
1024a799L76N168l158l618M547O22n134K222L960m786j771N348j184m346L865
1039C12K479n349N35N107k869k817M657M50n049K503L923m400j457M765j320m413
$$ plain form
1055 -2943 585 2757 -2057 -1944 2561 -562 -3755 1141 1874 -3084 -987 2587 -1528 -2788 2599
1070 2599 1417 -2989 514 3166 -1549 -1114 3533 724 -2569 1771 2302 -2403 102 3202 -1433
1085 -1433 -3151 2151 1095 -3392 95 2427 -2604 -2277 2304 -126 -2527 1482 1434 -2958 -268 3544
1101 3544 -771 -2076 3083 1422 -2963 867 3282 -1290 -1389 2544 -37 -2858 1582 1368 -3026 -917
1117 -917 2280 -1889 -2660 2387 665 -3793 132 2916 -1784 -1700 2784 394 -2278 1723 2025 -1660
1133 -1660 774 3369 -1412 -2227 2770 1395 -2880 665 2394 -2933 -2420 2399 272 -2469 896
1148 896 804 -2920 -582 2370 -975 -1651 2790 510 -3229 1250 3662 -1648 -1319 3019 465 -2195
1164 -2195 1517 2072 -2421 -556 2125 -1283 -1613 1934 -630 -3975 770 2980 -2303 -1997 2725 -99
$$ packed form
1055b943L528K172m814J13M505l123l193M896P33m958K097L574m115j260N387
1070B599j182m406L503K652m715M35M647k809l293M340N31m705K505L100m635
1085a433j718N302j056m487L487K332n031L27M581k430k401M009m8m392K690L812
1101C544m315j305N159j661m385L830K415m572r9L933k581k821M440k14m394K109
1117i17L197m169p71N047j722m458L925K784m700Q4M484k390k672M001L02l685
1133a660K434K595m781q15M997j375m275L545J729n327N13M819k127k741L365
1148H96r2l724K338K952l345o76M441k280l739M479K412n310L29M338k554k660
1164b195L712N55m493J865K681l408l30L547k564l345M745K210n283L06M722k824
$$ plain form
1180 -99 -3340 1106 2355 -1057 272 2269 -1323 -1529 3049 1101 -1955 1702 2163 -3008 -1577 3367
1196 3367 -150 -3284 1121 1906 -2596 -1579 1260 -1096 -1068 2035 -165 -2945 1392 2338 -2467 -977
1212 -977 3740 482 -2680 1967 2348 -2368 -885 2698 45 -1071 1334 -469 -2801 1131 1797 -2595
1228 -2595 -898 3019 -1381 -4404 1273 2719 -1486 -403 2478 -1166 -2188 1849 1358 -1286 1772
1243 1772 1519 -2523 -55 3526 -892 -3150 2642 2461 -3022 -1880 1787 -741 -1940 1564 436
1258 436 -1995 685 868 -3018 -421 3434 -256 -2126 2536 1648 -3634 -423 4102 647 -1795 1489
1274 1489 618 -2037 521 1104 -1674 498 2529 -1877 -3614 1508 1592 -2936 -289 3183 -1494 -3132
1290 -3132 1162 1455 -1197 1119 1739 -1043 133 2075 -1206 -1668 3387 2062 -3048 -556 2764 -1444
$$ packed form
1180i9l241M446J249l412J329J997l592k06M578j948l056L657M61n171J431M944
1196C367l517l134M405P85m502J017K839k356K8L103k200k780M337R46m805J490
1212i77M717l258l162M647L81m716J483L583k653j116K405j803k332L932O66m392
1228b595J697L917m400l023N677J446m205J083K881l644j022M037m91k644L058
1243A772k53m042K468L581m418k258N792j81n483J142L667k528j199L504j128
1258D36k431K680J83l886K597L855l690j870M662q88n282L211M525l455k442L284
1274A489q71k655K558N83k778K172K031m406j737N122Q4m528K647L472m677j638
1290c132M294K93k652K316O20k782J176J942l281m62N055j325n110K492L320m208
$$ plain form
1306 -1444 -2712 1954 1549 -2028 -335 413 -2396 -1020 2015 -550 -1108 2359 84 -3926 388 3848
1322 3848 -698 -1832 2594 1470 -2518 60 2172 -404 156 1998 -1205 -2168 1408 214 -2994
1337 -2994 618 3002 -2190 -2928 2173 634 -2936 391 2501 -780 -1188 1073 -736 -934 2731 1502
1353 1502 -1949 943 2413 -2349 -2244 3120 1308 -2557 229 1926 -2095 -1897 1206 -26 -1020 1307
1369 1307 -183 -2872 590 2131 -1663 -1110 3415 741 -3217 483 2617 -873 -710 2262 325
1384 325 -1530 834 344 -1737 1031 2093 -2047 -1740 2126 -641 -3478 774 2855 -1705 -1520 1572
1400 1572 -182 -1650 1318 1278 -1048 990 1672 -2013 -822 3009 542 -2347 1348 2115 -2212 -1886
1416 -1886 1838 187 -1595 880 444 -2067 -416 906 -1746 -631 2549 -103 -2786 1058 2108
$$ packed form
1306a444j268M666m05l577J693P48k809J376L035k565n58L467k275m010M314L460
1322C848m546j134M426j124l988K578K112k576N60J842l203r63L576j194l208
1337b994L612K384n192p38N101j539l570L327K110l281m08K261j809j98L665j229
1353A502l451K892J470m762J05N364j812l865K786J697m021J98L103j232r94K327
1369A307j490k689L462J541l794N53M525k674l958L700K134l490J63K972j937
1384C25j855K364m90k081K768J062m140L07L866k767k837M252K081m560J85L092
1400A572j754j468K968m0k326K038O82l685J191L831k467k889L695P67m327L26
1416a886L724j651j782K475m36k511J651J322k652J115L180k652k683L844J050
$$ plain form
1431 2108 -1857 -666 2979 404 -1877 909 1061 -1286 560 1732 -1016 -852 1717 -865 -2767
1446 -2767 1099 1709 -2101 -1162 2140 -694 -2467 1113 1158 -1065 250 1647 -1044 -617 1962 127
1462 127 -1324 1748 1984 -2169 -521 2379 -442 -2036 1357 1081 -1908 -564 997 -1266 -1077 1617
1478 1617 -456 -2248 1086 1254 -2228 -178 2632 -125 -1666 1649 1253 -1631 283 2180 -723
1493 -723 -830 1708 -210 -1940 969 1225 -1880 -526 1732 -999 -2324 1288 801 -2124 12 1708
1509 1708 -1088 -1115 1609 134 -1258 1423 1326 -1493 -40 2402 -585 -1434 1722 1232 -1797 -118
1525 -118 1476 -1287 -1326 1597 -114 -2098 603 867 -1862 -373 1810 -860 -1535 1795 671 -1927
1541 -1927 500 2082 -702 -938 1878 483 -1221 961 1231 -1550 -293 1801 -1051 -1822 1303 404
$$ packed form
1431B108l965J191L645k575k281K786J52k347J846J172k748J64K569k582j902
1446b767L866O10l810R39L302k834j773L580M5k223J315J397k691M27K579j835
1462A27j451L072K36m153J648K900k821j594L393k76k989J344J561k263J89K694
1478A617k073j792L334J68l482K050K810k757j541L315l96k884J914J897k903
1493g23j07K538j918j730K909K56l105J354K258k731j325L612m87k925K136J696
1509A708k796k7K724j475j392K681r7k819J453K442k987q49L156m90l029J679
1525a18J594k763l9K923j711j984K701K64k729J489K183k670o75L330j124k598
1541a927K427J582k784k36K816j395j704K182K70k781J257K094k852p71L125q99
$$ plain form
1557 404 -2247 -73 1490 -1386 -1069 1486 -161 -1503 1002 1299 -1518 -79 2063 -396 -1067 1564
1573 1564 758 -1820 587 1820 -1056 -1303 1561 134 -1951 581 775 -1923 -629 1448 -908 -1564
1589 -1564 1298 393 -1839 443 1771 -842 -902 1928 382 -1502 1139 1413 -1418 -158 1792 -558
1605 -558 -1406 1248 655 -1841 102 1268 -1386 -972 1596 -135 -1956 504 1052 -1371 -341 1554
1621 1554 -429 -1213 1686 779 -1505 620 2006 -1025 -763 1950 104 -1382 1074 1002 -1560 -305
1637 -305 1551 -955 -1707 827 451 -1766 37 1310 -1355 -882 1629 16 -1611 1104 1200 -1203
1653 -1203 64 1911 -404 -1061 1483 707 -1437 462 1338 -1247 -952 1272 -260 -1892 544 851
1669 851 -1609 -468 1240 -808 -1182 1206 471 -1495 432 1639 -994 -583 1888 3 -1202 1119
$$ packed form
1557D04k651K174J563k876L17K555j647j342K505K97k817J439K142k459o71K631
1573A564q06k578K407J233k876k47K864j427k085K532J94k698J294K077k356o56
1589a564K862r05k232K282J328k613o0K830j546j884K641K74k831J260J950k350
1605e58q48K654n93k496J943J166k654M14K568j731j821K460N48k423J030J895
1621A554j983p84K899r07k284K125J386l031K62K713j846j486K456p2k562J255
1637c05J856k506p52K534l76k217J803J273k665M73K511j613j627K715R6k403
1653a203J267J847k315o57K544p76k144J899Q76k585K95K224j532j632K436L07
1669H51k460J141J708k048l74K388p35j966J927J207k633M11K471j885j205K321
$$ plain form
1685 1119 1153 -1276 -270 1611 -568 -1347 1096 252 -1634 -16 974 -1326 -830 1306 -150 -1542
1701 -1542 776 1029 -1297 -105 1463 -432 -1039 1502 663 -1222 452 1281 -979 -323 1388 -51
1717 -51 -1645 634 760 -1853 -485 1108 -631 -1359 917 160 -1746 150 1193 -980 -544 1455
1733 1455 -27 -974 1003 1165 -1498 141 1687 -407 -980 957 398 -1504 138 942 -1224 -780
1749 -780 1003 -476 -1296 961 690 -1546 -269 1616 -839 -1323 1333 819 -1257 336 1366 -584
1765 -584 -363 1588 -46 -1023 1004 715 -1422 -249 1320 -797 -1213 1097 235 -1901 -129 978
1781 978 -1002 -817 1153 -259 -880 836 455 -1224 526 1909 -704 -1003 1563 696 -1236 462
1797 462 1404 -858 -765 898 -421 -1254 553 492 -1212 59 1092 -1349 -1324 1518 426 -1642 359
$$ packed form
1685A119L4k429J006J881k179p79K443q44j886J618R90k300M96K136j456j392
1701a542K318K53k326J192J568j895o07K541q39j885J674Q29k260O56J711j439
1717e1j594K279J26k613J368J593j739p28K276p57j906J896J043k173M36J999
1733A455j482r47J977J62k663J639J546k094n73J937n59j902J642Q04k166M44
1749g80J783j479q20K257k71k236J277J885k455m84K656n14k076J593J030j950
1765e84K21J951j634r77K027k89k137J173J569k117m16K310q62k136J772J107
1781I78j980J85J970j412o21J716l81j679J750J383k613k99K566q67j932J698
1797D62R42k262R3J663j319q33J807o1j704J271J033k441K5K842j092k068K001
$$ plain form
1814 359 1517 -767 -845 1111 354 -405 1091 531 -1032 134 975 -1056 -657 1549 99 -1852 148
1831 148 1075 -1177 -964 1166 104 -1312 196 218 -914 295 1241 -660 -451 1584 22 -1479 879
1848 879 1563 -721 -554 1243 -113 -1204 340 750 -644 56 626 -1283 -828 1230 -209 -1440 760
1865 760 1383 -1415 -845 1330 140 -1057 1002 1021 -713 -179 814 -570 -159 1343 -223 -1252 733
1882 733 777 -1570 -823 1895 7 -1764 142 307 -1257 -381 887 -308 -229 926 -585 -1158 1143
1899 1143 1147 -948 -1 1871 -195 -1460 679 1051 -439 129 764 -381 -826 504 -357 -685 933
1916 933 629 -1625 -487 1291 -624 -1257 1371 1118 -1010 -548 839 -169 -307 1104 298 -474 906
1933 906 459 -1471 23 1703 -345 -1529 589 614 -1826 -757 1123 -162 -636 395 -18 -1093
$$ packed form
1814C59J158k284p8J956p57p59J496n60j563J166Q41k031L99K206j450j951K000
1831A48R27k252K13K130j062j416J508K2j132J209R46j901K09K035j562j501K358
1848H79O84k284J67J797j356j091J544M10j394P00N70j909M55K058j439j231K200
1865G60O23k798N70K175j190j197K059J9j734N34R93j384M11J502j566j029J985
1882G33M4k347P47K718j888j771J906J65j564Q76J268j195P9J155j511n73K301
1899A143Mk095R47J872k066j265K139L72j490N68O35j145m45J330q61l28J618
1916I33l04k254J138J778j915o33K628k53k128M62J387j008j38J411q06p72J380
1933I06m47j930J494J680k048j184K118K5k440J069J880j285m74J031m13j075
$$ plain form
1949 -1093 418 527 -881 415 1703 -548 -1302 1202 856 -836 192 1512 -118 -993 232 131
1965 131 -555 645 411 -882 -239 679 -1175 -1196 1262 893 -1232 -334 1183 -436 -956 996 1045 -459
1983 -459 324 406 -806 37 1167 -376 -456 1334 237 -1804 -209 1249 -509 -1058 759 316 -1095
2000 -1095 -109 229 -586 273 1069 -520 -578 1097 295 -1015 704 1669 -465 -739 1069 304 -773 263
2018 263 867 -498 -315 486 -756 -607 882 100 -1398 317 856 -1110 -1162 1147 594 -839 341
2035 341 700 -598 -164 886 -63 -308 998 64 -1277 330 1118 -847 -679 1101 102 -1434 -13
2052 -13 477 -797 -560 691 -211 -601 460 69 -906 509 1054 -749 -447 1232 241 -1035 470 1167
2070 1167 -521 -394 716 -481 -798 662 4 -786 302 563 -1229 -723 1074 -95 -1183 400
$$ packed form
1949a093J511J09j408J296J288k251p54K504l46j692J028J320j630q75J225j01
1965A31o86J200k34j293O43R18j854k1K458l69k125Q98J517j619n20J952M9j504
1983d59P83Q2j212Q43J130j543q0J790j097k041J595J458j758n49J817m43j411
2000a095R86L38q15Q59P96j589n8J675q02j310J719R65k134k74J808p65j077J036
2018B63O04j365J83Q01j242J49J489p82j498J715N39j966n2K309n53j433J180
2035C41L59j298M34J050r49k45J306r34j341J607P88j965J68J780r99j536J421
2052a3M90j274K37J251r02l90J061l91r75J415N45j803L02J679r91j276J505O97
2070A167j688J27J110j197l17J460o58p90J088K61j792N06J797j169j088J583
$$ plain form
2086 400 870 -923 -457 806 55 -305 722 570 -684 278 706 -772 -182 1240 63 -1094 389
2103 389 941 -885 -349 896 -345 -997 349 55 -744 28 554 -689 -299 988 -223 -958 672
2120 672 924 -590 47 1075 -60 -817 612 317 -664 220 691 -740 -544 637 -349 -953 511 216
2138 216 -1108 -518 977 -387 -712 711 335 -624 245 711 -727 -42 1027 -62 -687 634 543 -992
2156 -992 -51 985 -521 -896 693 418 -941 87 479 -720 -393 646 -159 -597 657 679 -890
2173 -890 -45 1107 -159 -625 869 503 -790 36 512 -469 -485 552 -228 -1025 335 174 -1016 -253
2191 -253 728 -514 -894 669 234 -711 194 729 -582 -339 962 -46 -748 668 569 -915 130 829
2209 829 -403 -699 557 331 -1036 108 645 -723 -612 660 -389 -942 291 477 -952 -192 984
$$ packed form
2086D00M70j793M66J263p51l60J027j52j254R62M28j478N90J422j177j157J483
2103C89N52j826N36J245j241o52J346k94p99P72N26j243L90J287j211p35J630
2120F72K52j514O37J028j135p57J429k95r81Q84M71j431J96J181r86o04J464k95
2138B16j324N90J495j364l25J423l76r59Q69M66j438O85J069j089o25J321r1j535
2156i92R41J036j506l75J589k75j359J028L92j199L27J039q05m38J254K2j569
2173h90Q45J152j266m66J494l66j293Q26M76r81j6J037p80p97J360j61j190P63
2191b53R81j242l80J563m35r45R05N35j311K43J301j008p02J416r9j484J045O99
2209H29j232k96J256k26j367J144N37j368J11J272j049n53J233J86j429P60J176
$$ plain form
2226 984 -286 -645 754 489 -777 367 827 -503 -313 933 -41 -762 581 479 -789 -318 693
2243 693 -571 -679 608 156 -892 7 637 -714 -427 578 -18 -792 607 695 -808 159 994 -335
2261 -335 -385 999 357 -767 255 665 -714 -318 786 -199 -898 416 314 -870 -59 649 -413 -709
2279 -709 796 98 -712 408 841 -503 -176 810 -30 -768 712 487 -705 -12 869 -491 -595 468
2297 468 60 -1065 197 603 -631 -427 644 -161 -830 318 501 -678 14 812 -340 -341 747 325
2315 325 -635 471 709 -557 -459 735 -271 -840 542 279 -921 -264 579 -519 -574 575 -96 -935
2333 -935 318 618 -547 -118 923 -12 -545 647 654 -700 -139 734 -324 -500 532 -37 -697 103
2351 103 436 -626 -136 721 -242 -732 409 427 -716 69 693 -246 -454 809 291 -455 396 763 -473
$$ packed form
2226I84j270l59J399k65j266J144M60j330J90J246r74p21J343j02j268M71J011
2243F93j264j08J287m52j048Q99O30j351K87J005n96p74J399Q8j503R67Q35j329
2261c35n0J384o42j124J022M10j379L96J104r85o99J314j02j184Q11P08j062k96
2279g09J505o98q10J120M33j344L27R86q40p38J480k25j192O93Q81j360j04J063
2297D68m08j125J262M06j234K04J071q05o69J148J83j179O92P98j152jJ088m22
2315C25r60J106K38j266R8J194j006n69J382k63j200O57Q43j098n5J149o71q39
2333i35J253L00j165M29J041r35n33J192Pj354N61Q73j058j76J032n69o60Q00
2351A03L33j062M90Q57r63m90J141J8j143P85O24r39k08J263n18p46Q51L67j236
$$ plain form
2370 -473 57 752 -103 -586 508 478 -813 -164 615 -441 -756 340 44 -757 120 441 -711 -5 801
2389 801 -379 -736 716 532 -734 91 1022 -45 -401 718 234 -557 263 528 -515 -177 729 -447
2407 -447 -750 457 85 -1120 -158 774 -304 -730 430 -47 -615 201 683 -464 -24 698 -273 -425
2425 -425 789 513 -734 85 875 -344 -783 566 57 -758 43 388 -716 -208 472 -469 -503 526
2443 526 230 -1066 68 857 -420 -469 806 149 -720 140 510 -314 42 632 -349 -666 510 50 -911
2462 -911 143 668 -480 -591 655 -39 -989 39 653 -298 -180 509 -232 -365 682 196 -490 610
2480 610 863 -682 -382 976 304 -848 247 355 -716 -502 497 -335 -462 523 69 -780 14 441
2498 441 -582 -358 985 146 -883 381 620 -436 -317 625 196 -298 330 31 -507 329 610 -673
$$ packed form
2370d73N30O95q55m83J094l0j291O49P79j056l15J096k96q01Q77L21j152P06Q06
2389H01j180l57J452j84j266Q25R31j067l56J119m84p91Q20K65j043L38R06j176
2407d47l03J207l72j205R62R32j078m26J160m77n68Q16M82j147M40P22r71j52
2425d25J214k76j247Q19P90j219m39J349n09q15Q01L45j104N08O80r41l4J029
2443E26k96j296J134P89j277m9J275o57q69Q60L70q24L56N90r81l17J176m60r61
2462i11J054N25j148j11J246o94r50J028O14r51J18O89p41j33J047m86o86J100
2480F10K53j545L00J358o72j152J095J08j071K14R99q32j27R85m54q49P94M27
2498D41j023K24J343q39j029J264K39j056J19R42m29m94O28k99n38Q36K81j283
$$ plain form
2516 -673 -288 817 -83 -1093 247 712 -511 -278 639 -119 -706 189 199 -431 330 577 -693 -187 662
2535 662 -159 -609 635 910 -824 -416 722 -166 -561 530 223 -525 -94 171 -760 -290 834 -144
2553 -144 -849 311 317 -798 -257 1035 187 -410 268 344 -556 149 557 -198 -49 509 -444 -796 516 511
2573 511 -663 -261 871 -306 -879 206 419 -418 79 481 -437 -222 510 -206 -313 911 517 -816
2591 -816 -132 878 -294 -647 763 596 -606 -78 125 -512 -197 519 -231 -626 442 120 -977 0
2609 0 895 -212 -525 758 396 -789 -235 500 87 27 533 -155 -446 626 178 -865 205 753 -365
2628 -365 -847 376 300 -758 172 546 -260 -457 218 -96 -232 579 293 -513 187 623 -481 -449 915
2647 915 599 -647 131 580 -497 -601 300 -39 -517 292 8 -611 -24 531 -459 -454 649 295 -905
$$ packed form
2516f73L85J105r00j010J340M65j223K33R17p58n87Q95J0o30P61K47j270N06Q49
2535F62q21m50J244K75j734M08J138q88l95J091l07p48M31K65r31M70J124r78
2553a44p05J160Oj115N41J292q48n97O78P6r00P05M08p55J49N58r53l52J312n
2573E11j174M02J132j177n73J085K13q37M97M02r18K15P32p16j07J224l94j333
2591h16O84J010j172l53J410j67j202N28K03o37L15P16p50l95J068l22j097R77
2609@Q95j107l13J283l62j185N54P35m13o0N06o88k91J072m48j043J070N48j118
2628c65m82J223p6j058R30L74q06j97O75l14j36Q11k86q06P00M36j104L2J364
2647I15l16j246P78M49j077j04R01l39m78Q09k84o19N87N55r90NJ103l54j200
$$ plain form
2666 -905 -37 618 -263 -52 645 25 -325 167 357 -248 287 615 -465 -385 587 -85 -804 163 603 -472
2686 -472 -524 461 -138 -508 225 135 -446 195 623 -502 -396 649 333 -694 295 584 -380 -367 495 140
2706 140 -559 177 54 -593 37 265 -511 -222 432 -121 -786 225 499 -535 -352 760 150 -652 155
2725 155 327 -258 210 670 -250 -259 559 3 -526 276 596 -441 -364 597 -199 -685 298 261 -505 -96 509
2746 509 -301 -369 513 80 -537 404 589 -305 -94 616 -174 -502 470 436 -492 42 595 -345 -413 313 -175
2767 -175 -726 292 385 -588 -81 538 -101 -658 479 359 -505 100 530 -92 -382 591 122 -326 351 381
2787 381 -577 -87 525 -362 -667 490 310 -565 -131 396 -214 -335 355 -95 -414 381 421 -580 -194 758
2807 758 -120 -505 379 415 -519 -29 647 -411 -484 418 -124 -556 30 199 -664 -67 595 -370 -635 383
$$ packed form
2666i05Q68O55q81K11O97o20l50M92J90o05N35L28j080Q0R72o72p19R67M40j075
2686d72n2R85n99l70P33r0n81O41M28j125J06J045l16j027R89K89r64J3Q62l55
2706A40o99P36j23o47O30K28p76K89O54n53o65J011K74j034J83J112o10q02Q07
2725A55J72n85M68M60r20rQ18n56n29Q02L20j037P7R61p96m86R83l7p66M09O05
2746E09q10o8Q82m33o17R41J85q94K11P10p90l28R72l4r28N34N53r40o8P26m88
2767a75n51J018R3r73N07O19o39n57J137j20q64O05M30o22k90R73m69m48O77L0
2787C81r58M90O12q87l05J157j80q75M34N27o10j21O90m50l19P95M0j001L86R52
2807G58q78l85Q84L6r34M90O76j058p3R02n42m32N86J69q63N97O62r65k65J018
$$ plain form
2827 383 247 -509 101 519 -282 -293 522 63 -362 334 564 -451 -234 580 -137 -491 413 327 -678 -71
2847 -71 437 -511 -475 336 -255 -838 170 139 -472 -223 545 -126 -241 605 404 -410 135 574 -293 -317 690
2868 690 156 -558 134 335 -446 -45 524 -117 -653 228 182 -530 34 335 -331 -359 427 32 -395 356 447
2889 447 -432 -149 594 7 -380 451 215 -522 71 459 -434 -374 415 -33 -693 99 252 -590 -327 574
2909 574 -271 -555 305 230 -618 161 531 -409 -258 843 81 -503 378 335 -372 75 476 -274 -455 337
2929 337 256 -539 -26 605 -395 -421 440 -18 -585 229 361 -589 -65 498 -189 -307 465 291 -392 216
2949 216 528 -333 -252 582 55 -642 164 428 -501 -261 466 -248 -540 251 133 -689 19 145 -471 -315
2969 -315 477 129 -475 380 515 -271 -48 434 -55 -402 424 214 -494 119 559 -450 -111 294 -152 -439
$$ packed form
2827C83j36p56O10M18q01j1Q15m59m25O96K30j015K17Q14p17l54R04q6j005O07
2847g1N08r48L6Q11n91n83J008l1o11K49P68o71j15Q46k01q14N45M39q67k4J007
2868F90n34p14O92K01p81M01N69o41n36Q81m6p12N64L01o66k8P86l95m27P51R1
2889D47q79K83P43n87l87Q31k36p37N93L88q93O0P89m48o60P92J53q42K63R01
2909E74q45k84Q60p5q48P79L70r40J51J101p62n84Q81m3p07M47M01p50j81P92
2929C37q1p95N13O31j000k6Q61m58n67Q14J32r50N24N63o87j18P72j74o83O08
2949B16L12q61Q1Q34n27o97Q06K64r29K40P27p14k92P91j18q22P08J26o16J56
2969c15P92l48o04Q55J35p86K23M82m89l47Q26k10p08O13M40j009L39M05m46k87
$$ plain form
2989 -439 360 260 -374 -20 696 -158 -399 337 434 -447 80 443 -287 -148 607 80 -549 310 178 -474
3009 -474 -112 641 -387 -492 362 109 -614 53 387 -306 -346 291 -213 -458 326 246 -532 41 678 -31
3029 -31 -388 435 365 -311 166 509 -251 -139 485 -224 -414 385 246 -651 162 416 -362 -586 503 366
3049 366 -611 6 431 -367 -258 567 28 -477 492 301 -554 30 532 -166 -280 615 14 -701 54 295
3069 295 -400 -244 174 -252 -555 334 188 -454 141 629 -366 -516 506 358 -675 88 840 -28 -323
3088 -323 395 -116 -236 67 195 -260 140 303 -472 -426 512 178 -691 73 347 -356 -494 361 222 -266
3108 -266 372 103 -393 242 192 -179 -175 692 45 -648 105 308 -355 -181 428 39 -587 46 -13 -379 123
3129 123 250 -438 -326 452 -99 -534 175 746 -341 -311 384 49 -495 329 492 -188 155 124 -285 -330 310
$$ packed form
2989d39P99j00o34L54P16q54k41P36R7q81N27L63p30J39P55n27o29Q59j32o52
3009d74L62P53j028j05Q54k53p23O67L34o93m0O37n04k45P84q0p78N73O37p09
3029c1l57Q23p0o76M77L43p60J12O24p09j90P99j39q97Q13K54p78k24J089j37
3049C66r77O17M25p98J09Q25n39n05R69j91q55N84N02o98j14Q95o01p15P55K41
3069B95o95J56M18m26l03Q89j46o42N95M88r95j50J022j48j033P63P52q68k95
3088c23P18n11j20L03J28m55M00J63p75M6R38l34q69P64K74p03j38Q55j39m88
3108b66O38k69m96O35n0l71MQ67o47o93P53K03o63J74O09l89o26O33n9l66N02
3129A23J27o88J12P78n51m35P09N71j087L0O95l35n44Q24J63o80L43l1m09m5O40
$$ plain form
3150 310 -90 -567 83 242 -637 -423 472 -15 -507 143 245 -308 3 246 -254 -146 590 -2 -525 249
3170 249 425 -499 -312 763 -100 -401 -107 220 -473 14 214 -181 -157 317 -317 -344 360 351 -206 -75 810
3191 810 -115 -565 430 415 -273 67 501 -81 -268 327 170 -185 294 103 -634 -344 587 -237 -542 452
3211 452 335 -454 -258 245 -115 -420 443 222 -331 465 67 -454 67 567 -212 -595 251 248 -354 -211 502
3232 502 -128 -313 189 97 -345 146 238 -394 83 412 -288 -480 471 358 -466 -14 761 -91 -381 175 42
3253 42 -371 308 237 -345 -47 239 -448 -434 232 265 -594 -187 403 -388 -377 333 254 -333 63 273 -313 14
3275 14 626 0 -42 469 256 -473 169 566 6 -425 301 51 -593 182 312 -328 -4 286 -456 -423 306
3296 306 117 -298 226 376 -219 -283 342 284 -352 19 452 -39 -80 92 -450 -90 398 213 -426 119 323
$$ packed form
3150C10m00m77O50J59q79K14Q95m87m92O50J02n53L11K43n00J08P36n92n23P74
3170B49J76r24J87J075q63l01K94L27o93M87K00l95K4M74o34k7P04rn57J31Q85
3191H10r25m50R95j5o88L40M34n82j87N95j57l55M79j91p37K90R31q24l05R94
3211D52j17p89J96N03l60l05Q63k21n53P96l98n21N21N00p79l83Q46lo02J43P13
3232E02o30j85N02r2m42M91R2o32M77L29p00j92R51j13q24M52P75q52k90N56j33
3253D2m13O79p1n82K98K86o87J4O66L3q59M07N90p91J1P10p9n87L96K10n86L27
3275A4O12o26m2N11k13p29O42L97n60m31P26k50o44P75J30o40L24K90p42L3P29
3296C06j89m15N24J50n95o4O25n8o36L71M33m91m1J72n42L60M88j85o39N45K04
$$ plain form
3317 323 -172 -265 296 121 -404 163 280 -373 -76 367 82 -88 456 85 -557 341 471 -255 -163 534 126
3338 126 -456 119 306 -270 -138 323 -294 -276 246 15 -556 185 406 -285 -360 487 16 -390 258 297 -322
3359 -322 50 327 -103 -254 215 13 -394 174 120 -593 -94 361 101 -487 205 301 -491 -207 233 -229 -121
3380 -121 243 208 -442 127 266 -219 -68 449 153 -547 403 219 -302 -73 449 -92 -391 246 -97 -306
3400 -306 120 283 -297 -301 355 -15 -620 89 348 -246 -85 479 -222 -139 218 230 -280 102 260 -246 -136
3421 -136 458 -46 -486 129 208 -279 -56 370 -284 -231 244 -48 -488 211 468 -297 -70 568 70 -247 188
3442 188 328 -290 117 643 -91 -393 349 182 -453 28 150 -317 -177 260 -159 -423 253 -12 -394 -27
3462 -27 460 -214 -367 282 94 -407 102 406 -222 -96 322 -96 -316 105 42 -419 -172 307 -199 -396 249
$$ packed form
3317C23m95r3N61j75n25N67J17o53K97M43k85j70N44l71o42Q98J30p26R2O97m08
3338A26n82N75J87n76J32M61o17J8N22k31n71P41K21o91p5Q47m71m06O48L9o19
3359c22L72K77m30j51M69k02m07N68n4p13M99M55k60n88O92R6p92K84M40m62J08
3380a21L64l5o50N69J39m85J51N17k96p00R50j84n21K29N22n41k99O37l43k09
3400c06M26J63n80mO56l70o05P09K59n94J61N64p01Q3L57J2n10L82J58n06J10
3421a36N94n04m40O15P9m87K23M26o54N3M75k92m40O99K57p65K27O38m98l17M35
3442A88J40o18M07N26p34l02P42j67o35M81J22m67J40M37m19k64O76k65l82L67
3462b7M87o74j53O49j88n01N09L04o28J26M18m18k20M21o3m61K47M79n06j97O45
$$ plain form
3483 249 16 -522 153 353 -305 -179 460 88 -190 358 351 -461 68 592 -21 -247 424 73 -471 71 297
3504 297 -345 -271 246 1 -530 219 50 -277 152 543 -435 -250 394 143 -289 6 321 -220 -161 534 24
3525 24 -190 226 240 -359 63 351 -254 -228 306 -3 -407 20 150 -292 -152 400 -216 -514 128 143 -217
3546 -217 177 248 229 -126 477 211 -9 131 415 -379 -64 421 173 -339 286 191 -411 -18 270 -253 -275
3567 -275 326 -72 -377 38 326 -384 -99 597 -33 -306 277 153 -172 176 273 -195 -214 465 -18 -379 182
3588 182 259 -231 -208 304 -121 -237 71 158 -314 -32 333 -280 -268 318 66 -293 197 363 -161 -214 383 -171
3610 -171 -311 244 292 -389 -148 309 -105 -323 365 -73 -455 48 283 -152 -176 449 -55 -466 271 179 -335
3631 -335 129 488 -61 -50 259 256 -173 144 405 -258 -256 571 -268 -296 344 189 -353 14 479 -130 -294 184
$$ packed form
3483B49k33n38O75K00o58J26O39l72k78N48pq12N29N24o13k26O71l51n44N42K26
3504B97o42P4N17k45n31P49j69l27M29L91r78J85O44k51m32K95L15n41N9O95n10
3525B4k14M16J4n99M22K88o05K6N34l09m04M27J30m42J40N52o16k98O42J5l60
3546b17L94P1j9l55O03k66k20J40K84p94L15M85k48n12O25r5o02L93K88n23k2
3567b75O01l98l05M15K88p10K85O96o30k73N83j24l25L48R7m68j9O79m83l61N61
3588A82P7m90K3N12m25j16L08Q7m72K82L65o13J2N86k52l59M90J66n24n3N97n54
3610a71j40N55M8o81K41M57m14k18O88m38l82N03K35m35k4O25n04m11P37r2n14
3631c35M64L59n49J1L09lm29L17K61o63KQ27q39k8O40j55n42L67M65o09j64M78
$$ plain form
3653 184 12 -197 163 236 -95 -34 295 -70 -277 290 400 -359 -204 257 -159 -221 215 46 -355 -116 91
3674 91 -418 -10 250 -169 -294 395 175 -321 -41 352 -229 -336 393 191 -190 246 209 -235 -98 239 -187
3695 -187 -265 361 223 -505 134 395 -364 -342 214 -57 -274 70 119 -227 -50 275 -232 -236 403 457 -428 124
3717 124 401 -282 -155 251 -65 -306 73 158 -187 5 226 21 -111 231 78 -652 -16 393 -316 -309 350
3738 350 101 -269 137 169 -170 71 457 2 -208 276 191 -405 195 347 -216 -196 235 -63 -547 92 309
3759 309 -2 -223 251 -123 -306 289 63 -357 134 339 -268 -183 331 202 -417 -28 133 -372 -293 253 -141
3780 -141 -326 4 49 -387 155 34 -435 14 658 -239 -587 98 107 -292 -75 374 -1 -91 97 -6 -407
3801 -407 165 154 -252 -187 600 -131 -474 105 401 -150 -149 418 -86 -457 192 29 -217 287 261 -367 -125 378
$$ packed form
3653A84j72k09L60P3l31O1L29l65k07N67J10p59J55M61m16o2M36j69m01K39K07
3674I1n09M08K60m19j25O89k20m96K80L93n81j07P29k02l81M36l7m44J37L37m26
3695a87p8O26j38p28O39K61p59K2N56k71k17L44M9l46J77L25n07mO39N4q85N52
3717A24K77o83J27M06l16k41L79Q5l45J92K21k05j32L42j53p30O36M09p09PO59
3738C50k49l70M06L2l39K41L86m55k10M84q5n96O00J52n63K0M31k98m84O39K17
3759C09l11k21M74l74j83N95k26m20M91K05o07Q5N14j29o19L89J61n05P9N46l94
3780a41j85L30M5m36N42j21m69M49O44q97l48O85Rl99K17M49l75r0J88j03m01
3801d07N72j1m06O5P87p31l43N79K96n51JN67n04l71O49j63k46N04k6o28K42N03
$$ plain form
3823 378 115 -351 287 326 -343 -143 409 121 -323 215 -86 -228 54 259 -363 -39 334 -114 -319 86
3843 86 181 -420 -40 595 7 -404 338 185 -137 -108 403 -171 -4 372 5 -494 174 169 -339 -63 371 -158
3865 -158 -408 329 95 -369 43 135 -226 -92 98 -60 -280 410 318 -356 -23 385 -42 -493 205 72 -551
3886 -551 84 11 -251 -123 293 -46 -281 187 47 -672 -10 375 -135 -359 223 162 -469 25 416 -191 53
3907 53 328 -102 -145 198 307 -48 -5 330 -185 -406 323 112 -139 20 267 -261 -216 219 56 -221 56
3928 56 245 -283 -159 382 -306 -413 445 138 -323 41 383 -100 -209 312 152 -44 4 40 -363 43 199
3949 199 -136 -296 335 -88 -476 47 252 -329 -227 224 18 -257 20 380 -138 145 188 -169 -205 336 -22
3970 -22 -360 0 452 -272 -178 151 156 -458 -84 267 -288 40 152 -130 -196 328 175 -353 192 437 -147 -210
$$ packed form
3823C78k63m66O38L9o69K00N52k88m44N38l01j42K82K05o22L24L73m48k05M05
3843H6R5o01L80O35n88m11P42j53l22K9N11n74J67L76l67m99O68nn08K76M34n29
3865a58k50P37k34m64M12R2l61J34J90j58k20O90r2o74L33M08m27m51O98j33o23
3886e51O35p3k62J28M16l39k35M68j40p19O62L85n10k24N82o1o31M94L91o07K44
3907E3K75m30m3L43J09l55M3L35n15k21P29k11k51J59K47n28M5M35j63k77K77
3928E6J89n28J24N41o88j07Q58l07m61L64L42m83j09N21j60j96M8L6m03M06J56
3949A99l35j60O31m23l88N23K05n81J02M51k06k75K77L60n18K83M3l57l6N41l58
3970b2l38L60M52p24R4L29No14L74L51n55L28J12k82o6N24j53n28N45K45n84o3
$$ plain form
3992 -210 252 -19 -326 59 79 -253 -152 287 -113 -135 256 -121 -496 115 232 -231 -246 183 85 -300 287
4013 287 70 -214 165 254 -49 -148 235 97 -209 195 201 -198 -166 300 -88 -182 115 225 -252 -148 144 -275
4035 -275 -278 62 -83 -427 89 290 -340 -199 265 -97 -193 164 109 -198 -131 217 -61 -179 250 -65 -249 -67
4057 -67 156 -181 38 429 -117 -385 132 178 -77 -54 251 -143 -183 199 19 -227 144 283 -296 -118 310
4078 310 -84 -276 121 14 -404 -70 248 -263 -261 48 7 -215 325 36 -220 -61 155 34 -325 192 126
4099 126 -210 -56 193 -216 -87 355 119 -277 106 406 -252 -114 138 26 -426 69 154 -447 -57 248
4119 248 -245 3 268 155 -238 283 158 -196 -145 475 -161 -351 216 142 -254 -187 154 -292 -214 193 -91
4140 -91 -286 35 271 -187 -191 213 -129 -188 102 99 -133 -166 127 -179 -123 246 132 -228 175 182 -174 -115 244 -242
$$ packed form
3992b10M62k71l07L85K0l32J01M39m00k2L91l77l75O11J17m63j5M29r8l85N87
4013B87k17k84L79Q9l03r9L83j38l06M04Ol99L2M66l88r4K97J10m77J04K92m19
4035b75lL40j45l44N16K01o30J41M64l62r6L57n5l07O7L48k78j18M29l15j84J82
4057f7K23l37K19L91n46k68N17M6k55K3L05l94m0L82j80k46L71J39n79J78M28
4078C10l94j92L97j07m18L34L18n11KL09m1k22N40k89k56J59K16j21l59N17o6
4099A26l36J54K49m09J29M42k36l96L83L00o58J38K52j12m52M95Q5o01L90L05
4119B48m93K48K65j13l93N21j25l54N1O20o36j90N67p4l96O7L41m46P8M07k84
4140i1j95L21K36m58mM04l42n9K90lk32l3K93l06N6L69j14l60M03Pl56N9L59m86
$$ plain form
4164 -242 -227 56 333 -361 -51 155 -193 -161 201 5 -260 -46 153 -423 -105 263 -70 -201 168 237 -487
4185 -487 -70 368 124 -77 224 -55 -302 57 216 -288 -174 259 -173 -242 153 90 -258 -53 179 -177 -209
4206 -209 143 -36 -242 195 283 52 156 379 -13 -89 218 67 -359 3 242 -277 -208 99 -14 -253 -44
4227 -44 251 -231 -184 253 70 -194 231 182 -280 67 200 -126 -251 358 -11 -418 324 395 -168 -46 125
4248 125 3 -341 155 10 -258 -35 104 -320 -242 375 -95 -338 252 324 -321 8 210 -54 -245 287 280
4269 280 -165 85 307 -42 -148 170 -58 -253 135 244 -279 7 346 -127 -351 319 113 -189 -203 216
4289 216 -267 -40 288 -15 -191 235 239 -388 42 355 -64 -168 62 34 -237 97 103 -279 0 -105 76 -205
4311 -205 203 207 -220 -118 330 12 -259 240 79 -127 77 52 -150 -145 146 75 -352 136 141 -149 -236 76 -81
$$ packed form
4164b42J5K83K77o94L10K06l48L2L62j96k65K14J99n76L18L68l33j31L69O9p24
4185d87M17M38k44k01L01k79k47L59J59n04J14M33m32o9L95o3l48K05K32l56l2
4206b09L52j79k06M37Q8k31J04K23l92p6L07j51m26L62K39n19O9L07j13k39K09
4227d4K95m82M7M37j83k64M25m9m62L47J33l26j25O09l69m07P42P1n63J22J71
4248A25j22l44M96j45k68K23J39m24P8O17m70k43N90P2o45L29K02k64j91N32p
4269B80m45K50K22l49j06L18k28j95L88J09n23K86L39m73k24O70k06l02j4M19
4289B16m83K27L28l03j76M26Mo27M30L13m19j04K30k8k71L34Ol82K79j05J81k81
4311b05M08Mm27J02M48l18k71M99j61k06K04k5k02NK91p1m27M88Nk90q7L12j57
$$ plain form
4334 -81 -233 176 77 -297 -89 116 -409 -147 211 -41 -202 194 115 -230 -45 309 -187 -171 268 184 -350 4
4356 4 94 -43 0 98 -51 -383 241 181 -191 67 245 -176 -283 221 64 -302 37 204 19 -198 264 2
4378 2 -249 214 102 -244 -41 103 -130 -298 116 293 -405 -88 -72 -281 -105 312 63 -260 29 19 -365
4399 -365 101 256 -24 -20 54 60 -368 27 302 -18 -285 310 84 -181 -98 141 -83 -14 127 -176 -396 155
4421 155 -54 -225 -16 361 -219 -142 175 -117 -106 146 191 -132 69 90 -241 -40 189 -10 -227 182 134 -234
4443 -234 -175 149 197 -213 23 192 -222 -70 -48 -161 -63 323 32 -277 173 124 -362 -216 332 -19 -405 30
4465 30 30 -97 -47 252 -106 -133 193 77 -163 67 249 -304 -178 53 -49 -399 47 91 10 -44 127 -74 28
4488 28 214 44 -56 107 134 -180 -64 125 82 -378 74 127 -399 -267 202 -229 -120 230 20 -196 165
$$ packed form
4334h1j52M09r9l74K08K05n25K62L58k52j61L96p9l45J85L54m96J6M39q4n34L54
4356DR0j37M3R8j49l32O24o0l72K58J78m21j07N04j57l66L39J67j85k17M62k62
4378Bk51M63j12l46K03J44k33j68M14J77o98L17J6k09J76M17k49l23K89j0l84
4399c65M66J55k80MP4Om28L95K75l20k67N95k26k65Q3K39k24O9J41l03k20N51
4421A55k09j71K09L77n80P7L17k92J1K52M5l23K01K1l31K01K29j99k17M09m8l68
4443b34N9L24M8m10K36J69m14J52K2j13R8L86k91l09M50m9m86J46N48l51l86M35
4465C0%j27N0K99l58k7L26j16k40K30J82n53J26K31j02l50M46M4q1n4J71k01J02
4488B8J86j70j00J63K7l14J16J89m3m60M52N3n26J32M69m31J09L50k10k16L61
$$ plain form
4509 165 48 -161 -34 300 -95 -274 170 27 -367 -15 40 -15 -133 111 4 -183 54 72 -48 23 151
4530 151 -119 -203 201 200 -99 50 268 -11 -105 93 91 40 -23 -54 -70 -20 307 -24 -257 8 129 -396 -106 211
4554 211 -86 -101 152 -146 4 26 -26 -203 -19 511 -40 -124 137 -62 -271 41 414 -60 -185 111 109 -138
4576 -138 140 200 -88 -115 142 -17 -23 29 121 -196 23 159 61 -134 239 42 -199 36 234 -212 -137 95 -92
4599 -92 -98 25 222 -232 49 191 -139 -176 250 -36 -218 20 281 -72 -42 30 -115 -112 184 272 -120 183 298
4622 298 -103 -229 136 -36 -178 7 150 -28 199 145 -129 -179 107 -65 -347 31 285 -58 -68 152 69
4643 69 -142 60 105 -47 122 111 -96 -152 118 -162 -407 123 157 -131 -100 290 -4 -299 11 62 -247 -109
4665 -109 145 -29 -38 87 43 -257 -67 83 3 -170 94 -92 -182 69 57 -151 -184 156 -153 -108 15 51 -219
$$ packed form
4509A65j17k09J27L34l95j79M44j43l94L52N5n5j18K44j07j87K37J8j20P1J28
4530A51k70q4M04jk99J49K18k79r4J98kn1o3l1j6N0L27l31k33K65J21n25K90L17
4554B11k97j5K53k98J50K2n2j77J84N30n51q4K61j99k09L12L73m74j25K96kk47
4576a38K78O0k88k7K57j59oN2R2l17K19J36r8j95L73j97k41K35J98m46P5K32j87
4599i2oJ23J97m54K81J42l30l7M26k86j82K38K61l53L0P2j45LK96Q8l92L03J15
4622B98m01j26L65j72j42J85J43j78K27n4k74n0K86j72k82L78K54l43j0K20q3
4643F9k11K02M5j52J69j1k07n6K70k80k45N30L4k88L1L90k94k95L10N1l09J38
4665a09K54j74rJ25m4l00J90J50q0j73K64j86r0K51j2k08l3L40l09M5J23L6k70
$$ plain form
4688 -219 15 150 -244 -95 203 42 -274 1 256 -329 -145 89 -9 -244 95 50 -47 -42 178 -108 -24 42
4710 42 -136 -254 -37 113 -222 73 196 -135 -295 106 -77 -256 -107 425 -66 61 47 24 -167 108 127
4731 127 -124 90 315 104 15 191 -66 -263 -13 121 -207 -142 0 -59 -257 -6 -43 -216 -25 44 32 -144
4753 -144 129 -65 -338 -110 -91 -107 -48 276 -200 -174 66 59 -83 -108 243 -71 -126 177 266 -111 103 45 -48 -73
4777 -73 240 -23 -199 36 170 -205 -128 231 -57 -60 208 17 -120 30 152 -73 -386 72 -86 -91 67 168
4799 168 -285 85 178 -34 -154 188 -142 -173 79 119 19 -70 -22 56 -103 133 23 -154 -53 188 32 -124
4821 -124 30 -111 -20 22 115 -54 -160 49 137 -20 137 224 -101 -38 87 -202 -161 189 181 -209 81 212 -203
4844 -203 -74 127 -13 -4 9 62 -316 -61 -8 -195 -34 -28 55 -423 87 -93 -67 -228 110 212 -82 141 119
$$ packed form
4688b19K34J35l94J49K98j61l16K75K55n85J84K34r8k35L39m5r7NK20k86Q4O6
4710D2j78j18K17J50l35K95J23l31j60M01j83j79J49N32m91J27j4k3j91K75J9
4731A27k51K14K25k11q9J76k57j97K50J34l28O5J42n9j98K51l7j73J91O9j2j76
4753a44K73j94k73K28J9j6N9L24m76K6K40pj42k5L51l14n5L03Q9l77K14n8r3k5
4777g3L13k63j76K35J34l75P7L59k88lK68j91j37J50J22k25l13M58j58nJ58J01
4799A68m53L70R3k12j20L42l30l1K52M0j00q9M8P8j59K36j10j77J01K41j56j56
4821a24J54j41R1M2R3j69j06K09Q8j57J57Q7l25O3J25k89M1L50ql90K90J31m15
4844b03J29K01j40RJ3N3l78K55N3j87J61OQ3m78N10j80K6j61L38J02k94K23k2
$$ plain form
4867 119 -184 55 212 -34 -138 125 199 14 115 100 -231 3 173 -93 -257 21 99 -214 -22 34 -99
4888 -99 79 -38 -65 -134 17 184 -181 9 138 7 11 -11 234 -176 -67 -5 -49 -55 -30 -34 -341 -25 97 -202
4912 -202 1 -16 103 -19 66 96 -165 -201 189 5 -319 116 139 -287 50 107 -127 161 65 -40 -126 167 -35
4935 -35 -192 -148 46 -180 -345 31 42 -60 172 16 -199 79 169 -259 -7 189 224 -259 -88 -82 61 -215
4957 -215 78 -41 -106 19 89 -111 -97 169 -65 -234 -147 175 -224 65 166 -78 11 90 108 -113 2 172
4979 172 -107 -15 113 81 -205 33 34 -137 -31 263 -173 -123 21 152 -1 93 205 -21 -49 62 -159 -97 14
5002 14 185 -197 88 108 -36 9 150 58 -152 -22 10 -161 -142 209 63 -102 258 48 -217 43 76 -116
5024 -116 -133 163 55 -104 160 149 -38 -58 98 -77 -39 -48 128 72 -6 227 -117 -182 4 19 -146 16 125
$$ packed form
4867A19l03K39J57k46j04K63P4j85J01j5l31K34J70k66j64K78P8l13J92N6j33
4888i9J78j17k7o9J51J67l65J90J29j31Mk2K45m10J09O2m4oK5ml07L16J22k99
4912b02K03j7J19j22Q5L0k61l6L90j84l24M35K3m26L37N7k34K88r6j05q6K93k02
4935c5j57M4J94k26j65L76J1j02K32j56k15K78R0m28K52J96L5m83J71OJ43k76
4957b15K93j19o5J25P0k00J4K66k34j69Q7L22l99K89J01k44Q9P9J8k21J15J70
4979A72k79R2J28l2k86K38Jj71J06K94m36N0J44J31j53R4J12k26k8J11k21O2J11
5002A4J71l82K85K0j44M5J41r2k10J30L2j71J9L51j46j65L60k10k65K60L3j92
5024a16j7K96j08j59K64j1j87k0J56j75L8rJ76n6p8K33l44o5J86J5j65J62J09
$$ plain form
5047 125 -145 -1 220 -165 -42 195 -19 -170 0 95 -177 3 156 116 52 155 1 -115 56 99 -70
5068 -70 -156 95 -41 -79 -75 151 -154 -49 132 123 -224 72 204 -49 3 91 114 -34 -1 47 -39 -113 77 -120 -52
5093 -52 -10 103 -16 -21 50 -132 -38 75 -113 -44 -94 106 -131 -53 145 -258 -65 179 -106 13 -10 -16 -117 -102
5117 -102 210 17 -165 -134 147 -1 100 231 -90 43 254 -46 -63 -130 16 -316 -29 214 -6 -41 -73 148
5139 148 -114 139 333 -48 -73 -75 107 -190 -8 170 -97 1 177 -82 -117 152 263 -27 -106 54 -73 -117
5161 -117 136 80 -9 212 100 -53 -96 73 29 -21 -54 37 8 41 11 -50 -67 75 -13 -99 -65 -170 -182 -94 158 94
5187 94 -96 207 -134 -130 -60 122 15 114 179 -24 -128 119 44 -212 195 40 -57 -140 -5 -4 -224 41 73 74 52
5212 52 65 -25 -131 0 193 -161 -78 229 -73 -127 -1 76 -52 -147 355 -115 91 90 45 -61 -90 215 -135 -220
$$ packed form
5047A25k70J44K21l85J23K37k14j51J70R5k72J80J53m0o4J03j54j16J71M3j69
5068g0q6K51j36l8MK26l05J05J81rl47K96J32k53N2Q8K3j48L3M8q6p4J90j97O8
5093e2M2J13j19nP1j82R4J13j88O9n0K00k37P8J98m03J93K44k85J19k3oj01J5
5117a02L12j93j82L1K81j48J01J31l21J33K11l00j7o7J46l32K87K43k20l5l2K21
5139A48k62K53J94l81k5kJ82k97J82J78k67R8J76k59l5K69J11k90p9J60j27m4
5161a17K53n6q9K21j12j53m3J69m4n0l3R1k9L3l0o1j7J42q8q6L4j05j2Q8K52o4
5187I4j90L03l41MP0J82j07R9O5k03j04K47p5k56M07j55r7q3J35Jk20K65L2Jk2
5212E2J3r0j06J31J93l54Q3L07l02n4J26P7j28r5N02m70K06jm5j06k9L05l50q5
$$ plain form
5236 -220 79 -166 -42 242 -55 -179 -107 130 21 -63 75 -153 -88 90 -72 101 -91 91 -76 -72 107 145
5258 145 -195 53 51 -64 -55 217 -6 -30 -115 21 -232 -99 11 66 -59 114 87 -53 -69 -87 -46 -66 143 64
5282 64 -28 -42 -79 21 -90 128 -3 -55 116 -116 -64 -107 129 -80 -17 118 46 92 17 58 -88 -39 50 -142 -216
5307 -216 76 164 -87 162 68 -22 -88 92 46 -62 134 32 -128 108 164 -40 -58 67 -8 -112 -12 278 -2
5330 -2 -136 185 -111 -245 -1 103 -247 -22 41 -33 -82 184 96 -111 47 -44 -249 -37 152 -14 -152 -79 41
5353 41 -254 85 -16 -152 97 -140 -143 -86 82 57 -105 -90 -38 4 -101 -39 5 -155 -1 -101 83 152 36 -116
5377 -116 -167 -48 182 -10 -165 205 30 131 -14 45 -63 -132 87 11 84 52 -77 -75 101 80 -30 74 181
5400 181 -66 -108 77 16 -54 -65 32 -173 -44 96 122 -128 27 171 -13 1 -5 -78 -154 32 105 -111 19 -84
$$ packed form
5236b20K99k45J24K84k97j24P2K37j09q4J38k28O5J78j62J73j92J82j67MJ79L8
5258A45l40K48kj15RK72k23k4q5J36k53J33J10N5j25J73k7j40j6j8M1k0K09p9
5282F4r2j4l7J00j11K18j31n2J71k32N2m3K36k09O3J35p2M6p5M1j46M9Q9j92p4
5307b16K92Q8k51K49r4r0o6J80m6j08J96j02j60K36N6k04j8J25p5j04J00K90k80
5330bj34L21k96j34K44J04l50K25O3p4m9K66q8k07J58r1k05K12J89j66j38P3J20
5353D1k95L39j01j36K49k37lN7J68k5j62J5N2M2j05O2M4j60J54j00J84O9j16j52
5377a16n1J19K30j92j55L70j75J01j45N9j08o9K19p6P3l2j29KJ76k1j10J04J07
5400A81k47m2J85o1p0j1R7k05J29J40K6k50J55J44j84J4op3p6J86P3k16J30j03
$$ plain form
5424 -84 23 -59 80 77 -131 -158 -116 -17 -87 161 -30 -200 -127 42 -200 -62 82 -6 94 -3 -6 3 171 66 -170
5449 -170 -24 84 -122 166 71 96 67 -114 277 -113 -41 127 51 -97 98 60 -66 -39 92 -105 -156 198 4
5472 4 34 -24 169 -84 -104 100 33 -95 12 -16 -169 -281 81 -60 -15 -175 -73 -9 -10 222 -130 9 264 -18
5496 -18 -3 -1 25 -130 86 18 45 -147 82 111 -35 3 72 -49 -135 110 -185 -46 -47 -73 -19 34 94 131 47 92 -106
5523 -106 -98 31 148 144 -125 141 -49 -66 37 -45 -115 -11 45 -37 -179 -97 -47 10 -89 150 -4 -205 41 210
5547 210 -65 77 26 -20 6 129 86 -76 -71 -92 5 -108 100 -253 -11 129 234 -121 103 -49 -99 -71 117
5570 117 -58 -114 -15 86 -88 -49 35 -32 52 204 -8 48 57 -36 -28 20 148 55 -143 -42 263 -80 -172 100 -49
5595 -49 -220 -176 -39 -9 11 31 -249 -69 -8 -87 -22 179 118 -24 -69 58 -35 124 83 -42 -106 -25 212 -82 -30
$$ packed form
5424h4J07q2J39lk08k7M2R9p0K48j91j70P3J69k42J38J44q8J00r7lRJ68j05k36
5449a70J46J08k06K88r5K5k9j81L91l90P2J68p6j48J95l8j26K7J31j97n1L54j94
5472DL0n8J93k53k0K04o7j28J07k8j53j12L62j41M5j60J02O4jK32l52J39K55k82
5496a8J5KK6j55K16o8K7j92K29K9j46L8O9j21q6K45k95J39jk6N4N3O0L7q4M5j98
5523a06QJ29J17mk69K66j90j7J03q2p0J04N6q2j42Q2N0N7r9K39j54k01K46J69
5547B10k75J42n1m6K6J23m3j62Nk1R7j13K08l53K42J40J05l55K24j52n0K8J88
5570A17j75n6R9J01j74L9Q4o7Q4J52k12N6Rr3QM8J28r3j98J01L05l43r2K72j49
5595d9j71M4J37L0K0K0k80J80O1p9O5K01o1j42m5J27r3J59m1j25o4Q1K37k94N2
$$ plain form
5620 -30 42 -9 107 101 -20 -30 -130 20 -182 -18 111 100 19 -100 105 -164 -5 136 12 -10 36 -37 -71 139
5644 139 -129 7 75 203 39 -133 -67 75 -77 -43 84 -252 -49 32 94 34 -15 104 -105 44 -11 -22 -5
5667 -5 -30 15 -119 -33 84 7 58 88 -97 -195 -11 -16 24 -53 -7 -14 -21 -101 39 18 -61 32 59 -160 92 84 -97 -152 128
5696 128 75 -54 121 169 89 -153 -87 -55 36 -47 32 4 -54 79 86 51 182 9 109 -113 43 -32 42 45 -107 41
5722 41 108 -43 -185 34 64 -36 -190 -44 -96 -86 60 -51 -227 -15 -17 -200 -179 33 -9 -69 48 -201 -31
5745 -31 -24 20 -174 1 24 -73 0 56 -38 202 62 -40 126 -48 151 -81 59 -40 -123 -158 48 70 -118 172
5769 172 -120 -86 -44 67 153 7 -46 1 26 -179 40 13 104 -56 89 10 -85 55 -68 -118 78 -56 -11 56
5793 56 28 -94 184 199 -72 -56 -84 -3 48 -13 146 86 4 -41 157 7 -81 44 119 -39 -10 -36 -151 -45 -136
$$ packed form
5620c0P2n1J16oj21j0j00J50k02J64J29j1q1j19K05k69J59J41j24k2M6p3l4K10
5644A39k68J36O8J28j64j72O6J42j52L4J27l36K03Q1O2o0m9J19k09J49n5j1J7
5667ek5M5j34Q6J17p7N1L0j85r8J84nM0p7M6ppq0J40k1p9R3K7k19K52qj81n5K80
5696A28n3j29J75M8q0k42O6L2R1q3P9k8n8J33Pl5J31j73J00k22J56p5P4Lj52J48
5722D1O7j51j42K19L0j00j54J46n2J0J46j11j76K12kj83K1K12m2o0J17k49J70
5745c1PM4j94J75K3r7P3N6r4K40j40j02J66j74J99k32J40r9q3l5K06K2j88K90
5769A72k92L4M2J11Q6j46n3M7K5k05K19k7R1j60J45p9r5J40j23n0J96j34M5O7
5793E6k8j22K78J5k71J6k8Q1N1o1J59o0q2m5J98j50q8J25P5j58K9k6j15J06r1
$$ plain form
5818 -136 -210 -95 -194 -3 -40 -28 128 -5 -99 -26 6 -27 71 17 24 -37 50 25 -105 -107 25 -156 -174 -196 -141 -29 -42
5845 -42 60 4 52 -20 34 37 55 -60 -33 63 49 -27 -7 -74 -77 -164 -86 -93 -54 7 27 -151 109 -51 -58 -29 -65 66 0
5874 0 -222 -28 11 -31 -91 61 195 8 -48 24 -91 -30 80 -72 -15 47 -103 35 20 -30 -7 -16 -19 107 -69 232
5900 232 80 -71 -43 -25 19 37 64 -114 -97 -91 49 -72 142 157 -19 98 87 -47 103 47 100 -32 -98 -5 -220
5925 -220 20 -43 -85 -228 84 -109 25 -9 -86 -36 -44 136 -125 38 55 79 23 22 -65 6 -3 4 161 -19 -180 -49
5951 -49 -15 209 52 90 -47 24 54 -150 -125 -64 138 63 312 -57 80 4 85 -10 110 -52 89 68 23 25 54
5976 54 -19 -102 -49 84 -25 -84 -6 64 106 -214 -45 39 135 -5 -106 -76 -18 -71 93 -14 4 -61 -74 -111 107 -187
6002 -187 -12 -112 153 -6 -97 -32 -13 34 113 -152 -21 -93 -56 4 17 -16 26 -105 -96 115 3 -39 123 -15 3
$$ packed form
5818a36p4J15r9J91l7J2J56j33r4P3L2l3R8n4Po1Q7k5j30kJ32j81j8k2N5J12j3
5845d2J02n6M8p2N4LJ8j15K7R6j4p6K0o7lq7P8pL9O1K0j78K60j60pK9l6J31o6
5874@k22J94L9m2o0J52J34j87n6P2j15O1J10j52N7O2j50J38j5n0K3rlJ26j76L01
5900B32j52j51K8J8M4J8K7j78J7OJ40j21K14J5j76J17j1j34J50n6N3j32o6R3k15
5925b20K40o3m2j43L12j93J34l4p7N0qJ80k61J63J7K4n6jq7P1rPJ57j80j61J31
5951d9L4K24j57L8j37P1L0k04K5O1K02p5K49l69J37p6Q1r5J20j62J41k1m5KK9
5976E4p3q3N3J33j09n9P8P0M2l20J69Q4R6j40j01L0N8n3J64j07J8o5j3l7K18k94
6002a87J75j00K65j59r1O5J9M7P9k65J31p2L7O0J3l3M2j31RK11j12m2J62j38J8
$$ plain form
6027 3 148 22 38 141 78 -135 32 -36 0 -97 245 57 -9 -59 51 -9 54 2 4 26 65 32 -137 89 44 23
6053 23 26 -44 177 -48 6 74 31 7 -128 -103 -87 -48 19 32 -18 93 28 52 -34 6 -168 -12 157 254 93 -10
6079 -10 -92 22 -63 -157 -56 -69 191 113 -73 -17 39 2 -6 -56 238 -29 97 53 -4 -30 95 19 22 48 -122 138
6105 138 -43 42 72 15 -36 -13 149 80 143 66 55 -11 20 142 -62 139 -86 -26 -17 -194 -77 88 26 37 177
6130 177 34 -9 3 -64 -102 41 35 -8 50 101 -86 -73 9 -17 -79 -179 61 31 -181 74 -89 -36 17 -61 128 -108
6156 -108 125 14 -23 -37 -40 69 -157 110 38 -19 5 0 -31 -59 76 42 72 -8 24 95 -42 -106 10 74 6 -138
6182 -138 49 -24 21 26 -139 37 22 46 64 94 79 49 40 25 96 -59 152 -38 8 -69 -141 -103 53 79 146 161 -128
6209 -128 82 -47 -44 -17 -33 -111 122 8 47 27 10 -25 -36 -45 -71 11 -2 190 89 76 -36 -54 -101 -50 -13 116 169
$$ packed form
6027CJ45j26J6J03o3k13J67o8L6r7L42j88o6n0J10o0O3n2KK2L9l3j69K26m5k1
6053B3Lp0K21k25N4O8m3k4j35K5J6L9O7J3n0J11o5K4q6M0j74J56J69R7j61j03
6079a0q2J14q5r4J01j3K60p8j86N6N6l7qn0K94k67J26m4n7k6J25p6LK6j70K60
6105A38j81Q5L0n7n1K3J62o9O3p7j1o6L1J22k04K01k25O0Rj77J17J65o2J1J40
6130A77j43m3J2o7l8J43om3N8N1j87J3Q2k6o2j00K40l0k12K55j63N3N3p8J89k36
6156a08K33j11l7j4lJ09k26K67p2n7K4nl1k8J35l4L0q0L2P1j37o4J16O4o8j44
6182a38J87p3M5Nj65J76j5K4J8L0j5l0rj5P1j55K11j90M6p7p2L8J56K6O7J5k89
6209a28K10j29LK7j6p8K33j14L9k0j7l5j1rk6Q2j3J92j01j3j12j8m7N1L7J29N3
$$ plain form
6236 169 -13 21 -246 -20 -31 62 32 -77 -172 -75 7 63 43 81 -11 28 105 -108 -56 -60 17 -13 91 -9 65 -42
6262 -42 134 -9 -122 158 31 -57 174 -36 2 -79 -137 135 -38 99 -88 -76 -114 -43 -19 46 44 6 9 -11 20 51
6288 51 -115 -11 -146 -3 75 -12 -181 42 37 119 66 -35 63 40 -24 -8 -75 -17 122 -108 110 72 62 -33 175
6313 175 9 51 -186 104 179 -58 218 125 -4 -99 -19 184 10 30 -94 77 42 53 -49 44 31 -92 124
6336 124 -23 -5 -168 110 -215 -133 -120 -135 193 -66 -23 -63 -70 -11 20 -172 -28 -7 66 -46 -44 61 -27 127 -41
6361 -41 -147 13 119 -25 -43 -77 -79 -151 35 -5 97 72 46 47 -18 -116 46 -141 -134 -47 -10 -132 -143 1 -187 14
6387 14 -4 -129 -150 -57 -166 130 -121 -139 -144 33 50 -15 64 -151 101 -69 -97 -124 11 -21 -2 -53 -20 -57 123 -42
6413 -42 -132 -127 -24 -141 95 50 7 38 -103 160 4 35 -64 -17 52 42 -20 -54 90 -12 -77 -9 73 -45 -77 -36
$$ packed form
6236A69j82L4k67K26j1R3l0j09r5R7Q2N6k0L8r2L9P7k13N2mP7l0J04j00P4j07
6262d2J76j43j13K80j27q8K31k10L8q1n8K72j73J37j87J2l8P1K4O5kl8Lk0L1L1
6288E1j66J04j35J43P8q7j69K23nQ2n3j01R8k3o4J6o7N8J39k30K18l8j0r5K08
6313A75j66M2k37K90P5k37K76r3j29r5Q0K03j74K0j24J71l5J1j02R3j3j23K16
6336A24j47J8j63K78l25Q2J3j5L28k59M3m0pN9L1j92J44K1P3j12KJ05q8J54j68
6361d1j06J60J06j44j8l4kp2J86m0J02k5k6Jo5r8J62j87PQ7L7j22j1J44j88K01
6387A4j8j25k1R3j09K96k51j8nJ77J7o5P9k15K52j70k8k7J35l2J9n1L3l7J80j65
6413d2r0NJ03j17K36m5m3L1j41K63j56L1r9M7O9j0o2l4J44j02o5O8Q2j18l2M1
$$ plain form
6439 -36 -1 20 -22 18 91 173 -46 157 -57 -29 -113 60 -107 -28 -156 -107 -10 -97 -167 52 61 -85 -24 -26 308 -9
6465 -9 15 2 47 -133 -45 171 65 -57 140 -8 -82 -75 9 165 7 133 17 -115 -22 -44 44 -6 -101 -23 -78 -92
6491 -92 135 91 86 84 -114 11 -128 -168 17 93 -211 -56 -10 11 -39 -63 -99 13 138 10 -82 61 67 36 -91 173
6517 173 12 49 52 -63 137 8 -13 121 123 -20 42 17 -11 -14 -35 -123 91 19 35 -139 25 -181 -45 136 -200
6542 -200 -20 9 99 88 134 -38 18 -5 -28 84 170 -48 20 47 -7 58 76 96 -23 8 -46 140 87 -109 93 -214
6568 -214 -91 -137 120 -120 -24 -121 37 -53 -33 -25 174 -105 132 43 49 117 26 -112 -41 79 -28 180 20 83 -53
6593 -53 78 -35 20 -131 151 -29 -104 -33 -57 -49 -83 12 81 -131 -1 -45 51 106 12 -171 -124 2 63 6 -17 18
6619 18 -70 142 174 71 -9 95 -56 -7 86 83 128 -131 -28 145 -19 65 -63 169 71 87 -82 -8 103 178 139
$$ packed form
6439c6L5K1m2M0P3Q2k19K03k14K8q4J73j67P9j28M9R7q7p0K19Rj46O1kL34l17
6465iK4j3M5j80Q8K16j06j22J97j48p4PQ4J56j58J26j16j32R3k2Q8n0r5P8n5j4
6491i2K27m4nkj98J25j39m0J85P6l04J55M6K1n0k4l6J12J25j28r2J43Ol1j27K64
6517A73j61L7Lj15K00j29k1J34Kj43O2k5k8lk1q8K14p2J6j74J64k06J36J81l36
6542b00J80K9R0j1M6j72N6k3k3J12Q6k18O8K7n4O5J8K0j19L1n4J86n3j96K02l07
6568b14J23m6K57k40R6r7J58r0K0QJ99k79K37q9OO8r1j38P1J20j07K08j60O3j36
6593e3J31j13N5j51K82j80p5P1k4Ql4R5O9k12J30m4R6N5r4j83M7J26O1n7k3L5
6619A8q8K12L2j03q0J04j51M9R3lM5k59J03J73j64Q4j28K32r8J6j69P4J11P5l9
$$ plain form
6644 139 -51 164 -134 -7 -195 3 -94 -36 90 -52 -52 145 -81 -70 -162 -16 -57 -151 122 -71 13 -60 69
6667 69 -31 22 105 121 -95 -45 76 44 292 -3 -22 -141 63 -127 117 14 142 37 -90 38 -135 -85 84
6690 84 17 -20 93 31 78 -55 81 128 27 13 -31 -47 -145 -52 134 -76 125 -8 -67 -31 -2 58 -141 84 -36
6715 -36 -65 63 -139 -10 -3 69 -61 44 -20 -68 -78 156 39 -34 -87 -70 8 152 -138 87 -28 -165 34 -222
6739 -222 -10 -3 -59 -6 77 -96 -143 16 -160 -41 95 -80 -121 -136 28 -108 18 -57 87 -26 -47 88 -74
6762 -74 -126 3 30 52 126 -46 -134 -32 82 -18 24 -48 13 18 -182 -27 46 -84 4 -69 0 62 103 -1 51 76
6788 76 47 27 -73 210 -155 -1 6 -101 -81 180 8 149 -123 45 71 -127 -115 -49 -59 103 71 7 133 33
6812 33 32 -12 -41 -6 48 -98 -31 142 -54 -133 -63 -17 31 74 -92 -6 145 21 8 24 54 15 12 -47 -2 182 252 95
$$ packed form
6644A39j90K15k98J27j88J98r7N8J26j42%J97k26J1r2J46m1r4K73j93Q4p3J29
6667F9j00N3Q3J6k16N0J21l2K48k95j9j19K04j90K44j03J28j05j27J28j73N0J69
6690H4o7l7J13o2M7j33J36M7j01j4m4j6r8R3J86k10K01j33n9L6K9O0j99K25j20
6715c6k9J28k02J29PP2j30J05o4m8j0K34j17p3n3J7P8J44k90K25j15j37J99k56
6739b22K12Pn6N3Q3j73m7J59j76J19J36j75m1j5J64j36J26p5J44j13k1J35j62
6762g4n2J29K7K2P4j72q8J02J14j00M2p2O1Nk00J55P3j30Q8p3O9O2M1j04N2K5
6788G6k9k0j00K83l65J54Pj07K0K61j72J41k72J68K6j98J2O6j0J62l2o4J26j00
6812C3jm4k9L5N4j46O7J73j96p9P0M6M8M3j66Q6J51j24j3J6L0l9ln9M5J84P0j57
$$ plain form
6840 95 -54 -143 -52 -167 -22 6 -205 -87 257 49 -80 -20 28 -18 -39 107 -92 -73 134 -37 6 -79 -48 15
6864 15 -212 -17 94 148 -95 51 62 7 39 -82 -39 -88 66 -85 6 205 -42 21 121 97 20 32 8 -22 -125
6889 -125 12 68 -97 91 54 85 -27 125 295 -237 -104 15 14 77 38 -63 -224 -116 -7 40 14 81 69 -99
6913 -99 89 46 -89 -240 23 53 -121 -57 11 75 56 129 13 -276 17 -35 -17 60 91 28 -155 -39 -22 -18 61 -74
6939 -74 0 -16 -77 -167 32 -26 138 -90 15 123 -87 -8 84 73 105 53 -27 -183 79 164 24 -5 42 -13 -12 -53
6965 -53 54 -195 162 -10 5 111 163 -11 -63 -21 21 -74 -107 135 35 -112 -23 92 -40 -188 77 -29 -110
6988 -110 156 -67 -29 156 122 81 52 -18 162 -85 209 119 -31 89 79 -80 59 112 -86 -34 54 85 39 -26
7012 -26 132 48 125 64 2 51 91 31 -39 -41 113 35 -96 96 159 -78 85 -110 -185 8 -115 -4 -6 44 274 93
$$ packed form
6840I5j49q9R1j15J45K8k11J18L44k08j29O0M8m6k1J46j99J9K07j71M3q5L1O3
6864A5k27J95J11N4k43J46J1n5L2j21M3m9J54j51R1J99k47O3J00k4p7J2k4l0j03
6889a25J37N6j65J88l7L1j12J52J70n32J33J19jO3l9j01j61J08J09M7k6O7j2j68
6913i9J88m3j35j51K63L0j74O4O8O4j9P3j16k89K93n2J8P7L1o3j83J16J7MP9j35
6939g4P4j6o1r0J99n8J64k28J05J08k10P9R2j1L2n2q0j56K62Q5j40k9M7n5Jm1
6965e3J07k49L57j72J5J06N2j74n2M2M2r5l3K42j00j47Q9J15j32j48K65j06q1
6988a10K66k23L8J85l4m1k9p0J80k47K94r0j50J20j0j59J39N3j98N2Q8L1m6o5
7012b6J58q4P7o1o2M9M0o0p0kJ54p8j31J92O3k37J63j95p5J93j23J11kN0K30j81
$$ plain form
7038 93 -48 144 71 44 -116 135 -86 -91 -82 70 53 55 125 -147 36 -125 -78 76 -121 -35 -147 -86 78 -165 -102
7063 -102 71 25 -112 -75 -80 -128 54 33 -50 -30 -61 -55 -19 -6 -14 -54 -73 -88 100 30 51 26 -1 74 85 143 24 -43 20
7092 20 -102 -107 -66 102 -21 190 12 -81 147 69 24 72 80 -131 -61 0 15 -85 -63 165 -35 -43 73 9 -68 92
7118 92 -83 -173 38 33 144 -18 62 8 20 62 50 53 -45 85 139 -63 66 41 -79 -5 -22 37 -36 -56 118 -76
7144 -76 -122 116 -102 -102 47 140 -129 26 127 -87 -131 33 -76 -155 46 14 133 94 48 157 38 -84 8 -86
7168 -86 36 -150 -36 -15 135 -56 -100 90 -12 -229 118 39 -105 114 128 62 -10 114 -7 -1 -112 181 -126
7191 -126 -110 63 -46 -31 73 10 66 -1 90 19 -19 105 -154 -35 -37 53 133 -273 -92 -100 -11 49 -58 -106 96 101
7217 101 -86 -114 124 -103 -37 136 -118 94 -102 1 -80 -65 -131 -32 34 14 12 22 -153 251 164 -18 -8 15 64
$$ packed form
7038I3j41J92p3k7j60K51k21nRJ52j7KP0k72J83j61M7J54j97Q6j12O1J64k43O3
7063a02J73m6j37L7nm8J82k1q3K0l1OL6J3qm0j9j5J88p0K1k5k7P5J1N8j19o7O3
7092B0j22nM1J68j23K11j78r3K28p8m5M8Qk11P0O1J5j00K2K28k00qJ16o4p7J60
7118I2j75r0K11nJ11j62Q0n4J2M2j2Lr8J30N4k02J29k5j20P4j7N9p3k0J74j94
7144g6m6K38k18%J49R3k69J55J01k14m4J64j09p9K01l2J19l9m6J09j19j22R2r4
7168h6J22j86J14K1J50j91m4J90j02k17L47p9j44K19J4o6p2J24j21Oj11K93l07
7191a26J6J73j09J5J04o3N6o7R1p1l8J24k59J19kR0Q0m06J81qQ9O0j07m8K02N
7217A01j87k8K38k27O6J73k54K12j96J03q1J5o6R9O6k0kJ0j75M04q7j82J0K3M9
$$ plain form
7242 64 -21 -65 123 110 71 118 -156 160 69 94 -151 15 -6 -150 -61 7 75 -46 -85 -113 137 -62 -34 6 5 104
7268 104 -134 -63 33 42 -134 -152 42 -118 -110 -150 95 68 -38 132 44 -116 87 -232 35 128 -9 42 -23 -18 37
7293 37 -13 -69 87 -40 137 62 -141 18 -184 -95 -90 -98 31 -13 -98 -162 -56 -31 -6 -19 -127 116 -75 -69 -92 137
7319 137 154 139 34 83 -138 40 84 -42 -137 64 24 -34 48 -47 -56 37 261 46 -5 -15 148 -101 65 75 -126
7344 -126 165 13 61 -2 -3 114 -92 -55 29 -21 -85 93 289 44 149 45 -168 3 -58 -45 35 -70 45 -57
7368 -57 -132 46 -59 29 61 -85 28 8 -61 36 -113 39 18 164 -42 13 -161 -50 -44 93 -80 265 -117 -28
7392 -28 4 160 -95 -273 9 88 82 -67 1 -192 -144 89 127 -49 -54 -16 -24 -22 114 -144 -1 -103 -125 84 -71
7417 -71 51 -10 81 -72 -67 -66 47 81 -159 124 -199 23 84 -139 7 -242 44 -39 109 136 -31 -146 -9 18
$$ packed form
7242F4q5m4J88j3l9M7k74L16r1K5k45J66k1j44Q9O8O8j21l9k8K50j99K8M0jR9
7268A04k38P1R6Rj76j8J94j60Qm0K45k7j06J70q8j60K03l19K67R3j37N1o5NN5
7293C7n0n6J56j27J77p5k03J59k02Q9NqJ29m4q5o4J06K5K5j3j08K43j91Ok3K29
7319A37J7j5j05M9k21J78M4j26r5K01m0n8Q2r5rR3K24k15n1j0J63k49J66J0k01
7344a26K91j52M8o3jJ17k06L7Q4n0o4J78J96k45J05j04k13J71o1J3Q0j05J15j02
7368e7p5J78j05Q8L2j46J13k0o9R7j49J52k1J46k06N5j74J11OJ37j73L45l82Q9
7392b8L2J56k55j78K82P9oj49O8j93M8K33L8j76nL8qKJ36k58J43j02k2K09j55
7417g1J22o1R1j53NJJ13L4k40K83l23K22O1k23J46k49K86q3J48K7j67j15J37K7
$$ plain form
7441 18 71 39 -35 139 131 29 60 -85 -9 147 100 -48 43 62 119 18 -50 3 -24 -59 158 85 -18 -12 64 -27 264
7468 264 53 162 30 -45 -27 -159 -21 -28 -24 -29 -33 -202 44 111 88 -74 -94 121 -124 -89 6 -191 -69 -36 -77 4
7494 4 -23 -10 -135 -38 92 48 -53 -76 -88 -24 -72 -73 0 -146 14 37 -54 93 -117 18 54 108 23 -33 -205 -41
7520 -41 -196 -150 -46 53 -141 -73 249 -87 154 -123 -118 -77 67 19 96 65 90 94 -184 -226 96 -23 4 -49 -145 26
7546 26 28 167 73 3 -194 78 65 182 0 38 186 -26 -112 104 -18 -104 8 30 -102 -151 82 88 -30 -2 14
7571 14 49 -91 -20 -109 -240 73 13 87 227 86 -33 -105 31 -3 -145 122 -82 59 -64 109 -68 26 32 83
7595 83 -47 -51 67 -20 -27 108 56 -129 -45 -70 -68 -69 160 -85 85 262 21 -201 -23 -35 -33 -206 156 -4 -40 -1
7621 -1 97 115 -112 18 103 -31 54 -65 73 64 113 65 29 168 -20 165 34 7 -74 -81 -76 8 29 -142 30 97 84
$$ packed form
7441A8N3l2p4J74qj02L1j45P6J56m7j48R1J9N7j01o8N3k7l5K17p3j03OP6r1K91
7468B64k11J09j32p5J8j32J38pMnmj69K46O7k3j62k0K15k45L5R5j97J22L3m1Q1
7494Dk7J3j25R7J30m4j01k3j2O4m8jP3j46J60K3r1J47k10J35L6N4q5n6j72J64
7520d1j55M6J04R9j94O8L22l36K41k77NM1J44m8P7l1K5Mk78m2L22j19K7n3r6J71
7546B6KJ39r4p0j97K72j3J17j82L8J48k12q6K16j22q6J12K2j32m9K33Oj18K8J6
7571A4L5j40P1q9j31L13o0P4J40j41j19p2J36l4j42K67k04J41j23J73j77R4ON1
7595H3j30mJ18q7pJ35n2j85Q4k5KjK29k45J70J77k41k22J78j2Kj73L62j60l6L9
7621aR8J8k27J30Q5j34Q5j19J38rM9m8l6J39j88J85j31k7q1pNQ4K1j71J72O7j3
$$ plain form
7648 84 26 -43 181 -59 108 -74 124 -71 -20 133 -4 4 99 -16 -109 -102 148 20 -120 -2 116 13 -204
7671 -204 70 50 -67 34 -18 -71 34 108 121 -200 121 -73 34 36 43 -115 -18 -6 180 -30 20 146 -256 104
7695 104 -5 61 11 -45 -191 -252 -14 77 10 84 9 1 22 7 136 -85 5 47 226 13 49 173 -52 -51 48 -88
7721 -88 -47 162 58 38 -18 37 78 -82 -54 -102 -116 85 91 -52 29 -16 -37 -103 121 77 116 -152 60 -99 -26 8
7747 8 -86 -93 -45 33 -104 -45 -48 -50 89 -44 -55 -32 -62 -117 109 -62 20 -91 23 62 4 -158 -1 -54 28 13 -220
7774 -220 39 53 11 -202 -226 -172 135 31 -2 141 -74 -58 10 112 -41 81 164 -53 -34 -41 69 -132 94 -75
7798 -75 -94 -42 73 11 -71 -65 73 103 138 174 158 149 118 50 70 -3 71 -118 79 -238 86 -95 -231 -11 -22 -31 -100
7825 -100 26 -75 -50 -58 -92 26 -22 -127 189 -57 47 104 -158 65 137 -169 -13 81 9 47 -25 -30 29 -34 -44
$$ packed form
7648H4n8o9K24k40J67j82J98j95N1J53j37QR5j15r3PK50j28j40J18J18j03k17
7671b04K74k0j17J01n2n3J05P4J3l21L21j94J07KPj58R7J2J86k10N0J26m02L60
7695A04j09O6n0n6j46o1K38R1o7P4p5qK1j5J29k21R0M2J79k13L6J24k25JR9j36
7721h8M1K09j04k0n6N5M1j60K8m8j4K01Oj43Q1m5k1o6K24m4L9k68K12j59P3L4
7747Hr4pM8P8j37N9lkJ39j33j1K3l0n5K26j71Q2j11J14L9n8j62J57n3Q2j5k33
7774b20K59J4m2k13k4N4L07j04l3J43k15J6O8J02j53J22Q3k17J9pJ10k01K26j69
7798g5j9N2J15o2q2OJ38L0L5L6j6rl1o8K0p3P4j89J97l17L24j81j36K20j1ro9
7825a00J26j01K5ql4J18m8j05L16k46J04N7k62K23P2l06J56R4p2L8p2nN9o3j0
$$ plain form
7850 -44 -80 -124 106 3 -26 36 0 -112 195 123 156 188 4 -137 -157 -47 35 47 5 28 49 94 92 13 53 -125 93
7877 93 14 68 -146 -64 -107 -133 135 -53 50 -30 54 -5 85 -90 -243 -74 -17 -146 72 22 -129 -90 176 -38
7901 -38 -97 67 219 85 25 69 38 56 24 155 -172 62 112 75 -217 -81 10 224 87 3 127 148 79 -97
7925 -97 103 46 -133 94 -6 55 -40 -265 148 100 16 -27 -10 -23 -110 53 -134 -144 -131 236 -136 14 79 -111
7949 -111 7 131 79 13 214 -89 58 1 188 -76 -66 95 156 -93 77 23 154 40 -119 -108 -74 -16 -98
7972 -98 -169 115 114 -125 -263 -71 5 37 101 181 -4 -45 -72 -72 87 -96 -2 -25 65 -37 -45 41 -26 -71 -131 -136 58 -16
8000 -16 -117 48 84 11 -97 -107 -12 98 2 -62 102 164 -2 -71 72 130 130 199 -9 -88 -22 38 138 68 -111 42
8026 42 -253 36 200 -42 -19 8 -53 -31 3 41 -34 -169 84 -97 -71 69 199 39 -74 137 105 29 -88 110
$$ packed form
7850d4l6m4K30j03k9O2l6j12L07p2L3L2j84j41k0J10Q2J2m2K3K1M5kp9M0j78K18
7877I3p9N4k14Q2m3k6K68j88J03q0Q4n9R0j75j53J69N7j29K18n0j51L9K66k14
7901c8n9J64J52j34o0M4l1J8l2J31l27K34N0l7k92J36R1K14j37q4J24K1o9j76
7925i7K00n7j79K27j00O1r5k25M13m8q4m3J7j3q7J63j87j0J3L67l72J50O5j90
7949a11J18J24n2o6K01l03J47n7J87k64J0J61O1k49J70n4J31j14j59J1L4N8q2
7972i8p1K84jk39j38J92P6L2O4Q0j85m1k7%J59j83R4k3R0j02qQ6o7m5o0nJ94p4
8000a6j01J65L6p3j08j0R5J10r6o4J64O2j66o9J43N8%O9k08p9O6O0J00p0j79J53
8026D2k95K89J64k42K3K7o1K2L4L8p5j35K53j81K6J40J30j60j13K11l2p6j17J98
$$ plain form
8050 110 -16 161 33 110 1 56 -1 -20 -105 -51 17 22 31 -2 28 142 22 -41 -33 -43 39 -59 -108 -78 -36 0 2 -68 -274
8079 -274 157 51 -61 -31 36 17 59 151 -127 -1 -31 4 46 -98 -58 -95 -100 8 99 -46 181 -8 -24 -183 54
8104 54 144 -197 28 78 -129 -76 -47 95 -12 135 13 170 -106 143 46 -73 149 -82 -159 152 55 -134 7
8127 7 40 -28 -33 50 48 29 -43 -14 -3 -50 -111 58 -27 47 101 50 130 268 -9 -43 175 -30 -80 -120 -23 -93 99 22 43
8156 43 65 47 -62 -94 -76 92 -169 -37 63 133 -88 247 -77 110 -34 138 -6 -74 29 143 -80 -38 54
8179 54 -25 -49 104 -87 -102 66 -61 -24 -110 14 -176 131
$$ packed form
8050A10j26J77j28P7j09N5n7j9q5N4O8NRl3L0J14j20o3Qj0Q2r8m9L0M2L6Kp0k06
8079b74M31j06j12L0O7j9M2R2k78J26l0L5M2j44M0l7nJ08R1j45K27j89j6j59K37
8104E4R0l41K25N0k07N3K9J42j07J47j22J57k76K49r7j19K22k31p7L11r7j89J41
8127GL3o8nQ3kj9p2K9J1m7o1J69q5P4N4n1Q0J38k77l4K18k05n0m0R7p0J92p7K1
8156D3K2j8j09l2J8J68k61J32J00P0k21L35l24J87j44J72j44o8J03J14k23M2R2
8179E4p9k4J53j91j5J68j27L7q6J24j90L07
8191A31
$$ Imaginary data points
##PAGE= N=2
##DATA TABLE= (X++(I..I)), XYDATA
$$ plain form
0 0 0 0 0 0 0 0 0 0 0 0 0 0 0 0 0 2 -32 32 -32 32 -32 64 -64 64 -96 96 -120 129 -160 161 -193 225 -257 289
34 289 -322 367 -418 459 -514 578 -643 711 -794 873 -968 1073 -1183 1304 -1438 1583 -1744
51 -1744 1922 -2114 2336 -2586 2859 -3177 3539 -3961 4465 -5059 5799 -6733 7959 -9635
65 -9635 12099 -16074 23546 -42577 199722 279336 -185604 -260446 -79577 153420 150436 9442
77 9442 -141539 -95112 4911 25188 8714 82704 77652 -51539 -133603 -46211 73756 128982
89 128982 53806 -109887 -175071 -10367 153363 103433 -40734 -81023 -40552 20845 64284
100 64284 46679 -2310 -7319 -25122 -80624 -43162 88593 98463 -37017 -104643 -36690 42015
112 42015 63929 28158 -34502 -39691 11250 901 -48138 -2650 76266 35044 -57285 -56774 9088
$$ packed form
0@%%%%%%%%%%%%%%%Kl4O4o4O4o4R6j28J28j60J92k16K49k89L21l54M18m82N46
34B89o11O89p85Q77r73J092j221J354j505J667j841K041k256K487k742L021l327
51a744L666m036M450m922N445o036O716p500Q426r524J0858j2532J4692j7594
65i635K1734k8173L9620o6123K42299P9614m64940p4842J80869K32997k984j40994
77I442j50981M6427J00023K0277j6474P3990n052j29191q2064Q7392J19967N5226
89A28982p5176j63693o5184J64704J63730m9930j44167m0289M0471O1397M3439
100F4284j7605m8989n009j7803n5502L7462J31755R870j35480o7626O7953P8705
112D2015K1914l5771o2660n189N0941j0349m9039M5488P8916m1222r2329N11O5862
$$ plain form
125 9088 61619 70172 1876 -83105 -49211 53909 50683 -31443 -42245 2527 15301 1959
137 1959 -15379 -17233 33510 67800 -18575 -110534 -36623 93060 78562 -34188 -89279 -50908
149 -50908 37906 94772 38829 -55633 -44218 25996 26904 -3821 6063 6684 -20390 -20508 -8770
162 -8770 -10693 13780 38964 -4392 -47643 -6158 40539 17503 -14655 -17816 -16586 1442 24688
175 24688 39 -29105 5480 34094 -3328 -19684 19620 26154 -8386 -16877 -7014 -2744 12815
188 12815 11236 -27531 -28598 22919 28595 -17032 -22074 6838 10374 9144 9312 -19111 -31653 10094
202 10094 29846 -4572 -13937 10342 5776 -8264 6346 13807 6740 11837 -4517 -41853 -20210
215 -20210 40858 30709 -29073 -35885 -2909 14923 23586 14670 -22653 -28059 11898 18786 -9729
$$ packed form
125I088N2531Q553o8296q4981L3894J03120l226q2126j0802M4772J2774j3342
137A959j7338j854N0743L4290q6375r1959P3911J29683j4498j12750n5091L8371
149e0908Q8814N6866n5943r4462J1415P0214R08l0725R884O21k7074j18J1738
162h770j923K4473K5184m3356m3251M1485M6697k3036l2158l161J230J8028K3246
175B4688k4649k9144L4585K8614l7422j6356L9304O534l4540q491R863M270J5559
188A2815j579l8767j067N1517N676m5627n042K8912L536j230J68k8423j2542M1747
202A0094J9752l4418r365K4279m566j4040J4610P461p067N097j6354l7336K1643
215b0210O1068j0149n9782o812L2976J7832Q663q916l7323n406L9957O888k8515
$$ plain form
228 -9729 -5997 8595 -9129 -12037 13619 13560 397 10881 6399 -19915 -7351 25104 10229
241 10229 -18395 -10838 -3797 -8372 6060 12249 -9960 -8851 14118 635 -19327 5714 21922
254 21922 -5635 -17836 -944 1374 1343 13696 2391 -15492 5251 23106 -1676 -13172 8233
267 8233 6456 -10281 -1952 1508 -13505 -3007 15562 -3352 -17617 5125 12651 -6073 -2206
280 -2206 7177 -7058 -8171 8789 627 -10020 10330 13907 -13234 -9342 18639 13016 -5262
293 -5262 -1194 -3364 -11063 6206 13620 -12036 -17409 7502 5853 -9877 1798 9202 -6696 -4840
307 -4840 8649 -3260 -9010 9387 6222 -14618 -3638 14726 2203 -4593 8346 3326 -6388
320 -6388 7097 8570 -11518 -6804 10758 -2663 -15465 1921 7422 -6478 -1653 5930 -6705
$$ packed form
228i729L732J4592j7724k908K5656n9j3163J0484m482k6314J2564L2455j4875
241A0229k8624P557P041m575J4432O189k2209J109K2969j3483j9962K5041J6208
254B1922k7557j2201J6892K318l1J2353j1305j7883K0743J7855k4782j1496K1405
267H233j777j6737Q329L460j5013J0498J8569j8914j4265K2742P526j8724L867
280b206R383j4235j113J6960q162j0647K0350L577k7141L892K7981n623j8278
293e262M068k170p699J7269P414k5656n373K4911j649j5730J1675P404j5898J856
307d840J3489j1909n750J8397l165k0840J0980J8364j2523o796J2939n020r714
320f388J3485J473k0088M714J7562j3421j2802J7386N501j3900M825P583j2635
$$ plain form
333 -6705 -4570 12760 2139 -14744 405 10981 -4995 -5457 8349 887 -4750 9501 6509
346 6509 -8999 1903 13259 -4718 -10971 5460 2540 -10362 -287 4961 -8522 -3783 9823
359 9823 -2506 -9769 7485 7746 -10290 -4191 8803 -1646 -4671 7751 757 -8712 7462 13248
373 13248 -5488 -5483 9310 1105 -7860 3848 2715 -10650 -2434 7165 -6187 -7411 8775 2983
387 2983 -10882 442 8528 -4411 -3873 7022 -2218 -7631 7453 6941 -7832 152 11406 -973
401 -973 -5493 7640 3341 -7903 1579 4994 -9188 -5588 7975 -1552 -10193 3231 5540 -7068
415 -7068 -993 7806 -3947 -6046 7418 2364 -9041 2628 8901 -4651 -3119 9462 1498 -5695
429 -5695 6163 5384 -7652 -709 7546 -5446 -8825 5561 2568 -8871 -304 5001 -6147 -2651
$$ packed form
333f705K135J7330j0621j6883J5149J0576j5976m62J3806p462n637J4251k992
346F509j5508J0902J1356j7977o253J6431k920j2902J0075N248j3483M739J3606
359I823j2329p263J7254K61j8036O099J2994j0449l025J2422o994r469J6174N786
373A3248j8736NJ4793q205q965J1708j133j3365Q216R599j3352j224J6186n792
387B983j3865J1324Q086j2939N38J0895r240n413J5084n12j4773P984J1254j2379
401i73m520J3133m299j1244R482L415j4182L600J3563r527q641J3424K309j2608
415g068O075Q799j1753k099J3464n054j1405J1669O273j3552J532J2581p964p193
429e695J1858p79j3036O943Q255j2992l379J4386k993j1439Q567N305j1148L496
$$ plain form
443 -2651 8839 -714 -8560 4284 5193 -6964 217 9281 -2667 -5943 7331 4394 -5135 4352
457 4352 7622 -6446 -5414 6822 -169 -7193 3016 1818 -10034 -1824 7993 -2931 -5755 6189
471 6189 1272 -9032 1716 8391 -3226 -3989 5319 -978 -4709 7818 6755 -6017 -650 7388
485 7388 -3016 -4555 7825 2433 -10222 -2244 3942 -5158 -2555 7213 -1742 -8824 2008 3884
499 3884 -4405 2173 7541 -5404 -7129 6445 3804 -5148 4439 7836 -6046 -5520 7468 3755
513 3755 -2449 3330 -423 -10078 -657 8474 -2741 -6445 2618 -2125 -8389 4998 10477 -4586
527 -4586 -7436 2637 -181 -2545 7831 5552 -7276 -3478 4413 -731 2263 11382 451 -12600
541 -12600 -1560 7497 -1467 -993 5495 -4391 -11484 551 6256 -866 585 1580 -7948 -4283 9149
$$ packed form
443b651J1490r553p846J2844R09j2157P181R064j1948l276J3274k937r529R487
457D352L270j4068J032J2236o991p024J0209j198j1852Q210R817j0924k824J1944
471F189m917j0304J0748O675j1617p63R308o297l731J2527j063j2772N367Q038
485G388j0404j539J2380n392j2655P978O186r100K603R768q955p082J0832J876
499C884q289O578N368j2945j725J3574k641q952R587L397j3882N26J2988l713
513C755o204N779l753r655R421R131j1215l704R063m743o264J3387N479j5063
527d586k850J0073k818k364J0376k279j2828L798P891n144K994R119j0931j3051
541a2600J1040R057q964M74O488r886p093J2035N705p122J451R95r528L665J3432
$$ plain form
556 9149 3755 -6080 1491 4475 -6008 -1444 11024 3432 -6911 154 2928 -2358 2881 6387
570 6387 -4604 -6748 2444 -998 -5436 5567 5970 -9457 -7975 5380 1826 -3289 5600 4851 -7082
585 -7082 -4819 3229 768 2965 8690 -1784 -10074 2073 8031 -1496 580 7072 -4305 -11103
599 -11103 2436 7399 -2727 -3513 79 -4990 -2171 6701 1173 -6109 1071 2169 -6324 1208 12013
614 12013 322 -10333 -629 4969 417 4552 7247 -4343 -8410 1027 2612 813 6048 841
628 841 -12027 -5679 7241 1082 -4389 4176 2145 -9102 -3736 6989 2078 -1886 2458 -672
642 -672 -3245 4463 3991 -5492 -372 7881 -996 -5522 5117 4535 -6624 -2409 5290 -1689 -4664
657 -4664 2506 268 -5334 -81 1014 -4205 1970 8251 -2706 -8231 2263 3315 -3836 3702 9584
$$ packed form
556I149n394r835P571K984j0483M564J2468p592j0343P065K774n286N239L506
570F387j0991k144R192l442m438J1003M03j5427J482J3355l554n115Q889p49j1933
585g082K263Q048k461K197N725j0474q290J2147N958r527K076O492j1377o798
599a1103J3539M963j0126p86L592n069K819Q872n528p282P180J098q493P532J0805
614A2013j1691j0655R704N598m552M135K695j1590m067R437J585j799N235n207
628H41j2868O348J2920o159n471Q565k031j1247N366J0725m911l964M344l130
642f72k573P708m72r483N120Q253q877m526J0639n82j1159M215P699o979k975
657d664P170k238n602N253J095n219O175O281j0957n525J0494J052p151P538N882
$$ plain form
672 9584 -2663 -8783 1312 4479 991 4417 1902 -6612 -3029 3017 -2555 -2459 7232 1779 -11238
687 -11238 -4187 7152 1151 -3271 2197 -476 -4883 2415 5446 -1885 -2044 2259 -1622 -49 8591
702 8591 2715 -8886 -2242 6127 -1005 -2337 6115 1402 -9030 -4557 2884 1531 2214 2120 -6041
717 -6041 -5962 4806 2977 -4550 2391 7188 -3874 -6511 4139 3935 -2518 1918 4521 -2428 -2064
732 -2064 3079 -862 -1670 4347 -189 -7128 813 5308 -4653 -5535 4283 1546 -5508 1155 5262 -2648
748 -2648 -4016 1670 711 896 5602 85 -6443 1450 6004 -2588 -1614 7534 2052 -8215 -2568 3616
764 3616 -209 318 3108 -3387 -5792 1435 1772 -2667 1893 2916 -5424 -3239 6433 2088 -5167 1397
780 1397 5127 -2163 -1542 4691 576 -3277 1267 1458 -1480 3355 2744 -6763 -4650 5579 1724 -5485
$$ packed form
672I584j2247o120J0095L167l488L426k515q514L583O046n572R6R691n453j3017
687a1238P051J1339o001m422N468k673m407P298L031p331j59M303l881J573Q640
702H591n876j1601O644Q369p132j332Q452m713j0432M473P441j353O83r4q161
717f041P9J0768j829p527O941M797j1062k637J0650k04o453M436K603o949L64
732b064N143l941q08O017m536o939P941M495r961q82R818k737p054O663M107p910
748b648j368N686r59J85M706n517o528P893M554q592R74R148n482j0267N647O184
764C616l825N27K790o495k405P227L37m439M560J023q340K185R672m345p255O564
780A397L730p290O21O233m115l853M544J91k938M835o11r507K113J0229l855p209
$$ plain form
796 -5485 517 3188 -4440 -3354 3468 304 -2068 3078 1153 -4254 703 3935 -1838 -506 5694
811 5694 381 -4846 2354 4242 -3490 -1414 5055 -518 -5119 582 1151 -3346 38 1924 -3365
826 -3365 -1575 4248 -1411 -5370 2790 5024 -3246 -1853 4525 203 -2847 2774 1990 -2665 1817
841 1817 3979 -2844 -2989 3197 103 -2942 2415 1953 -5635 -2511 3991 -830 -3850 2404 1730 -4176
857 -4176 -540 3475 -904 -849 3256 -562 -2926 3931 3441 -4507 -1163 5506 157 -3210 2018 1322
873 1322 -3856 44 2796 -2789 -2525 2865 -1110 -4380 1675 2572 -3388 -328 3777 -1858 -3430 3901
889 3901 2914 -3407 550 3998 -1285 -1661 3499 214 -2812 2051 1700 -4040 -354 3966 -2510 -4659
905 -4659 2382 1744 -3776 -399 2107 -2520 -1531 3747 231 -3152 1994 2650 -2905 -24 4174 -748
$$ packed form
796e485O002K671p628J086O822l164k372N146j925n407M957L232n773J332O200
811E694n313n227P200J888p732K076O469n573m601N701N69m497L384J886n289
826c365J790N823n659l959Q160K234q270J393O378m322l050N621p84m655M482
841A817K162o823j45O186l094l045N357m62p588L124O502m821l020O254o74n906
857d176L636M015m379N5M105l818k364O857m90p948L344O669n349l367N228o96
873A322n178L900K752n585K64N390l975l270O055Q97n960L060M105n635j572P331
889C901r87o321L957L448n283l76N160l285l026M863l51n740L686M320o476k149
905d659P041o38n520L377K506m627R89N278l516l383N146O56n555K881M198m922
$$ plain form
921 -748 -2238 3354 1647 -3595 931 3466 -2489 -2742 2667 -178 -3774 1242 1644 -3661 -619 3308
937 3308 -1809 -3130 3151 1761 -3898 409 3866 -1272 -1234 3489 2 -2797 2838 3129 -3106 -915
953 -915 3446 -1222 -2756 2707 716 -4190 111 2654 -2743 -2185 3115 -461 -3829 1697 2689 -2681
969 -2681 -264 3438 -1070 -2153 3541 1823 -3125 1153 3679 -1990 -1706 3440 -12 -3354 1604
984 1604 1817 -3751 -836 3192 -1878 -3550 2051 957 -3419 741 2832 -2389 -1470 3735 316 -2716
1000 -2716 2500 2778 -2652 -224 3806 -630 -2220 2731 793 -3480 628 2778 -2805 -2167 2679
1015 2679 -826 -3842 1449 1802 -3051 -646 3064 -1449 -2213 3345 1447 -3096 717 3294 -1646
1030 -1646 -614 3576 -33 -2994 2087 2248 -2923 -339 2859 -1630 -3293 2238 625 -3508 217
$$ packed form
921g48j490N592j707n242M526K535n955k53N409k845l596N016M02n305L042L927
937C308n117j321O281j390n659M307L457n138L8M723l487k799N635K91o235K191
953i15M361m668j534N463j991m906M301K543n397N58N300l576l368N526R92n370
969b681K417L702m508j083N694j718m948M278K526n669K84N146l452l342M958
984A604K13n568K915M028n070j672N601j094m376M160K091n221R19N205l419l032
1000b716N216K78n430K428M030m436j590M951j938m273M108K150n583O38M846
1015B679l505l016N291L53m853K405L710m513p64N558j898m543L813K577m940
1030a646J032M190l609k961N081J61n171K584L198m489j663N531j613m133L725
$$ plain form
1045 217 2098 -2882 -1662 3418 -123 -2972 1941 2366 -2509 73 3724 -597 -1777 2877 1191
1060 1191 -2989 1330 3040 -2320 -1717 2613 -602 -3354 1633 1693 -3522 -1099 2537 -1482 -2436 2408
1076 2408 1020 -3145 696 2950 -1798 -812 3466 -101 -2715 2513 2764 -2430 -30 3132 -1416
1091 -1416 -2647 2456 953 -2860 304 1338 -3095 -1473 3021 -676 -3273 1618 1531 -3176 -17
1106 -17 3675 -762 -2164 2288 1308 -2170 1645 2918 -1701 -823 2876 -577 -2283 2132 1389 -3551
1122 -3551 -723 2916 -1607 -3051 1881 584 -2957 231 2220 -1835 -654 2593 -998 -2653 2718
1137 2718 2250 -2328 363 3178 -1417 -2178 2944 1784 -2491 31 1495 -2329 -1120 2400 -903
1152 -903 -2396 1457 395 -3756 58 3213 -1610 -2673 2335 1299 -2465 848 2774 -1512 -778
$$ packed form
1045B17J881m980J220N080l541k849M913M25m875K582L651m321j180M654j686
1060A191m180M319J710n360O03M330l215k752M987O0n215K423L636m019r54M844
1076B408j388m165L841K254m748R86M278l567k614N228K51n194K400L162m548
1091a416j231N103j503l813L164J034m433J622M494l697k597M891q7m707L159
1106a7L692m437j402M452r80l478L815J273m619Q78L699l453j706M415p43m940
1122c551K828L639m523j444M932j297l541L188J989m055J181L247l591j655N371
1137B718m68m578K691K815m595p61N122j160m275K522J464l824J209L520l303
1152i03j493L853j062m151L814L155m823j063N008j036l764L313J926m286P34
$$ plain form
1167 -778 2970 223 -1507 2194 738 -3204 750 3502 -1806 -2871 2131 390 -3825 257 2641
1182 2641 -1740 -1313 1436 -1310 -1979 2357 1640 -2246 634 2594 -1970 -1459 3853 1250 -2813 961
1198 961 2981 -1949 -1845 2109 180 -1634 1221 -55 -3399 377 2298 -2270 -2145 3277 546 -3433
1214 -3433 763 2545 -1990 -1091 3081 951 -1498 1352 883 -1816 1308 2987 -1689 -1385 2829 -578
1230 -578 -4006 1075 3440 -1850 -2117 1444 -866 -2848 1287 1511 -1572 264 1368 -1886 -602 3504
1246 3504 255 -2939 2070 3518 -2487 -1823 2962 1019 -1853 1192 1238 -1866 -343 920 -2221 -949
1262 -949 2958 -367 -3332 845 1556 -3405 -1062 4288 758 -2907 656 1512 -1297 432 2263 -640
1278 -640 -99 2537 -968 -3206 1925 2834 -2442 -1084 2739 -1059 -3884 1012 2034 -1715 -510 1311
$$ packed form
1167g78L748k747j730L701j456l942L954K752n308j065N002j741m215M082K384
1182B641m381M27K749k746o69M336p17l886K880J960m564N11N312k603m063L774
1198I61K020m930J04L954j929j814K855j276l344L776J921m568J25N422k731l979
1214c433M196J782m535Q99M172k130k449K850m69k699L124J679m676L04M214l407
1230e78l428N081K365n290k67L561k310j982M135K24l083J836J104l254J284M106
1246C504l249l194N009J448o005O64M785j943k872L045M6l104J523J263l141J272
1262i49L907l325k965M177P11m961K343N350l530l665L563Q56k809J729J831k903
1278f40N41K636l505k238N131R09n276J358L823l798k825M896J022l749J205J821
$$ plain form
1294 1311 -1299 -1317 1561 -624 -1700 2715 2311 -3034 -806 3565 -120 -2376 2226 2293 -1798 -851
1310 -851 1488 -1258 -957 2192 187 -2010 1059 156 -3776 -378 3990 -726 -3264 1458 1457 -2670
1326 -2670 -651 2818 270 -615 1553 -399 -1695 1682 1607 -1852 822 3231 -1819 -3203 1888 1432
1342 1432 -2885 -405 2470 -1116 -2526 479 -168 -1010 1800 1128 -2391 -228 2227 -1315 -1922 3093
1358 3093 2379 -2440 -214 2615 -1047 -1594 2007 1265 -1163 429 218 -2356 -55 2432 -1379 -2008
1374 -2008 2101 543 -3844 -557 3096 -598 -1389 1871 620 -1846 569 1148 -991 933 2643
1389 2643 -1281 -1877 2219 636 -2905 746 3006 -1629 -2578 1102 305 -1887 449 1283 -1416 -482
1405 -482 1253 -1651 -1364 2779 1095 -2365 684 2788 -1654 -1690 2547 1157 -1487 629 1263 -1446
$$ packed form
1294A311k610j8K878k185j076M415m04n345K228M371l685k256M602O7m091R47
1310h51K339k746L01L149k005k197L069r03l932L398M368m716k538M722jm127
1326b670K019L469k548q85K168j952j296L377p5l459K674K409n050j384N091m56
1342A432m317K480K875l586j410L005o47q42K810o72l519K163K455l542o07N015
1358C093p14m819K226K829l662n47L601p42k428J592k11k574K301K487l811o29
1374b008M109j558m387L287L653l694p91L260j251k466K415N79k139J924J710
1389B643l924n96M096j583l541L651K260m635r49L680p97k192K336Q34k699R34
1405d82J735k904K87M143j684l460L049K104m442l6M237j390k644K116O34k709
$$ plain form
1421 -1446 -583 1435 -867 -1138 1792 -84 -3143 166 2107 -1689 -1499 2511 195 -2688 272 1668
1437 1668 -870 -34 2090 -402 -743 1784 315 -2053 1316 2521 -1746 -1449 2163 69 -2420 614
1453 614 1693 -1367 -814 1056 -1146 -1484 1382 459 -1754 694 1821 -1964 -1081 2792 468 -1869
1469 -1869 1274 2032 -1483 -431 1794 -247 -1001 1365 30 -2139 423 1387 -1928 -1197 2109 -416
1485 -416 -2591 712 1408 -1825 -490 2102 -414 -1249 1581 641 -1501 1257 1904 -1255 -442 2098
1501 2098 -93 -2149 1178 1752 -2008 -681 1776 -754 -1833 996 357 -1757 221 1311 -1755
1516 -1755 -715 2085 -330 -1711 1328 1809 -1711 -260 2280 -230 -1207 1712 774 -1733 320 1412
1532 1412 -1519 -822 1791 -485 -2069 909 792 -2088 -485 1817 -609 -1557 1537 847 -1674 504
$$ packed form
1421a446Q63K018k302k71K930j876l059L309J941l796J90M010k316k883K960J396
1437A668k538Q36K124k492l41K527j469k368L369J205m267K97L612k094k489L034
1453F14J079l060N53J870k202l38K866r23k213K448J127l785Q83L873k324k337
1469a869L143P58l515J052K225k041p54K366j335k169K562R64l315P31L306k525
1485d16k175L303O96l233J335K592k516q35K830r40k142K758O47l159Q13K540
1501B098k191k056L327N74l760J327K457k530j079K829o39k114J978J090l066
1516a755J040K800k415j381L039M81l520J451K540k510r77K919r38k507K053J092
1532A412k931O97K613k276j584K978j17k880J603K302k426r48L094o90k521K178
$$ plain form
1548 504 1660 -1024 -448 2060 -246 -1701 1384 1394 -1705 -148 1741 -883 -1660 1303 312 -1880
1564 -1880 224 1287 -1504 -957 1608 -332 -1685 1175 1130 -1614 -37 1942 -653 -1263 1860 834
1580 834 -1544 770 1709 -1050 -742 1600 -393 -1587 953 826 -2023 -498 1338 -988 -1508 1056
1596 1056 330 -1833 410 1535 -1135 -512 1889 -42 -1593 1349 1248 -1345 -12 1889 -636 -1258
1612 -1258 1675 484 -1833 271 1292 -1483 -976 1236 -401 -1728 912 752 -1775 -72 1612
1627 1612 -731 -1237 1695 653 -1352 788 1623 -1093 -512 2006 -66 -1474 1007 1001 -1635 -73
1643 -73 1352 -883 -1414 1011 194 -1901 345 1236 -1443 -892 1489 -121 -1390 1114 935 -1320 334
1660 334 1707 -474 -834 1433 568 -1570 695 1381 -1129 -655 1327 -154 -1617 697 628 -1683 -339
$$ packed form
1548E04J156k684N76K508k306j455L085J0l099J557J889k624p77K963r91k192
1564a880K104J063k791N47K565j940j353K860m5k744J577J979k595o10L123j026
1580H34k378K314R39k759L08K342j993j194K540j27k849J525J836k326n20K564
1596A056p26k163K243J125k670O23K401j931j551K942j01k593J333J901k525o22
1612a258K933j191k317K104J021k775N07K212j637j327K640j60k527J703J684
1627A612k343n06K932j042k005K140Q35k716N81K518k072j408K481ok636J562
1643g3J425k235n31K425q17k095K246Q91k679N51K381j610j269K504j79k255J654
1660C34J373k181l60K267q65k138K265O86k510M74J982j481j463K314o9k311J344
$$ plain form
1677 -339 1377 -730 -1232 1273 578 -1416 794 1374 -1076 -397 1801 -6 -1108 1159 982 -1213
1693 -1213 27 1488 -840 -1059 1354 222 -1711 383 1093 -1396 -902 1150 -366 -1510 955 885
1709 885 -1280 -122 1393 -341 -637 1528 308 -1432 924 1373 -1113 -518 1663 -209 -1264 869
1725 869 738 -1395 -373 1161 -841 -1027 1007 -14 -1588 615 979 -1362 -307 1826 -132 -1209
1741 -1209 1179 1243 -1109 157 1492 -461 -826 1440 379 -1257 759 847 -1451 -657 1377 -815
1757 -815 -1648 1054 912 -1718 -377 1217 -352 -879 1124 371 -1206 905 939 -1220 -179 1712 -91
1774 -91 -994 1116 942 -1351 -241 1413 -538 -1119 982 138 -1312 308 379 -1256 -121 1623 -613
1791 -613 -1455 1104 903 -1384 120 1669 -430 -875 1145 564 -752 657 1014 -945 -260 1161 -993
$$ packed form
1677c39J716k107n02K505o95j994K210N80k450O79K198j807j102K267j77k195
1693a213J240J461k328k19K413j132j933K094P10k489M94K052j516j144K465p0
1709H85k165J158J515j734k96K165j220j740K356M49k486N95K181j872j055K133
1725H69j31k133J022J534k002j86K034j021j574K203L64k341J055K133j958j077
1741a209K388O4k352J266J335j953l65K266j061j636K016Q8k298P94K034k192
1757h15q33K702j42k630J341J594j569n27K003p53j577K111L4k159J041J891j803
1774i1r03K110j74k293J110J654j951n81K101q44j450J620P1j635J135J744k236
1791f13q42K559k01k287J504J549k099m45K020n81j316J409L57j959O85J421k154
$$ plain form
1808 -993 -1362 1314 525 -1875 -291 1128 -961 -1334 930 363 -899 245 818 -907 -161 1279 -123
1825 -123 -520 1611 873 -1616 10 1596 -467 -1021 1288 564 -1350 -3 440 -912 -139 717 -606
1842 -606 -1333 783 95 -1504 565 1777 -755 -1097 1119 705 -1048 693 1377 -366 -133 746 -576
1859 -576 -650 1197 338 -1278 385 1278 -1436 -1477 1176 339 -1382 194 776 -979 -668 867 42 -315
1877 -315 1246 342 -1198 625 1251 -913 -415 1778 534 -1755 135 1036 -826 -365 780 53 -1019
1894 -1019 330 -347 -1314 554 1243 -1126 -622 1415 -28 -1621 727 1638 -405 -239 1120 79
1910 79 -757 642 502 -531 742 724 -1374 -721 1359 -67 -1332 759 1117 -1479 -1319 930 61
1927 61 -562 593 452 -578 421 450 -931 -118 1983 222 -1433 666 1098 -1376 -631 1534 186
$$ packed form
1808i93l69K676p89k400J584J419k089l73K264n67j262J144N73j725P46J440j402
1825a23l97K131p38k489J626J586k063n54K309p24j914J347M43j352P73Q56j323
1842f06p27K116o88j599K069J212k532l42K216m14j753J741O84j743K33Q79j322
1859e76p4J847q59j616J663Q93k714m1K653q37j721J576N82j755L11J535q25l57
1877c15J561r04j540J823O26k164M98K193j244k289J890R01j862M61J145p27j072
1894a019J349o77r67J868O89k369N04K037j443j593K348R11k043J66J359j041
1910G9q36J399j40j033J273j8k098O53K080j426j265K091L58k596J60K249q69
1927F1o23J155j41j030R99K9j381Q13K101j761j655K099M32k474P45K165j348
$$ plain form
1944 186 -841 211 -53 -974 87 724 -827 -227 1089 -753 -1735 934 1197 -1117 -431 1287 -26
1961 -26 -1129 414 968 -345 450 716 -656 -325 708 -385 -1107 1202 908 -1794 -898 1154 -364
1978 -364 -1242 684 686 -845 -179 260 -704 -44 1314 -60 -527 1136 488 -1486 -262 1818 72 -1176
1996 -1176 674 567 -1208 -151 751 -405 -85 840 -738 -1286 681 327 -1219 76 1465 -414
2012 -414 -1377 922 732 -695 216 1105 -291 -438 493 -80 -487 1009 471 -1372 -105 836 -915 -1324
2030 -1324 996 617 -1196 -356 532 -590 -661 730 159 -316 583 182 -1142 104 1363 -232 -555
2047 -555 1124 519 -1176 -88 1083 -323 -423 618 -60 -1071 141 236 -812 94 898 -804 -976
2064 -976 928 322 -1112 47 1335 -225 -528 818 184 -573 642 714 -572 226 758 -759 -736 1047
$$ packed form
1944A86j027J052k64r21J061O37j551O00J316j842r82K669K63k314O86J718j313
1961b6j103J543N54j313P95K66j372L31J033j093p22K309k94k702Q96K052j518
1978c64q78J926Kj531O66M39r64O60J358j374m67J663o48j974J224K080j746j248
1996a176J850j07j775J057R02j156L20R25j578n48J967l54j546J295J389j879
2012d14r63K299j90j427R11Q89j396j47R31n73m07J496n38j843J267R41j751m09
2030a324K320l79j813Q40Q88j122p1J391n71m75Q99m01j324J246J259j595l23
2047e55J679o05j695J088J171j406j00J041o78j011J212R5j048R06Q04j702j72
2064i76J904o06j434J159J288j560l03J346o34p57J215P2j286P98N32j517K3J783
$$ plain form
2082 1047 355 -1237 -4 860 -923 -917 910 13 -806 265 384 -920 41 829 -462 -194 1200 207
2100 207 -1210 566 1158 -515 -498 997 228 -918 337 333 -832 -55 562 -665 -595 723 -18 -1135
2118 -1135 256 867 -745 -567 958 118 -896 536 847 -540 -44 874 -395 -396 861 325 -888
2135 -888 407 862 -1019 -469 732 -7 -1153 290 634 -1043 -33 755 -494 -420 728 162 -818
2152 -818 552 881 -672 -347 1040 70 -767 472 576 -723 -183 732 -416 -470 527 4 -1133 183
2170 183 735 -898 -306 868 -235 -766 561 577 -651 113 848 -235 -453 943 189 -588 475 691
2188 691 -778 -258 937 -154 -857 466 396 -949 -134 458 -580 -513 695 189 -891 361 568 -543
2206 -543 -114 1062 11 -665 903 719 -686 -139 911 -321 -710 604 199 -758 347 648 -882
$$ packed form
2082A047o92j592J233Q64j783OJ827q97q19J071J19j304R61P88j291K68J394r93
2100B07j417J776N92j673J7J495p69j146J255mj165P77O17j227P0J318p41j117
2118a135J391O11j612J78J525q40j014J432L11j387M96R18j269jJ257n36j213
2135h88J295M55j881N50J201p39j146J443L44j677J010P88j249P4J148n66r80
2152h18J370L29j553L25J387r70q37J239J04j299N40R15j148n4R97n23j137J316
2170A83N52j633N92J174j103n31J327J6j228P64P35j083k18J396p54p77J063K16
2188F91j469N20J195j091p03J323p0j345Q15N92j038O7J208n06j080J252K07j111
2206e43M29J176j051o76J568j84j405N47J050j232l89J314m05r57J105L01j530
$$ plain form
2223 -882 -285 632 -375 -920 325 330 -839 49 933 -416 -410 762 355 -734 399 592 -511 -174 811
2242 811 -97 -619 890 291 -768 -41 814 -675 -755 615 -63 -912 221 689 -706 -240 732 -333
2260 -333 -682 571 389 -555 55 870 -383 -360 937 233 -567 330 624 -715 -507 743 -209 -749 521
2279 521 135 -1017 3 756 -594 -626 557 176 -749 465 826 -584 -362 955 -163 -500 829
2296 829 431 -674 56 691 -611 -547 499 -78 -822 297 459 -917 -363 601 -232 -800 511 307
2314 307 -785 174 880 -562 -473 911 253 -550 429 620 -624 -214 742 -291 -649 510 301 -732
2332 -732 89 618 -566 -503 598 56 -842 331 682 -512 -360 835 -155 -594 623 376 -587 176
2350 176 690 -693 -481 928 -145 -850 126 385 -778 -296 573 -289 -849 498 239 -710 7 678
$$ packed form
2223h82N97R17j007n45J245Nj169Q88Q84j349OJ172m07j089J133J93j103L37R85
2242H11r08n22J509n99j059P27Q55j489q0J370o78q49J133M68j395M66R72j065
2260c33l49J253j82r44O10Q15j253K3J297p04q00Q97K94j339K08J250r52n40J270
2279E21l86j152J020P53j350l2J183l81r25J214L61j410K22J317j118l37J329
2296H29l98j105P30O35j302O4J046n77p44J119J62j376N54R64q33n68J311k04
2314C07j092R59P06j442Q9J384o58q03R79J91j244M10R56j033l58J159k09j033
2332g32Q21N29j184O3J101n42q98J173L51j194J52J195r90m39J217k47r63P63
2350A76N14j383K12J409j073p05R76K59j163M82Q69q62n60J347k59r49P17O71
$$ plain form
2368 678 -532 -593 776 -23 -587 454 782 -530 -43 954 -129 -560 551 285 -614 -83 399 -522
2386 -522 -426 724 -183 -727 388 484 -738 -272 766 -133 -623 516 372 -658 79 606 -366 -262 665
2405 665 -177 -923 501 698 -862 -212 800 -292 -1040 459 281 -953 -66 521 -565 -555 621 -269
2423 -269 -518 606 470 -627 -139 1068 -385 -595 556 684 -719 66 543 -447 -301 567 -36 -518
2441 -518 691 274 -762 -215 696 -485 -861 598 469 -759 -250 772 -136 -157 645 -50 -509 433
2459 433 414 -691 269 992 -315 -742 632 420 -938 -124 709 -477 -516 275 -246 -589 271 278 -686 -19
2479 -19 683 -670 -648 854 638 -767 -90 799 -360 -468 729 226 -411 236 367 -905 -5 560 -558
2498 -558 -487 909 -45 -1235 -210 809 -442 -465 796 281 -514 191 217 -490 377 789 -298 -389 804
$$ packed form
2368F78j210o1J369p99n64J041L28j312M87R97j083m31J111k66q99N31M82r21
2386e22R6J150r07n44J115R6j222M66J038q99m90J139j44j030P37N27r72J04R27
2405F65q42p46J424J97j560O50J012j092p48J499j78j234Q87N87j086J0J176q90
2423b69k49J124j36j097M88J207j453k10J151J28j403P85M77r90J46Q68o03m82
2441e18J209m17j036N47R11j181l76J459j29j228N09J022r08k1Q02o95m59R42
2459D33j9j105R60P23j307m27J374k12j358Q14Q33j186l9P91n21l43Q60Pr64O67
2479a9P02j353K2J502k16j405O77Q89j159j08J197n03o37O47J31j272R00N65j118
2498e58P1J396r54j190J025J019j251k3J261n15p95P05K6p07Q67M12j087r1J193
$$ plain form
2517 804 103 -829 277 909 -426 -657 516 -69 -921 122 367 -552 60 311 -840 -606 691 126
2535 126 -644 367 751 -662 -564 893 327 -361 446 408 -491 -192 357 -539 -248 728 -101 -899 160
2554 160 539 -884 -338 854 39 -920 63 374 -446 82 703 -120 -239 379 -185 -652 487 1015 -522
2573 -522 -132 979 -29 -919 143 611 -337 -109 418 -616 -534 338 36 -502 725 619 -924 -344
2591 -344 812 -77 -607 648 678 -542 -348 703 -256 -156 603 150 -448 385 233 -863 -266 853
2609 853 -71 -997 315 421 -730 -247 731 -84 -246 381 14 -455 501 651 -456 31 832 -390 -987
2628 -987 458 488 -681 -225 700 -425 -709 320 136 -408 194 305 -743 -271 674 -512 -585 844
2646 844 556 -809 -137 636 -54 -607 708 436 -259 70 335 -528 -49 481 -252 -696 490 104 -1007
$$ packed form
2517H04p01r32J106O32j335k31J173n85q52J043K45r19O12K51j151K34J297n65
2535A26p70J011L84j413R8J457n66o88Q07l8q99K99N49q96K91R76q29p98J059
2554A60L79j423N46J192q15r59R83L11q20N28O21q23j19O18n64m67J139N28j537
2573e22L90J111j008q90J062M68r48K28N27j034Q2Q72l02n38J227j06j543N80
2591c44J156q89n30J255L0j220J94J051r59J00P59m53n98Q33j52j096N97J119
2609H53r24r26J312J06j151M83R78q15j62O27l67m69R56J50j107M87Q01j222n97
2628i87J445L0j169M56R25j125k84J029j84n44O02J11j048M72R45j186p3J429
2646H44k88j365O72P73o90n53J315k72o95L29K65q63M79N30p33m44J186l86j111
$$ plain form
2665 -1007 -165 656 -268 -389 421 147 -615 106 504 -320 186 602 -359 -557 762 248 -819 109 864
2684 864 -344 -629 487 265 -515 270 80 -430 -128 483 -447 -660 532 241 -719 131 799 -414 -495
2703 -495 851 365 -464 179 267 -374 -54 414 -236 -476 508 -172 -1047 -51 503 -511 -548 537 -73 -755
2723 -755 -94 522 -305 -148 520 -218 -386 445 187 -428 207 889 -371 -388 672 145 -727 332 430 -561
$$ packed form
2665a007Q42Q21r24j21Q10k74p62P21L98q24N06M16r61j98J319n14j067R28P55
2684H64j208k85J116k22p80P85j90n10L02O11r30k13J192k91r60Q50O68j213q1
2703d95J346m86q29O43Q8o41L20M68o50k40R84o80q75R96N54j014l7J085o10o82
2723g55O61O16q27J57O68p38j68Q31k58o15O35O82j260j7J060n27q72J059R8r91
$$ [...]
8191f4
##END NTUPLES=NMR FID
##END=
