##TITLE=1H ikalashn
D-7
23.10.2024
##JCAMPDX= 6.0         $$ Bruker NMR JCAMP-DX V2.0
##DATA TYPE= NMR SPECTRUM
##DATA CLASS= NTUPLES
##ORIGIN= UXNMR, Bruker Analytische Messtechnik GmbH
##OWNER= root
$$ TOPSPIN		Version 1.3
$$ 2024-10-23 11:23:09.281 +0400  Irina@DPX200
$$ Compression mode = diff/dup
##.OBSERVE FREQUENCY= 200.131300845
##.OBSERVE NUCLEUS= ^1H
##.ACQUISITION MODE= SIMULTANEOUS
##.ACQUISITION SCHEME= undefined
##.AVERAGES= 16
##.DIGITISER RES= 18
##SPECTROMETER/DATA SYSTEM= spect
##.PULSE SEQUENCE= zg
##.SOLVENT NAME= D2O
##.SHIFT REFERENCE= INTERNAL, D2O, 1, 17.49637
##AUDIT TRAIL= $$ (NUMBER, WHEN, WHO, WHERE, WHAT)
$$ ##TITLE= Audit trail, TOPSPIN		Version 1.3
$$ ##JCAMPDX= 5.01
$$ ##ORIGIN= Bruker BioSpin GmbH
$$ ##OWNER= Irina
$$ $$ F:/spectra/data/iren/nmr/1H/4/pdata/1/auditp.txt
$$ ##AUDIT TRAIL=  $$ (NUMBER, WHEN, WHO, WHERE, VERSION, WHAT)
(   1,<2024-10-23 11:21:45.390 +0400>,<Irina>,<DPX200>,<TOPSPIN 1.3>,
      <acquisition in progress>)
(   2,<2024-10-23 11:22:53.015 +0400>,<Irina>,<DPX200>,<TOPSPIN 1.3>,
      <Start of raw data processing
       efp BC_mod = 2 LB = 0.02 FT_mod = 6 PKNL = 1 PHC0 = 311.5602 PHC1 = 14.62994 SI = 32K 
       data hash MD5: 32K
       03 59 09 AB 78 89 E9 26 45 28 6B F0 98 C0 A5 C1>)
(   3,<2024-10-23 11:22:55.500 +0400>,<Irina>,<DPX200>,<TOPSPIN 1.3>,
      <apk 
       data hash MD5: 32K
       ED A7 46 2F BA CB 29 22 55 4F F8 3E AD B2 6B 16>)
(   4,<2024-10-23 11:22:57.687 +0400>,<Irina>,<DPX200>,<TOPSPIN 1.3>,
      <abs n ABSG = 5 
       data hash MD5: 32K
       66 32 56 88 4F 9E AA 27 9C BA BC 17 89 4A 62 F6>)
$$ ##END=
$$ 
$$ $$ hash MD5
$$ $$ 25 38 B8 47 37 3E F2 1F B0 85 2D 9A BA 8D D5 B8
##$RELAX= 
##$RELAX= 
##$RELAX= 
##$RELAX= 
##$RELAX= 
##$RELAX= 
##$RELAX= 
##$RELAX= 
##$RELAX= 
$$ Bruker specific parameters
$$ --------------------------
##$DU= <F:/spectra>
##$EXPNO= 4
##$NAME= <1H>
##$PROCNO= 1
##$TYPE= <nmr>
##$USER= <iren>
##$AMP= (0..31)
100 100 100 100 100 100 100 100 100 100 100 100 100 100 100 100 100 100 
100 100 100 100 100 100 100 100 100 100 100 100 100 100 
##$ANAVPT= -1
##$AQSEQ= 0
##$AQ_mod= 1
##$AUNM= <au_zg>
##$AUTOPOS= <>
##$BF1= 200.13
##$BF2= 200.13
##$BF3= 200.13
##$BF4= 200.13
##$BF5= 200.13
##$BF6= 200.13
##$BF7= 200.13
##$BF8= 200.13
##$BYTORDA= 1
##$CFDGTYP= 0
##$CFRGTYP= 5
##$CHEMSTR= <none>
##$CNST= (0..63)
1 1 145 1 1 1 1 1 1 1 1 1 1 1 1 1 1 1 1 1 1 1 1 1 1 1 1 1 1 1 1 1 1 1 
1 1 1 1 1 1 1 1 1 1 1 1 1 1 1 1 1 1 1 1 1 1 1 1 1 1 1 1 1 1 
##$CPDPRG= <>
##$CPDPRG1= <>
##$CPDPRG2= <>
##$CPDPRG3= <>
##$CPDPRG4= <mlev>
##$CPDPRG5= <mlev>
##$CPDPRG6= <mlev>
##$CPDPRG7= <mlev>
##$CPDPRG8= <mlev>
##$CPDPRGB= <>
##$CPDPRGT= <>
##$D= (0..63)
0 2 0 0 0 0 0 0 0 0.06 0 0.03 0 0 0 0 0.0002 0 0 0 0 0 0 0 0 0 0 0 0 0 
0 0 0 0 0 0 0 0 0 0 0 0 0 0 0 0 0 0 0 0 0 0 0 0 0 0 0 0 0 0 0 0 0 0 
##$DATE= 1729668170
##$DBL= (0..7)
120 120 120 120 120 120 120 120 
##$DBP= (0..7)
150 150 150 150 150 150 150 150 
##$DBP07= 0
##$DBPNAM0= <>
##$DBPNAM1= <>
##$DBPNAM2= <>
$$ [...]
##$SW_h= 4401.40845070422
##$TD= 16384
##$TD0= 1
##$TE= 300
##$TE2= 300
##$TE3= 300
##$TEG= 300
##$TL= (0..7)
0 120 120 120 120 120 120 120 
##$TP= (0..7)
150 150 150 150 150 150 150 150 
##$TP07= 0
##$TPNAME0= <>
##$TPNAME1= <>
##$TPNAME2= <>
##$TPNAME3= <>
##$TPNAME4= <>
##$TPNAME5= <>
##$TPNAME6= <>
##$TPNAME7= <>
##$TPOAL= (0..7)
0.5 0.5 0.5 0.5 0.5 0.5 0.5 0.5 
##$TPOFFS= (0..7)
0 0 0 0 0 0 0 0 
##$TUNHIN= 0
##$TUNHOUT= 0
##$TUNXOUT= 0
##$USERA1= <user>
##$USERA2= <user>
##$USERA3= <user>
##$USERA4= <user>
##$USERA5= <user>
##$V9= 5
##$VALIST= <valist>
##$VCLIST= <CCCCCCCCCCCCCCC>
##$VD= 0
##$VDLIST= <DDDDDDDDDDDDDDD>
##$VPLIST= <PPPPPPPPPPPPPPP>
##$VTLIST= <TTTTTTTTTTTTTTT>
##$WBST= 1024
##$WBSW= 25
##$XGAIN= (0..3)
0 0 0 0 
##$XL= 0
##$YL= 0
##$YMAX_a= 365305
##$YMIN_a= -560189
##$ZGOPTNS= <>
##$ZL1= 120
##$ZL2= 120
##$ZL3= 120
##$ZL4= 120
##$ABSF1= 17.49637
##$ABSF2= -4.496376
##$ABSG= 5
##$ABSL= 3
##$ALPHA= 0
##$AQORDER= 0
##$ASSFAC= 0
##$ASSFACI= 0
##$ASSFACX= 0
##$ASSWID= 0
##$AUNMP= <proc_1d>
##$AXLEFT= 0
##$AXRIGHT= 0
##$AXTYPE= 0
##$AXUNIT= <>
##$AZFE= 0.1
##$AZFW= 0.1
##$BCFW= 0
##$BC_mod= 2
##$BYTORDP= 0
##$COROFFS= 0
##$CY= 7568.61572265625
##$DATMOD= 1
##$DC= 0
##$DFILT= <>
##$DTYPP= 0
##$F1P= 17.9538593292236
##$F2P= -4.03888763876832
##$FCOR= 0.5
##$FTSIZE= 32768
##$FT_mod= 6
##$GAMMA= 0
##$GB= 0
##$INTBC= 0
##$INTSCL= 1.936888e-010
##$ISEN= 128
##$LB= 0.02
##$LEV0= 0
##$LPBIN= 0
##$MAXI= 945.577
##$MC2= 0
##$MEAN= 0
##$ME_mod= 0
##$MI= -402.1523
##$NCOEF= 0
##$NC_proc= -6
##$NLEV= 6
##$NOISF1= 8.587773
##$NOISF2= 6.764455
##$NSP= 0
##$NTH_PI= 0
##$NZP= 0
##$OFFSET= 17.49637
##$PC= 1
##$PHC0= 313.9545
##$PHC1= 9.373834
##$PH_mod= 1
##$PKNL= yes
##$PPARMOD= 0
##$PPDIAG= 0
##$PPIPTYP= 0
##$PPMPNUM= 100
##$PPRESOL= 1
##$PSCAL= 0
##$PSIGN= 0
##$REVERSE= no
##$SF= 200.13
##$SI= 32768
##$SIGF1= 16.12182
##$SIGF2= -4.496377
##$SINO= 3.521527
##$SIOLD= 32768
##$SREGLST= <1H.CDCl3>
##$SSB= 0
##$STSI= 32768
##$STSR= 0
##$SW_p= 4401.40845070422
##$SYMM= 0
##$S_DEV= 0
##$TDeff= 16384
##$TDoff= 0
##$TI= <>
##$TILT= no
##$TM1= 0
##$TM2= 0
##$TOPLEV= 0
##$USERP1= <user>
##$USERP2= <user>
##$USERP3= <user>
##$USERP4= <user>
##$USERP5= <user>
##$WDW= 1
##$XDIM= 32768
##$YMAX_p= 272258747
##$YMIN_p= -719209
$$ End of Bruker specific parameters
$$ ---------------------------------
##NTUPLES= NMR SPECTRUM
##VAR_NAME=  FREQUENCY,     SPECTRUM/REAL,   SPECTRUM/IMAG
##SYMBOL=    X,             R,               I
##VAR_TYPE=  INDEPENDENT,   DEPENDENT,       DEPENDENT
##VAR_FORM=  AFFN,          ASDF,            ASDF
##VAR_DIM=   32768,         32768,           32768
##UNITS=     HZ,            ARBITRARY UNITS, ARBITRARY UNITS
##FACTOR=    0.134324425510551, 1,           1
##FIRST=     4401.40845070422, -8185,        -1204384
##LAST=      0,             115132,          -1312769
##MIN=       0,             -719209,         0
##MAX=       4401.40845070422, 272258747,    0
$$ Real data points
##PAGE= N=1
##DATA TABLE= (X++(R..R)), XYDATA
$$ [...]
12181A472593j7190L9320J57315J64463j5604j76471j23478K8568O1531r76J0183
12170A600254Q9188Q5043j5491p7496n9095m1649l7757J5074P5228K9916p8671
12159A584544p8374M6137J09848L1852l4916K4331R0567K4223j00440j36968j04097
12148A456707j03606j05038o156J46884J89772Q4216l0225m8501k4884m2131p1298
12137A445740l4117O2206J26427R9255J8644l5570l7798l6803p5554j18234r5404
12126A318792r200O3314P6238N9825M4152J3806k6327k0274M4432Q0507J4168
12115A659433r6549j32949o5864L3884R3037P5131k5619j45060j56162j9324J18667
12104A338625R7374k1825m2955N4923Q0322n2879j62207p0380J12260J49794K6840
$$ y = [1472593, 1455403, 1494723, 1652038, 1816501, 1800897, 1624426, 1500948, 1529516, 1591047, 1590071, 1600254, 1689442, 1774485, 1758994, 1681498, 1622403, 1580754, 1542997, 1558071, 1633299, 1663215, 1584544, 1506170, 1552307, 1662155, 1694007, 1659091, 1683422, 1773989, 1798212, 1697772, 1560804, 1456707, 1353101, 1248063, 1241907, 1388791, 1578563, 1662779, 1632554, 1584053, 1559169, 1517038, 1445740, 1411623, 1473829, 1600256, 1699511, 1718155, 1682585, 1644787, 1607984, 1532430, 1414196, 1318792, 1309592, 1372906, 1449144, 1508969, 1553121, 1566927, 1540600, 1520326, 1564758, 1645265, 1659433, 1562884, 1429935, 1364071, 1397955, 1490992, 1566123, 1540504, 1395444, 1239282, 1219958, 1338625, 1435999, 1414174, 1371219, 1426142, 1506464, 1453585, 1291378, 1220998, 1333258, 1483052, 1509892]
12093A509892o4178l9769j6155n9172n6690N7012J28118M353j83489j66918O8776
12082A181780K44699J69362k6945j15152o3226O113K7557K4138P570k0857k7089
12071A407950q270k6075p3873k6216J34340J82972l1331k63733j75079J18215
12061A238900J74191q1674k20645K76K43289J44077j13144j33775N8474J42790
12051A452759N8096P129J8159o1798j79085j05883J18965J83594K781j51607j11590
12040A231520l8953o4486n9002O0521J23081J3949q9924j8080J09148J16627N8867
12029A443268M2058l569j25343j52094K1735J66750M8852j55017j22666P7319
12019A241293J05990o9689j33610L7569J80720Q5837r8205j33231j7472R4436
$$ y = [1509892, 1445714, 1405945, 1389790, 1330618, 1273928, 1330940, 1459058, 1463411, 1279922, 1113004, 1181780, 1426479, 1595841, 1568896, 1453744, 1390518, 1396631, 1424188, 1448326, 1455896, 1435039, 1407950, 1399680, 1373605, 1299732, 1273516, 1407856, 1590828, 1559497, 1295764, 1120685, 1238900, 1413091, 1331417, 1110772, 1111048, 1354337, 1498414, 1385270, 1251495, 1309969, 1452759, 1510855, 1517984, 1536143, 1474345, 1295260, 1189377, 1308342, 1491936, 1494717, 1343110, 1231520, 1192567, 1128081, 1069079, 1129600, 1252681, 1266630, 1176706, 1158626, 1267774, 1384401, 1443268, 1485326, 1481757, 1356414, 1204320, 1226055, 1392805, 1441657, 1286640, 1163974, 1241293, 1347283, 1277594, 1143984, 1181553, 1362273, 1448110, 1349905, 1216674, 1199202, 1293638]
12009A293638J11826M1092n7068q4134j3149J4955j20630k60642j40376J67880
11999I53392K85733P8332j37139p9890R3557R6444l0938n1744N0120Q4794M047
11988A346708m6680k496L6167P998k3241k1537m2926r4978q0498M4102J63948
11977A286567J45367J6835o9832l5763L4420J6322p9349j14800k4230O8521J6072
11966A260130j16745j21210M5950J81065J25801j2056m6191Q117L068p2974q3669
11955A171286J2103Q1361K5129p1666p5851l70L2823j4574m0408L8833J44003
11944A302669J24368k4728j36198j04634l8481p4504j35024m5982J45164J92848
11934A205498K9302j11363m8074P8943N5099p0250r8124o644O1095N7674N4621
$$ y = [1293638, 1405464, 1446556, 1389488, 1305354, 1292205, 1307160, 1186530, 925888, 785512, 953392, 1239125, 1317457, 1180318, 1100428, 1193985, 1290429, 1259491, 1207747, 1257867, 1342661, 1346708, 1300028, 1297532, 1333699, 1341697, 1318456, 1296919, 1253993, 1159015, 1078517, 1122619, 1286567, 1431934, 1448769, 1378937, 1343174, 1377594, 1393916, 1314567, 1199767, 1175537, 1244058, 1260130, 1143385, 1022175, 1068125, 1249190, 1374991, 1362935, 1316744, 1324861, 1327929, 1254955, 1171286, 1183389, 1264750, 1289879, 1218213, 1142362, 1141992, 1174815, 1160241, 1119833, 1158666, 1302669, 1427037, 1402309, 1266111, 1161477, 1122996, 1048492, 913468, 867486, 1012650, 1205498, 1234800, 1123437, 1075363, 1154306, 1209405, 1139155, 1041031, 1034387, 1095482, 1153156, 1207777]
11923A207777N0181j9187r0839l0678J06761J07661n4445j37356o874J27998L6765
11912A297764j51665j35052Q3889J84194J6112j61089p1270J48985J50311q9071
11902A273108k13421k9281J88861J17635j12582j27228R8860K13326N4653j20534
11892A343397r5263k8760j15641k05550o9176J65807J91895J4956p6395J8170
11882A143440J04344N8049j5650l0670m7427q9583q2028l3399m4113p9864J0268
11871H93367J86188K04148J3613j17271k1842R5801J3593j35398r8740P5610J37910
11860A246979L7629m8027k7251J1724J363j9962k9392n4350p4075l0114N1743
11849A066267P3568J6431k3563K4156J00831Q6482n2003j93088j68675J9991J50825
$$ y = [1207777, 1257958, 1238771, 1147932, 1117254, 1224015, 1331676, 1277231, 1139875, 1133001, 1260999, 1297764, 1146099, 1011047, 1094936, 1279130, 1295242, 1134153, 1062883, 1211868, 1362179, 1273108, 1059687, 1030406, 1219267, 1336902, 1224320, 1097092, 1195952, 1409278, 1463931, 1343397, 1248134, 1219374, 1103733, 898183, 829007, 994814, 1186709, 1201665, 1125270, 1143440, 1247784, 1305833, 1290183, 1259513, 1212086, 1122503, 1040475, 1007076, 962963, 883099, 893367, 1079555, 1283703, 1297316, 1180045, 1158203, 1254004, 1267597, 1132199, 1033459, 1109069, 1246979, 1284608, 1236581, 1209330, 1221054, 1222417, 1202455, 1173063, 1118713, 1044638, 1014524, 1066267, 1139835, 1156266, 1132703, 1156859, 1257690, 1344172, 1292169, 1099081, 930406, 950397, 1101222]
11838A101222N3431j25298j09921Q1339J56018J6656r0715m385R4289L5876l5644
11827A172868K5877N2415j12276k35618n0930K22283J82076p4883j01913J24080
11817A203979J53936j39229l02293n4623K31843J41993j26323j34710Q4407J54581
11807A213561M504p9520J3706O9154l0723r9378J3946J57118J16022o0389j50156
11796A167845p2929M3034P0373K3418k6251o5698j02796q0629N3998K03099J78431
11785A391895k9255j79622r7838O7947P4009m6282o8302L4759O8689k0188n8624
11774A137188K0121N3914k5153l5302J18839K20673P3457j59038j90405k6076
11764A188218J04698J01644M1979j7731o3066l6765N8854P2910p2009j82887n7874
$$ y = [1101222, 1154653, 1029355, 919434, 1000773, 1156791, 1173447, 1082732, 1078347, 1172636, 1208512, 1172868, 1198745, 1251160, 1138884, 903266, 852336, 1074619, 1256695, 1181812, 1079899, 1203979, 1357915, 1218686, 916393, 861770, 1093613, 1235606, 1109283, 974573, 1058980, 1213561, 1218065, 1138545, 1152251, 1221405, 1190682, 1091304, 1105250, 1262368, 1378390, 1318001, 1167845, 1094916, 1137950, 1208323, 1231741, 1205490, 1139792, 1036996, 956367, 1010365, 1213464, 1391895, 1362640, 1183018, 1085180, 1153127, 1227136, 1180854, 1112552, 1147311, 1216000, 1195812, 1137188, 1157309, 1211223, 1186070, 1150768, 1269607, 1490280, 1563737, 1404699, 1214294, 1188218, 1292916, 1394560, 1436539, 1418808, 1355742, 1318977, 1377831, 1450741, 1378732, 1195845, 1137971]
11753A137971J64917J91264K0200q5931l2790J7308j3004n48R8820J43160O6861
11742A708228J97K5907M2197k1531o1442K193O5875J9119o8767p1167M900O8843
11730A714552Q7837P4428K0423o1615r8546l6237Q5390J74574J61840L9310j05016
11719B056940j26176M761J17621O4448m7037k5067P4474M0611j05818j26312Q020
11708A936465M0373j18890j98777m339K51166K76243J13748j8972q2749j45698
11698B048570j46027r350J32868J13110P440n842M4008J3089n7223j7358Q2478
11687B205763N0865j06784j79084p4398Q3554J79750K03763J40745l842r0859
11677B409473M870J55056J32923j9198n4610N9397J03301J1547k1889P3171R4081
$$ y = [1137971, 1302888, 1494152, 1514352, 1428421, 1395631, 1412939, 1399935, 1399387, 1498207, 1641367, 1708228, 1708425, 1734332, 1776529, 1754998, 1693556, 1695749, 1761624, 1780743, 1711976, 1640809, 1645709, 1714552, 1802389, 1876817, 1897240, 1835625, 1737079, 1700842, 1786232, 1960806, 2122646, 2161956, 2056940, 1930764, 1935525, 2053146, 2117594, 2070557, 2045490, 2119964, 2160575, 2054757, 1928445, 1936465, 1976838, 1857948, 1659171, 1654832, 1905998, 2182241, 2295989, 2277017, 2194268, 2048570, 1902543, 1893193, 2026061, 2139171, 2146611, 2140769, 2184777, 2197866, 2140643, 2123285, 2205763, 2256628, 2149844, 1970760, 1896362, 1979916, 2159666, 2363429, 2504174, 2500332, 2409473, 2414343, 2569399, 2702322, 2683124, 2628514, 2687911, 2791212, 2802759, 2780870, 2854041, 2948122]
11666B948122n7979j69223p2082O7468M5138m2445o588Q4073L9456j02948j37080
11655B595912k0148R1609R5000L1641l3894o2553j5425P2358O0863r7883k16619
11644B500861j08176J10780J61261L518j26331p7281M0793Q2135O2501N0793K8776
11633B729630l3694p8920m6763J2086P673m4031l9187N2228J19170M9813r4806
11622B633199j27433J6810J66398J40006J0156j6615O2921N4222p4510j06125
11612B759029M3282J31554k0995j97253j12301J20272J80237N9726J9592J00751
11602C083894Q0806p4652j24998n337K6456j47821k57955q7462J43297J20687
11592B756915p0150j11387M2149J41218N7278o5209p0670J4710Q1896P8640K3275
$$ y = [2948122, 2890143, 2720920, 2648838, 2716306, 2761444, 2718999, 2712411, 2796484, 2835940, 2732992, 2595912, 2575764, 2667373, 2762373, 2794014, 2760120, 2697567, 2682142, 2754500, 2815363, 2717480, 2500861, 2392685, 2503465, 2664726, 2668244, 2541913, 2464632, 2505425, 2587560, 2650061, 2700854, 2729630, 2695936, 2617016, 2570253, 2582339, 2590012, 2545981, 2506794, 2559022, 2678192, 2728005, 2633199, 2505766, 2522576, 2688974, 2828980, 2839136, 2822521, 2885442, 2939664, 2865154, 2759029, 2802311, 2933865, 2912870, 2715617, 2603316, 2723588, 2903825, 2963551, 2983143, 3083894, 3164700, 3090048, 2965050, 2959713, 2986169, 2838348, 2580393, 2492931, 2636228, 2756915, 2686765, 2575378, 2617527, 2758745, 2816023, 2750814, 2680144, 2694854, 2776750, 2855390, 2878665]
11581B878665l0267m2970m6802r0390j10022O168J80422J77594j7804j01458Q6154
11570B889290K50822Q4109k12657k18417M4168J68040K6961p6310L0403J28677
11560C115086M5851n0559K130O4572j6484j08348m0519Q0979P1873q901L542Q0220
11548C239442Q7774M2318L4986L0932k5546l7282P2590J49623L6817j13914n7696
11537C460044J22503J41458j1502p3552L6449J20819Q0773M0217M2651k3583j18568
11526C817709l1340K09654K69368K6241j87300q9024J32978J74847R2525R7883
11516D513541J31080J0646j63394j40814M4677J29963M8841k8138k9300k9681
11506D487421m142J27702K30548Q5139j95690k51460k5219J46970Q4624L572O2036
$$ y = [2878665, 2848398, 2805428, 2758626, 2668236, 2558214, 2564382, 2744804, 2922398, 2904594, 2803136, 2889290, 3140112, 3224221, 3011564, 2793147, 2837315, 3005355, 3032316, 2956006, 2986409, 3115086, 3160937, 3110378, 3112508, 3177080, 3160596, 3052248, 3011729, 3092708, 3164581, 3155680, 3159222, 3239442, 3327216, 3369534, 3404520, 3435452, 3409906, 3372624, 3445214, 3594837, 3631654, 3517740, 3460044, 3582547, 3724005, 3712503, 3638951, 3675400, 3796219, 3876992, 3917209, 3959860, 3936277, 3817709, 3786369, 3996023, 4265391, 4291632, 4104332, 4015308, 4148286, 4323133, 4415658, 4513541, 4644621, 4655267, 4491873, 4351059, 4395736, 4525699, 4574540, 4546402, 4517102, 4487421, 4483279, 4610981, 4841529, 4926668, 4730978, 4479518, 4454299, 4601269, 4685893, 4689465, 4751501]
11495D751501P7867o5160j18511R6024K83630J10148k12793k30733K5649J10043
11485D827665q9757j82393N3879K93857J82587j27286k42068r0435P9011J17324
11475D822384J00292R6580P2794L3490M4789Q6901N6522m3613p8395r62N7385
11464E248167P632l6154M5678J43608P4198r6937j16819O1241J82814P5901r1930
11453E497399r1248K5357O5415L1904N7710J02816J4855j40553j26370N9045J42237
11442E638567K4706n5244M6077J18022r933j27226j258J84622J23273p9894q0134
11431E781578J13458J63935n698j03745k168O3297l9674q2730J00428K85262K16874
11420F490817K0640l4191L7308M0849k7118j4176Q4869J33741J01540O7115L3410
$$ y = [4751501, 4829368, 4764208, 4645697, 4741721, 5025351, 5135499, 4922706, 4691973, 4717622, 4827665, 4737908, 4555515, 4609394, 4903251, 5085838, 4958552, 4716484, 4626049, 4705060, 4822384, 4922676, 5019256, 5092050, 5125540, 5170329, 5257230, 5313752, 5270139, 5191744, 5190782, 5248167, 5255799, 5219645, 5265323, 5408931, 5483129, 5386192, 5269373, 5330614, 5513428, 5589329, 5497399, 5406151, 5431508, 5496923, 5528827, 5586537, 5689353, 5704208, 5563655, 5437285, 5496330, 5638567, 5663273, 5608029, 5654106, 5772128, 5762195, 5634969, 5633711, 5818333, 5941606, 5861712, 5781578, 5895036, 6058971, 6053273, 5949528, 5947360, 6010657, 5970983, 5888253, 5988681, 6273943, 6490817, 6511457, 6477266, 6514574, 6555423, 6528305, 6514129, 6598998, 6732739, 6834279, 6901394, 6934804]
11409F934804m0092p4745L0220J76681J70341K5930n0623J8930J01601J00929
11399G393976P3085O2331K9123n610N3436J74200J80026L3640n0914P9818K55619
11388H278730K11698k2978j62819n3516J59627K66007K30917J37537K1049j11263
11378H954989j60059m404K71039L74898J60485j25219j24552J48120L31435K38028
11368A0064760Q4953R9403J70020J04057o57O2015K09637J95147M4571J8035J58264
11357A1210205K39826J94935K13072L28245K93328L4697j32032J9495K53130K64295
11347A2919196J62791K16791L48196K89020R5563P5778K53985L26431J78929N8899
11337A4925579J39590K64337K66928K37728K87862L09873J90471O0665J05361
$$ y = [6934804, 6894712, 6819967, 6850187, 7026868, 7197209, 7223139, 7172516, 7191446, 7293047, 7393976, 7467061, 7529392, 7558515, 7552905, 7606341, 7780541, 7960567, 7994207, 7943293, 8023111, 8278730, 8490428, 8467450, 8304631, 8251115, 8410742, 8676749, 8907666, 9045203, 9066252, 8954989, 8794930, 8790526, 9061565, 9436463, 9596948, 9471729, 9347177, 9495297, 9826732, 10064760, 10149713, 10249116, 10419136, 10523193, 10522536, 10584551, 10794188, 10989335, 11033906, 11051941, 11210205, 11450031, 11644966, 11858038, 12186283, 12479611, 12514308, 12382276, 12401771, 12654901, 12919196, 13081987, 13298778, 13646974, 13935994, 14031557, 14107335, 14361320, 14687751, 14866680, 14925579, 15065169, 15329506, 15596434, 15834162, 16122024, 16431897, 16622368, 16683033, 16788394]
11328A6788394K65731L47042L15946K84175K79238K39767J90444K19021K94354
11319A9224112K95046K27103K32550L45476M13022L35106K33088K65824L88245
11310B1959572M34302L77626L51116M12301M50908L92121L52419M64780O35312
11301B5830457O47419M93281M11211N33265O79882O41182N11860N39436P22148
11292C1010141Q06392O89300N75367O45965P89670Q11920P49883P85653R37433
11283C7801724J036502R89297Q91700Q62891Q98638R31862R47366R88664J093893
11274D6442537J242551J347424J331400J248317J264558J449470J655645J715249
11266E7697151J686273J753439J931810K060371K089455K162018K353244K536401
$$ y = [16788394, 17054125, 17401167, 17717113, 18001288, 18280526, 18520293, 18710737, 18929758, 19224112, 19519158, 19746261, 19978811, 20324287, 20737309, 21072415, 21305503, 21571327, 21959572, 22393874, 22771500, 23122616, 23534917, 23985825, 24377946, 24730365, 25195145, 25830457, 26477876, 26971157, 27382368, 27915633, 28595515, 29236697, 29748557, 30287993, 31010141, 31816533, 32505833, 33081200, 33727165, 34516835, 35328755, 36078638, 36864291, 37801724, 38838226, 39827523, 40719223, 41582114, 42480752, 43412614, 44359980, 45348644, 46442537, 47685088, 49032512, 50363912, 51612229, 52876787, 54326257, 55981902, 57697151, 59383424, 61136863, 63068673, 65129044, 67218499, 69380517, 71733761, 74270162]
11258G4270162K609156K661445K784432K897353K937380L043100L318244L561715
11250I8082987L522387L329683L340491L587876L744093L670819L609219L683594
11242A26571149L624487L254691K885790K840367K853756K434979J673010J147361
11234A47285590J045588R14033M17759j64903m69813o28163r44690j318226j425043
11225A44712132j297723j278801j460468j570430j434573j209528j081902j013062
11217A34365645q78465o51594l68314p0525J73308L41326N48907Q94714J251508
11208A35606510J435473J549724J869206K375402K743979K872570L059147L494192
11200A55006203L928324M092938M145674M386285M769592N046337N213080N457024
$$ y = [74270162, 76879318, 79540763, 82325195, 85222548, 88159928, 91203028, 94521272, 98082987, 101605374, 104935057, 108275548, 111863424, 115607517, 119278336, 122887555, 126571149, 130195636, 133450327, 136336117, 139176484, 142030240, 144465219, 146138229, 147285590, 148331178, 149245211, 149662970, 149498067, 149028254, 148400091, 147455401, 146137175, 144712132, 143414409, 142135608, 140675140, 139104710, 137670137, 136460609, 135378707, 134365645, 133487180, 132835586, 132467272, 132396747, 132570055, 132911381, 133460288, 134355002, 135606510, 137041983, 138591707, 140460913, 142836315, 145580294, 148452864, 151512011, 155006203, 158934527, 163027465, 167173139, 171559424, 176329016, 181375353, 186588433, 192045457]
11192A92045457N759331N914738N904061N914940N995932N989390N817906N555491
11184B38897246N196524M631425L885311L114630K331237J401359L58215n81745
11176B59234202j385697k273040l296051m164525m669264m998097n406469n818001
11168B27223058o011542o008733n993348n981673n850193n605336n372973n173276
11160A81225984m921371m597679m227169l771025l243236k832085k655160k485530
11152A52492729k025517j402241j039002j010201r01854m38471J10937L78884
11144A46165264M52689O70000J057012J330654J394639J484935J770035K096431
11136A56421659K264046K339652K507888K735532K799917K631211K433072K397835
$$ y = [192045457, 197804788, 203719526, 209623587, 215538527, 221534459, 227523849, 233341755, 238897246, 244093770, 248725195, 252610506, 255725136, 258056373, 259457732, 259815947, 259234202, 257848505, 255575465, 252279414, 248114889, 243445625, 238447528, 233041059, 227223058, 221211516, 215202783, 209209435, 203227762, 197377569, 191772233, 186399260, 181225984, 176304613, 171706934, 167479765, 163708740, 160465504, 157633419, 154978259, 152492729, 150467212, 149064971, 148025969, 147015768, 146113914, 145675443, 145786380, 146165264, 146617953, 147287953, 148344965, 149675619, 151070258, 152555193, 154325228, 156421659, 158685705, 161025357, 163533245, 166268777, 169068694, 171699905, 174132977, 176530812]
11128A76530812K438235K312256J936314J445134R68805M88701n7975o49860j221469
11119A84190953j750011k240507k688832l106550l508717l836543l993787m017516
11111A59048490m085384m259778m363124m242656m019769l894293l827881l651550
11103A26704055l387037l186740l016924k714707k347390k167643k159260j994918
11095A05729436j574924j239663j231139j285294j060032o84597n15324n45008
11087I7593455m60782j89033J5879J3644m0349J5087J70890L89856O46705Q00275
11077I8955627P10150N22452N51961Q23133J027981J017364J003434J136368J219809
11068A06968279J074130Q92556R48258J159409J246620J171087J115504J132530
$$ y = [176530812, 178969047, 181281303, 183217617, 184662751, 185631556, 186120257, 186062282, 185412422, 184190953, 182440942, 180200435, 177511603, 174405053, 170896336, 167059793, 163066006, 159048490, 154963106, 150703328, 146340204, 142097548, 138077779, 134183486, 130355605, 126704055, 123317018, 120130278, 117113354, 114398647, 112051257, 109883614, 107724354, 105729436, 104154512, 102914849, 101683710, 100398416, 99338384, 98653787, 98138463, 97593455, 97132673, 96943640, 96959519, 96973163, 96932814, 96947901, 97118791, 97508647, 98155352, 98955627, 99665777, 100188229, 100740190, 101563323, 102591304, 103608668, 104612102, 105748470, 106968279, 108042409, 108934965, 109883223, 111042632, 112289252, 113460339, 114575843, 115708373]
11060A15708373J110368J035933J012934J030709R67718Q37842Q03394R06378
11052A23413649R87902R28444Q03400P46229P89749Q82687R52277R33614Q41083
11043A31279034Q02394R09776J066687J114318J069271J074956J157383J220848
11035A39694667J257723J340891J415281J348589J214511J246111J434454J471923
11027A50424150J231910J005483J046850J156177J009821O97998N73511O67192
11019A57813092O32063K87378j15092k74419k38623k72113m91268p84148j004431
11010A55552439j118456j188959j292049j451282j628560j773990j860255j858545
11002A43380343j749867j612332j613411j815395k050748k105782j977701j826912
$$ y = [115708373, 116818741, 117854674, 118867608, 119898317, 120866035, 121703877, 122507271, 123413649, 124401551, 125329995, 126133395, 126879624, 127669373, 128552060, 129504337, 130437951, 131279034, 132081428, 132991204, 134057891, 135172209, 136241480, 137316436, 138473819, 139694667, 140952390, 142293281, 143708562, 145057151, 146271662, 147517773, 148952227, 150424150, 151656060, 152661543, 153708393, 154864570, 155874391, 156572389, 157145900, 157813092, 158445155, 158732533, 158617441, 158343022, 158104399, 157832286, 157341018, 156556870, 155552439, 154433983, 153245024, 151952975, 150501693, 148873133, 147099143, 145238888, 143380343, 141630476, 140018144, 138404733, 136589338, 134538590, 132432808, 130455107, 128628195]
10994A28628195j729434j632991j528036j482735j491621j453643j342529j258750
10986A16708456j263872j285537j235550j118599r89472r00356r04726j003747
10978A08006597j085314j042742r49713r66385j077693j112593j037295j012506
10970I9722356j113735j227827j299534j425213j591842j602473j429618j357982
10962H8674132j544153j714101j602880j434029j563860j848182j845978j561491
10954G5559458j452387j659539j763204j488031j171153j223060j492567j540049
10946F3769468j296759j071423j040949j089152j090826j048667r63707q26663
10938E5341322p34001p86497q78281q06771n93719m73403n40538o34220o19255
$$ y = [128628195, 126898761, 125265770, 123737734, 122254999, 120763378, 119309735, 117967206, 116708456, 115444584, 114159047, 112923497, 111804898, 110815426, 109915070, 109010344, 108006597, 106921283, 105878541, 104928828, 103962443, 102884750, 101772157, 100734862, 99722356, 98608621, 97380794, 96081260, 94656047, 93064205, 91461732, 90032114, 88674132, 87129979, 85415878, 83812998, 82378969, 80815109, 78966927, 77120949, 75559458, 74107071, 72447532, 70684328, 69196297, 68025144, 66802084, 65309517, 63769468, 62472709, 61401286, 60360337, 59271185, 58180359, 57131692, 56167985, 55341322, 54607321, 53820824, 52942543, 52135772, 51542053, 51068650, 50528112, 49893892, 49274637]
10929D9274637n61026n39112m94602l79959k86122k87237l02919k48569j89770
10920D5985321k03505k13305j31879n5787j15549k11817j35635P6815J62063L5791
10910D5192513o9407K7980J84568J91907J18185J62748K93504K97417J57358J08640
10900D6665413K69709M53596M58979L57892L41531M23823M82139N03928N89378
10891E0546388P28945P74413O80122O16777P45280R69645J036756Q68373O92759
10882E7659458P89186J138152J412556J358612J111545J023413J210453J434541
10874F7137916J470897J405610J439610J554879J574364J463326J353611J305206
10866G8705419J259097J222787J284156J408889J434245J322757J223060J206880
$$ y = [49274637, 48713611, 48174499, 47679897, 47299938, 47013816, 46726579, 46423660, 46175091, 45985321, 45781816, 45568511, 45436632, 45380845, 45265296, 45053479, 44917844, 44994659, 45156722, 45192513, 45123106, 45151086, 45335654, 45527561, 45645746, 45808494, 46101998, 46399415, 46556773, 46665413, 46935122, 47388718, 47847697, 48205589, 48547120, 48970943, 49453082, 49957010, 50546388, 51275333, 52049746, 52729868, 53346645, 54091925, 55061570, 56098326, 56966699, 57659458, 58448644, 59586796, 60999352, 62357964, 63469509, 64492922, 65703375, 67137916, 68608813, 70014423, 71454033, 73008912, 74583276, 76046602, 77400213, 78705419, 79964516, 81187303, 82471459, 83880348, 85314593, 86637350, 87860410, 89067290]
10858H9067290J151676R88108Q61291R02002J011013J030475R78441R47094R11612
10849I7849002Q24707P73514Q42904R32230R15235Q78225R68608J098005J064627
10840A06147057R20657R25654J127925J283036J247693J179670J240502J347909
10832A15420103J371572J368217J446155J550007J559703J496415J465370J473111
10824A27150653J452441J407747J390523J369364J261505J082377R43707Q86107
10816A36944424Q03881N77411K40552k4736p6235J4592K5788j47361l61056m39480
10806A37557780m36310n29118p11423q00234p52170p37890q38741r03680q26571
10797A31021643p47214q11245r20608r22128q84769r60856j092689j105946j021486
$$ y = [89067290, 90218966, 91207074, 92068365, 92970367, 93981380, 95011855, 95990296, 96937390, 97849002, 98673709, 99447223, 100290127, 101222357, 102137592, 103015817, 103984425, 105082430, 106147057, 107067714, 107993368, 109121293, 110404329, 111652022, 112831692, 114072194, 115420103, 116791675, 118159892, 119606047, 121156054, 122715757, 124212172, 125677542, 127150653, 128603094, 130010841, 131401364, 132770728, 134032233, 135114610, 136058317, 136944424, 137748305, 138325716, 138566268, 138541532, 138465297, 138479889, 138505677, 138358316, 137997260, 137557780, 137121470, 136592352, 135880929, 135080695, 134328525, 133590635, 132751894, 131848214, 131021643, 130274429, 129463184, 128542576, 127620448, 126735679, 125774823, 124682134, 123576188, 122554702]
10788A22554702j023172j145664j235530j229184j243240j346145j437138j422694
10780A12471935j363649j377126j495216j657957j762422j725288j594629j561465
10772I9934183j728161j917436j891720j722543j709460j921903k080528j974212
10764H4988220j752855j671020j741251j803216j779311j694454j564459j423761
10756G1557893j363615j398317j391589j255401j113840j110138j157122j072227
10748F1695644q83405p86301q30838q65540q00563p22959p08537p01141o49637
10739E4746723o15001o58490p41190q08946q69694r16415q87266p91331p64990
10730D7693400q87434j028558j018524r07081q93089j015255j088095r86240q32289
$$ y = [122554702, 121531530, 120385866, 119150336, 117921152, 116677912, 115331767, 113894629, 112471935, 111108286, 109731160, 108235944, 106577987, 104815565, 103090277, 101495648, 99934183, 98206022, 96288586, 94396866, 92674323, 90964863, 89042960, 86962432, 84988220, 83235365, 81564345, 79823094, 78019878, 76240567, 74546113, 72981654, 71557893, 70194278, 68795961, 67404372, 66148971, 65035131, 63924993, 62767871, 61695644, 60812239, 60025938, 59195100, 58329560, 57528997, 56806038, 56097501, 55396360, 54746723, 54131722, 53473232, 52732042, 51923096, 51053402, 50136987, 49249721, 48458390, 47693400, 46805966, 45777408, 44758884, 43851803, 42958714, 41943459, 40855364, 39869124, 39036835]
10721C9036835q05622q84128r05453q12468o97165o34069o12577o29975p03924
10712C2351454p67681p05175n47830m82553n72022o25295m89466l21835l64871
10703B7474726n52623n96610m31001k98986l53691m36593l67496k33858k26256
10694B3977612l38916m05237l39539k06351j17420j54192l08757m30841l54897
10685B1321462j56280j17769l28032n05569l98351j69127j37478k90384l50229
10676A8868243k41382j60971k01357k26179j69646j61593k61604l28001k65491
10667A6852019j77558j56711j36505p4955p3945j72594k22858j36424o7671j60695
10657A5472103k83023k31548p1564l0858j38166k04190j29208j7512J3707l5617
$$ y = [39036835, 38231213, 37347085, 36441632, 35629164, 34931999, 34297930, 33685353, 33055378, 32351454, 31583773, 30878598, 30330768, 29848215, 29276193, 28650898, 28161432, 27839597, 27474726, 26922103, 26325493, 25894492, 25595506, 25241815, 24805222, 24437726, 24203868, 23977612, 23638696, 23233459, 22893920, 22687569, 22570149, 22415957, 22107200, 21676359, 21321462, 21165182, 21047413, 20719381, 20213812, 19815461, 19646334, 19508856, 19218472, 18868243, 18626861, 18465890, 18264533, 18038354, 17868708, 17707115, 17445511, 17117510, 16852019, 16674461, 16517750, 16381245, 16306290, 16232345, 16059751, 15836893, 15700469, 15632798, 15472103, 15189080, 14957532, 14885968, 14855110, 14716944, 14512754, 14383546, 14366034, 14379741, 14344124]
10647A4344124j17434j91938k11161j62225j14388j25355j43938j07348o1836
10638A3108501o2759n0185J6241P977j70646l27904k11896N4437R1031j60133
10628A2294664l19167j44486J08643J05638p6849j46984p1870m6931j18024j47594
10618A1437040j08469j19167j80916j48085j1643L2700j01298k16714j20257O8827
10608A0532018P7846j23305k69898j63854N8231J11157n4837j92168j09227M8026
10598I913989Q211k02869k73076p5269J15567L0763j76606j75713K0572R4711
10588I280280n4266j67791p2061N1842j846j23303r4246M6376Q2207l7520j53962
10577H755710j49451o3259J6189L3644k7503j06602q3711N3593J36368L3412j42194
$$ y = [14344124, 14226690, 14034752, 13823591, 13661366, 13546978, 13421623, 13277685, 13170337, 13108501, 13045742, 12995557, 13011798, 13019775, 12849129, 12521225, 12309329, 12363766, 12454797, 12294664, 11975497, 11831011, 11939654, 12045292, 11968443, 11821459, 11749589, 11702658, 11584634, 11437040, 11328571, 11209404, 11028488, 10880403, 10868760, 10901460, 10800162, 10583448, 10463191, 10532018, 10609864, 10486559, 10216661, 10052807, 10111038, 10222195, 10167358, 9975190, 9865963, 9913989, 9922200, 9719331, 9446255, 9370986, 9486553, 9517316, 9340710, 9164997, 9185569, 9280280, 9226014, 9058223, 8986162, 9038004, 9036158, 8912855, 8818609, 8864985, 8947192, 8909672, 8755710, 8606259, 8543000, 8559189, 8592833, 8565330, 8458728, 8375017, 8428610, 8564978, 8598390, 8456196]
10566H456196j93487j16857m7705j9007K3099L9908l2919r6970k0148R1458L1135
10555H114703j28967j21901M2790O6224j07136j53459O5255K10718J6522k41222
10545G763527j80498P8048J54177L3997k299O8481J4601j54084j67086N909Q0945
10534G695718l7956j04414L255O6878m7669j31116k1115Q5937j5270j60897r4805
10523G238546R2764J20150l6114j44535q5052M3675J24377J16920J3320j21131
10513G362920j36591R12R4403j5944j77832j33826Q6660K15156J27734m4379j50318
10502G228895j52074n2601R8515J51250J4126j52130j08953J04927K10334Q5921
10492G428210q8351j18461k5766O2947Q4477M3813j7736l0105K2554M7246j3229
$$ y = [8456196, 8262709, 8145852, 8098147, 8079140, 8102239, 8142147, 8109228, 8012258, 7992110, 8083568, 8114703, 7985736, 7863835, 7906625, 7972849, 7865713, 7712254, 7777509, 7988227, 8004749, 7763527, 7583029, 7661077, 7815254, 7849251, 7846952, 7915433, 7930034, 7775950, 7608864, 7614773, 7695718, 7657762, 7553348, 7556603, 7623481, 7575812, 7444696, 7423581, 7509518, 7494248, 7333351, 7238546, 7331310, 7451460, 7415346, 7270811, 7185759, 7229434, 7353811, 7470731, 7484051, 7362920, 7226329, 7227241, 7321644, 7305700, 7127868, 6994042, 7080702, 7295858, 7423592, 7379213, 7228895, 7076821, 7024220, 7122735, 7273985, 7288111, 7135981, 7027028, 7131955, 7342289, 7428210, 7339859, 7221398, 7195632, 7258579, 7343056, 7386869, 7369133, 7339028, 7361582, 7408828, 7395599]
10481G395599n1727K8426J07747L5933p6853k8477R9676O8550o7919k7381J79311
10470G662885K21471K2035r3139K8584J03875l5758r1555J59342L82751J93072
10460H553563j82677k43969N782J40124K9814m6408L4522P8182J4233L0064J64447
10449H577677J89910L7965m0958Q8579K01410J02971m2049r297J13191J15383
10439I334782L5566O7566K13976K83326J85253L2386l5843Q718J07576J80353
10429A0413659J80515J42341J38255J69802J75044J53772J70738K14989K02336
10420A1961451J57290K17599L81006M35946K70988Q0770R8557K65450L53077L06582
10410A4528716K63143K97391L49049L76090M01889M16054L78004L13745K79012
$$ y = [7395599, 7343872, 7372298, 7480045, 7515978, 7439125, 7410648, 7510324, 7578874, 7510955, 7483574, 7662885, 7884356, 7906391, 7813252, 7841836, 7945711, 7909953, 7818398, 7977740, 8360491, 8553563, 8370886, 8126917, 8132699, 8272823, 8302637, 8256229, 8290751, 8368933, 8383166, 8413230, 8577677, 8767587, 8805552, 8764594, 8853173, 9054583, 9157554, 9115505, 9106208, 9219399, 9334782, 9370348, 9437914, 9651890, 9935216, 10120469, 10152855, 10117012, 10125730, 10233306, 10413659, 10594174, 10736515, 10874770, 11044572, 11219616, 11373388, 11544126, 11759115, 11961451, 12118741, 12336340, 12717346, 13153292, 13424280, 13505050, 13603607, 13869057, 14222134, 14528716, 14791859, 15089250, 15438299, 15814389, 16216278, 16632332, 17010336, 17324081, 17603093]
10401A7603093K48376J78529J48993K67799M43395M46440K46042R6670J91127
10392A9870464L83705M00907K19810O5948P9561J63922J93585K09081K97915L89826
10382B2274724L33531J56136P3376J83415L06948K57225J41464J98370M00604
10373B4325793M62139K70286P2102J19785L26074M32536L76054L02213L03974
10364B6990956L34203L37529L07988K36077J34339R1086J68059K71631K58664
10355B9130532J42334N2146K1687j8524n7757j2698O4207k369k20508l59261k80529
10344B8459260j53245j79713k78547k55300j66468k40890m69066n59043l77611
10335B5779377j83110k56717m87346n42449l48761j58926j59250k52391k85478
$$ y = [17603093, 17851469, 18029998, 18178991, 18446790, 18890185, 19336625, 19582667, 19679337, 19870464, 20254169, 20655076, 20874886, 20940834, 21020395, 21184317, 21377902, 21586983, 21884898, 22274724, 22608255, 22764391, 22837767, 23021182, 23328130, 23585355, 23726819, 23925189, 24325793, 24787932, 25058218, 25130320, 25250105, 25576179, 26008715, 26384769, 26686982, 26990956, 27325159, 27662688, 27970676, 28206753, 28341092, 28432178, 28600237, 28871868, 29130532, 29272866, 29325012, 29346699, 29328175, 29270418, 29257720, 29321927, 29319558, 29099050, 28739789, 28459260, 28306015, 28126302, 27847755, 27592455, 27425987, 27185097, 26716031, 26156988, 25779377, 25596267, 25339550, 24852204, 24309755, 23960994, 23802068, 23642818, 23390427, 23104949]
10326B3104949k75945k93034k93148k29747j88736k37640k55798j20320L1504
10317B1242085k8619k37321l00888j44861j4282o6436j60205j69549k10327l64309
10307A9545288m43732k84075o3602n3735k12331l09495l17449l63175m03428k96340
10297A6797926j44855k06009m47035n45527l90942k42226k79649l34800k38172
10288A3968711j36642k29013m06809m18977k60814j58619k31464l61682l81592
10279A1383099k60236j14181r3995k22667l32985k54006n6831K8319n6485j43385
10269I876647j46539j79000k75451k66236q7437L6846o3179k03501j45891k650
10259H543609l8887k10728k35284n8616P0781r43j45822k01463j66677j00843
$$ y = [23104949, 22829004, 22535970, 22242822, 22013075, 21824339, 21586699, 21330901, 21210581, 21242085, 21213466, 20976145, 20675257, 20530396, 20516114, 20449678, 20289473, 20119924, 19909597, 19545288, 19101556, 18817481, 18753879, 18700144, 18487813, 18178318, 17860869, 17497694, 17094266, 16797926, 16653071, 16447062, 16000027, 15454500, 15063558, 14821332, 14541683, 14206883, 13968711, 13832069, 13603056, 13196247, 12777270, 12516456, 12357837, 12126373, 11764691, 11383099, 11122863, 11008682, 10914687, 10692020, 10359035, 10105029, 10048198, 10076517, 10020032, 9876647, 9730108, 9551108, 9275657, 9009421, 8921984, 8958830, 8895651, 8692150, 8546259, 8543609, 8504722, 8293994, 8058710, 8000094, 8070875, 8069932, 7924110, 7722647, 7555970, 7455127]
10249G455127k8685O725l7545j04606j03038o5418q3585j15138m6966O9106O2180
10238G008157p2308j55634j15058o4646o3898l1271M4893M6676m2778q0718k8554
10227F444861l4585j38056j44467L7039J73146M5636j85085k12054l6472P9152
10217F029115K6795m8413l9414j7555n0048p5257k1656P9312J44099J15307j1906
10206F130379j56675j73991j5662J60089J58959K749j18647j18597q0088n9434
10196E729082p535P3139P3642l2579j00295k7896O5946K2383r9560j13987k158
10185E580182P0756L1384O40O1556R8942o881j54961j54990j2587R0274P1742
10174E676057K5956J3976k6310j00749q2468O7732J70949P7619q7189j06160Q276
$$ y = [7455127, 7426442, 7433167, 7395622, 7291016, 7187978, 7122560, 7038975, 6923837, 6876871, 6945977, 7008157, 6935849, 6780215, 6665157, 6600511, 6536613, 6505342, 6550235, 6596911, 6554133, 6473415, 6444861, 6410276, 6272220, 6127753, 6164792, 6337938, 6383574, 6198489, 5986435, 5949963, 6029115, 6055910, 6007497, 5968083, 5950528, 5900480, 5825223, 5803567, 5882879, 6026978, 6142285, 6130379, 5973704, 5799713, 5784051, 5944140, 6103099, 6105848, 5987201, 5868604, 5788516, 5729082, 5721547, 5794686, 5868328, 5835749, 5735454, 5707558, 5773504, 5795887, 5696327, 5582340, 5580182, 5650938, 5682322, 5682962, 5744518, 5843460, 5836579, 5681618, 5526628, 5514041, 5604315, 5676057, 5702013, 5715989, 5689679, 5588930, 5506462, 5574194, 5745143, 5822762, 5735573, 5629413, 5637689]
10163E637689P5059M8109L6689O6862N4365M421R339M1702j2356r5934k3791J64158
10151F006312J84415l7966j91894m2286J94364J86124j4149r9257K386Q1503L3319
10140F302871j1078M4817J07672P0647k8561q5756n1913N0853J48553J57502Q2890
10129F788497L4374O6023Q1179K502o7305n753J05294J02088J0434j3840L5369
10118G138862K3353n0839k6245J35593K49218J64236l0844j36239o1975J18350
10108G523470K43250J88213L614j03097j9137J12987J15162M7439P6152J74741
10098H362794J93937J44413J40511J38229L5899l2313J32190L64650L04063O857
10088I791230q0490J45974K62738O2574o0223J95605M64915L09044k6191q937
$$ y = [5637689, 5712748, 5760857, 5797546, 5864408, 5918773, 5923194, 5932533, 5974235, 5961879, 5865945, 5842154, 6006312, 6190727, 6152761, 5960867, 5918581, 6112945, 6299069, 6284920, 6185663, 6188049, 6269552, 6302871, 6291793, 6336610, 6444282, 6514929, 6486368, 6400612, 6348699, 6399552, 6548105, 6705607, 6788497, 6822871, 6888894, 6970073, 6972575, 6905270, 6899517, 7004811, 7106899, 7117333, 7103493, 7138862, 7162215, 7111376, 7085131, 7220724, 7469942, 7634178, 7603334, 7467095, 7405120, 7523470, 7766720, 7954933, 7958547, 7855450, 7836313, 7949300, 8064462, 8111901, 8188053, 8362794, 8556731, 8701144, 8841655, 8979884, 9015783, 8983470, 9115660, 9480310, 9784373, 9791230, 9710740, 9856714, 10119452, 10182026, 10121803, 10317408, 10782323, 11091367, 11065176, 11056239]
10078A1056239L05014M04690J78645K8009J52415K92081K53421J88998K22958
10069A3082470K32347J61138J72586L16631L84889K76686J96659K95420M05742
10060A5524568L52390K60439L12749M23288M12507L34256L61706M70697M98902
10051A8951502M49609M90643O65493Q11725P97097O93986O73586Q01706R71433
10042B5306780J025891R56959R46027J126069J351619J371437J216534J177620
10034C4478936J330998J362100J035754N93714M13648M46774L25917m0465l33602
10025C9613774l25532k02643k49962m41715n36362m45417l07572k40678j99764
10016C6664129j14267l1448k9263n1978M1286K49816L77419K94687J60740K31505
$$ y = [11056239, 11361253, 11765943, 11944588, 11972597, 12125012, 12417093, 12670514, 12859512, 13082470, 13314817, 13475955, 13648541, 13965172, 14350061, 14626747, 14823406, 15118826, 15524568, 15876958, 16137397, 16450146, 16873434, 17285941, 17620197, 17981903, 18452600, 18951502, 19401111, 19891754, 20557247, 21368972, 22166069, 22860055, 23533641, 24335347, 25306780, 26332671, 27289630, 28235657, 29361726, 30713345, 32084782, 33301316, 34478936, 35809934, 37172034, 38207788, 38801502, 39215150, 39661924, 39987841, 39947376, 39613774, 39288242, 39085599, 38835637, 38393922, 37857560, 37412143, 37104571, 36863893, 36664129, 36549862, 36518414, 36489151, 36437173, 36478459, 36728275, 37105694, 37400381, 37561121, 37792626]
10006C7792626M85917O33731N29389L83511M55359O95714Q54183Q38871P95699
9997D3465000Q73945J067652J285865J462515J585707J691999J827230J972298
9989E5232211K057786K101226K242460K550484K873978L000382K911077K771993
9981G5741597K721828K767652K826750K769974K500192K094550J765465J549949
9973I4737957J176069M37770m25336r91276j221330j454336j854732k201494k288354
9964H5914938k213752k147872k090020k004950j944186j867825j595992j131836
9956G0918505p93516p94337r10263q26476o10066n25544n48377m31550j66590
9947F5311786P166L8612J35316L56362N01279N07945O11484R36829J244501J308834
$$ y = [37792626, 38278543, 38912274, 39441663, 39825174, 40280533, 40976247, 41830430, 42669301, 43465000, 44338945, 45406597, 46692462, 48154977, 49740684, 51432683, 53259913, 55232211, 57289997, 59391223, 61633683, 64184167, 67058145, 70058527, 72969604, 75741597, 78463425, 81231077, 84057827, 86827801, 89327993, 91422543, 93188008, 94737957, 95914026, 96351796, 95926460, 94935184, 93713854, 92259518, 90404786, 88203292, 85914938, 83701186, 81553314, 79463294, 77458344, 75514158, 73646333, 72050341, 70918505, 70124989, 69330652, 68420389, 67593913, 66983847, 66458303, 65909926, 65478376, 65311786, 65318952, 65357564, 65492880, 65849242, 66350521, 66858466, 67469950, 68406779, 69651280, 70960114]
9937G0960114J291079J467496J786609K000193K102648K309785K640883K845999
9929H7404806K808572K750959K909348L193265L330644L243306L107314L060254
9921A11808468K991584K684288K095534J403244P66455J36253o09968j414458
9913A19861400k073672k525729k919068l325869l580844l552097l401698l362448
9905I5119975l377510l219390k896464k647818k540096k380228k091501j863230
9897G4103738j792817j678720j377178j098612j070481j114826r03257n09602
9889F4558245l32696m84768o20643m57963j53150o000l3246l1597R5368K73481
9879F2807031M34700N82352P11062P96362Q67590J004793J245988J533272J758314
$$ y = [70960114, 72251193, 73718689, 75505298, 77505491, 79608139, 81917924, 84558807, 87404806, 90213378, 92964337, 95873685, 99066950, 102397594, 105640900, 108748214, 111808468, 114800052, 117484340, 119579874, 120983118, 121749573, 121885826, 121275858, 119861400, 117787728, 115261999, 112342931, 109017062, 105436218, 101884121, 98482423, 95119975, 91742465, 88523075, 85626611, 82978793, 80438697, 78058469, 75966968, 74103738, 72310921, 70632201, 69255023, 68156411, 67085930, 65971104, 65067847, 64558245, 64225549, 63740781, 63120138, 62662175, 62509025, 62503025, 62469779, 62438182, 62533550, 62807031, 63241731, 63824083, 64535145, 65331507, 66199097, 67203890, 68449878, 69983150, 71741464]
9870G1741464J863494J905929J980584K045605J912788J517230J096504R04330
9862H4967928P98142L76601m35690j219714j601036j706380j897296k257687k580298
9853G4444570k717307k696586k574870k404337k291470k283745k243786k029865
9845E5202604j749328j623951j644029j584931j361884j141087j066740j080407
9837D3950247j061447r76661q47369p17037o70655p32576p49868n65941l11189
9828C7317504k92123n47655p53046o54824l82180k09029k03531k50752k56333
9819C3768031j86784m2230R3724J06363M0075P8701K52303L61593L05126K49992
9809C5026894L13258L18968J07695j34739j58628q8878k35639n70438p62801p13613
$$ y = [71741464, 73604958, 75510887, 77491471, 79537076, 81449864, 82967094, 84063598, 84967928, 85766070, 86142671, 85706981, 84487267, 82886231, 81179851, 79282555, 77024868, 74444570, 71727263, 69030677, 66455807, 64051470, 61760000, 59476255, 57232469, 55202604, 53453276, 51829325, 50185296, 48600365, 47238481, 46097394, 45030654, 43950247, 42888800, 41912139, 41064770, 40347733, 39677078, 38944502, 38194634, 37628693, 37317504, 37025381, 36477726, 35724680, 35069856, 34687676, 34478647, 34275116, 34024364, 33768031, 33581247, 33539017, 33632741, 33739104, 33779179, 33857880, 34110183, 34471776, 34776902, 35026894, 35340152, 35659120, 35766815, 35632076, 35473448, 35384570, 35148931, 34578493, 33815692, 33102079]
9799C3102079o80455q19323r48956q96446p81235p77901q24204p67089o41782
9790B5964688o02183o62264o85675n98416m76850m28475m71027n31748n23712
9781B0984338m31642l33882l09887l33393l15277k45164k08987k55429l28689
9772A8221988l55836l25204k58997j84931j52969j97437k59597k33684j20953
9763A6132380n0983j06041k05376k23799j61470j23422j61675k07051j67482n5908
9753A4669173J5526k3339j05646j25942r8863j18054j69832j39165l2817r757
9743A3861284j03443j24059J3690Q9809o7350k42218j58071L6702P3k01195j82833
9732A2922389Q2976J86160l5702k28653j34630k353r9352k36422j47624Q313m6240
$$ y = [33102079, 32421624, 31602301, 30653345, 29756899, 28975664, 28197763, 27373559, 26606470, 25964688, 25362505, 24700241, 24014566, 23416150, 22939300, 22510825, 22039798, 21508050, 20984338, 20552696, 20218814, 19908927, 19575534, 19260257, 19015093, 18806106, 18550677, 18221988, 17866152, 17540948, 17281951, 17097020, 16944051, 16746614, 16487017, 16253333, 16132380, 16081397, 15975356, 15769980, 15546181, 15384711, 15261289, 15099614, 14892563, 14725081, 14669173, 14684699, 14661360, 14555714, 14429772, 14330909, 14212855, 14043023, 13903858, 13871041, 13861284, 13757841, 13633782, 13647472, 13737281, 13669931, 13427713, 13269642, 13306344, 13306417, 13105222, 12922389, 13005365, 13191525, 13155823, 12927170, 12792540, 12790187, 12690835, 12454413, 12306789, 12315102, 12268862]
9721A2268862j74100o0426K01150K36722Q592j56529j21286p7254j10878o0094
9711A1954759J04266J43593m8074k27231j62738L5291J22789N8713k8598n6375
9701A1896395k4979M2492R1271O3010n373j6397K8185L5620Q33P808L6416k8751
9689A2126530j53516j42550M3198J79036J08724j8708L082J25376J55396N5205
9679A2481773m2665m5042J2895M4944J608p0357l8408J45901K99876K06462l8341
9668A2958646j11525N7840J81135Q8113j0528O7000J29678k1605j72029k4850
9658A3141875K51459K55387J8903l6168K01779L59716K05793J105K7259J46842
9648A4573950J11451Q777P3529K48158K74937J32839O2350J65679K62180J96810
$$ y = [12268862, 12094762, 12034336, 12235486, 12472208, 12480800, 12324271, 12202985, 12125731, 12014853, 11954759, 12059025, 12202618, 12154544, 11927313, 11764575, 11799866, 11922655, 11981368, 11952770, 11896395, 11871416, 11913908, 12005179, 12068189, 12062816, 12046419, 12074604, 12110224, 12111057, 12118865, 12155281, 12126530, 11973014, 11830464, 11873662, 12052698, 12161422, 12142714, 12145796, 12271172, 12426568, 12481773, 12439108, 12394066, 12406961, 12451905, 12453513, 12383156, 12344748, 12490649, 12790525, 12996987, 12958646, 12847121, 12904961, 13086096, 13174209, 13163681, 13230681, 13360359, 13338754, 13166725, 13141875, 13393334, 13648721, 13667624, 13631456, 13833235, 14192951, 14398744, 14399849, 14427108, 14573950, 14685401, 14694178, 14767707, 15015865, 15290802, 15423641, 15485991, 15651670, 15913850, 16110660]
9638A6110660O7412M4103J23765J87839K05105K44544L20311L43551K58009J48547
9628A8053846J49778K65703L47855K81647J46359J27827K81990M53109M57191
9619B0565305L02521J76617K21755L74974M62417M21237L59366L79646M30049
9610B3693887M09058L55831L99543N31465N88072N05724M32328M94604O03651
9601B8014163O23314N98798O45333P11532O58812N21451M74403N55469O24589
9592C3427864O11447O02455O46799O74657O68008P19792Q37292Q70003P47766
9583C9806083O28478O72577Q05842Q54317Q04801P73763P98591Q18514Q13470
9574D6776436Q16389Q17414P85947P67505Q35929R54660R95084R04096P71625
$$ y = [16110660, 16178072, 16222175, 16345940, 16533779, 16738884, 16983428, 17303739, 17647290, 17905299, 18053846, 18203624, 18469327, 18817182, 19098829, 19245188, 19373015, 19655005, 20108114, 20565305, 20867826, 21044443, 21266198, 21641172, 22103589, 22524826, 22884192, 23263838, 23693887, 24102945, 24458776, 24858319, 25389784, 25977856, 26483580, 26915908, 27410512, 28014163, 28637477, 29236275, 29881608, 30593140, 31251952, 31773403, 32247806, 32803275, 33427864, 34039311, 34641766, 35288565, 35963222, 36631230, 37351022, 38188314, 39058317, 39806083, 40434561, 41107138, 41912980, 42767297, 43572098, 44345861, 45144452, 45962966, 46776436, 47592825, 48410239, 49196186, 49963691, 50799620, 51754280, 52749364, 53653460, 54425085]
9565E4425085P22561P98910R40674J033713R98831Q81414Q18757Q73668R55386
9556F2448999R62862R34236R68070J063449J145567J198109J255740J309006J338103
9547G2624141J400781J550701J701775J730494J697650J789642K023854K205806
9539H6724844K234369K248925K366866K470603K427492K362894K483104K717633
9531A06036730K803058K712273K722616K973492L214995L178942L002272L016278
9523A29660656L213927L244452K971309K721887K806566L026170K938702K508793
9515A53092462K176226K249233K513476K580723K414214K299742K404525K590436
9507A72321037K663754K633349K659183K843405L135542L402715L561239L657384
$$ y = [54425085, 55147646, 55946556, 56887230, 57920943, 58919774, 59801188, 60619945, 61493613, 62448999, 63411861, 64346097, 65314167, 66377616, 67523183, 68721292, 69977032, 71286038, 72624141, 74024922, 75575623, 77277398, 79007892, 80705542, 82495184, 84519038, 86724844, 88959213, 91208138, 93575004, 96045607, 98473099, 100835993, 103319097, 106036730, 108839788, 111552061, 114274677, 117248169, 120463164, 123642106, 126644378, 129660656, 132874583, 136119035, 139090344, 141812231, 144618797, 147644967, 150583669, 153092462, 155268688, 157517921, 160031397, 162612120, 165026334, 167326076, 169730601, 172321037, 174984791, 177618140, 180277323, 183120728, 186256270, 189658985, 193220224, 196877608]
9499A96877608L813432M065184M275447M259178L978330L554651L105135K646477
9491B26575442K177037J767059J502744J378102J308400J248842J245702J352206
9483B38555534J545932J779712K071522K444226K776673K858017K675548K515047
9475B57222211K611453K787906K658257K157172J617230J285121J033767O64620
9467B72037737K21010j97847o97397j387547k080401k487519k633897k790401
9459B59983738l047984l246988l304260l308437l269451l073285k752703k521085
9451B35459545k434526k276173j901742j473351j222555j196574j366234j753192
9443B21835198k283023k725395k972600l194804l532812l831071l895163l828152
$$ y = [196877608, 200691040, 204756224, 209031671, 213290849, 217269179, 220823830, 223928965, 226575442, 228752479, 230519538, 232022282, 233400384, 234708784, 235957626, 237203328, 238555534, 240101466, 241881178, 243952700, 246396926, 249173599, 252031616, 254707164, 257222211, 259833664, 262621570, 265279827, 267436999, 269054229, 270339350, 271373117, 272037737, 272258747, 272060900, 271363503, 269975956, 267895555, 265408036, 262774139, 259983738, 256935754, 253688766, 250384506, 247076069, 243806618, 240733333, 237980630, 235459545, 233025019, 230748846, 228847104, 227373753, 226151198, 224954624, 223588390, 221835198, 219552175, 216826780, 213854180, 210659376, 207126564, 203295493, 199400330, 195572178]
9435A95572178l846488l907644l808334l551457l321622l158147k946309k706509
9427A68325668k599029k624945k595217k443583k323707k334364k376752k361143
9419A48666928k348905k404937k492140k589648k739233k899637k934259k829609
9411A27428560k755231k816150k909682k916899k867540k817790k737694k631497
9403A04976077k595926k631766k572020k345789k142115k136326k212684k160564
9395H6178887k005734j917894j899831j818352j673194j578759j513874j349884
9387G2421365j133130j082707j250564j406341j345128j128960r38560q46836
9379F3289139q28132q48352q52322p81139o80993o79577p88752q63137q29594
$$ y = [195572178, 191725690, 187818046, 184009712, 180458255, 177136633, 173978486, 171032177, 168325668, 165726639, 163101694, 160506477, 158062894, 155739187, 153404823, 151028071, 148666928, 146318023, 143913086, 141420946, 138831298, 136092065, 133192428, 130258169, 127428560, 124673329, 121857179, 118947497, 116030598, 113163058, 110345268, 107607574, 104976077, 102380151, 99748385, 97176365, 94830576, 92688461, 90552135, 88339451, 86178887, 84173153, 82255259, 80355428, 78537076, 76863882, 75285123, 73771249, 72421365, 71288235, 70205528, 68954964, 67548623, 66203495, 65074535, 64135975, 63289139, 62461007, 61612655, 60760333, 59979194, 59298201, 58618624, 57829872, 56966735, 56137141]
9370E6137141q06246q84456r45241q50568o97157o86234q06055q46381p21642
9361D8893161n92695o22071p56596q32210p97501p43055p52119p98834p99377
9352D2198703p27719o55897o69417p55508q09684p55510o15563m62240l63496
9343C6383669l85916n50996p41724p64754n93621m44586m90678o03771n50121
9334C1257502l64839l09230m66305o17207n83332m72603m62013n13137m73116
9325B6995720l45540k80949l42558m30264m31593l45447k56580k50302l34903
9316B3977584m11612l71913k55318k19830l06795l61005k75305j73484k06854
9307B1395468l01259k97232k33458k59410l39381l07459j87671j73975k74515
$$ y = [56137141, 55330895, 54446439, 53501198, 52650630, 51953473, 51267239, 50461184, 49614803, 48893161, 48300466, 47678395, 46921799, 46089589, 45292088, 44549033, 43796914, 42998080, 42198703, 41470984, 40815087, 40145670, 39390162, 38580478, 37824968, 37209405, 36747165, 36383669, 35997753, 35446757, 34705033, 33940279, 33346658, 32902072, 32411394, 31807623, 31257502, 30892663, 30583433, 30117128, 29499921, 28916589, 28443986, 27981973, 27468836, 26995720, 26650180, 26369231, 26026673, 25596409, 25164816, 24819369, 24562789, 24312487, 23977584, 23565972, 23194059, 22938741, 22718911, 22412116, 22051111, 21775806, 21602322, 21395468, 21094209, 20796977, 20563519, 20304109, 19964728, 19657269, 19469598, 19295623, 19021108]
9298A9021108k77333j38739r2779k41369l44592k21833p6044j45822k78195j90120
9288A7014282J5873r457k79244m27601k76919p7255p7039j82699k06203j75287
9278A5318451j94180k11662j50399j03103j69086k21356q7395J13644Q5077j95318
9268A4184673l97160k91110o3598l3745k08598l13230k00126k3603K2991l4853
9258A2641641o4458o6132j33428k28914j99243m2793L0982r3396k40694k00750
9248A1402815m3221J2899n7798j00704p9778j09247j89464j72010l9699K7984
9238A0651777m6000j14243r1598j09187k24394k38895l7629J25222j6926k76921
9228I621206k62494R358J39091k4927j86347j20370p855n9467j38722m2729Q5025
$$ y = [19021108, 18743775, 18605036, 18512257, 18270888, 17926296, 17704463, 17628419, 17482597, 17204402, 17014282, 17030155, 17020698, 16741454, 16313853, 16036934, 15959679, 15882640, 15699941, 15493738, 15318451, 15124271, 14912609, 14762210, 14659107, 14490021, 14268665, 14181270, 14294914, 14379991, 14184673, 13787513, 13496403, 13432805, 13399060, 13190462, 12877232, 12677106, 12653503, 12676494, 12641641, 12577183, 12511051, 12377623, 12148709, 11949466, 11906673, 11937655, 11844259, 11603565, 11402815, 11359594, 11372493, 11314695, 11213991, 11134213, 11024966, 10835502, 10663492, 10623793, 10651777, 10605777, 10491534, 10399936, 10290749, 10066355, 9827460, 9789831, 9915053, 9898127, 9621206, 9358712, 9368070, 9507161, 9482234, 9295887, 9175517, 9167662, 9108195, 8969473, 8926744, 9011769]
9217I011769l0794k97106l33210m9954J88782Q8954j63956k05335j1941J19567
9207H316776K9198j26112j64708j21012r7229o4916K4079O3967o1308k31941k16022
9196G350772k5117Q6749J0018p9813m9930k0917r7983j39187j9360Q4447l7150
9185G062529k24935j62993R0202J59834m9542k01728p6234R2303K0291j74033
9175F535694j94423m1658L1250n7698j22213l0119J04145J10421k984r1124p5158
9164F166133k0845j9573n4797m8732j9959p3031j85423j66627L5659J61967P199
9153E781971j95348r5550J69507J39307j98409l23644k3767K29586N6065j96029
9143E343689n8221K39526J61298k08577l06536l0339J46167J0101j01751J7490
$$ y = [9011769, 8980975, 8683869, 8350659, 8300705, 8489487, 8578441, 8414485, 8209150, 8197209, 8316776, 8345974, 8219862, 8055154, 7934142, 7836913, 7771997, 7796076, 7860043, 7798735, 7566794, 7350772, 7325655, 7412404, 7422422, 7342609, 7292679, 7271762, 7173779, 7034592, 7015232, 7099679, 7062529, 6837594, 6674601, 6764803, 6924637, 6875095, 6673367, 6597133, 6689436, 6709727, 6535694, 6341271, 6299613, 6330863, 6273165, 6150952, 6120833, 6224978, 6335399, 6332415, 6241291, 6166133, 6145288, 6125715, 6070918, 6022186, 6002227, 5929196, 5743773, 5577146, 5612805, 5774772, 5781971, 5586623, 5491073, 5660580, 5799887, 5601478, 5277834, 5254067, 5483653, 5539718, 5343689, 5285468, 5524994, 5686292, 5477715, 5171179, 5140840, 5287007, 5297108, 5195357, 5212847]
9133E212847R4264o1140j84588n7454Q8527N148j33804q7461J2058m4339j18158
9122D725900j745J43998N9835j19263q6126R1387J01443n2603r0199J6451J9389
9111D808467j11309j31422N127O2052k4531m5269L4135k2977k24254k17081J12192
9100D245130L46761J56245j79498k26294m6155J8573n3705l2041P6775O8254k8160
9089D345885j232J06907N1617j34042j45214N8781J51674j6790j80202j21085
9079D116299j288j5154n3547K6952R3646q542j31844o5982Q4782Q1999l9098o4928
9067D023295Q663J6284k7822L6499J65219J37875m7876j38320l3235P7835O5243
9056D283660L6936N7573k109j74216k37136n9613J40518J17833k4450l8868N4006
$$ y = [5212847, 5307111, 5245971, 5061383, 5003929, 5092456, 5097604, 4963800, 4876339, 4888397, 4844058, 4725900, 4724155, 4868153, 4927988, 4808725, 4722599, 4813986, 4915429, 4862826, 4772627, 4789078, 4808467, 4697158, 4565736, 4570863, 4632915, 4608384, 4563115, 4597250, 4574273, 4350019, 4132938, 4245130, 4591891, 4748136, 4568638, 4342344, 4296189, 4314762, 4261057, 4229016, 4305791, 4374045, 4345885, 4344653, 4451560, 4503177, 4369135, 4223921, 4282702, 4434376, 4417586, 4237384, 4116299, 4115011, 4099857, 4046310, 4073262, 4166908, 4158366, 4026522, 3960540, 4045322, 4127321, 4088223, 4023295, 4031958, 4048242, 4020420, 4056919, 4222138, 4360013, 4312137, 4173817, 4140582, 4218417, 4283660, 4320596, 4378169, 4376060, 4201844, 3964708, 3905095, 4045613, 4163446, 4138996, 4100128, 4154134]
9045D154134M7770o5118r3880L751N7988j0962p1395j7730O6785O1081k4770j02012
9033D005642j19049p3654O056N6811K4352o5346j25859r8214J0565J31576J44881
9022C897761j9708k31062k35242Q140K15821J61043J714R253J26133R6579o5403
9011C965029j01881K0393N3799o6123r1068P8213J77614K9275j36229p2485O0688
9000C917225j3016j99708j94511J0514J32883N7340l6627r201N3932L7600l1774
8989C724657p0182m8031J5207O9409N4859j6152n0448k0592j9046p4526o3444
8978C501711N9585J19165k106j24759n6808O1791K434j25736o0646J20189J14799
8967C609619n4248o8009J01776J24699p8820j63531K4279J49489k1336j93091
$$ y = [4154134, 4201904, 4136786, 4042906, 4046657, 4104645, 4093683, 4022288, 4004558, 4071343, 4132424, 4107654, 4005642, 3886593, 3812939, 3818995, 3875806, 3900158, 3834812, 3708953, 3610739, 3621304, 3752880, 3897761, 3878053, 3646991, 3411749, 3419889, 3635710, 3796753, 3798467, 3807720, 3933853, 4030432, 3965029, 3863148, 3883541, 3937340, 3871217, 3780149, 3858362, 4035976, 4065251, 3929022, 3856537, 3917225, 3904209, 3704501, 3509990, 3520504, 3653387, 3710727, 3674100, 3664899, 3718831, 3756431, 3724657, 3654475, 3606444, 3621651, 3691060, 3745919, 3729767, 3679319, 3658727, 3639681, 3565155, 3501711, 3561296, 3680461, 3678355, 3553596, 3496788, 3558579, 3561013, 3435277, 3374631, 3494820, 3609619, 3555371, 3487362, 3589138, 3713837, 3635017, 3471486, 3495765, 3645254, 3623918, 3430827]
8957C430827o3638J35136N1108j67063j52125L0638M2817q4390k6823J83858J64049
8946C544394j27578k59033l8114J59616K3055j87945j05139J40513J75240j412
8936C323597q2520J691K6542p6529j06112K0623J10652M1381k9941L4242R2149
8925C355775k4360j88007j61514J3911Q7378K130n0660J0284L6483l1283j5698
8914C034439J56584K31853N917k78236k38672N6047J76735j0651j70399n9492
8904B904125J13412P7357p3402j01175l0840l7106r2752l8999Q8799J03655o141
8893B906933o5489j8944N063m5250n7707K1051Q2856M6275k1778l7867j2890K0304
8881B822557O0059P8634L7570j4706R943Q0015P3239k4164j01334j14640j19909
$$ y = [3430827, 3367189, 3502325, 3553433, 3386370, 3234245, 3264883, 3307700, 3223310, 3196487, 3380345, 3544394, 3416816, 3157783, 3119669, 3279285, 3302340, 3114395, 3009256, 3149769, 3325009, 3323597, 3241077, 3242768, 3269310, 3192781, 3086669, 3107292, 3217944, 3259325, 3229384, 3263626, 3355775, 3331415, 3143408, 2981894, 2995805, 3083183, 3085313, 3034653, 3044937, 3081420, 3050137, 3034439, 3191023, 3422876, 3428793, 3150557, 2911885, 2967932, 3144667, 3134016, 2963617, 2904125, 3017537, 3094894, 3021492, 2920317, 2889477, 2852371, 2759619, 2720620, 2809419, 2913074, 2906933, 2841444, 2822500, 2827563, 2782313, 2724606, 2745657, 2828513, 2874788, 2853010, 2815143, 2802253, 2822557, 2882616, 2961250, 2998820, 2984114, 2994057, 3074072, 3147311, 3123147, 3021813, 2907173, 2787264]
8870B787264r9649L0034J92605J66916o5733k15964q2542J41057J48469m5378
8860B957079j71138j07082J2099N1580L5786L3553M1153K7521J233q291R902M0048
8848B923443M8314J2715m7048r9645j46178j72043r6013J06965K63658J74660
8838B968828n8833j17765N5214J34032p7905k97631j86988J10439K01829N4692
8828B785912k3731N3494M3687j32460k05844j9104J82468J40828j5881k4937P4501
8817B858933M9875j08604j75421n2690J05683J41088O2256m7595j23262r5772
8807B614491N7695K06366J66055l8246j60019n8865J04169J11372j115l8381L2279
8796B995801N4029l7353j03935l8444O1735O1050k926j0804L0101K7900q44M0547
$$ y = [2787264, 2687615, 2717649, 2910254, 3077170, 3011437, 2795473, 2712931, 2853988, 3002457, 2957079, 2785941, 2678859, 2690958, 2742538, 2778324, 2811877, 2853030, 2880551, 2881784, 2873493, 2883395, 2923443, 2971757, 2984472, 2937424, 2837779, 2691601, 2519558, 2423545, 2530510, 2794168, 2968828, 2909995, 2792230, 2847444, 2981476, 2903571, 2605940, 2418952, 2529391, 2731220, 2785912, 2762181, 2815675, 2859362, 2726902, 2521058, 2501954, 2684422, 2825250, 2809369, 2784432, 2858933, 2908808, 2800204, 2624783, 2572093, 2677776, 2818864, 2881120, 2833525, 2710263, 2614491, 2672186, 2878552, 3044607, 3006361, 2846342, 2787477, 2891646, 3003018, 3001903, 2963522, 2995801, 3049830, 3012477, 2908542, 2870098, 2931833, 2992883, 2989957, 2979153, 3009254, 3037154, 3036310, 3076857]
8784C076857J21351R3703n3337j33438m0765P5059L7114q7154j02718Q069P4836
8773C069577R540p7617o0943K8705P3633L4675j8666k0165m95m1233j34919j46907
8761B715185R257J94448J75987m3361j85273o3227J60612K13002P7513l8675j8740
8750C196728O0089R3787O2674m816n2251j1993Q6766R3855m6315j45267j4339
8739C318918K20370K62408O0407j46386j79572r1334J3774R2435Q2306n7233j94274
8728C381819j43968L4534J01894J8636j9223L9188J4368j16945j10803R9226K01869
8717C500595j923k28952j38931J36169K28119Q9016m1247o2469n2379r29J35819
8706C562888K06700M6518j78664j63872M3374J14829j4041o6564P1275J69279
$$ y = [3076857, 3198208, 3291911, 3238574, 3105136, 3064371, 3139430, 3176544, 3089390, 2986672, 2994741, 3069577, 3079117, 3001500, 2940557, 2969262, 3042895, 3077570, 3058904, 3038739, 3038244, 2997011, 2862092, 2715185, 2724442, 2918890, 3094877, 3051516, 2866243, 2803016, 2963628, 3176630, 3254143, 3215468, 3196728, 3256817, 3350604, 3413278, 3408462, 3356211, 3344218, 3430984, 3524839, 3478524, 3333257, 3318918, 3539288, 3801696, 3862103, 3715717, 3536145, 3444811, 3458585, 3551020, 3633326, 3576093, 3381819, 3237851, 3272385, 3374279, 3392915, 3373692, 3412880, 3427248, 3310303, 3199500, 3298726, 3500595, 3498672, 3269720, 3130789, 3266958, 3495077, 3584093, 3542846, 3480377, 3427998, 3427069, 3562888, 3769588, 3816106, 3637442, 3473570, 3516944, 3631773, 3617732, 3551168, 3622443, 3791722]
8696C791722Q0570k0450J4872N2909l8535j28624n7943Q8193J43897J13859P7905
8685D118375K0822o5276p7301K0419P3168k7202j37450q8650L1111L7116l2803
8674C872329m29J28562J65612M3622r0496j01774k2561L8893K4802m5960r1990
8663C920610l1002J01921J57737P6051p088L5281J14109P5411l7862o2870J1228
8652D353526N2635K8542K5388M4884L165n5823J9111K01978K59947J03306n3644
8641D983015j6928R9169Q6869j4685j7013P8898Q7204l7560j09054M137J80577
8630E324629K26628J29027K2833q991O359L2287P6263J39601J86647J84307J36966
8619F456556P9028N9082J13385K10616K43225J42219j780j4615J40565L01715
$$ y = [3791722, 3872292, 3851842, 3866714, 3919623, 3881088, 3752464, 3694521, 3782714, 3926611, 4040470, 4118375, 4139197, 4073921, 3996620, 4017039, 4090207, 4063005, 3925555, 3836905, 3868016, 3905132, 3872329, 3871900, 4000462, 4166074, 4209696, 4119200, 4017426, 3994865, 4033758, 4058560, 4012600, 3920610, 3889608, 3991529, 4149266, 4225317, 4218229, 4253510, 4367619, 4443030, 4405168, 4342298, 4353526, 4406161, 4434703, 4460091, 4504975, 4508140, 4452317, 4471428, 4673406, 4933353, 5036659, 4983015, 4966087, 5065256, 5152125, 5137440, 5120427, 5199325, 5286529, 5248969, 5139915, 5144052, 5324629, 5551257, 5680284, 5703117, 5694126, 5700485, 5732772, 5809035, 5948636, 6135283, 6319590, 6456556, 6535584, 6594666, 6708051, 6918667, 7161892, 7304111, 7302331, 7287716, 7428281, 7729996]
8609G729996L13340K12800J41853J46397J62502J50575J26384P6844l7724j83917
8599H839050k54677j96007p0622J1933k3745j78876l44420l52303j76697l5407
8589G218229j34360l47816l61525j39506L493j25829l14372k90152j26638p2520
8579E309004j46415j68525r9934p4616j21573j15134l0568j9993j58063k91913
8569D082270k46887o3506O8113M2490o8346j26611q6296l1124n0692j04736q4922
8558C329753n861m28q3249r1367L6836J13345k1j30318o8354N8692o692j90722
8546B961614j93522r317N3200r3341j61660M728J54364N9514j06390q3552M8856
8535B634494N3482o0125j10731q2457r4349j30375p8472K1596L0431k6611M809
$$ y = [7729996, 8043336, 8256136, 8397989, 8544386, 8706888, 8857463, 8983847, 9060691, 9022967, 8839050, 8584373, 8388366, 8317744, 8329677, 8305932, 8127056, 7782636, 7430333, 7253636, 7218229, 7083869, 6736053, 6374528, 6235022, 6238515, 6112686, 5798314, 5508162, 5381524, 5309004, 5162589, 4994064, 4894130, 4819514, 4697941, 4582807, 4552239, 4532246, 4374183, 4082270, 3835383, 3771877, 3839990, 3882480, 3814134, 3687523, 3601227, 3570103, 3519411, 3414675, 3329753, 3323892, 3323464, 3240215, 3148848, 3185684, 3299029, 3299008, 3168690, 3100336, 3159028, 3152336, 2961614, 2768092, 2758775, 2811975, 2718634, 2556974, 2561702, 2716066, 2775580, 2669190, 2585638, 2634494, 2687976, 2627851, 2517120, 2434663, 2340314, 2209939, 2131467, 2153063, 2183494, 2156883, 2161692]
8524B161692J18919J33735j3626j65040j78934r5631j9065J5095L824n8800j26216
8513A775953j12031q229Q6168Q9803L3343P831N7587J25678R3134q1395k49573
8502A818269k04143L1519J84465R7100n0956m0294L7600l5690j96934j80783L2042
8491A492195J62605O9425n7396l3264N0549L3216n2387q4178n6240k4765J9234
8480A518994P8790P0928l8712j25407p4442K9003K6879o8267j10054n0784J2026
8469A268954K872m6668p6577n8289J7032J16012J40652K7916j28354j55798k5501
8458A082251R3723M8094r8555j39730J5044K15905K36726M1837j63978j76156
8448A155161k8533P6233L9605l7145m1265j0095l1883p8408n1094M2187P4889
$$ y = [2161692, 2280611, 2414346, 2400720, 2235680, 2056746, 1961115, 1942050, 1957145, 1960969, 1902169, 1775953, 1663922, 1655693, 1741861, 1831664, 1865007, 1872838, 1930425, 2056103, 2149237, 2067842, 1818269, 1614126, 1645645, 1830110, 1927210, 1876254, 1835960, 1873560, 1837870, 1640936, 1460153, 1492195, 1654800, 1724225, 1666829, 1633565, 1684114, 1717330, 1664943, 1580765, 1524525, 1499760, 1518994, 1597784, 1668712, 1630000, 1504593, 1430151, 1459154, 1486033, 1417766, 1307712, 1256928, 1268954, 1271826, 1225158, 1148581, 1090292, 1107324, 1223336, 1363988, 1391904, 1263550, 1107752, 1082251, 1175974, 1224068, 1125513, 985783, 1000827, 1216732, 1453458, 1495295, 1331317, 1155161, 1126628, 1202861, 1242466, 1205321, 1164056, 1153961, 1122078, 1043670, 992576, 1034763, 1109652]
8437A109652j3256j10404p3374P0360J42636M7744r2428j03245l050L5807l3797
8426I76645n2410P7106J96164J11264j05231k15739j47023k6663N9797J32736
8416A006646J58494N8531r7923j35039m5493o11m2035j8710R3282R4959p5182
8405I96919j72970l6475J27899R0469k3241N308P4293l0068j84649j02026J39421
8394H84880J74258m5802j61158J223J54995M4037j52080j40546K6812Q7959j0715
8383H63863q8135l2382P6529J12169L6730p9279j07123M449J17464N3625j19030
8372H38880j35508O0064J82250K1264k22606k30578k1430J30736J18264P3722
8362H15058P7384N3046l5301j03068j00611p8020n9904l339Q7254J31673Q8085
$$ y = [1109652, 1096396, 985992, 912618, 982978, 1125614, 1173358, 1080930, 977685, 974635, 1010442, 976645, 924235, 1001341, 1197505, 1308769, 1203538, 987799, 840776, 814113, 873910, 1006646, 1165140, 1223671, 1125748, 990709, 945216, 944605, 902570, 883860, 977142, 1072101, 996919, 823949, 787474, 915373, 1005842, 982601, 987909, 1062202, 1032134, 847485, 745459, 884880, 1059138, 1013336, 852178, 853401, 1008396, 1052433, 900353, 759807, 786619, 874578, 863863, 775728, 743346, 819875, 932044, 968774, 889495, 782372, 786821, 904285, 957910, 838880, 703372, 763436, 945686, 966950, 744344, 513766, 492336, 623072, 741336, 815058, 892442, 945488, 910187, 807119, 706508, 628488, 568584, 565245, 652499, 784172, 872257]
8351H72257n819j01653j48660p4494J04399K04576Q9207q3105n3407J10329P4579
8340I88209k11150l57530j06158K41729K50848j4277j34299O990J04362k4938
8330G43786j61953p6557J14118J73478J01856M3210M886q6866j62284r3199M8254
8319F48729O3522m5535o7467O2944J42678L2700j06652o8064Q4196J35640M5970
8308I28661m5800p0630q4194j01229o7035M27J5259q278L5904J31500J16480m6968
8296H04097j56487n6031J05194P7736j09339j77520j422K04744J75170n8421k16886
8285E90835j27061P9844J46181J367j66416j51048K3432J49658J00864l3237q9105
8274E25314l2210L5566K7946l0533n7259j4370N7733R3874P2990K5303j6800m3117
$$ y = [872257, 866438, 764785, 616125, 541631, 646030, 850606, 939813, 856708, 803301, 913630, 988209, 777059, 419529, 313371, 555100, 805948, 791671, 657372, 664362, 768724, 743786, 581833, 505276, 619394, 792872, 894728, 937938, 942824, 855958, 693674, 600475, 648729, 712251, 666716, 599249, 662193, 804871, 837571, 730919, 662855, 747051, 882691, 928661, 882861, 812231, 728037, 626808, 559773, 560200, 575459, 567181, 603085, 734585, 851065, 804097, 647610, 591579, 696773, 774509, 665170, 487650, 486228, 690972, 866142, 807721, 590835, 463774, 543618, 689799, 691166, 524750, 373702, 397134, 546792, 647656, 614419, 525314, 493104, 528670, 556616, 526083, 468824, 454454, 512187, 606061, 679051, 704354, 687554, 644437]
8262F44437l9965O664N7803L7004n0177q5210n555P1425J2828j06021j01336K9847
8250D71744J07038N6590J749J8916J6585n0708n6632O5211J48305L9583j23957
8239F94424j00282Q7614J88491Q7414p5701j47271j29685q3310k1072M7185Q0869
8228F28676O5612K6872k6271r2047j13754k2604J40058K25298J34707o4269j95085
8217G07193j35033N4382J62711O0171j16600j25445L0553R4990m3386j70679r8966
8206D19891L7371M2160p177M4433R4754k0873j52836m3521J83822J68282q3562
8195F82744j84332l521J37184L0892r1356n065J32512J01365k0128p3392j02818
8184F04085j60879j15025P6303J70636K0153j23803r433J71382J08853q4349p8487
$$ y = [644437, 604472, 611136, 668939, 705943, 655766, 570556, 565001, 636426, 649254, 543233, 441897, 471744, 578782, 635372, 637121, 656037, 672622, 621914, 565282, 630493, 778798, 818381, 694424, 594142, 681756, 870247, 957661, 881960, 734689, 605004, 521694, 500622, 547807, 628676, 694288, 721160, 694889, 602842, 489088, 466484, 606542, 831840, 966547, 902278, 707193, 572160, 626542, 789253, 849424, 732824, 607379, 637932, 732922, 689536, 518857, 419891, 457262, 499422, 492245, 536678, 631432, 610559, 457723, 414202, 598024, 766306, 682744, 498412, 494891, 632075, 662967, 571611, 566546, 699058, 800423, 780295, 706903, 604085, 443206, 328181, 404484, 575120, 595273, 471470, 462037, 633419, 742272, 657923, 579436]
8173E79436J00152J48389L0161j0632O7271N1411q5145j16569Q356O0370o1112
8162G72088j61089r1640M6681J33265J65959J08618q8038k51290j17505K09852
8152G26901L01208L4702j93839q8699J03865M8677j31277j18266N2307J02621
8142H38200M995k7088M4081L9941p1636j00086L4146J53860R5797o5162j50231
8131G96817j05437j8203K0291J0428J7156O1347P0136l998n7443L3715J75775
8120A000584J48512m2254j43447n6047J8308m1979n9000P7930J41006m3463k16776
8109G83374p9804J70473J38607j03194j41481P2031J68578K3310o8492K5676M4008
8098A033086j27358j79327O9053K83240J33634j55193j73551L6069J30965M7746
$$ y = [579436, 679588, 827977, 858138, 847506, 914777, 966188, 881043, 764474, 772830, 833200, 772088, 610999, 519359, 566040, 699305, 865264, 973882, 885844, 634554, 517049, 726901, 1028109, 1062811, 868972, 780273, 884138, 932815, 801538, 683272, 735579, 838200, 843195, 816107, 860188, 900129, 828493, 728407, 762553, 916413, 1012210, 947048, 796817, 691380, 673177, 693468, 703896, 721052, 782399, 852535, 848537, 791094, 824809, 1000584, 1149096, 1106842, 963395, 907348, 925656, 883677, 824677, 902607, 1043613, 1000150, 783374, 703570, 874043, 1012650, 909456, 767975, 840006, 1008584, 1031894, 963402, 989078, 1033086, 905728, 726401, 795454, 1078694, 1212328, 1057135, 883584, 919653, 1050618, 1098364]
8088A098364l055J8277k5142q4725J3807J68813Q5098j99456k84480j9212K43089
8077A011378J88051q005k5035Q4989N4322j08938j42317J6513J28466M6186p0218
8066A175392l9862N3798K8941q3728r2217M5105J50953J01578N890J9295R5772
8055A460917P0967n8270j08165J0521J42516J11795k3100p0715P165O7075K4038
8044A634744l8082l1714k300k2860n6722k9061K8483J9951m8967o1513K7282R3524
8032A512765M041j73699k20085m2561J77284J92280K139j53448j20596j5688p594
8021A154838m4895L6407J97849K06068r671k08014j57285M4001J24903K3166p1741
8010A295626k1045R4393J28380N1033o7911j50522j43697n0331L9450L3285k7624
$$ y = [1098364, 1095309, 1113586, 1088444, 1003719, 1017526, 1186339, 1271437, 1071981, 787501, 768289, 1011378, 1199429, 1191424, 1166389, 1251378, 1305700, 1196762, 1054445, 1070958, 1199424, 1245610, 1175392, 1135530, 1189328, 1218269, 1134541, 1042324, 1087429, 1238382, 1339960, 1345850, 1365145, 1460917, 1531884, 1473614, 1365449, 1375970, 1518486, 1630281, 1607181, 1536466, 1543631, 1610706, 1634744, 1596662, 1564948, 1562648, 1539788, 1483066, 1454005, 1482488, 1502439, 1453472, 1391959, 1419241, 1512765, 1516806, 1343107, 1123022, 1080461, 1257745, 1450025, 1452164, 1298716, 1178120, 1162432, 1154838, 1109943, 1146350, 1344199, 1550267, 1540596, 1332582, 1175297, 1219298, 1344201, 1367367, 1295626, 1274581, 1368974, 1497354, 1548387, 1480476, 1329954, 1186257, 1135926, 1175376, 1208661, 1181037]
7999A181037j8867O4576R1000J9213j9077M5576P2741n0047j73141r6455R0833
7988A207389J28343q760q7771j0307M8861l2640j19254o8277L2947M1851p870
7977A124512j9795j9488m7315k0896R6919J43300J311j39326m7029J39075R6994
7966A308262j34889j88561K7197J57733j7480k17940j23772J09551J25429o2154
7956I83376j38044j5088P3975K88q0418l4901L9145K2911k6163k0911j6052q2715
7944G05403j35911m9269J24979K01718J10165k7969p8806n4375m8586q2961q6177
7933E78211j5357O6632P0669L765m4741l1076k215K793J7083O1465O8756k3821
7921G52164j50185j75654o8769O3439J06634M4746n1962q7336j2975R8811R8985
$$ y = [1181037, 1162170, 1226746, 1317746, 1336959, 1317882, 1363458, 1436199, 1386152, 1213011, 1116556, 1207389, 1335732, 1326972, 1239201, 1228894, 1277755, 1245115, 1125861, 1057584, 1090531, 1132382, 1124512, 1104717, 1085229, 1037914, 1017018, 1113937, 1257237, 1258548, 1119222, 1072193, 1211268, 1308262, 1173373, 984812, 1012009, 1169742, 1152262, 934322, 810550, 920101, 1045530, 983376, 845332, 830244, 904219, 904507, 824089, 789188, 828333, 851244, 825081, 804170, 788118, 705403, 569492, 520223, 645202, 846920, 957085, 929116, 850310, 795935, 747349, 664388, 578211, 562854, 629486, 700155, 703920, 659179, 628103, 625888, 628681, 645764, 707229, 775985, 752164, 601979, 426325, 357556, 420995, 527629, 572375, 520413, 433077, 420102, 518913, 617898]
7910F17898m3243j50200o0962J08674J05549p5150j57251M561J94880J53683n4874
7899F43565j74860j32346n9526k0535M5413J17459P4178o3921r8505L3391J13659
7888D77972l1037k29444k04197Q219J28451P1474L2590J10568J33216j9771j72559
7877C05482j26999J3278L1391l1248K8873J85555J94956P361j32863p6676J4374
7866D13484k7273j02407n9561K1939j2556j00956o9567N8664J01145K0864l1784
7855B11992J6727O0913J3604o1810o7626K479R0648J31238P3131n5650j19847
7844B95799l0248R7046P6839o3649j10478J1589J22849O3315q1022j29074n7451
7833A95515J5149J9068j731J2937N3815N6475j7907j12880j17110q137R7273R7678
$$ y = [617898, 574655, 424455, 363493, 472167, 577716, 502566, 345315, 349876, 544756, 698439, 643565, 468705, 336359, 276833, 256298, 301711, 419170, 493348, 429427, 330922, 364313, 477972, 446935, 217491, 13294, 21513, 149964, 221438, 254028, 364596, 497812, 478041, 305482, 178483, 191761, 223152, 191904, 220777, 406332, 601288, 608649, 475786, 399110, 413484, 386211, 283804, 224243, 246182, 233626, 132670, 63103, 121767, 222912, 243776, 211992, 228719, 289632, 303236, 241426, 173800, 176279, 266927, 398165, 471296, 415646, 295799, 265551, 362597, 439436, 375787, 265309, 276898, 399747, 463062, 382040, 252966, 195515, 210664, 229732, 228001, 240938, 294753, 351228, 333321, 220441, 103331, 95194, 192467, 290145]
7821B90145M1075J5544k183n5876o7104K9664R6279k5903j98763j38560J24132
7810A08450K50552J07191n6187m5968n630q3203j36044j2781J31569Q2430p2687
7799B67692j08720k6618K1194K6167O6117P4741m3535j62018q6555R9551J30371
7788B58387l4229j63694j11942K7818J25734J50475R7470j6203q4915k2752P8863
7777C05012P0124k6024p6191o1281m8360k3280L9091L8711q1654j51051k1522
7766c6425J29597O7580p1533r849J41923N6033j81642j57044J39019K47425K3034
7755C48118j21605L1335J15878j18659k92170m1572K96138K04930j61030k46729
7745A4634J2481J70216L6996r8249k7546Q2933N2193l8746m6627J9528O9898M6033
$$ y = [290145, 331220, 346764, 344581, 288705, 221601, 251265, 347544, 321641, 122878, -15682, 108450, 359002, 466193, 410006, 364038, 358408, 275205, 139161, 126380, 257949, 340379, 267692, 158972, 132354, 153548, 179715, 245832, 320573, 277038, 115020, 28465, 128016, 258387, 224158, 60464, -51478, -23660, 102074, 252549, 350019, 333816, 248901, 226149, 305012, 375136, 349112, 272921, 211640, 163280, 140000, 179091, 217802, 136148, -14903, -36425, 93172, 160752, 89219, 79370, 221293, 277326, 95684, -61360, 77659, 325084, 348118, 226513, 257848, 373726, 255067, -37103, -78675, 217463, 422393, 261363, 14634, 27115, 197331, 234327, 136078, 108532, 191465, 243658, 204912, 158285, 177813, 247711, 293744]
7733B93744n3601j32034n1951J32573J59228n1493k03958p1805J12078M0323j39514
7722C3590r8463Q1031P8309n3656p29J73741J03094j69519j85248J19410K36410
7711C17970n8328k86344m5991L23125K90350o4972k70832j81823k3333P3231J47198
7700B20251J53024J1203j60646j75814o6363P914L3616Q2908J01925J7919n8954
7689A66983l492O7806j8848j59118j17728O2435J12492k1609r5344L5949J94572
7678B24098J46031q8511k74018k25659O614J80825J23177m3060m9171J15595J68923
7667B84844m217j35956j9134J20232q16k17894j77335P2854J78409O8530O381
7656A75898P8959Q2453m4683j02083l0523l1661j56676j59195O6459K49452J58082
$$ y = [293744, 240143, 108109, 56158, 188731, 347959, 296466, 92508, 20703, 132781, 173104, 33590, -64873, 16158, 94467, 40811, 40082, 213823, 316917, 147398, -37850, 81560, 317970, 259642, -26702, -72693, 250432, 540782, 475810, 204978, 23155, -178, 73053, 220251, 373275, 384478, 223832, 48018, -18345, -10431, 23185, 106093, 208018, 225937, 166983, 163491, 231297, 212449, 53331, -64397, -1962, 110530, 88921, -6423, 29526, 224098, 370129, 281618, 7600, -218059, -211445, -30620, 92557, 49497, 326, 115921, 284844, 280627, 144671, 125537, 245769, 244953, 27059, -150276, -77422, 100987, 169517, 175898, 254857, 337310, 292627, 190544, 160021, 128360, -28316, -187511, -121052, 128400, 286482]
7645B86482m7399j05530m1801k8952o9603n7058M54K3099J0697j317j9034j8175
7633f8137N5213J31253N8762j14380j43385K0570J15128k791j09634p659J34950
7622F9890J02232M852K2736L9470j00819k10916n8248J49143N2244k13597j88152
7611c31165J42457K97372Q5991j07514L532J61680O5429j19225r7104M2590L5766
7600A79809p3530n1000Q0017Q6700n2929j21916l8442M1960J5754l3681k7041
7589E701J850K7321P2204R3962J1963j18079j37793l3730L4340L846N886J02544
7577G0015J35808j0280j70942j23876O4408J35687K6599o7296j7634O1212K9631
7566A33332n8207o2612K8039J05143R4647J1838q8117j37443q3705L3746Q4500
$$ y = [286482, 239083, 133553, 91752, 62800, -6803, -63861, -63407, -40308, -29611, -30928, -49962, -68137, -12924, 118329, 177091, 62711, -80674, -60104, 55024, 52233, -57401, -65060, 69890, 172122, 176974, 199710, 239180, 138361, -72555, -130803, 18340, 70584, -143013, -331165, -188708, 108664, 194655, 87141, 90673, 252353, 317782, 198557, 101453, 144043, 179809, 106279, 55279, 135296, 221996, 169067, 47151, 8709, 50669, 66423, 32742, 5701, 7551, 34872, 107076, 201038, 213001, 94922, -42871, -76601, -42261, -38415, -32529, 70015, 205823, 195543, 24601, -99275, -34867, 100820, 127419, 60123, 42489, 103701, 133332, 75125, 12513, 40552, 145695, 240342, 252180, 164063, 26620, -57085, -23339, 61161]
7555F1161L557j01749q8532K7306J15983J25736J01973M8483p0310j83127j42904
7544a02423M0792J61946R7302k4173m3870j7860p5623j53782q6401R1068J59202
7533D6178N3019l6079K7363J04789J5392j58737j82261j5065J36232J20753L2153
7522A43737L0827J02712J05810m580j17634j30288o8390j6512o552k1188m2585
7511b4643m1555K3543J28245J57228M5924r8704j25892n4394k8227p7838q4379
7500a80692n58O6490N4412N6060J29901J61027N1011r0023j06886m4267m3165
7489E3310q0688k6041R0500R2895m6751j42012p2917M8550P2132J8382m007K0030
7477B3383J9129l3096p7694m6782N3578J31722R8121j4782p3960l1709j370o0310
$$ y = [61161, 64718, -37031, -125563, -98257, 17726, 143462, 245435, 293918, 223608, 40481, -102423, -61631, 100315, 197617, 173444, 129574, 111714, 36091, -117691, -204092, -113024, 46178, 99197, 63118, 90481, 195270, 210662, 51925, -130336, -145401, -9169, 111584, 143737, 174564, 277276, 383086, 378506, 260872, 130584, 62194, 45682, 39130, 17942, -24643, -66198, -42655, 85590, 242818, 288742, 190038, 64146, 9752, -18475, -96313, -180692, -181250, -114760, -60348, -4288, 125613, 286640, 337651, 247628, 140742, 96475, 53310, -27378, -53419, 37081, 129976, 83225, -58787, -131704, -83154, -11022, 7360, 3353, 23383, 42512, 9416, -68278, -115060, -61482, 70240, 168361, 153579, 79619, 47910, 46540, -13770]
7465a3770r0479L0732J80543J45412l0626r9472m262M4261o2752j49012n2115
7454a01540J16249J54855N2538n3461p3019j2256O2681N1560o4544j23094J7584
7443B7553J83315P2812k23897k61617P4034L22192J37151j73552j63953M9732
7433D3770P0485o9512l1248J54872J25635j32800k20139j1792J34155Q787j23600
7422e1387m9255L0240n7251q7772J18922K74102O7423k50986k15272J12896K42708
7411A34368K4346j65878n7040J35017J11760n8325j10664N728J07361O7257m0980
7400A52950o9382K1166J11170N7284j03974j53639J9583K07280J28876j46884
7390B24430k53633m4959J76155Q7562j84662k53740k7722J84730J37445l1292
$$ y = [-13770, -104249, -73517, 107026, 252438, 221812, 122340, 118078, 162339, 99587, -49425, -101540, 14709, 169564, 222102, 168641, 95622, 83366, 146047, 197607, 133063, 9969, 27553, 210868, 283680, 59783, -201834, -127800, 194392, 331543, 157991, -5962, 43770, 114255, 44743, 13495, 168367, 294002, 161202, -58937, -70729, 63426, 72213, -51387, -100642, -70402, -127653, -215425, -96503, 177599, 245022, -5964, -221236, -108340, 134368, 158714, -7164, -64204, 70813, 182573, 124248, 13584, 19312, 126673, 193930, 152950, 83568, 104734, 215904, 273188, 169214, 15575, 35158, 242438, 371314, 224430, -29203, -74162, 101993, 189555, 4893, -248847, -276569, -91839, 45606, 14314]
7380A4314n8265N1379Q9079N883k6611P1069J39078M2073j03610j20195m7067
7369E7127l8578q0855l5596P8934R6233J269k7526O1583P8469q2675k25362j35306
7357b52283Q8416J85682R8907j4495m9530l7919j2111L3853O2977K4306m1734
7346H6069m5971J3212N6149M1929m361m8909n8900j0339M7121J8813p1202p0148
7334d6537N3603J10717j4166j41865p4602P5894R1719K8927Q0010J70225O3101
7323C97026j74401k11099R088J58323N0935r6567p6917n075k1900j4935J15703
7312A30181J93818N0322j53039j64342k2877O9098Q4255J03006O9858q1068j88044
7301I1168o7552J37280J38783l0740p5820O5373J33128l757j42059r0508N6144
$$ y = [14314, -43951, 7428, 96507, 102390, 75779, 146848, 285926, 327999, 224389, 104194, 57127, 18549, -62306, -97902, -18968, 77265, 78534, 51008, 112591, 191060, 108385, -116977, -252283, -163867, 21815, 120722, 106227, 56697, 18778, 6667, 40520, 103497, 127803, 86069, 40098, 53310, 109459, 151388, 147027, 98118, 39218, 28879, 76000, 94813, 23611, -46537, 7066, 117783, 103617, -38248, -112850, -36956, 54763, 83690, 163700, 333925, 397026, 222625, 11526, 20614, 178937, 229872, 133305, 56388, 51313, 29413, 14478, 130181, 323999, 374321, 221282, 56940, 34063, 103161, 187416, 290422, 360280, 279212, 91168, 23616, 160896, 299679, 268939, 193119, 258492, 391620, 387863, 245804, 155296, 211440]
7290B11440J17748P9639J6888m5972q4151m1824N0657P5986J8910l035M1700L8424
7278D76410l7358l8475P8890J19562l7571j92878j18362O4119O6223j05229j66753
7267A08578j7154J18465O7274l2132J0786J19611Q5436r0553j94482j13814K7684
7256H9699P9972N6927L9315J4980n6859j02629j9964J14082R8953q4386j99312
7245C0778q1818J13423J41232J3232o7895l2867Q367J675O324K1216k3358p6729
7233E3580Q73J66110J89379J3304j26750p2254J0322o1167j52611m7419J56094
7222A29461J79916Q168j07044n3708J4055j6179m5544K0068R8618P7466k3703
7211B81574j15787j40988o5114R6174K11340J47124j7650o7165K1672L6863j00862
$$ y = [211440, 329188, 408827, 425715, 379743, 295592, 253768, 304425, 380411, 399321, 396286, 437986, 476410, 439052, 400577, 479467, 599029, 561458, 368580, 250218, 314337, 380560, 275331, 108578, 91424, 209889, 277163, 245031, 255817, 375428, 460864, 370311, 175829, 62015, 89699, 169671, 226598, 265913, 280893, 224034, 121405, 101441, 215523, 314476, 230090, 30778, -51040, 62383, 203615, 216847, 148952, 116085, 124452, 126127, 132451, 153667, 130309, 53580, 54453, 220563, 409942, 423246, 296496, 224242, 234564, 173397, 20786, -26633, 129461, 309377, 317545, 210501, 156793, 170848, 154669, 109125, 129193, 227811, 305277, 281574, 165787, 24799, -40315, 55859, 267199, 414323, 396673, 329508, 351180, 388043, 287181]
7200B87181j70280q893J83748J34728p6198j53487m6738K3637k9547l7998Q6749
7189A92902J75310Q4604n9034o4694L3036O4417k190n4199m0475j7953j9165j7249
7177B75310j3173k9570k5502N0900J25401O2292j05203j66940k9228J32307J23848
7166D00442O471l4702N914j9354j20267j26404K0037J30898M5067j14260j09038
7155H4804P1197J99619J24836m8908j21290l4833R1995J14088L675j28983j44278
7144B11922k0877J11378J11970j1075j17015r4362L0463J35205J17892j2851j29239
7133C33411r3696P7841J96716J11425r2501j88450r2745M8200P2570K305l0112
7122C44964K0525P0085L7268n0559r8401n9576J5075M9115L8039L3792M1075P633
$$ y = [287181, 116901, 108008, 291756, 426484, 350286, 196799, 150061, 173698, 144151, 106153, 192902, 368212, 452816, 393782, 329088, 362124, 426541, 424351, 370152, 329677, 311724, 292559, 275310, 262137, 232567, 207065, 257965, 383366, 445658, 340455, 173515, 144287, 276594, 400442, 406913, 372211, 378125, 358771, 238504, 112100, 132137, 263035, 308102, 193842, 84804, 156001, 355620, 480456, 431548, 310258, 275425, 367420, 481508, 485183, 356200, 211922, 191045, 302423, 414393, 403318, 286303, 191941, 222404, 357609, 475501, 462650, 333411, 239715, 317556, 514272, 625697, 533196, 344746, 252001, 300201, 372771, 375076, 344964, 365489, 435574, 472842, 422283, 323882, 264306, 279381, 328496, 366535, 400327, 441402, 449035]
7110D49035n6653n4649L1378O1457m6202j30182j0774J77630J40909r6567j76624
7099B88758L9944K22393P3579j92632j81055O7790J60592k1386j64177m1619J52507
7088D04694J43414j9323r8902l8225K5909K1396J5251N5279R0412O3595q949o6567
7076E87984o5226j5456J8256j2468n9848l2749N5180Q4068J4203l9484N439N5596
7064E95495M461o5918j0365J15577J11098n3742j70184r2816N7988R1699J4243
7053E97536k7927J3835M8533J3068m4588o0862l8498n528L2001N9142L6288l4327
7041E88673p1493j0071Q7726R1632j5572r2242k1275J19250J49695K9636r0722
7030G65237p7004K3255P4353L9581m732n72L1966N2161M1870k823n6651n3514
$$ y = [449035, 392382, 337733, 369111, 430568, 384366, 254184, 243410, 421040, 561949, 465382, 288758, 328702, 551095, 624674, 432042, 250987, 318777, 479369, 457983, 293806, 252187, 404694, 548108, 528785, 429883, 391658, 417567, 438963, 454214, 509493, 599905, 663500, 654551, 587984, 522758, 507302, 525558, 513090, 453242, 420493, 475673, 559741, 573944, 534460, 539899, 595495, 599956, 534038, 523673, 639250, 750348, 696606, 526422, 433606, 491594, 583293, 597536, 569609, 583444, 631977, 645045, 600457, 539595, 501097, 495569, 527570, 586712, 623000, 588673, 517180, 507109, 594835, 686467, 670895, 578653, 557378, 676628, 826323, 855959, 765237, 688233, 711488, 785841, 825422, 820690, 820118, 852084, 904245, 946115, 943292, 886641, 833127]
7018H33127L2875J08030N6717p0327r4207K5427J01132n110j42145p2280J57557
7007I30796K50590P4961j52137j71184j0088J13258J00357L4946J433n436l358
6996A164138J5668L6997L6021L7082O2991M6703p4534j85822r1087J74048L14879
6985A537084J65529p1880j25051k6350J4883j7051K9741J38725J17443m6718j17197
6974A599158Q600J18960M3906n7572J8602J58273J22737l5215n6104Q9255J61089
6963B171689N7754l7903R950Q3728N7861J5322O1556J16452P2608N556L4365R9604
6951B748542Q3642M5347J06975J85642J00173p9108p4225J55314K92708J22736
6941C687746j32833j41064O2748J73069Q6732q34M2913J01690N8791K555M9046
$$ y = [833127, 866002, 974032, 1030749, 960422, 866215, 891642, 992774, 987664, 845519, 773239, 930796, 1181386, 1256347, 1104210, 933026, 922938, 1036196, 1136553, 1171499, 1172932, 1167496, 1164138, 1179806, 1216803, 1252824, 1289906, 1352897, 1399600, 1325066, 1139244, 1048157, 1222205, 1537084, 1702613, 1630733, 1505682, 1479332, 1494215, 1477164, 1506905, 1645630, 1763073, 1716355, 1599158, 1607758, 1726718, 1770624, 1713052, 1731654, 1889927, 2012664, 1977449, 1921345, 2010600, 2171689, 2229443, 2191540, 2201490, 2285218, 2343079, 2358401, 2419957, 2536409, 2609017, 2614573, 2648938, 2748542, 2832184, 2877531, 2984506, 3170148, 3270321, 3191213, 3116988, 3272302, 3565010, 3687746, 3554913, 3413849, 3476597, 3649666, 3736398, 3735564, 3778477, 3880167, 3938958, 3941513, 3990559]
6930C990559J28576J14234M7315N4932J15165R7053Q158J133J07676J61701O7735
6919D894237k6926M5320K11889K76652K04467J20366Q2443L9724L154O9698K33893
6908F154917L36361K75589J49244J05364J53949K08674K29889K36852K39901K40337
6898H331077K51704K64055K41976K03564K23947L05953L43339K89081K53778L28336
6888A1036810M13453L72420K70439K82053M04681M60513L86233L28382M03255
6879A4358239N30881N85502N74399N74623N94778N96055N86013O13609P06084
6870A9720183Q45450R66085R78209Q72331P93790R01963J149281J333475J387289
6861B8948056J453236J622911J792283J880546K008419K298031K642833K870209
$$ y = [3990559, 4119135, 4233369, 4280684, 4335616, 4450781, 4547834, 4555992, 4557125, 4664801, 4826502, 4894237, 4867311, 4912631, 5124520, 5401172, 5605639, 5726005, 5808448, 5848172, 5851326, 5921024, 6154917, 6491278, 6766867, 6916111, 7021475, 7175424, 7384098, 7613987, 7850839, 8090740, 8331077, 8582781, 8846836, 9088812, 9292376, 9516323, 9822276, 10165615, 10454696, 10708474, 11036810, 11450263, 11822683, 12093122, 12375175, 12779856, 13240369, 13626602, 13954984, 14358239, 14889120, 15474622, 16049021, 16623644, 17218422, 17814477, 18400490, 19014099, 19720183, 20565633, 21531718, 22509927, 23382258, 24176048, 25078011, 26227292, 27560767, 28948056, 30401292, 32024203, 33816486, 35697032, 37705451, 40003482, 42646315, 45516524]
6853D5516524L034150L344077L848208M352550M607534M425972L696482K489916
6845G5315413J130757l3478r42538j751916k493750l022198l294242l466373l646456
6836E7795219l749741l682198l488084l228096k880360k465983k125536j961253
6828C4213968j916468j884509j809343j628230j293818r36343q03096r10996r61264
6819B2069901p61053n24192n35447p01116p14143n45157m58623n77427p20433
6810A6532310o99931n48623m07199l63616m26694n14285m89217l51501l14111
6801A2417133m90719o23921m17837n3531R656k64102m22103k46610p6720j98590
6791I632656l63977k52547l8260o8622k53532k47764p2024o0775k59587l51618
$$ y = [45516524, 48550674, 51894751, 55742959, 60095509, 64703043, 69129015, 72825497, 75315413, 76446170, 76412692, 75470154, 73718238, 71224488, 68202290, 64908048, 61441675, 57795219, 54045478, 50363280, 46875196, 43647100, 40766740, 38300757, 36175221, 34213968, 32297500, 30412991, 28603648, 26975418, 25681600, 24745257, 23942161, 23031165, 22069901, 21308848, 20784656, 20249209, 19548093, 18833950, 18288793, 17830170, 17252743, 16532310, 15832379, 15283756, 14876557, 14512941, 14086247, 13571962, 13082745, 12731244, 12417133, 11926414, 11302493, 10884656, 10831125, 10840781, 10576679, 10154576, 9907966, 9831246, 9632656, 9268679, 9016132, 8977872, 8909250, 8655718, 8407954, 8335930, 8275155, 8015568, 7663950]
6781G663950k03929n1053n9971j06960r2975j11831j73005j13602N0979M0850
6771F842453k15240l63227j53163J24990P7310j73129k05968J3917J14044o3369
6761E998618k37540j61706K9549Q7055L442n8004j8777O8642J17946O6979o2276
6750E833928j25465o123J76068J80240R111n0896J48151L67301L20861R0912j0124
6739F933964J20351K92533L22020K00336n200k17622l11906k08638m5683p4209
6729G005946l16161m92770l90401j47804m9121j49944k69355k78622k18462j49991
6719D543315p0312j4355p9250k56376l59110k42590k5740M3447q0980j89977j20653
6708C147419K8869O4735l0949j16438j19363j03924j11360q0496J3719O3388k3711
$$ y = [7663950, 7460021, 7408968, 7348997, 7242037, 7149062, 7037231, 6864226, 6750624, 6801603, 6842453, 6627213, 6263986, 6110823, 6235813, 6313123, 6139994, 5934026, 5947943, 6061987, 5998618, 5761078, 5599372, 5628921, 5715976, 5719418, 5661414, 5642637, 5711279, 5829225, 5896204, 5833928, 5708463, 5702340, 5878408, 6058648, 6067759, 6016863, 6165014, 6532315, 6853176, 6944088, 6933964, 7054315, 7346848, 7668868, 7869204, 7864004, 7646382, 7334476, 7125838, 7080155, 7005946, 6689785, 6197015, 5806614, 5658810, 5609689, 5459745, 5190390, 4911768, 4693306, 4543315, 4473003, 4458648, 4379398, 4123022, 3763912, 3521322, 3495582, 3539029, 3458049, 3268072, 3147419, 3176288, 3241023, 3210074, 3093636, 2974273, 2870349, 2758989, 2678493, 2692212, 2755600, 2731889]
6697B731889j51682j43451j35Q2248r402j33195r0707Q2298J58756M2436r6768
6686B472287p2720M8721N6967q7044k00256j53188l8466N207l780J7706L5832
6675B081266k4633r3619m0464P5901N7965r5500j36791M1305J84015L4635k48079
6664A836001k86381k2134K09546J55946n2866j58976j20360o2612l8347l706M0408
6653A496519M0482J905j4033j374j4878n6393n2361K4202Q9014N5836m2343j00538
6641A426038p8350k5642J1200K9744R712r1157k20851k09645J4949K48889K15996
6630A330883m9774k17184j08962O4588M9994p1127o0783O7922R7061j3026q0942
6619A008650m1426l1186q5648m3773J30091K04999L8697j59265j32865L7558R2154
$$ y = [2731889, 2580207, 2436756, 2436621, 2518869, 2509467, 2376272, 2285565, 2367863, 2526619, 2569055, 2472287, 2399567, 2448288, 2505255, 2418211, 2217955, 2064767, 2026301, 2031508, 2027728, 2045434, 2081266, 2056633, 1963014, 1922550, 1998451, 2056416, 1960916, 1824125, 1865430, 2049445, 2084080, 1836001, 1549620, 1527486, 1737032, 1892978, 1840112, 1681136, 1560776, 1498164, 1459817, 1456111, 1496519, 1537001, 1538906, 1524873, 1523499, 1508621, 1452228, 1399867, 1424069, 1513083, 1568919, 1526576, 1426038, 1347688, 1322046, 1333246, 1362990, 1372702, 1281545, 1060694, 851049, 865998, 1114887, 1330883, 1281109, 1063925, 954963, 1019551, 1069545, 998418, 937635, 1005557, 1102618, 1089592, 1008650, 967224, 936038, 850390, 806617, 936708, 1141707, 1180404, 1021139, 888274, 925832, 1017986]
6608A017986q553q4658m6019L2532Q6342R9793K1686j52331k59755j47329O5333
6597F25027J17974r935q0869K3728J39362R2439n9143j45534j00832J1715Q4407
6586F98339M3792o1012o8766P7854J90368Q2822j12930j21582L8489R2329k3863
6575H35840p6415K6583P5945k9813q2423L4288R4888n4555j65992l412J99610
6564H54544R2886j93786k43045j0354J51735P8493l1236m0823o3210j38900j04486
6553C51818P2930J51508q783j79062q2672J87695K83026N1643k74267l38653n0536
6542A64647K92785L09523j4074k90804k35462j9854N2759J6215Q1433J83774R9264
6531F40206p8177m0931J56859J26141j74970l03954n6999J79244P3008j27407
$$ y = [1017986, 1009433, 924775, 878756, 911288, 997630, 1097423, 1119109, 966778, 707023, 559694, 625027, 743001, 733066, 652197, 675925, 815287, 907726, 848583, 703049, 602217, 613932, 698339, 742131, 681119, 612353, 690207, 880575, 963397, 850467, 728885, 767374, 859703, 835840, 759425, 786008, 861953, 832140, 749717, 784005, 878893, 824338, 658346, 654934, 854544, 947430, 753644, 510599, 500245, 651980, 730473, 699237, 658414, 595204, 456304, 351818, 424748, 576256, 567473, 388411, 305739, 493434, 776460, 828103, 553836, 215183, 164647, 457432, 766955, 752881, 462077, 226615, 206761, 259520, 275735, 357168, 540942, 640206, 562029, 521098, 677957, 804098, 629128, 325174, 268175, 447419, 520427, 393020]
6521C93020p0535J09186R7645m1802o2060p895m7095o5731R9447K33273M8654
6510F86107k42940k01080J09288K10923J689j28082p112O7716o8125j44288J8859
6499C02955J61381M5770j31597r9809M4231O5852m115l226M1766J6177l5640k1307
6487C82438j578n1697p8879M015Q1294K5317p4110q2075n2230o7811l0806J35248
6475A89126K44670J07050j11554j03053R8990J76081K0979j42843j41579n5631
6465B82236k691K4490M0649O049n1861l4711N6482J03678N5964j7135o7759j09275
6453B86116j12568l2600N7123L6294m6889k5187J00187J31611o743j28813o6259
6442A92272Q3621J15482k92j13476r9223K4680J39034J30260j399j25107j20874
$$ y = [393020, 322485, 431671, 529316, 487514, 425454, 417559, 370464, 304733, 404180, 637453, 686107, 443167, 242087, 351375, 562298, 563987, 435905, 428793, 496509, 428384, 284096, 302955, 464336, 510106, 378509, 278700, 322931, 388783, 384668, 381442, 423208, 439385, 403745, 382438, 380860, 329163, 250284, 254299, 335593, 360910, 286800, 204725, 152495, 84684, 53878, 189126, 433796, 540846, 429292, 326239, 425229, 601310, 622289, 479446, 337867, 282236, 279545, 304035, 344684, 350733, 298872, 264161, 320643, 424321, 480285, 463150, 395391, 286116, 173548, 140948, 198071, 234365, 187476, 162289, 262476, 394087, 387344, 258531, 192272, 275893, 391375, 391083, 277607, 178384, 203064, 342098, 472358, 470959, 345852, 224978]
6431B24978k1521N5354P2495O5007K2250p4293j33578m9429J02333J41819N4671
6420D60086q521j560l1436j11584j03449K9379J35779J30015J07061J12476L8144
$$ y = [224978, 203457, 258811, 331306, 396313, 418563, 344270, 210692, 161263, 263596, 405415, 460086, 451565, 450005, 418569, 306985, 203536, 232915, 368694, 498709, 605770, 718246, 756390]
$$ [...]
##END NTUPLES=NMR SPECTRUM
##END=
