##TITLE=1H ikalashn
D-6
22.10.2024
##JCAMPDX= 6.0         $$ Bruker NMR JCAMP-DX V2.0
##DATA TYPE= NMR FID
##DATA CLASS= NTUPLES
##ORIGIN= UXNMR, Bruker Analytische Messtechnik GmbH
##OWNER= root
$$ TOPSPIN		Version 1.3
$$ 2024-10-22 11:17:28.062 +0400  Irina@DPX200
$$ Compression mode = diff/dup
##.OBSERVE FREQUENCY= 200.131300845
##.OBSERVE NUCLEUS= ^1H
##.DELAY= (6, 6)
##.ACQUISITION MODE= SIMULTANEOUS
##.ACQUISITION SCHEME= undefined
##.AVERAGES= 16
##.DIGITISER RES= 18
##SPECTROMETER/DATA SYSTEM= spect
##.PULSE SEQUENCE= zg
##.SOLVENT NAME= D2O
##.SHIFT REFERENCE= INTERNAL, D2O, 1, 17.49637
##AUDIT TRAIL= $$ (NUMBER, WHEN, WHO, WHERE, WHAT)
$$ ##TITLE= Audit trail, TOPSPIN		Version 1.3
$$ ##JCAMPDX= 5.01
$$ ##ORIGIN= Bruker BioSpin GmbH
$$ ##OWNER= Irina
$$ $$ F:/spectra/data/iren/nmr/1H/4/audita.txt
$$ ##AUDIT TRAIL=  $$ (NUMBER, WHEN, WHO, WHERE, VERSION, WHAT)
(   1,<2024-10-22 11:17:10.250 +0400>,<Irina>,<DPX200>,<TOPSPIN 1.3>,
      <created by zg
	started at 2024-10-22 11:16:02.109 +0400,
	POWCHK disabled, PULCHK disabled
       configuration hash MD5:
       BE 6D 3F 07 2A EA 11 49 91 17 2B D3 AF B3 58 0D
       data hash MD5: 16K
       45 DD DE B2 17 99 31 5D FE 5C 8B 8F 78 F0 8F 16>)
$$ ##END=
$$ 
$$ $$ hash MD5
$$ $$ 6D 1B 04 36 7C 4D 8A E3 44 FF DB 2F AD 12 70 09
##$RELAX= 
##$RELAX= 
##$RELAX= 
##$RELAX= 
##$RELAX= 
##$RELAX= 
##$RELAX= 
##$RELAX= 
##$RELAX= 
$$ Bruker specific parameters
$$ --------------------------
##$DU= <F:/spectra>
##$EXPNO= 4
##$NAME= <1H>
##$PROCNO= 1
##$TYPE= <nmr>
##$USER= <iren>
##$AMP= (0..31)
100 100 100 100 100 100 100 100 100 100 100 100 100 100 100 100 100 100 
100 100 100 100 100 100 100 100 100 100 100 100 100 100 
##$ANAVPT= -1
##$AQSEQ= 0
##$AQ_mod= 1
##$AUNM= <au_zg>
##$AUTOPOS= <>
##$BF1= 200.13
##$BF2= 200.13
##$BF3= 200.13
##$BF4= 200.13
##$BF5= 200.13
##$BF6= 200.13
##$BF7= 200.13
##$BF8= 200.13
##$BYTORDA= 1
##$CFDGTYP= 0
##$CFRGTYP= 5
##$CHEMSTR= <none>
##$CNST= (0..63)
1 1 145 1 1 1 1 1 1 1 1 1 1 1 1 1 1 1 1 1 1 1 1 1 1 1 1 1 1 1 1 1 1 1 
1 1 1 1 1 1 1 1 1 1 1 1 1 1 1 1 1 1 1 1 1 1 1 1 1 1 1 1 1 1 
##$CPDPRG= <>
##$CPDPRG1= <>
##$CPDPRG2= <>
##$CPDPRG3= <>
##$CPDPRG4= <mlev>
##$CPDPRG5= <mlev>
##$CPDPRG6= <mlev>
##$CPDPRG7= <mlev>
##$CPDPRG8= <mlev>
##$CPDPRGB= <>
##$CPDPRGT= <>
##$D= (0..63)
0 2 0 0 0 0 0 0 0 0.06 0 0.03 0 0 0 0 0.0002 0 0 0 0 0 0 0 0 0 0 0 0 0 
0 0 0 0 0 0 0 0 0 0 0 0 0 0 0 0 0 0 0 0 0 0 0 0 0 0 0 0 0 0 0 0 0 0 
##$DATE= 1729581427
##$DBL= (0..7)
120 120 120 120 120 120 120 120 
##$DBP= (0..7)
150 150 150 150 150 150 150 150 
##$DBP07= 0
##$DBPNAM0= <>
##$DBPNAM1= <>
##$DBPNAM2= <>
##$DBPNAM3= <>
##$DBPNAM4= <>
##$DBPNAM5= <>
##$DBPNAM6= <>
##$DBPNAM7= <>
##$DBPOAL= (0..7)
0.5 0.5 0.5 0.5 0.5 0.5 0.5 0.5 
##$DBPOFFS= (0..7)
0 0 0 0 0 0 0 0 
##$DE= 6
##$DECBNUC= <off>
##$DECIM= 32
##$DECNUC= <off>
##$DECSTAT= 4
##$DIGMOD= 1
##$DIGTYP= 9
##$DL= (0..7)
0 120 120 120 120 120 120 120 
##$DP= (0..7)
150 150 150 150 150 150 150 150 
##$DP07= 0
##$DPNAME0= <>
$$ [...]
##$SW= 21.9926040160658
##$SWIBOX= (0..15)
0 0 2 0 0 0 0 0 0 0 0 0 0 0 0 0 
##$SW_h= 4401.40845070422
##$TD= 16384
##$TD0= 1
##$TE= 300
##$TE2= 300
##$TE3= 300
##$TEG= 300
##$TL= (0..7)
0 120 120 120 120 120 120 120 
##$TP= (0..7)
150 150 150 150 150 150 150 150 
##$TP07= 0
##$TPNAME0= <>
##$TPNAME1= <>
##$TPNAME2= <>
##$TPNAME3= <>
##$TPNAME4= <>
##$TPNAME5= <>
##$TPNAME6= <>
##$TPNAME7= <>
##$TPOAL= (0..7)
0.5 0.5 0.5 0.5 0.5 0.5 0.5 0.5 
##$TPOFFS= (0..7)
0 0 0 0 0 0 0 0 
##$TUNHIN= 0
##$TUNHOUT= 0
##$TUNXOUT= 0
##$USERA1= <user>
##$USERA2= <user>
##$USERA3= <user>
##$USERA4= <user>
##$USERA5= <user>
##$V9= 5
##$VALIST= <valist>
##$VCLIST= <CCCCCCCCCCCCCCC>
##$VD= 0
##$VDLIST= <DDDDDDDDDDDDDDD>
##$VPLIST= <PPPPPPPPPPPPPPP>
##$VTLIST= <TTTTTTTTTTTTTTT>
##$WBST= 1024
##$WBSW= 25
##$XGAIN= (0..3)
0 0 0 0 
##$XL= 0
##$YL= 0
##$YMAX_a= 421770
##$YMIN_a= -592756
##$ZGOPTNS= <>
##$ZL1= 120
##$ZL2= 120
##$ZL3= 120
##$ZL4= 120
##$ABSF1= 10
##$ABSF2= 0
##$ABSG= 5
##$ABSL= 3
##$ALPHA= 0
##$AQORDER= 0
##$ASSFAC= 0
##$ASSFACI= 0
##$ASSFACX= 0
##$ASSWID= 0
##$AUNMP= <proc_1d>
##$AXLEFT= 0
##$AXRIGHT= 0
##$AXTYPE= 0
##$AXUNIT= <>
##$AZFE= 0.1
##$AZFW= 0.1
##$BCFW= 1
##$BC_mod= 2
##$BYTORDP= 1
##$COROFFS= 0
##$CY= 7568.61572265625
##$DATMOD= 1
##$DC= 2
##$DFILT= <>
##$DTYPP= 0
##$F1P= 17.9538593292236
##$F2P= -4.03888763876832
##$FCOR= 0.5
##$FTSIZE= 32768
##$FT_mod= 4
##$GAMMA= 1
##$GB= 1
##$INTBC= 1
##$INTSCL= 1
##$ISEN= 128
##$LB= 0.01
##$LEV0= 0
##$LPBIN= 0
##$MAXI= 945.577
##$MC2= 0
##$MEAN= 0
##$ME_mod= 0
##$MI= -402.1523
##$NCOEF= 0
##$NC_proc= 0
##$NLEV= 6
##$NOISF1= 8.587773
##$NOISF2= 6.764455
##$NSP= 1
##$NTH_PI= 0
##$NZP= 0
##$OFFSET= 17.49637
##$PC= 1
##$PHC0= -22.52487
##$PHC1= -21.06012
##$PH_mod= 0
##$PKNL= yes
##$PPARMOD= 0
##$PPDIAG= 0
##$PPIPTYP= 0
##$PPMPNUM= 100
##$PPRESOL= 1
##$PSCAL= 0
##$PSIGN= 0
##$REVERSE= no
##$SF= 200.13
##$SI= 32768
##$SIGF1= 18.5376
##$SIGF2= -6.396296
##$SINO= 400
##$SIOLD= 32768
##$SREGLST= <1H.CDCl3>
##$SSB= 3
##$STSI= 0
##$STSR= 0
##$SW_p= 4401.40845070422
##$SYMM= 0
##$S_DEV= 0
##$TDeff= 0
##$TDoff= 0
##$TI= <>
##$TILT= no
##$TM1= 0
##$TM2= 0
##$TOPLEV= 0
##$USERP1= <user>
##$USERP2= <user>
##$USERP3= <user>
##$USERP4= <user>
##$USERP5= <user>
##$WDW= 1
##$XDIM= 8192
##$YMAX_p= 0
##$YMIN_p= 0
$$ End of Bruker specific parameters
$$ ---------------------------------
##NTUPLES= NMR FID
##VAR_NAME=  TIME,          FID/REAL,        FID/IMAG
##SYMBOL=    X,             R,               I
##VAR_TYPE=  INDEPENDENT,   DEPENDENT,       DEPENDENT
##VAR_FORM=  AFFN,          ASDF,            ASDF
##VAR_DIM=   8192,          8192,            8192
##UNITS=     SECONDS,       ARBITRARY UNITS, ARBITRARY UNITS
##FACTOR=    0.0002272,     1,               1
##FIRST=     0,             0,               0
##LAST=      1.8609952,     1,               89
##MIN=       0,             -592756,         -592756
##MAX=       1.8609952,     421770,          421770
$$ Real data points
##PAGE= N=1
##DATA TABLE= (X++(R..R)), XYDATA
0@%%%%%%%%%%%%jJ7l2L2l2M8o4O5q1J04j20J44j76K08k40K72l05L53m12M68n28
$$ 0 0 0 0 0 0 0 0 0 0 0 0 0 -1 16 -16 16 -16 32 -32 33 -48 56 -64 80 -96 112 -128 144 -161 192 -220 248 -280
33b80O01o82P64q60R70j084J211j350J501j667J846k044K261k495K751l036L348
$$ -280 321 -361 403 -457 513 -571 640 -710 791 -876 970 -1074 1187 -1308 1443 -1593 1755
50A755l688M061m475M935n446O024o678P420q279R289j0485J1932j3731J6033
$$ 1755 -1933 2128 -2347 2588 -2858 3166 -3512 3908 -4371 4918 -5567 6365 -7366 8667
64H667j9098K3410k9976M1298o6130K14824k03843n17433K44861M88513K33104
$$ 8667 -10431 12979 -16997 24301 -41829 172995 -30848 -548281 -303420 185093 418197
75D18197k84491l16089n2336J92813J11077J1578j554J9950j16994j78667j4863
$$ 418197 133706 -182383 -234719 -41906 69171 80749 79195 99145 -17849 -196516 -211379
86b11379K59624K39543p9972l50704j96048J94752L60143Q8205k45497k59175
$$ -211379 48245 287788 207816 -142888 -338936 -144184 215959 304164 58667 -200508
96b00508O322J82119J28631j4528o8394n4223m4151k9206N8537J38556O2622j33148
$$ -200508 -194186 -12067 116564 102036 33642 -20581 -64732 -93938 -35401 103155 165777 32629
108C2629j89406p728J83847J35274o9565j55488l3578R7438O2261m9151l9708
$$ 32629 -156777 -164505 19342 154616 85051 -70437 -104015 -6577 55684 6533 -33175
119c3175O1567N3461q3532j26363K7786J75881R6537j20597j86784p203J79116
$$ -33175 28392 81853 -1679 -128042 -100256 75625 172162 51565 -135219 -142422 36694
130C6694J20359r1848j53961l39J19330L5147r5219n2880R7588J08883o7999j79997
$$ 36694 157053 65205 -88756 -89095 30235 65382 -29837 -82717 14871 123754 55755 -124242
142a24242l3432J89954J66191r2340k34966p0121J74335J83516k7454j70072q2729
$$ -124242 -157674 32280 198471 106131 -128835 -198956 -24621 158895 131441 -38631 -121360
153a21360Q0990R9447q687n7666L31L1833k6264o2973J0254R9271O2676p2252
$$ -121360 -40370 59077 50390 -7276 -6945 24888 -1376 -64349 -54095 45176 107852 35600
165C5600j27713j7026J19650J00217m5248j18472l8158O9041O8282q209m1814
$$ 35600 -92113 -109139 10511 110728 65480 -52992 -91150 -22109 46173 37964 -3850
176c850o557J8976r190k9242J4441N7787J3254o8632o0248L8053Q7028J5669p4245
$$ -3850 -10407 8569 -621 -29863 -15422 42365 55619 -13013 -73261 -35208 51820 67489 -6756
189f756n6503L8754P1247m950p2383k7302N9734N4898l4484p2328l724P1473M6789
$$ -6756 -63259 -24505 46742 41792 -30591 -57893 1841 56739 22255 -50073 -53797 17676 64465
202F4465m0228o6648j44N7464K4142l9461l0370L1012L8095k5556n7352L531P5647
$$ 64465 24237 -42411 -42555 14909 39051 -410 -30780 232 38327 12771 -44581 -41050 34597
215C4597M5525o0495r8032l582J01931P4234m7953j01170k5893O7837O6528o703
$$ 34597 80122 19627 -78405 -81987 19944 94178 46225 -54945 -80838 -13001 53527 46824
227D6824m9405k5406R599R007J185J9096K8847j0751n7239l4759M3053P7487J6826
$$ 46824 -2581 -27987 -18388 -9381 -8196 10900 39747 28996 -28243 -63002 -19949 57538 74364
240G4364o9870p5211R300P8484M9227l2447o1524j7111K9133K8669N399m206m234
$$ 74364 4494 -70717 -61417 17067 66294 33847 -27677 -44788 -15655 13014 18413 14207 9973
253I973j5766k6317k464M2437M5337j5864o6680l3282M5050O6883O789n6182m6961
$$ 9973 -5793 -32110 -34574 7863 53200 37336 -29344 -62626 -17576 49307 56096 -86 -47047
266d7047J4598M7327J7352k3034k0710L988P103n959j367J6084J3584j4652l1904
$$ -47047 -32449 14878 32230 9196 -11514 -7526 -423 -6382 -7749 8335 21919 7267 -24637
279b4637q324L2344L4939j0487m2473j6340L0390L3146o330l1075j2279J9213
$$ -24637 -32961 -617 34322 23835 -18638 -34978 -4588 28558 22228 -8847 -21126 -1913
291a913J8754r623k0249M487K2262J780k2780j1326J7850J9198p243k3851p625
$$ -1913 16841 7218 -13031 -8544 13718 15498 -7282 -18608 -758 18440 11197 -12654 -20279
304b0279J8864J7229r486j9840K240J9175M985j5724j0483J0306J5951j531j8758
$$ -20279 -1415 15814 6328 -13512 -11272 7903 12888 -2836 -13319 -3013 12938 11407 -7351
317g351r875J6066K0466n463k2886o279J6557J3678p426j6065l146J2651P998
$$ -7351 -17226 -1160 19306 13843 -9043 -15322 1235 14913 7487 -8578 -11724 927 8925
330H925r821j0112Q675J3309n790j6408r22J6982J0251j0912j8417m95K0266J3503
$$ 8925 -896 -11008 -2333 10976 5186 -11222 -12144 4838 15089 4177 -14240 -14735 5531 19034
344A9034j1782j8561J181J5145O232p394q295j24N276J113m892l69Q342K875j1416
$$ 19034 7252 -11309 -10128 5017 11249 3855 -4440 -4564 712 1825 -3067 -3436 4906 7781 -3635
359c635r876Q136J5489J678j4559j3536N213J9259Q136j3483j4732M624J3311
$$ -3635 -13511 -5375 10114 11792 -2767 -16303 -11090 8169 16305 2822 -11910 -7286 6025
372F025K694p001m009J776J645k351k380M367P503k778j2739m035J1402J0512
$$ 6025 8719 1718 -2291 -515 1130 -1221 -3601 766 8269 5491 -7248 -11283 119 10631
386A0631m581j2540n409P176J1241J642r803o261N688P108j181m339k67K321L57
$$ 10631 6050 -6490 -11899 -4723 6518 8160 -1643 -7904 -2216 4892 3711 -628 -895 1426 1783
401A783k659j497L804N237k836r291j309R678N662o715r293l97P618O184k677
$$ 1783 -876 -2373 1431 6668 3832 -5459 -6768 2910 8572 1857 -7436 -7833 -215 5969 3292
416C292p550j701N812L500k574j395J560n15k544k64L164L843M88m974n743K215
$$ 3292 -4258 -5959 -147 3353 779 -616 944 429 -2115 -2379 785 4628 5116 142 -5601 -3386
432c386Q315K677n982o888o88M690M800j94m536j964J763K80j350K335M454j315
$$ -3386 4929 7606 1624 -5264 -5952 -1262 3538 3344 -1192 -3156 -1393 -1113 -2463 -128 4326 3011
448C011o486l495L952P842L465m765q001j288N745M976M29k582m026l850L99N074
$$ 3011 -3475 -6970 -3018 4824 8289 3524 -4477 -5765 -20 4956 5385 2803 -1223 -5073 -4674 400
464D00M563M13m469o455k747N010Q517K534n784q366l279N195R755M981m754r171
$$ 400 4963 5376 907 -5548 -8295 -3285 5232 7766 1982 -6384 -9663 -4468 5287 10268 5514 -3657
480c657n037K716Q809Q470j311j1560j0301K115J2448R910k416j2087r769J769
$$ -3657 -8694 -5978 2831 11301 9990 -1570 -11871 -9756 2692 12602 10186 -1901 -11670 -9901
494i901J0217P739o6o374q645m407M986J1408P651l818j2718j0377L208J5825
$$ -9901 316 8055 7989 1615 -7030 -11437 -6451 4957 12608 8790 -3928 -14305 -11097 4728
508D728J2819m644j7783j2140N899J7401J1475o315j6647r189N416J1639O914
$$ 4728 17547 12903 -4880 -17020 -11121 6280 17755 11440 -5207 -14396 -8980 2659 9573
521I573j159p607r226l437N935J1091P339l826j3364j0810M030J6026J2220m009
$$ 9573 8414 807 -8419 -11856 -5921 5170 12509 8683 -4681 -15491 -11461 4565 16785 12776
535A2776j6288j3034L618J8036J3493n485j7381j0708M937J3050Q544k555r804
$$ 12776 -3512 -16546 -12928 5108 18601 13116 -4265 -14973 -10036 3014 11558 9003 -801
548h01p588k64M601O980N456q52q771r325j213R479J3798M324j2258j8150l104
$$ -801 -8389 -8653 -4052 2928 8384 7532 -1239 -10564 -11777 -2298 11500 15824 3566 -14584 -17688
563a7688J6905J8451J79j7483j6173J926J6226J1251m101j0743n377M42K185L684
$$ -17688 -783 17668 17847 364 -15809 -13883 2343 13594 9493 -1250 -6627 -6185 -4000 -316
577c16N576L282m275j1694r005O861J9950J0961j2933k3516p924J6807K4309N331
$$ -316 5260 8542 4267 -7427 -16432 -9571 10379 21340 8407 -15109 -23033 -6226 18083 23414
591B3414j9502k1934j26J8269J4624j092j1452j0079k104M804P036N851J808n861
$$ 23414 3912 -18022 -18148 121 14745 13653 2201 -7878 -9982 -5178 1858 7709 9517 3656
605C656j3045p346Q822J8183Q969j0524k1287j0691J3626K5173Q953j6940k3548
$$ 3656 -9389 -16735 -7913 10270 19239 8715 -12572 -23263 -9637 15536 24489 7549 -15999
618a5999n344J6369K0591M314j5303j6963j507J1033J0051K192m231o636n478
$$ -15999 -21343 -4974 15617 19931 4628 -12335 -13842 -2809 7242 9434 5203 -1433 -6911
631f911j940L013R226R755j963j7073j4845O813K3029J4224j0920k5080j1539
$$ -6911 -8851 -5838 3388 13143 11180 -5893 -20738 -13925 9104 23328 12408 -12672 -24211
644b4211J5938K4576M596j7160j6369J92J1202Q842k12m910k330j664n004k553
$$ -24211 -8273 16303 20899 3739 -12630 -12438 -1236 7606 7394 2484 154 -1510 -6514 -9067
658i067Q561J3541O90j6347j6937K449K1846J8062p272k5229j3464J2034K1890
$$ -9067 -506 13035 13725 -2622 -19559 -17110 4736 22798 15526 -9703 -23167 -11133 10757
671A0757Q770j0501j6532o698P287J2073N091k407o379p491m080M109J0500P540
$$ 10757 19527 9026 -7506 -14204 -6917 5156 10247 7840 1461 -6030 -10110 -6001 4499 12039
685A2039k570j2626j2758J550J6926J5429l636j9337j4940M659K0466J5264o301
$$ 12039 9469 -3157 -15915 -14365 2561 17990 14354 -4983 -19923 -15264 5202 20466 14165
698A4165k0747j2055Q007J7489Q984o214j3453p314M365Q719M447L79k866o423
$$ 14165 -6582 -18637 -10630 6859 15843 9629 -3824 -11138 -6773 1946 6393 6772 3906 -2517
712b517p314J98J0603J1510m83j4777j4445L651J9065J2642q164j8164p682R393
$$ -2517 -9831 -9633 970 12480 11997 -2780 -17225 -13574 5491 18133 9969 -8195 -15877 -6484
726f484J4814M528q636j0165j031N651L952N69j34n70l017m473j079N278P706
$$ -6484 8330 12858 4222 -5943 -6974 -1323 2629 3198 3064 2494 -523 -4996 -6075 -797 6909
741F909Q45q842q689J640R834O625k540q142n203K517O784L937j604l869k875
$$ 6909 7754 -1088 -9777 -8137 1697 8322 5782 -2360 -7563 -5046 1738 5675 4071 202 -2673
756b673j90K167K837J319r55j896k650j846J784M433L021k641n729l796K418P135
$$ -2673 -2863 -696 2141 3460 2505 609 -2041 -3887 -2103 2330 5351 2710 -3019 -6815 -4397 2738
772B738M321l641p538l480M062P080L135l424o275k261L604M340J239j075j939
$$ 2738 7059 3418 -4120 -7600 -3538 3542 6677 3253 -3022 -5283 -1679 2661 3900 2825 886
787H86k877j730J518M558L369k183o657m374L743P727K660m852o624j582M348
$$ 886 -1991 -3721 -2203 2355 5724 3541 -3116 -7490 -3747 3980 6640 1788 -4836 -6418 -2070
802b070N479J506l519m272n67K209K915J383m53k389k298j54K069K495J156j932
$$ -2070 3409 4915 1396 -2876 -3443 -1234 1681 3064 2611 222 -2076 -2230 -161 2334 3490 1558
818A558l589j638K634L159L21k068k357q39J288K188R99p18j489j168j30J783
$$ 1558 -2031 -3669 -1035 2124 2445 377 -1980 -2819 -1531 657 1656 938 -551 -1719 -1849 -66
834f6K069k27j720p30j1M27J044Q78l70j190j317j11Q23J765L70j392j888n28
$$ -66 2003 1776 56 -674 -685 -258 786 1664 1294 104 -1213 -1324 -501 1264 1634 242 -1646 -2174
852b174J200J643J084j116k281q26J569J910P15n91j376j548N57K264J354m81
$$ -2174 -974 669 1753 637 -1644 -2470 -901 1009 1724 1133 -243 -1791 -1234 1030 2384 1903
868A903j722j935k4K424K225j235k606j158O39J471J525j16k129j714O97J735
$$ 1903 181 -1754 -1778 646 2871 1636 -970 -2128 -1489 -18 1507 1391 -738 -2452 -1755 -20
884b0J329Q4j547j697L21K301J030l60j049j309o07J684K004m37j853j045M7J213
$$ -20 1309 1393 -154 -1851 -1530 771 1801 1441 392 -917 -1524 160 2164 1727 -126 -1171 -1124 89
902H9J288r9j926j102M71J049R08K45j346j375M41J906Q86p02p80q55R1J478R67
$$ 89 1377 1278 -648 -1750 -1279 -230 678 923 -423 -1798 -1357 549 1435 733 -47 -902 -811 667 1634
921A634m43j303m73J31Q15J081j89j829r23Q72J088J35j37j030j012N13J390L78
$$ 1634 1191 -112 -585 -454 361 1442 1253 -576 -1499 -627 461 596 459 -571 -1583 -1070 320 698
939F98n19n67m81J79J201O04p97n76J01J78K07P95O7j209n77N30M33Q9J16p85
$$ 698 179 -388 -869 -690 511 1115 318 -258 -157 21 228 1023 1090 -119 -696 -166 267 356 472 -313
959c13p63M20R00j01m21q5l89kR93N07q50l53L19K46J80K24Q8m77j57K34r8L53
$$ -313 -1076 -656 244 143 -278 -363 -752 -754 239 746 -104 -457 -138 108 288 512 600 123 -34 200 102 455
981D55L25n53j035K49R95p3m44l79k41R8N41L53n71k07M55j15j04N67L92m71k57
$$ 455 780 227 -808 -559 436 363 -81 -460 -701 -603 -62 291 -280 -487 -32 -147 -251 316 708 237 -20
1002b0j44JM10Q90m22j014k47N20M63o6j58m71l10n0L39P9N37K1j019q90J076
$$ -20 -164 -163 247 1137 715 -299 -546 -26 437 371 213 -258 -568 -618 -279 -200 337 358 -661 -1551 -475
1023d75J458J27j026r22KJ043R73n5q96o16j3K57M25Q03k65r52r65kO99J377L10
$$ -475 983 1110 84 -838 -836 207 1180 1125 229 -387 -400 -143 282 1085 820 -132 -1097 -1099 -400 977 1287
1044A287j645j774N33J941J030m63j425q34M88J206P73l9l92q15j311O97J821
$$ 1287 -358 -2132 -1599 342 1372 909 -516 -1350 -862 344 1117 1078 686 -129 -1440 -743 1078
1061A078J245j361k015q62J108J975M92j372j567L0P02M73L67K79k02j173p75
$$ 1078 2323 962 -1053 -1915 -807 1168 1660 288 -1279 -1249 -547 -74 293 572 370 -803 -1578
1078a578M60J905J617q92l018j062K096K880J75k420j846L21J940O80p13q08L23
$$ -1578 -1118 787 2404 1512 -1506 -2568 -472 2408 2583 163 -1683 -1362 578 1258 545 -263 60
1095F0r4j106k84J446J931p00k714j550J450L081J499k039l167l02K357J873K13
$$ 60 -34 -1140 -1424 22 1953 1253 -1461 -3011 -1561 1520 3019 980 -2187 -2489 -132 1741 1954
1112A954j216j522m41Q66J156N58p0q65j773o78J492J845L81j395j549r25Q20
$$ 1954 738 -784 -1225 -359 797 1355 1285 420 -1353 -2031 -539 1306 1687 292 -1257 -2182 -1362
1129a362J951J421n58j946k004L7L057L033r25m044k237K068L603J303k298k993
$$ -1362 589 2010 1452 -494 -2498 -2461 596 3629 2704 -1340 -3577 -1509 2094 3397 1099 -1894
1145a894j09K130J214j077o42R31K21j850j517J174L440J481l142m858K97N610
$$ -1894 -2003 127 1341 264 -378 553 774 -1076 -2593 -1419 2021 3502 360 -4498 -4201 1409
1161A409L629k510n289j411L474M112l17l635j578J894J492j121j174J244J683
$$ 1409 5038 2528 -2761 -4172 -698 3414 3097 -538 -2116 -222 1270 149 -1025 219 1902
1176A902p39k632j751K170L800N79l973l340J155L908K145j223l236j666J522
$$ 1902 1163 -1469 -3220 -1050 2750 3329 -644 -3984 -2829 1079 3224 2001 -1235 -2901 -1379
1191a379K631R58j077j415q78J45J308J025o8q90o18m18l40N65J182O96l58k096
$$ -1379 1252 2210 1133 -282 -1160 -1015 293 1318 1250 360 -258 -676 -1016 -451 731 1427 1069 -1027
1209a027k261J119M094K078k998m586m77M127M053p23m702k670K829L937k88l034
$$ -1027 -3288 -2169 1925 4003 1005 -3581 -4058 69 4122 3399 -1303 -3973 -1144 2793 2505 -529
1225e29r92J958J049j310k277R54L555Q61m219l929K295N606J737m317m884M32
$$ -529 -1521 437 1486 176 -2101 -1147 2408 3269 -950 -4879 -2584 3022 4759 442 -4442 -4010
1241d010N286L122k557m511j29L349J666j505j508P08J120Jk067p35K096K285
$$ -4010 1276 4398 1841 -2670 -2799 550 2216 711 -797 -89 1031 1032 -1035 -1770 326 2611
1257B611j202l094j117K019K509M37k196k077jJ882J539k18q96j145n13Q21J854
$$ 2611 1409 -1685 -2802 -783 1726 2163 -33 -2110 -2111 -229 1310 1092 196 -949 -1462 -641 1213
1274A213L64j085j401j6J076P82k95p72K65Q27r24j647M84K629J036k463l001
$$ 1213 1577 492 -909 -925 151 933 638 -134 131 958 34 -1613 -1129 1500 2536 73 -2928
1291b928J30L663K559j915m221o11L515K607j376k734l94J988J576j426j851J102
$$ -2928 -2798 865 3424 1509 -2712 -3323 192 2799 1423 -1311 -1705 283 1859 433 -1418 -316
1307c16K309k45l009j364K349L078l79l683k182K077L649J86l189j909J509K292
$$ -316 1993 1748 -1261 -2625 -276 2802 2423 -1260 -3442 -1365 2284 2470 -719 -2628 -1119 1173
1323A173o9j535m22Q98O42r36p90R05J737k22k074j039J522J730j13j439j069
$$ 1173 1104 -431 -853 45 687 -249 -1039 -134 1603 1381 -693 -1732 -210 1520 1407 -32 -1101
1340a101M78J136p3n73j18N24o29q67M74J553N29j381j383K76J792R63j285j518
$$ -1101 -623 513 440 -133 -251 273 -356 -1223 -749 804 1333 -48 -1431 -1155 637 1600 315 -1203
1358a203M42J571K02j303l53J209O40r75j503M6K071Q47j571k159M91K401P97
$$ -1203 -761 810 1012 -291 -644 565 1205 230 -1273 -1227 844 1691 120 -2039 -1548 853 1650
1375A650j647j600N35J878L77j494r87J260J360o38j700O0J837R60j280j993J35
$$ 1650 3 -1597 -1062 816 1193 -301 -1288 -28 1332 694 -1006 -946 891 1851 571 -1422 -1287
1392a287K142J126j661j825L76J871K37j379q56J063J066l94j472J9J427J007
$$ -1287 855 1981 320 -1505 -1129 742 979 -400 -1256 -193 873 479 -993 -974 453 1460
1408A460j221j763N68J893N58j246j191L55J488K13j231p66P39R88m55j255J58
$$ 1460 239 -1524 -956 937 1495 249 -942 -587 901 1114 -117 -883 -144 844 389 -866 -708
1425g08J236M33j206j067M37J662K80j470j011R53J396k75j136j40J058M41o34
$$ -708 528 961 -245 -1312 -875 787 1067 -403 -1414 -461 935 660 -476 -616 442 883 249
1442B49p63J79J175J72j176q72Q07J290l35j356m93R44J007l63j341j23J225P70
$$ 249 -514 -335 840 1012 -164 -1036 -229 1061 726 -630 -1123 -179 828 465 -876 -999 226 996
1460I96r95j145P48J149J62j152p79P59J332o3j521n49J213J097q10j175p6J216
$$ 996 1 -1144 -396 753 915 -237 -1016 -257 1075 1012 -509 -1058 155 1252 442 -733 -809 407
1478D07M63q06j058L05J239K91j270q00R50R29j36r43k96O89J004m41j022o4J136
$$ 407 870 64 -994 -689 550 841 -429 -1229 -279 650 514 -429 -725 -36 968 527 -495 -559 577
1497E77M09r50q06O49Q32k3q49o54O58R71l97r84k21R49M99q12o26K81Q08J50
$$ 577 986 36 -770 -121 711 688 -161 -815 -157 814 417 -567 -788 161 660 -152 -778 -497 311 461
1517D61n48p31O59Q87j32r84k64R97N11m70o91j55N75O55o07q20K02Q93Qq25m03
$$ 461 -87 -818 -159 728 596 -388 -652 345 856 386 -305 -460 115 770 163 -657 -455 438 446 -379 -782
1538g82M93P29j29p72m35Q67P97n43q49J92R08K72p74m89L41P34K64q93n83M91
$$ -782 -289 440 311 -461 -896 -29 768 225 -624 -432 476 748 -26 -515 -174 560 824 -69 -652 -161
1558a61Q90j55j048j13N69M20k75n45q8O30M00n61o05M23O73j66o07j47M56O16
$$ -161 729 574 -474 -587 -18 402 127 -418 -506 124 524 -37 -642 -219 454 288 -319 -466 -10 606
1578F06j76p31j98N69N84l89n73J2M96l5k15k11J37J98L3l81k55N33L10l77l47
$$ 606 430 -301 -499 70 654 265 -308 -296 200 165 -50 -261 -124 74 107 -274 -529 4 314 -63 -410
1599d10J37M58Q8J9l83M1L72O0k80r8K05J07l06l59L28L04M6l73n10J29P34j4
$$ -410 -273 185 273 292 -91 -50 322 382 102 4 209 316 10 -349 -21 283 329 -44 -554 -425 309 295
1621B95m76k97K14K34Q6m2k56J51J70p0j74N2M37P1k65l30J3N86l9k33l10j62
$$ 295 -181 -478 -264 -30 56 14 -242 -91 79 9 -165 -113 324 395 130 -200 -187 399 360 127 -183 -345
1643c45L30K86j76l32J4L8J7R4J42r3Q9j70n2K27P9J56j96k68K10R1L9om0jl38
$$ -345 -15 271 95 -237 -223 -185 -168 -74 68 -25 64 -106 -158 69 148 304 108 -160 50 141 180 174 134 133 -205
1668b05Q7M0K89K7k28l90PK03K90Q9l58k40J37K84J64Ok58JJ00J60j01qj8P7p8
$$ -205 -118 -78 211 238 10 -380 -373 -170 120 209 -149 -389 -252 32 196 202 -56 -55 45 205 104 96 78 155 77
1693G7j39RK21N0n9l71j75L40J78P0k79l10r0M50L30j09m20j34J24M10K13m10
$$ 77 -62 -53 168 218 159 -212 -387 -47 131 201 -78 -388 -478 -28 302 193 -227 -361 -237 173 386 -24
1715b4p7J28K80k01k07J05K98M0m61k37K6M88K66l33n00k27M57M45J16m87l71
$$ -24 -101 27 307 106 -101 4 302 342 -119 -356 -330 158 424 91 -409 -636 -179 266 382 -105 -476
1736d76J26N58R4k30j42l6J80Q7r3j32J64K12j51k17k74L54L38J9m96n34K38O44
$$ -476 -350 208 302 72 -70 -106 74 161 68 -64 100 312 161 -56 -330 24 362 381 -115 -649 -411 233
1758B33K98m05o45r5P22M21k12o94l7N68K82j64m89Q2K37L23m27k29j81O32M87
$$ 233 531 126 -519 -614 108 529 317 -377 -414 154 436 272 -217 -135 102 425 -2 -231 -412 220 707
1779G07o18q12J07P98L89l94q52j85P66O56k71o99k05N83L29j45l59L4L66J84
$$ 707 89 -723 -616 182 571 177 -675 -860 -94 562 291 -408 -613 -30 299 154 -205 -171 195 379
1799C79k50m75K5P36K20n20n94J43M43M29o6r06k52N40M10P9m37l64P3L94L76
$$ 379 129 -346 -321 415 635 115 -479 -336 107 536 470 -436 -688 -148 262 341 -96 -460 -387 7 383
1820C83l27k89K77Q9R8j38k17P2L83J56n49n93M26O15P7n04o57R3Q18M22l81q96
$$ 383 56 -233 44 133 231 93 -124 -52 331 487 -62 -655 -229 386 463 -41 -698 -605 213 635 254 -642
1842f42N0N20N67l32m76p7M46M66l62m38j0O85K15o40m87K17P41L79o36p67M8
$$ -642 -592 -72 495 163 -313 -390 56 522 160 -278 -288 397 612 -28 -515 -298 443 822 186 -581 -533
1863e33Q44L02o70n25O5N40K07j55l69J37N44j21m07p0K30K43o0k43j35J30K33
$$ -533 311 613 -57 -582 -517 23 230 75 -294 -157 387 266 -141 -211 19 262 202 -41 -176 -46 187
1884A87J25k21l47J3J84J69M7k07k08O5J7L39q5j48j44l9L75m2j09j28J96O9J9
$$ 187 312 91 -256 -243 -59 110 157 -50 -258 -193 -176 163 78 -70 -214 -253 122 80 -29 -157 39 108 127
1907A27l37K00J09K39k21m54J10M42L10m69m88J60L50J92k41m71J54K98J72k31
$$ 127 -210 -10 99 338 117 -337 -227 215 525 56 -432 -272 78 270 29 -442 -288 10 182 -49
1927d9k31J25M72J9m10k29L91L77k18l92j84M27L37j5n58k79L72K90p3l75k3J13
$$ -49 -280 -155 317 336 -74 -303 88 465 247 -145 -329 98 435 420 -138 -417 -45 245 172 -203 -226 -113
1949a13L47m20j42K29L00o1j67j49J84J51M1k74r5J09L18j23j55J67k6N1k14k30
$$ -113 234 -186 -328 -99 201 140 -27 -176 8 159 200 -74 -169 -60 258 135 -20 147 121 172 -42 -272
1971b72L85%j46k02J5K98J51l31o1M2K46j35oj00J50K89k59k66J28L11P9k30l57
$$ -272 113 113 -33 -235 -220 78 229 -102 -163 -121 125 -10 -16 -116 34 323 64 -202 -74 237 316 86 -271
1994b71K48L51ll75k12M3M35o7l47j62L94K21k36k82L0L10J58k91j98O9M15M5
$$ -271 -23 328 325 -50 -262 -219 216 149 -198 -360 34 255 19 -263 -233 77 235 -56 -254 -185 230 275
2016B75k14k22R7L56%k44j65K69J2ml52j01K79K26k49l04Q3L33J66j85k34o5K12
$$ 275 61 -161 -64 292 292 48 -117 152 164 160 -192 -293 -14 212 -37 -341 -258 75 241 56 -178 -243 -31
2039c1R2o3j43K14J25j29j18j4K66P8k50o2j2J41M7k63j75L33J35j35l42J74J50
$$ -31 61 -2 -145 69 194 65 -53 -67 199 277 27 -35 -47 94 141 -122 -297 36 171 36 -306 -132 18
2062A8L1M6l44J58L34J06n43o5L08J88n8k38k07L19L57j49l11j33L56ol53qq6
$$ 18 49 95 -249 -91 243 349 -194 -259 49 237 179 -59 -266 53 410 261 -50 -183 173 167 -186 -194 -280
2085b80K60J78k30j58J64K14k7l27K0J65O8M8k50P3J67M2p9j50P9J1K02l26oK06
$$ -280 -20 158 -72 -230 -66 148 121 -206 -186 -21 47 95 -155 -82 85 127 48 -102 -23 -12 190 -136 -142 64
2109F4N9j25o1j33J07K79l39o2M9K53Q5q5k31Q1L78j19k69j01P9K67j32j32mR8
$$ 64 123 -2 -63 -196 -89 190 -149 -211 -162 91 176 91 -140 -59 319 200 -69 -170 -91 176 44 -88 -92 6
2133FK44p5k50j03L93Nk27k47L04j4k0k29J91j5K22q6k29N8M9K48j26k75J18J51
$$ 6 250 175 -75 -178 215 220 -7 -254 50 36 16 -213 -22 -37 185 99 -130 -72 -23 225 99 -176 -58 93
2157I3j11K0j55J49K30o3k53j77K32K20k05j60m6K48J94k33j15J14J89k0k54k4
$$ 93 -18 2 -153 -4 226 163 -90 -267 -35 185 -20 -180 -226 22 216 -17 -132 -18 171 151 -103 -127
2179a27J55N8K08m97J22Q7J67j50j24o6L17O6k39j82P0K88l8k67n8J43J15Q0k02
$$ -127 28 86 294 -203 -81 6 173 23 -101 -167 150 216 -23 -205 -135 153 115 -152 -210 -67 48 128 -74
2202g4o7J83J18j74j16K5J36O0j5j45mK70j21j13k9J72or8j52k2K65N9j87J2q8
$$ -74 -141 42 160 -14 -130 -105 31 91 76 -69 -73 197 76 -37 -66 106 100 2 -150 -172 93 152 -35 -23 -111
2227a11L14j17p3o4J07J43j71j99J23J62K8N5l48n5L43l9j48j68J29K44j50j59
$$ -111 203 86 13 -51 56 199 28 -171 -48 114 142 197 -151 -206 137 98 -50 -218 -89 155 5 -154
2249a54r3J14K31K6m49K21J71J0o9j82R0J91q5J5j15n4L35n2j43j78K49j7jj11
$$ -154 -247 -133 98 124 -325 -104 67 77 8 -174 -84 107 22 37 -78 -132 203 151 8 -170 79 62 61 -50
2273e0O7RK8q7r1k3K19K2j50j20J90J14j33mj40J55J20k44K9O0K41J03l17k05
$$ -50 17 26 54 -33 -124 -147 72 94 -56 -176 14 128 -5 -9 -149 6 126 -118 -89 -29 212 315 -2 -207
2297b07K13P2Q4j52k69J70J61qk82m6J96K74k53o3L5l0J80o0j10M2K48j66M0o5
$$ -207 6 78 162 10 -259 -89 72 64 -218 -264 -68 206 -47 -110 -75 -105 75 15 -95 -53 195 29 69 4
2321Dl6P7l9J18o3L4j03m0N3q8K00j30o4O6N8l1P5p7l1k8rP9n8Q6Q9k02M5R5N8
$$ 4 -32 45 6 124 61 95 -8 -48 5 -83 117 -13 -77 -11 47 16 91 14 -17 -45 -54 25 -33 53 142 -60 -15 80 138
2350A38j9j31j68Q4J33N3j08j98J32M5J47j18k4p8P9J61j18j53J82N2N3p9j91
$$ 138 119 -12 -180 -96 37 90 -18 -216 -84 -39 108 -10 -34 -112 -33 128 10 -143 39 91 144 65 -126
2373a26L9J77J00j32k42K34RJ02q0p4K8Lrp1j9m9J10Q1j01N2l5%O3L3q9j00K25
$$ -126 -87 90 190 58 -184 50 59 161 81 7 35 38 29 -42 -61 -110 0 81 -20 32 -3 -3 60 93 4 -96 129
2400A29K1k47M7J3j11K86mk58O4J7J67k33PK3J00r7J60j83m1J85p5R0k30M5K72
$$ 129 150 -97 -50 -37 -148 138 134 -124 -60 -43 124 -109 -102 -79 21 -76 84 -99 -140 45 -30 60 -170 -125 147
2425A47j00J76Lk14k8K3P8k0j75J76o2J31j12n3l2MJ13j25j13J05N5j8J88j52
$$ 147 47 223 226 12 -16 7 85 65 -110 66 4 135 23 -30 -62 -58 55 -70 -183 -78 -23 -41 147 -5
2449el1pK13k44O5pJ37J02j41k03J15o0J93j18j62k9J15Q3j3r8o1N4J58j5r3j08
$$ -5 -36 -43 170 -74 -9 -16 121 223 82 -121 -6 -66 127 9 -153 -182 -67 16 3 -95 -156 -102 56 41 -52 -160
2475a60L21j17l1j68rK72j0K2l62J89j6L11j47k94P2K56o3m8r0P2L2N1j30j57
$$ -160 161 44 13 -155 -164 108 98 120 -242 -53 -69 242 95 -199 -127 129 66 18 -72 0 32 83 -47 -204
2499b04M8J87N8j71l8K68p3l1l5J1q6M7K1j1L1r9J44m8p7J52nj02j38J05l0k2
$$ -204 -156 31 89 -82 -120 148 75 44 9 20 -66 -19 2 -9 22 -77 67 19 -58 94 89 -13 -151 -46 -76 -98
2525i8J1jJ23J8j7l9j1j5K6o3mJ00J41n8l8j91K53J6j47n4n4J71O1j46q5J19J39
$$ -98 -87 -88 35 53 36 -3 -14 -29 -3 -66 -70 30 171 113 75 -116 137 153 6 -48 -102 69 130 -16 -101 18 157
2552A57M9k72j04J65N1J07j47j74J03J64l9j39J41p6R9k7j33p8J34M7j44O3om3
$$ 157 206 -66 -170 -5 46 153 6 -168 -65 99 60 -79 62 -14 85 58 -75 -153 -19 28 -116 -53 -59 -102
2576a02J92k41P4K1O2R4j63P7N6n9K3j61J44J16j96J31n2l3P9p6j05J79o5R1j04
$$ -102 90 -151 -77 -56 6 100 -63 14 70 11 34 -127 17 133 -63 68 16 -17 62 -14 -119 60 -5 86 -18
2601a8m7l8J11M9k20J64O3q8J16j28m6J11N3n7p1o9K31n3j11j28Q4K8M7o3k6J82
$$ -18 -65 -103 8 57 -163 1 64 -24 92 -36 -82 29 82 25 -46 -115 116 63 -48 -176 -92 -64 -17 -80 -106 76
2627G6O3j14n4j05L3K15j07l6P0J5k0j07J66r2j0O6rq7K4L8J45m3j60R1n7Q1j72
$$ 76 139 25 -29 -134 -101 114 7 -29 41 56 36 -71 95 3 -7 59 50 -37 -13 25 170 127 -33 58 1 82 -90
2654i0J84l5M1j10r6J42N3o6n7O0k7K1q5L0M5M8P5j09m0L2mJ6Mo7n3J15J1q9k8
$$ -90 94 59 100 -10 -106 36 89 23 -34 26 -1 20 -65 -35 10 58 133 24 -16 16 12 28 32 -35 -88 27 38 -51 -79
2683g9M8k4N0o7Q5O1r0L0n7L5J7J29j34n5K0Q2j00l7R6QN7j12N3P3o5l8O5j80
$$ -79 -31 -55 -5 -72 13 74 -16 14 -43 -8 9 138 4 -51 -31 51 -49 -86 10 18 75 -37 16 89 24 -14 51 -129
2711a29O6J19n8m8l6M8J46r4j7n0O1O7Om8M9q0lO3r4J9J10j26j38P2O9l9j1J63
$$ -129 -63 56 -2 -50 -86 -38 108 14 -3 -53 8 75 81 33 82 2 -1 62 -32 -13 97 -29 -167 -95 -26 -65 -76 87
2739H7j46Q0J7p4p7l2J01N8j0m2p5J44j9Lm5N6J11j71J46j84l0J62p0O0k4j5p7
$$ 87 -59 21 38 -36 -113 -145 -44 14 4 -38 -113 31 12 15 -30 26 137 -34 112 -72 -102 60 -10 50 26 11 -66
2766f6J08j30N6M2n8j08J36N9m9L0j15J49Mj55J33k0OQ5j09r1n4J28J13Nj40J21
$$ -66 42 -88 -32 10 -48 -156 -20 39 -10 20 -95 54 58 -97 36 16 22 107 -2 -93 -147 -19 94 99 -41 80
2792H0j08O3l6Jl6J01Qk00J22q5rN9K6J8m9P8j33N0J30m2JK4j97J35N9r2M5j27
$$ 80 -28 35 -1 0 -36 65 73 -127 -5 -90 -99 -40 -14 4 -45 33 -100 -50 80 38 39 63 -134 1 60 -32 13 -114
2820a14J49p4nJ61k49R2J31j19L2Q7o4n9O2j02J09l1L6n7MJ1j3R3j91J38L9K0
$$ -114 35 -39 -44 117 -132 -40 91 -28 4 91 27 -32 30 -72 37 6 42 -15 -11 0 -13 80 -111 27 66 86
2846H6jj8L2k9o8O8K6j01l9o0J38j24J9n4L37k46j71J87j2Q5J2j15k6J14J9p6
$$ 86 85 67 99 70 2 70 96 -5 -44 -104 34 -90 -71 -125 212 -34 -205 -18 -30 55 67 -48 -74 40 59 -17
2872a7m4l8K8N0o0K02j57J4J67j00q6q1J58j0L2m8k2K3J95k04q8J43l7m7P4m4
$$ -17 -61 -99 -71 -21 -81 121 -36 -22 145 45 -41 -122 36 26 58 10 -12 11 206 2 -86 57 20 -27 47 3
2898CQK5Kkl3N7j89K23p2J47j22j92J69m7N2j45R6O4Qp9J18l3L6R2j76m5P6J7
$$ 3 11 36 38 36 3 60 -129 94 22 169 47 -145 24 -23 29 -116 -20 44 52 -27 91 58 94 186 10 -35 41 58
2926E8kq8J6J9NK8Q5k22J44j04P2j15J55m8J6j22R0K7J16p8ro8j24J42M0L5om7
$$ 58 56 -32 -16 3 8 36 121 -101 43 -61 11 -104 51 3 19 -103 -13 14 130 52 43 -25 -149 -7 33 68 62 15
2954A5n6jQ5j06J05N7j66J0k1J72j59L9J08k9J3q2l0J02r2K20j82j8P7Oq1pM8
$$ 15 -41 -42 43 -63 42 99 -67 -57 -78 94 -65 -26 82 53 66 -16 -46 56 -36 184 2 -16 61 67 -14 -21 27
2981B7p8%K5M0l5j08Q5K5jj13J64k8L3o7p2J15P0l4k4l1L8k11J84J16j30n3K21
$$ 27 -51 -51 -26 14 -21 -129 -44 -19 -20 -133 31 3 36 -31 -103 12 82 48 24 -7 31 -180 4 120 -10 -63 158
3008A58j23n2O1k2j36K27lj19KR9j42P7m7P1J1M1j37ll2K1J30q9L4r0N2N0J9q6
$$ 158 35 -17 44 22 -114 113 110 -9 -7 92 -50 27 -20 51 62 103 -34 -37 -69 -48 82 -7 27 -63 -11 39 58 -28
3036b8k4K2p2M1N7m2J17p4lj51Q3J31r0M2j2kM7q7J88r4p4J61j24k5J23l1j17
$$ -28 -52 -30 -102 -61 -4 -46 71 -3 -6 -157 -74 57 -33 9 -3 -5 42 -45 143 49 -25 136 12 -13 110 79 -38
3063c8oJ22j44M2k7N1o0M9N0r4J04rlJ7j40J33j64J15n2K9N6k4Jj25rJ52j1K0
$$ -38 -44 78 -66 -24 -51 0 -60 -11 39 -55 49 40 37 54 -86 47 -117 -2 -54 -25 31 7 8 -117 -126 26 15 35
3091C5m6n6k1q0J87Rl8j22Q9K14j28kr4n5J29j6M3N4J7k7Lj57Q4J0jr9P2O3j21
$$ 35 -11 -67 -88 -168 19 28 -10 -132 -43 171 43 41 -53 -108 21 5 48 102 119 92 95 -62 22 32 31 -68 4 67 -54
3120e4L9j1o2J22o4K6NKo2K2J05p8k6P3j94J10K7N0m5O7n7l2j8N2j2ooL9rM9j02
$$ -54 -15 -26 -88 34 -30 -4 1 3 -59 -37 68 -10 -36 37 -157 -47 -20 30 -15 52 -5 -37 -55 -3 -15 -21 -27 12 3 52 -50
3151e0R6j9Or3P5N6j46QO1K09j36j19J1O6L9o6N1L8k1j34P1M9l3q3R1O7j16j7
$$ -50 46 27 33 -60 15 71 -75 -67 -6 203 67 -52 -41 25 64 -2 49 87 66 -68 3 52 19 -64 27 94 -22 -39
3179c9j4J78n2K0j6p7K8Q9j41k3nJ25N6j39R2Mr4J21n3k2k0k3l9n6K50k38P3K9
$$ -39 -53 125 73 93 77 0 28 117 -24 -47 -52 73 129 -10 82 86 -8 113 60 38 18 -5 -44 -100 150 -88 -15 14
3207A4J57p4q5Mm2N9mp9j3J44m4J3Kj8oj3J34k10m4j2J17J30k14O3o8K04j33q5
$$ 14 171 97 12 16 -26 33 29 -50 -63 81 37 50 52 34 28 15 149 -61 -105 -117 0 130 -84 -21 -89 115 -18 -103
3235a03P5P7n9N8j48Q1Qk3n5P5L5p6R3q0O8o1Q2n8k7R3l6L6n6M7m9j02J18m3J06
$$ -103 -28 49 -10 48 -100 -19 -11 -34 -89 -14 21 -55 38 -42 26 -35 47 -11 -38 55 19 55 -1 46 -3 -105 13 -30 76
3264G6j39P7J08o5L3j46N1Oo6J76j26J65j09k38J88j45K07n7j58J45J02o0r7J93
$$ 76 -63 14 122 57 90 -56 -5 1 -65 111 -15 150 41 -197 -9 -154 53 -4 -162 -17 85 25 -72 121
3288A21Rj00J2q2Q6k7J06j44l8J71j14L0q1l0P3k8J9k2P3j02M5P2n8J9n6M3%J05
$$ 121 130 30 42 -40 46 19 125 -19 -57 114 0 30 -51 -81 -8 -36 -17 -39 34 -68 -23 49 -9 10 -46 -3 -3 102
3316A02j0j45J5J08j30J95p4n0K1m1p%k7N6K2n5L8J1Rj3m3l5k6K6J14j40QJ4K12
$$ 102 92 -53 -38 70 -60 135 61 11 32 -9 -16 -16 -43 13 35 -20 18 29 38 25 -18 -53 -79 -53 61 -79 -71 -57 155
3345A55j13j35J69p6M4j5k2M7n1J20l7j38p7N7OL7j55K08j1N9m5m2p2O8R0n0p3
$$ 155 42 -93 76 0 44 29 7 54 3 123 86 -52 -129 -72 -66 -29 -184 24 13 72 27 -15 -87 -19 71 21 -52
3372e2n5J53M1L8k02l4R8qj7l6R7qM7k9n0k3P5q4R7j8p9Oo7P8m0L3q1O3l5J00
$$ -52 -107 46 87 125 -77 -111 -13 -21 -38 -74 23 15 62 33 -17 -40 35 -49 48 30 -49 -43 -110 -32 -72 -39 -120 -57 -92 8
3402Hk6Mo5N2J03J6j15q5N8N9j0l6n8J32J39k26J69j64RN2o6m4k1J28o4O2Ko4
$$ 8 -18 -14 -79 -27 76 92 -23 -108 -50 9 -1 -37 -95 37 176 -50 119 -45 -36 16 -50 -94 -115 13 -51 11 13 -51
3430e1PR8r2O9R6m5J7p3q2Q5K5p3P6j12J21k10N0N0JR7j68P3o7J15RJ3j63J15
$$ -51 -44 54 -38 31 127 82 99 26 -56 29 54 -19 57 -55 66 -144 -94 -44 -43 54 -114 -41 -108 7 16 29 -134 -19
3458a9R3p9Q3j91N2O2r0K26j87jQ8M5J3q0PJ33q8j40P7p5m0L19q8j66M6Q3n8k
$$ -19 74 -5 78 -113 -61 1 -89 137 -50 -51 37 82 95 15 22 155 67 -73 4 -71 -111 208 120 -46 0 83 25 23
3486B3K2J9J9r6k4j2N1O1j59J73j08j26R6j2P2NNp5n1O4J69r8Ln5Q3l4p1O9K2
$$ 23 45 64 83 -13 -37 -49 2 63 -96 77 -31 -157 -61 -73 -1 4 9 -66 -117 -53 116 18 21 -34 49 15 -56 13 35
3515C5J8Lj10J13L9j15J3m5O0j1M9n0k3J23k8%j43J21L1M1j48J09j91Q8R2o8K7
$$ 35 53 56 -54 59 98 -17 -4 -49 11 0 49 -1 -24 99 71 71 -72 49 80 121 -27 82 -109 -21 71 3 30
3542C0n0O0k9J8K5j24J17N9r3k1l1J07M1j30l0o7J30k0N9lr5Q2J6K5j19J04p3
$$ 30 -20 40 11 29 54 -70 47 106 13 -8 -39 68 109 -21 -51 -118 12 -8 51 48 -47 35 51 76 -43 61 -12
3569a2J9K6J1K4k3j35J13O1j8j8q4P7l2P8j72k8K68q0k54J40P0j24K24j12j66
$$ -12 7 33 44 68 45 -90 23 84 66 48 -36 41 9 87 -85 -113 155 75 -179 -39 31 -93 131 19 -147
3594a47J31P3kOp8J06N6r4M0m7r8O2k8j53J76N3m4M0j2j44J07k9N7j65N3M8J22
$$ -147 -16 57 55 61 -17 89 145 51 91 44 -54 8 -20 -173 3 56 12 52 40 -104 3 -26 31 -134 -81 -33 89
3621H9j44LO8K7K3l0q1k9L5J17j30J45q8r1Q2j0m0J08oj14J33j16J15p4q5J88
$$ 89 -55 -52 16 43 66 36 -45 -74 -39 78 -52 93 5 -86 -4 -14 -54 54 48 -66 67 -49 66 -8 -93 95
3647I5r9J64j29j18J58o1J8r7J0J1L1J04j09j0lJ0o3kL4O1k9J9Q1j7k9n9N9j19
$$ 95 -4 160 31 -87 71 10 28 -69 -59 -48 -17 87 -22 -32 -35 -25 -88 -90 -56 5 -24 -5 76 59 30 -29 30 -89
3675h9O3J12J30j39j43J02m2M9r3P3j5j07J93j25P5Q8j30Kj6KN9n5j4o5J32NL2
$$ -89 -26 86 216 77 -66 36 -6 43 -50 23 8 -99 94 -31 44 132 2 4 -12 -10 49 -6 -20 -85 47 52 84
3702H4m9J4P3j18j7J6P0k7r0J86k39O5K1l9P5m3j34J18jM5p5l9J99q2m4KJ37j49
$$ 84 35 49 122 4 -13 3 73 46 -44 142 -97 -32 -11 -50 25 -18 -152 -34 -35 10 -65 -104 95 13 -31 -29 108 -41
3730d1K3N0j91K77p3r5q7O8K35r7j08oK8P2M2j93k8J80j69J44j05J27r0J9R4j3
$$ -41 -18 32 -159 118 45 -50 -137 -69 166 69 -39 -45 -17 55 97 -96 -124 56 -113 31 -74 53 -37 -18 76 63
3756F3q1pJ5P9q1J6l3R8r1m5R8j6l9M7n7l3K2J35j55M2J04q2q7n6J81k18J40M5
$$ 63 -18 -25 -10 69 -12 4 -29 69 -22 -67 31 15 -24 23 -34 -67 -45 90 -65 -23 81 -1 -88 -144 37 -181 -41 4
3784DL0o0J5m1J11j41Q1o5J05J2l4on1N2n6J62j01o2O1J5J5nj27o3K59o5j04K2
$$ 4 34 -26 -11 -52 59 -82 -1 -66 39 51 17 11 -40 12 -44 118 17 -45 16 31 46 41 -86 -149 110 45 -59 -37
3812c7L9P7n5lK6j06J08P1J0j32O6o8k4J45j80M1L1j25Q5N6q6n1O1J40q7J7j52
$$ -37 2 79 24 21 47 -59 49 120 130 -2 64 -4 -28 117 -63 -22 9 -116 -31 25 -61 -112 -51 89 2 19 -133
3839a33K97l9j35k1M8P3o7m3o9J19N6n3k3r8L2J41j02J13j0q4m2r1O1k5O6J14
$$ -133 164 125 -10 -31 17 90 23 -20 -89 30 86 33 10 -88 -56 85 -17 96 86 2 -40 -131 -70 -95 -29 85
3865H5j6j49L3r2R5M1L9r7J6m4M9l4Q6n3MK0L1p2K6O9m6m4j7N4m3J52o4J15q3
$$ 85 69 -80 -47 -139 -44 -3 36 -61 -45 -89 -40 -74 12 -41 -37 -17 14 -58 -32 37 -9 -53 -70 -16 -59 93 29 144 61
3894F1j06O8N1J9j24j4J9K9K6K8j22L8Q0j17J42j58O4j6Kj31J42R5N7j47m3m3
$$ 61 -45 23 74 93 -31 -45 -26 3 29 57 -65 -27 53 -64 78 -80 -16 -32 -30 -161 -19 76 133 -14 -57 -100
3920a00J86j18J3n7l3J37Q3k4l4j88J00PP2N2k1l3n9m7o4J24l4J04j25k8J06O8
$$ -100 86 -32 -19 -76 -109 28 111 87 53 -135 -35 -28 44 96 75 42 -17 -64 -128 -4 -38 66 -59 -87 19 87
3946H7j6Rr7P9k1J15j54j6l6J95j60j7L6j7m7Q3kj90K91j59J03Mj38J2k7O9P0
$$ 87 71 80 -17 62 41 156 2 -14 -50 145 -15 -32 4 -13 -60 23 21 -169 122 -37 66 70 -68 -56 -83 -14 56
3973E6o6m7J98j25N0j06pO8P3O9q0k3l5O5j06m5P6O3j0K5p9j01M0K19j86m0R4
$$ 56 -10 -57 141 16 66 -40 -47 21 94 163 83 60 25 90 -16 -61 15 78 68 93 14 -87 -47 172 -14 -54 40
4000D0N5r0K0J9o2qK7J3K8m5N0r0J02j29J26K8j73J58m1j63R2k2k3R8J58j87q1
$$ 40 95 5 25 44 -18 -26 1 14 42 -3 47 -43 59 -70 56 84 -89 69 28 -135 -43 -65 -88 10 168 -19 -100
4027a00P5j8k6o1J06Kl1J58k00P9K7j0o8K10j23k1K4j00m3J47j18J95r5Jl3K3
$$ -100 -25 -43 -69 -130 -24 -22 -53 105 -95 -16 11 1 -67 143 20 -1 23 -77 -120 27 -91 104 9 10 -23 0
4053@J00j33J29j72Q8O3J9m4o8m3Q0j11K34k57K70j25M3j59Q9Qj18R7L7J18j28
$$ 0 100 -33 96 -76 12 75 94 50 -18 -61 19 -92 142 -115 155 30 73 -86 3 11 -107 -10 27 145 17
4078A7j27P3k4N3O2p8J51Rj07J9m5N0j57J8J17Q9j22L0k3Ol8J13O6j79J77j20
$$ 17 -110 -37 -61 -8 54 -24 127 136 29 48 3 53 -104 -86 31 120 -2 28 5 11 -27 86 152 -27 150 30
4104C0n7J07q1r7J8K61j65j35J63j43J21m7J33o6j03O5n3P1p1M5j3J2N0n5O9J6
$$ 30 -27 80 -1 -98 -80 181 16 -119 44 -99 22 -25 108 42 -61 4 -49 22 -49 -4 -17 -5 45 -10 59 75
4130G5jj06l0J01OL1j34R4o1KlL4J0K3O9l6o7o3J14k6r8N2M5j51L16j16r0N9q8
$$ 75 74 -32 -62 39 45 76 -58 36 -25 -23 -26 8 18 41 110 74 7 -56 58 32 -66 -14 31 -120 196 80 -10 49 -39
4159c9j23K43k5L2n3l6Q4j12J23Qj29J05p0j1N1m4M8j01J53k01J32n4R4r0p8J96
$$ -39 -162 81 56 88 35 -1 83 -29 94 102 -27 78 8 -3 48 4 52 -49 104 -97 35 -19 75 -15 -93 103
4185A03l4j23L0j08K13o4N7j78J70o3j97J91M2J2R9j06j28J13k5J05p8o7L0M4
$$ 103 69 -54 -24 -132 81 17 74 -104 66 3 -194 -3 39 51 150 44 -84 29 4 109 31 -36 -6 38
4209C8K1m7J02j31RL3j3M1j7K9Rj19k2pQ1p1R9O0m5q3J61p7pORk03J10P1j25M2
$$ 38 59 12 114 -17 -8 25 12 53 36 65 74 -45 -67 -74 7 -64 35 95 50 -33 128 51 44 50 59 -144 -34 37 -88 -46
4239d6R7l8j15j1J04J4J6rK25j00k03M4J49r5o4N0l2R8r9O1J4p1j1l9J9M4Kj49
$$ -46 51 13 -102 -113 -9 5 21 12 237 137 -66 -22 127 32 -32 18 -14 84 -15 46 60 -11 -22 -61 -42 2 4 -145
4267a45J26l3J33j10j7RQj5J78j81%J09p4m3K7O0q9r2J56l8O6N4n6J6m1j11Q0
$$ -145 -19 -52 81 -29 -46 -37 -29 -44 134 -47 -47 62 -12 -55 -28 32 -57 -149 7 -31 35 89 33 49 8 -103 -23
4294b3J07j17O6O0o4P7j4r7N7l0O7k7o5O6j92K76j3j79R4J9j6PK5l4m8q7J45K2
$$ -23 84 -33 33 93 29 106 92 -5 52 22 89 62 -3 63 -129 147 134 -45 49 68 52 59 84 50 2 -85 60 82
4322H2m8J9Qj01J08m5l3L8M2n4j0O4n0%n9n5J4P0J07j02J24p6m0m3J45j21j3M5
$$ 82 34 53 61 -40 68 23 -10 28 70 16 6 70 20 20 -39 -94 -80 -10 97 -5 119 43 3 -40 105 -16 -29 16
4350A6m9r8J52J22j67O6j17J74j52L9p7J66Qn1j25R0P4N4j54MQ9J7j4rK8l5r6
$$ 16 -33 -131 21 143 -24 42 -75 99 -53 -14 -91 75 83 32 -93 -3 71 125 -29 -25 64 81 67 58 86 51 -45
4377d5J13j64J6J5NQ9j21j4J15N0n6L7j14R3R9j01k8O5k9m7M3lm7P3p6N3m9K9
$$ -45 68 -96 -80 -65 -60 29 -92 -106 9 59 3 40 -74 19 118 17 -11 54 25 -22 21 18 -29 44 -32 21 -28 1
4405Ap5l7O4n9J17Pj88J10J42j3L2Rk08K07r3oQ8j04J35q9n6n0J31o0o6J22n6
$$ 1 -74 -111 -47 -106 11 18 -170 -60 82 69 101 110 -98 109 16 10 98 -6 129 40 -16 -66 65 5 -61 61 5
4432Ek6P4nk8j0N6j40J24J02q7m1L6p2J3p7K53k08J73j25k7k8J7j21P3M3l8J25
$$ 5 -21 53 48 20 10 66 -74 50 152 65 24 60 -12 1 -76 177 -31 142 17 -10 -38 -21 -142 -69 -26 -64 61
4459F1K4p5J1P3r7J34r3Op6j0K4J10o9M3p9o0kQ0P8j10L9p8K1J6p3j2nR5q8J09
$$ 61 85 10 21 94 -3 131 38 44 -32 -42 -18 92 23 66 -13 -73 -75 5 83 -27 12 -66 -45 -29 -102 -114 -119 -24 -112 -3
4489cm1R5j5r3J42q0K3N9q9O0k03J82j06J12p6n0M6O7km4K3j7k2J50k23J74j50
$$ -3 -44 51 36 -57 85 5 28 87 -2 58 -145 37 -69 43 -33 -83 -37 30 28 -16 7 -10 -32 118 -105 69 -81
4516h1N6LJ38q1N3Op4m2O6k4J8o0N9o9J17J1k09M0K9r5J05j3j41K97o2r9P4j0
$$ -81 -25 -22 116 35 88 94 20 -22 44 20 38 -22 37 -32 85 96 -113 -73 -44 -139 -34 -47 -188 109 47 -52 22 12
4544A2k67K78k0Q6p0k1l9l1Q7j77J04J9J43n7j71J05j56j5J93O7l0n9m2J16j34
$$ 12 -255 23 3 89 19 -2 -41 -72 15 -162 -58 -39 104 47 -124 -19 -175 -190 3 70 40 -19 -61 55 -79
4569g9Q7K1j70J25P4l2n0m7JJ17ql9n3K0J7J6j7OJ08r1j3q2J07L3P8r8q7O3j56
$$ -79 8 29 -141 -16 58 26 -24 -71 -70 47 39 0 -53 -33 -16 0 -17 -11 97 6 -7 -89 18 51 129 31 -56 7 -149
4598a49J50Q2j42J28k2j32J25O0j51R6j8R6j05R8q7p1Q6q9J5N1nJ02k22K28J38
$$ -149 1 83 -59 69 47 -85 40 100 -51 45 27 123 18 116 29 -42 44 -45 -30 21 16 118 -104 124 262
4623B62l71k6J61Pk8K4L3j08R1l6k5o8JK1O2j4K4j5NO6m0j59J81l9k0J31j96Q8
$$ 262 -109 -135 26 33 5 29 62 -46 45 9 -16 -84 -83 -62 0 -14 10 -5 0 66 26 -133 48 9 -11 120 -76 12
4651A2K1Pj51P9l4pK3K7R9j74L1J1J41p3Or7L6L6J02j40kL2N3q9L4J46j00l2J0
$$ 12 33 40 -111 -32 -66 -73 -50 -23 76 -98 -67 -56 85 12 18 -79 -43 -7 95 -45 -47 -15 38 -51 -17 129 29 -3 7
4680GN8q1pJ44j24O0j28J01j4Jl4q2l0K56j72J0QO3l6P6j90O4J1K1K4q9P8r8N7
$$ 7 65 -16 -23 121 -3 57 -71 30 16 17 -17 -99 -129 127 -45 -35 -27 36 0 76 -114 -50 -39 -18 6 -83 -5 -103 -46
4709d6J24q8k1L4j7j32K05k2Ko6N0o4N0J2N9K2o1K0m5M5l0L5j16J12J0l0j29P0
$$ -46 78 -10 -31 3 -14 -146 59 37 39 -27 23 -41 9 21 80 102 41 61 16 61 31 66 -50 62 72 42 -87 -17
4737a7K3k4J1j2K8j09J45Ro5l8J39j69j9J6J16q1l2Q5P6k4r1m7%J36m1L3p0P5
$$ -17 6 -18 -7 -19 9 -100 45 54 -11 -49 90 -79 -98 -82 34 -47 -79 6 82 58 -33 -80 -80 56 15 48 -22 53
4765E3m7L5Mjm2kRP2j5k6R3j87Q2rk4rJ58j70K5R5j30K4K6k8J7j54J20M2nm6M6
$$ 53 6 41 45 44 2 0 9 81 66 40 133 -54 28 19 -5 -14 144 -26 -1 94 -36 -12 14 -14 3 -151 -31 11 6 -40 6
4796Fo1R4K4l0p9P4K0n0l6J0J22r7J25r3j13J06k00J84j10N3K0R2q2N6rn4L7R8
$$ 6 -55 39 63 33 -46 28 48 -2 -38 -28 94 -3 122 29 -84 22 -178 6 -104 -51 -31 61 -21 35 26 -28 9 107
4824A07p8l6M3m8L5r3J89J1j77Q8j32J36J6o0k6l6J27Jk9j22N9k0P0j08J05j4
$$ 107 29 -7 36 -12 23 -70 119 130 -47 41 -91 45 61 1 -25 -61 66 67 38 -84 -25 -45 25 -83 22 8
4850HO6o0O8j10%L3mjp9J28j27O5L8Jl3j6OJ6n6J63q3j06NJ43M2j48Q4o0P4q3
$$ 8 74 14 82 -28 -28 5 1 0 -79 49 -78 -13 25 26 -7 -23 -17 -1 -57 106 23 -83 -78 65 107 -41 43 -17 57 -26
4880b6J24l00J91P3j63j6J97j10L7Mk5J75j73j3m3J03mj08O9L6l5j21N4M9Pj11
$$ -26 98 -202 -11 62 -101 -117 80 -30 7 11 -14 161 -12 -25 -68 35 31 -77 -8 28 -7 -128 -74 -25 -18 -129
4906a29J58J2Q0j55J12j36k9L3p0J32j04J14k8j9j4lO9jK7j42J00p2j2j5k2R7
$$ -129 29 41 121 -34 78 -58 -87 -54 -124 8 -96 18 -10 -29 -43 -46 23 22 49 -93 7 -65 -77 -92 -114 -17
4932a7k6m7J14J8r6K26k70K01j97N9J07J8j97K5Q3M9j60J80p2P3m8l9M5o6q7J96
$$ -17 -43 -90 24 42 -54 172 -98 103 -94 -35 72 90 -107 -82 1 50 -110 70 -2 71 23 -16 29 -37 -124 72
4958G2q3M3o2K9J3n0J3jj5P5l8J7L6K9o1M9j67L3QO9n9j19L01j10M2o2k1l0M8
$$ 72 -11 32 -30 -1 12 -38 -25 -26 -41 34 -4 13 49 78 17 66 -101 -68 -60 9 -50 -169 132 22 64 2 -19 -49 -1
4987al1L5p0j3J36o2L9j11M1J36L7p5j01n1J42j2m0P2J6p5J3j19R9r0J60j73J25
$$ -1 -32 3 -67 -80 56 -6 33 -78 -37 99 136 61 -40 -91 51 39 -1 71 87 12 25 -94 5 -85 75 -98 27
5014B7J7r8l5L0K7J16j12LN3j88J41rJ34k0o4l5n0J07mo0N7N7o0o2R4j14J18m4
$$ 27 44 -54 -89 -59 -32 84 -28 -25 28 -160 -19 -28 106 86 22 -13 -63 44 40 -20 37 94 34 -28 66 -48 70 26
5042B6L8Qk5J3J3l3j02R7k2k0m2M5J3m7P1q2K8n8J37q9J4j02J60m3mO5l1K8p6
$$ 26 64 72 47 60 73 40 -62 35 13 -7 -49 -4 9 -38 33 -49 -21 -79 58 -31 -17 -119 41 -2 -6 59 28 56 -20
5071b0lj9K2m2J47Oq3O9j64J00m3j3k6j6K6O2J3q7J87j56o6L3R3q9m4Q2j11J05
$$ -20 -23 -42 -20 -62 85 91 8 77 -87 13 -30 -43 -69 -85 -59 3 16 -71 116 -40 -106 -73 20 -69 -113 -31 -142 -37
5099c7J01J3j00O3M6N3j44n8k5K05o5j30K20j88N2m5N6j64K67j71J4oJ23L3j58
$$ -37 64 77 -23 40 86 139 -5 -63 -88 117 52 -78 142 -46 6 -39 17 -147 120 -51 -37 -43 80 113 -45
5124d5M2rK1j8N6l7N5j10K5p0J86j31Q9q4l6L3J50j13p1MN9l5O9o7Q1j35J3P0
$$ -45 -3 -12 9 -9 47 10 65 -45 -20 -90 96 -35 54 -30 -66 -33 117 4 -67 -63 -4 -39 30 -37 44 -91 -78 -8
5152hJ20p3j14R1JJ20j42Q6j22NK0N2l3oj3k4j7O8rp3N2j0j8J54k04O0O1j33J66
$$ -8 112 39 -75 16 17 137 -5 81 -41 -36 -16 36 3 -3 -16 -40 -57 11 2 -71 -19 -29 -47 107 -97 -37 24 -109 57
5181E7J2j2q6J12q8K6Ml6M5P1m7k2l0J6q5O0q1J21o0m2J40Pj74N7kJ39j70J16
$$ 57 69 57 -29 83 -5 21 25 -11 34 105 58 36 6 22 -63 -3 -84 37 -23 -65 75 82 -92 -35 -37 102 -68 48
5209D8p7J18j65J01j03L4N1k00J61N0k0JN8j51J27n8JPK6p3J57j40K7j61J55n7
$$ 48 -29 89 -76 25 -78 -44 7 -193 -32 18 -2 -1 57 -94 33 -25 -24 -17 9 -64 93 -47 -20 -181 -26 -83
5235h3m8J40n3J3P6p5M8J01p5R5j81K7O8R1m4j24O6Qj68O4Q8j23K06j44M5j9K
$$ -83 -131 9 -44 -31 45 -30 18 119 44 139 -42 -15 53 144 100 -24 42 50 -118 -54 34 -89 117 -27 18 -1 1
5262AO6l4jL8k34J97k0m1O4rJlo9K0l2Q3Q7j53J00K8l1p8L5k3l5J16q7r7J60n2
$$ 1 67 33 32 70 -164 33 13 -28 36 27 28 25 -44 -24 -56 27 114 -39 61 89 58 -20 15 -8 -43 73 -14 -111 49 -3
5292cO9l3k9k6J8Q8l2Rj4m7pn9K6MM0P6j03j3J06r0j6R1r3Q5j13J42k40J58o2
$$ -3 66 33 4 -22 -4 84 52 61 47 0 -7 -66 -40 -36 4 80 -23 -36 70 -20 -36 55 -38 47 -66 76 -164 -6 -68
5321f8J3O3K4q5k1J25j29m9L4K3K05n4j46L1J0O6j28J77j51J15j53n0K62l5j16
$$ -68 -55 8 32 -53 -74 51 -78 -127 -93 -70 135 81 -65 -34 -24 42 -86 91 -60 55 -98 -148 114 79 -37
5346c7Mk7L5O9o1j33L30k22N5N4qM4n7j33J83%q0n3J74o5j31oP9j5N7qr3n8j0
$$ -37 -33 -60 -25 44 -17 -150 180 -42 13 67 59 103 46 -87 96 96 16 -37 137 72 -59 -65 14 -1 56 48 -45 -103 -113
5375a13N6Q4j1k2M1o3ML9l3J9K6NK8l9P2j74J43l5j14J77j96J71n3N9r7pj8J00
$$ -113 -57 27 16 -6 35 -28 -24 15 -18 1 27 32 60 21 93 -81 62 27 -87 90 -106 65 12 71 -26 -33 -51 49
5403D9K4q2j4j8Q7l5P8j77K03j37R8j94l1K23j1p3j0LMJ70k55Q1J3L2r5J53o3
$$ 49 73 -9 -23 -41 46 11 89 -88 115 -22 76 -118 -149 74 63 -10 -20 -17 -13 157 -98 -17 -4 28 -67 86 23
5430B3m7l5oQ1L6k8j44J22j57J68j46P9n2Q5O0k4L8o2M5l5J01j4j3m9o4J91j13
$$ 23 -24 -59 -65 16 52 24 -120 2 -155 13 -133 -54 -106 -21 39 15 53 -9 36 1 102 88 75 26 -38 153 40
5457D0j1M1m5k7N4j44M2Q2N5m1j0N4j59J70q8Nql9m5P9OJ3k3P2r3o3J14j67N5
$$ 40 29 70 25 -2 52 -92 -50 32 87 46 36 90 -69 101 13 18 10 -29 -74 5 11 24 1 73 -20 -83 31 -136 -81
5486h1J09J3j0L0j02j06P3O6l5n0J01K2n8L7m5P9q9J8N8k8Lj15O1O0q5J96n0k3
$$ -81 28 41 31 61 -41 -147 -74 -8 -43 -93 8 30 -28 9 -36 43 -46 -28 30 2 5 -110 -49 11 -74 122 72 49
5514D9k9J08l4k4n1n8J49p1j39J93n5o0K0k5P8J2o3lJ2pJ03q2K2Lkq0P8j67J09
$$ 49 20 128 94 70 19 -39 110 39 -100 93 38 -22 -2 -27 51 63 0 -3 9 2 105 23 45 48 46 -34 44 -123 -14
5543a4j33J96j71J10j0nk8J05j7j46P0K7j1j8K7J01lj34j02J92j7Nk2J74n3r8
$$ -14 -147 49 -122 -12 -22 -27 -55 50 33 -113 -43 -16 -27 -45 -18 83 80 -54 -156 36 19 24 2 176 123 25
5569B5j57J45mJ0QK8j55J96l3j49P9J7N6j53J0J17p8J21j36O1J7j38N7n2J35j4
$$ 25 -132 13 9 19 27 55 -100 96 63 -86 -7 10 66 -87 -77 40 -38 83 -53 8 25 -113 -56 -108 27 13
5595A3k6N1p2O6q0J18L4k08J32p0K0P6j24R4jj59K12o5k0j54J40lO7P2j71rJ90
$$ 13 -13 38 -34 32 -48 70 104 -104 28 -42 -22 54 -70 24 23 -136 76 11 -9 -163 -23 -26 41 113 -58 -67 123
5622A23r4M0q2K5Q6j4j22l3Pp2J43n4m1Q7r9J19r8q1J37M4J59q3j40J5J08K4k12
$$ 123 29 69 -13 12 98 84 -38 -71 -64 -136 7 -47 -88 -1 -100 19 -79 -160 -23 21 180 97 -43 -28 80 104 -108
5649a08J29r8J27k6j21K13j42J1J75j35l6R9p8O2j52jN7L1N3j54J88j15j8L7j1
$$ -108 21 -77 50 24 -97 116 -26 -15 160 25 -11 88 10 72 -80 -81 -24 7 60 -94 94 -21 -39 -2 -13
5674a3p7L0P6j46K68j74p9K38k07L3O3j16M5N6r7l1L2M5N2K8o9lj9N3P9j12j00
$$ -13 -90 -60 16 -130 138 -36 -115 123 -84 -51 12 -104 -59 -3 -100 -131 -99 -54 -2 26 -43 -46 -65 -12 67 -45 -145
5701a45K65j55Q7Jj7J03j62k6J06n3N2l8j40J80rM0l4q8R9k1m1P0k2q3P4j2n2
$$ -145 120 -35 52 53 36 139 -23 -49 57 4 56 18 -122 58 49 89 55 -33 66 45 4 74 52 -31 43 31 -21
5728b1M9r6LN1jJ09j21j0O5j63J88l3L0k9j36J31k5o9J63m6r7J8k4K00m8q6n5
$$ -21 28 -68 -65 -14 -15 94 -27 -37 28 -135 53 20 50 21 -115 16 -9 -78 85 39 -58 -40 -64 136 88 2 -53
5755e3Q2oJ5j00J02rj10J56Qj67qJ26n5J8j1L6K7n3J6m5PJ55j35l6rN6r1L7K7
$$ -53 29 23 38 -62 40 31 -79 77 85 -82 -90 36 -19 -1 -12 24 51 -2 14 -31 -24 131 -4 -40 -49 7 -84 -47 -20
5784b0m0J0P4n6j2Mkk6Q7r1r1J58L9n1k3R9j40J21j09K5oM9l5O3NNQ4j69O6K1
$$ -20 -60 -50 24 -32 -44 -40 -42 -68 19 -72 -163 -5 34 -17 -40 59 -81 40 -69 -44 -50 -1 -36 27 32 37 121 -48 18 39
5814C9n9j9M1K2k8M3q5J60o6P3m9j2q0J6k9J87o0j99J32q8J30r0J06j91J60k3
$$ 39 -20 -39 2 24 -4 39 -46 114 48 121 72 60 -20 -4 -33 154 94 -105 27 -61 69 -21 85 -106 54 31
5840C1r0J39o7j3p4J07K5j09r4K61j90l2J07p0J02Q9j65m7Q0n8J41q4K2O4j57
$$ 31 -59 80 13 0 -74 33 58 -51 -145 116 -74 -106 1 -69 33 122 -43 -90 -10 -68 73 -11 11 75 -82
5865h2J53j54J17K3n2Oj19J15p3J18q6J7o0J11l6m4O3K5O9j08k9k0o3N1M4M8l5
$$ -82 71 -83 34 57 5 11 -108 7 -66 52 -34 -17 -77 34 -2 -46 17 42 111 3 -26 -46 -109 -58 -14 34 -1
5892ar3J6O8l9JJ14j08j48J71J8r4M5mJ11O9j34K9n3n0O3m4P5j8Pl3M9m2M1p2
$$ -1 -94 -78 -10 -49 -48 66 -42 -190 -19 -1 -95 -50 -54 57 126 -8 21 -32 -82 -19 -63 12 -6 1 -32 17 -25 16 -56
5921e6J42l0m0J8Mk04M6Pj1O8J36j72K51j73N4nJ08j40L3J7j68J15o4J46o0L8
$$ -56 86 56 16 34 38 -166 -120 -113 -124 -56 80 -92 159 -14 40 35 143 3 36 53 -115 0 -64 82 22 60
5947F0J02r9q6Q1P8j79ll7P8L5q0O2l5K8LJ14j78J70j08p0O3j6l4K9L4k5m9J38
$$ 60 162 63 -23 58 136 -43 -46 -83 -5 30 -50 12 -23 5 8 122 -56 114 6 -64 -1 -17 -51 -22 12 -13 -62 76
5975G6r5M1m4j9J2M0on7m8J85pj4k08K16q6qP6r4J09p1n1J48k3k06O3J93k03%
$$ 76 -19 22 -22 -41 -29 11 5 -52 -100 85 78 64 -144 72 -14 -22 54 -40 69 -2 -53 95 72 -134 -71 122 -81 -81
6003h1J59j85Q8k3q7j1J37J53k17K07r6m4P2j18P3N4j24N7NRj48M7J41j6Oj14
$$ -81 78 -107 -19 -42 -129 -140 -3 150 -67 140 44 0 72 -46 27 81 -43 14 19 28 -120 -73 68 52 58 -56
6029e6Q1J6m5j4krQk2K5qR8m3k1k4Ql7N2L2k02M9J39J1J4J05j44qmqJ16j13P5
$$ -56 25 41 -4 -18 -20 -29 -21 -43 -18 -26 72 29 8 -16 -8 -45 7 39 -163 -114 25 36 50 155 11 3 -1 -9 107 -6 69
6060F9K7j57r3K25o3R1p1o8K3M8j06J22j08J30j1m7M9l1j12p5K23j07J33qq7P2
$$ 69 96 -61 -154 71 8 99 28 -40 -17 31 -75 47 -61 69 58 11 60 29 -83 -158 65 -42 91 83 -4 68
6086F8p4L0l1jm9r5J42R%q8P7K9n6P3M2r5N6K0j37J27j42J01J44j24k3l8QJ5j00
$$ 68 -6 24 -7 -8 -57 -152 -10 -1 -1 -89 -12 17 -39 34 76 -19 37 57 -80 47 -95 6 150 26 3 -35 -27 -12 -112
6115a12K19j12j34J58j78K37j50J31n3l0k8J21o0n5lP4M1o5M1l8J13j15k7P5n3
$$ -112 107 -5 -139 19 -159 78 -72 59 6 -24 -52 69 9 -46 -49 25 66 1 42 4 117 2 -25 50 -3
6140ck8J8J78j10q2R5j2q2M4o7R0Q6k61J60L5j20J34L4j89LL9N0P9m9P6j65k9
$$ -3 -31 -13 165 55 -27 68 56 -26 18 -49 41 127 -134 26 61 -59 75 109 -80 -77 -38 12 91 42 118 -47 -76
6167g6N3r0K00j12O5j25J43k34K63n0j9n3J22n8po2J43j05Q8lj18M0nM3k8m1n3
$$ -76 -23 -113 87 -25 40 -85 58 -176 87 37 18 -35 87 29 22 -40 103 -2 86 83 -35 5 0 43 15 -26 -79
6194g9P8rl3J06l8k3pn2M0K2O6k0n0j58J71M5j9K4r1N3k3j8m6oM8K1O5o6j05Q9
$$ -79 -1 -10 -43 63 25 2 -5 -57 -17 5 71 51 1 -157 14 59 40 64 -27 26 3 -15 -61 -67 -19 2 67 1 -104 -15
6224a5O0j07J6n1P8P0j25J02J17j86L2J20j76l4K4N8m4P0Q8p5J28j33k5J91j26
$$ -15 45 -62 -46 -97 -19 51 -74 28 145 -41 -9 111 -65 -99 -75 -17 -61 9 97 22 150 17 -8 183 57
6249E7j4o2o5P3j7j24J53J10j48nJ00J16j49K6O8j34R6j06j0K1j40J44l0M6j5
$$ 57 43 -19 -84 -11 -28 -152 1 111 -37 -42 58 174 25 51 119 -15 81 -25 -35 -14 -154 -10 -40 6 -9
6274iM3j7r5J2OJ9P1l3M6r2N0k9J58j56K2N8n3r8%P6k3J84q1j40J61kJ7L3j85
$$ -9 34 17 -78 -66 -60 -41 30 -3 43 -49 1 -28 130 -26 -4 54 1 -97 -97 -21 -44 140 59 -81 80 78 95 128 -57
6303e7M4p6J14r9P5Q3j24j02PJ18o6pPR0J4j44N0K6L4L9o5M1L9n2l3J53o7J10
$$ -57 -13 -89 25 -74 1 84 -40 -142 -135 -17 -83 -90 -83 7 21 -123 -73 -47 -13 26 -39 2 41 -11 -44 109 42 152
6331A52j31q2M6OR6j05M6J33j72j1j1N5j28K05j81J59p1N3j38P0M2P5j27k8p4
$$ 152 21 -61 -15 -9 87 -18 28 161 -11 -22 -33 22 -106 99 -82 77 6 59 -79 -9 33 108 -19 -47 -121
6356a21J05L6R7k12K2J02rm3J8M0M6o1O4Jj43m1j21K90p9K6m8l4l2K06o2j82K2
$$ -121 -16 20 117 -95 -73 29 20 -23 -5 35 81 20 84 85 -58 -99 -220 70 -9 17 -31 -65 -97 109 47 -135 -113
6383a13K24j39M8p7N3R4j20P3j27O4M4l1j07J85%n8J7J8j30Q7L3l8J37p0Ln0N8
$$ -113 111 -28 20 -57 -4 90 -30 43 -84 -20 24 -7 -114 71 71 13 30 48 -82 5 38 0 137 67 70 20 78
6410G8M1p7m8J10j78j4J17O6N2j72o9J46L6K2j49oJ32m1jn6k4Po4K4N8j4k0n5
$$ 78 119 42 -6 104 -74 -88 29 95 147 -25 -94 52 88 110 -39 -45 87 46 45 -11 -35 -28 -92 -68 -10 -24 -44 -99
6438i9J43O3j48J14m8r8J07j63J07N2K2j27J43N6j56Jm3O1LM5p1K3j1N3n1l1n2
$$ -99 44 107 -41 73 25 -73 34 -129 -22 30 52 -75 68 124 -32 -31 -74 -13 -10 35 -36 -13 -24 29 -22 -53 -105
6465a05K1R6k8K5o4Q8o4K7P0j07P8J1m9J4p5J31j22P8j53J76J16j78J11J9o0j55
$$ -105 -84 12 -16 9 -55 33 -31 -4 66 -41 37 48 -1 13 -62 69 -53 25 -128 48 164 -14 97 116 56 -99
6491i9J85J5j25l0kq5K00r4o6J40q0Q3l8j9K5K8q8JJ5n2L3m1J01m5r4K21j00m0
$$ -99 86 101 -24 -54 -56 -141 59 -35 -101 39 -41 42 4 -15 10 38 -50 -49 -34 -86 -53 -94 7 -38 -132 89 -11 -51
6519e1J15j13P8N1j92K9N8L8j62K60j89Q2PO3j30k2P6j20K79o9p3o0P9j17J03
$$ -51 64 -49 29 80 -112 -83 -25 13 -149 111 -78 4 11 74 -56 -78 -2 -122 157 88 15 -45 34 -83 20
6544B0L8j65L1K9K7Q0Q7j04m0p8R3R7j09o5J67q2p9K2R2n8K2r1J54K0j81Q5N5
$$ 20 58 -107 -76 -47 -20 60 147 43 3 -75 18 115 6 -59 108 26 -53 -31 61 3 25 -66 88 108 -73 12 67
6571F7Kn9q9J45l5Oq6J04k34J92O2k39J78O6j22J01m8n6J23j48J73j55J45p9m
$$ 67 69 10 -79 66 31 37 -49 55 -179 13 75 -164 14 80 -42 59 11 -45 78 -70 103 -52 93 14 10
6596A0m7J21jr0j8o5Q2Q2r4L6rP0j10K6R7j93j5P9J34k44J01K0M7o4L6L4k2K5
$$ 10 -37 84 83 -7 -25 -90 -8 74 -20 16 7 77 -33 -7 90 -103 -118 -39 95 -149 -48 -28 19 -45 -9 25 3 28
6624B8p0J76j08j3j10J24m0M6m5M0j66R9P1O0j21n5J34p5L9p4L0O9j35J45r3P2
$$ 28 -42 134 26 13 -97 27 -13 33 -12 28 -138 -39 32 92 -29 -84 50 -25 14 -60 -30 39 -96 49 -44 28
6650B8Q6j80L1P6L8j22M8k5l8k7J79p1l6J89j43j4J4j36K43k09L9O7j29R8p2J18
$$ 28 114 -66 -35 41 79 -43 5 -20 -58 -85 94 23 -13 176 33 19 33 -103 140 -69 -30 37 -92 6 -66 52
6676E2m0j12R5q4L4J57j16n8J01j6m7J67o4o6M8j54J21J04r2m8N5r1m2O9M2j3
$$ 52 12 -100 -5 -89 -55 102 -14 -72 29 13 -34 133 69 3 51 -103 18 122 30 -18 37 -54 -96 -27 15 2
6702Bj3n1P6K4J2j6o3P5%j9N5m2pk9m5J64o5m0n3Q0pK1K1r5M5j32J94j80N9m6
$$ 2 -11 -62 14 38 50 34 -29 46 46 27 82 40 33 4 -41 123 58 18 -35 45 38 59 80 -15 30 -102 92 -88 -29 -75
6732g5Q2oJN0j69J87k2j2j72L19q9l2J45j53Rn8o8J03pj6jm1Q5k7m6k8r8J61M5
$$ -75 7 1 2 52 -117 70 48 36 -136 183 94 62 207 54 63 5 -63 40 33 17 16 -25 60 33 -13 -41 -139 22 67
6761F7j03L5po7Q8j6Ln1J32j2pm5j6l2J45j28L8J6l2N2o1o4J47j74N5Q5l0p0L0
$$ 67 -36 -1 -8 -75 13 -3 0 -51 81 69 62 17 1 -31 114 -14 24 40 8 60 -1 -65 82 -92 -37 48 18 -52 -22
6790b2Oo2J66k8k8m2J70j42l8q2R3j3K2M1j55J05NQ0q4l4J6K08l40J53N2l3n0
$$ -22 -16 -78 88 60 32 -10 160 18 -20 -102 -9 -22 0 41 -114 -9 -4 76 -8 -42 -26 182 -158 -5 47 14 -36
6817c6N1j8k5J23p2o9mM2j0j1J55P3j22j58O0n0Q9q8J8M5q7P5R6r5o4N1K7N2j19
$$ -36 15 -3 -28 95 23 -46 -50 -8 -18 -29 126 199 77 -81 -21 -71 18 -70 -52 -7 -94 -19 77 -18 -82 -31 -4 48 -71
6846g1N2N3pr8J23l6j5r2Q9L2L5l8M0l9m0J13K1j72RR5k8m2J9N0r1J8L3p4lR4
$$ -71 -19 34 27 -71 52 16 1 -91 -2 30 65 27 67 28 -12 101 122 -50 -41 54 26 -16 3 53 -38 -20 13 -61 -64 30
6876C0pLj17J04q6LQ3n5P2K7L0K8p7n8L2k6J9j04J15m1J3m2nN5O1k10J72k4k7
$$ 30 23 26 -91 13 -73 -70 13 -42 30 57 87 115 38 -20 12 -14 5 -99 16 -25 -12 -54 -59 -4 57 -153 19 -5 -32
6905c2P6J4p9o9N7oM4O5J4j16J30J7k19J97r4J3j10J26l3l3R7kL6o6k9M4Q8o2
$$ -32 44 58 -21 -90 -33 -39 5 70 84 -32 98 115 -104 93 -1 12 -98 28 -5 -38 59 57 93 27 -2 42 130 68
6933F8j59J32l1k9m1P5J08o6j6J5j01P8j6L9K1r9J22o7J4K6m3kkP8l4J2k39J21
$$ 68 -91 41 10 -19 -60 15 123 57 41 56 -45 33 17 56 77 -22 100 33 47 73 30 28 26 104 70 82 -157 -36
6961c6N8n9P9j55nL9J59j7j65J47L5n7pM4p0Q1p2q4J48n2j34J27J27j21k9Q1r7
$$ -36 22 -37 42 -113 -118 -79 80 63 -102 45 80 23 16 60 -10 71 -1 -85 63 11 -123 4 131 10 -19 62 -35
6988c5M8q9O2j3l9J22K0K8jo2n4K5L7l9M9j54J44oJ8l3M2%K4r1m0j1M2N3Pp6r9
$$ -35 13 -76 -14 -27 -66 56 76 104 103 41 -13 12 49 10 59 -95 49 43 61 28 70 70 94 3 -37 -48 -6 47 54 -22 -121
7019a21K00j31p4J44p5P1p4l2J9%M5j28M8J18J0o3J64j29J22q7O1j51L9J11j43
$$ -121 79 -52 -126 18 -57 14 -60 -92 -73 -73 -28 -156 -108 10 20 -43 121 -8 114 27 88 -63 -24 87 -56
7044e6N6L9K5l3p2k2K7P0q0Q6qj29J29j35Q6p0R9J9j43RJ7O3J31Nr3j3K1m0O3
$$ -56 0 39 64 31 -41 -63 -36 34 -46 40 32 -97 32 -103 -17 -87 12 31 -112 -103 -86 -23 108 113 20 7 28 -12 51
7073E1Q9p5j9p5k0Q6p2k9O2k6L8J28j88%lk5P9m9L5O8j01O6j33J11K1j7K7M2M
$$ 51 140 65 46 -29 -49 37 -35 -64 -2 -28 10 138 -50 -50 -53 -78 1 -48 -13 55 -46 20 -113 -2 19 2 29 71 75
7102G5k9j17P0r9K8J4l1J14qk5Q5j41R8l5qM1O4l4p9j7l3K5n7Q6O4j21K4O2qk7
$$ 75 46 -71 -1 -100 -72 -58 -89 25 17 -8 77 -64 34 -1 -9 32 96 62 -17 -34 -67 -42 -99 -13 51 -70 -46 16 8 -19
7132a9O2N0j93J29J03n9p9L3P3r4q8P9J8k8R1j49K16r4J8n8r2O5L1m4K5no3Q3
$$ -19 43 93 -100 29 132 73 -6 27 100 6 -82 -3 15 -13 78 -71 145 51 69 11 -81 -16 15 -29 -4 -9 -72 11
7160A1J9L3lm5p8N4L0n1Q2K9o1m0N8j05M9M8j46J99j3np6pK6M6q7k0J84j21J09
$$ 11 30 63 60 15 -63 -9 21 -30 52 81 20 -20 38 -67 -18 30 -116 83 70 65 -11 -18 8 54 -33 -53 131 10 119
7189A19j09j31Q2j6k0j2J10J40j39q2M8L7j46R9j8mJ01o6M1j31K29j49P1k48L10
$$ 119 10 -121 -39 -55 -75 -87 23 163 24 -58 -10 27 -119 -20 -38 -42 59 -7 34 -97 132 -17 54 -194 116
7214A16q2O7n7k25J09O9Lk1k2p3J57Mj73K37j66L2O1Jp8J76j55n5J16l7M9m0M9
$$ 116 34 101 44 -181 -72 -3 0 -21 -43 -116 41 45 -128 109 -57 -25 36 37 -41 135 -20 -75 41 4 53 13 62
7241F2L8j01p1j0J85j25lMP0N6j44rK0K3L3j1N4O7j08r2J34Ml7kj18PP3J41j84
$$ 62 100 -1 -72 -82 103 -22 -25 -21 49 105 -39 -48 -28 -5 28 17 71 138 30 -62 72 76 39 37 -81 -74 -1 140 -44
7270d4L5J26j89J36j84P1R3j61K16m5o4P6k6J01j09oNP8p9N7n2Mj29J20K05j42
$$ -44 -9 117 -72 64 -120 -49 44 -117 99 54 -10 66 40 141 32 26 31 109 30 87 35 39 -90 30 235 93
7296I3m5l3K1q2J2K8M7j1k6k1q1L1O9P6j27N9J50j95O3j3q0J97j02j5j39J76n3
$$ 93 48 15 36 -46 -34 -6 41 30 4 -17 -98 -67 2 78 -49 10 160 -35 28 15 -65 132 30 15 -124 52 -1
7323am5O2R1k27J58J9l7N6o5J40j59P7q7K04j42q6p0J18p5J07j24%J13N2m1q3
$$ -1 -46 16 107 -120 38 57 20 76 11 151 -8 69 -18 186 44 -42 -112 6 -69 38 -86 -86 27 79 38 -45
7349d5j3J33j23n0J89j48l9Q7l5oJ56j34J4J53j55K9O3mj88K98j60N3q9P2Lr8
$$ -45 -58 75 -48 -98 91 -57 -96 -9 -44 -50 106 -28 -14 139 -16 13 76 72 -116 182 22 75 -14 58 61 -37
7375c7J19j18L7O2j47J66Lj13J36o4q4J5L0P2o0O4k1K8j8j68J20j2o4N2j17m0
$$ -37 82 -36 1 63 -84 82 85 -28 108 44 -40 -25 5 77 17 81 60 88 70 -98 22 10 -54 -2 -119 -159
7401a59N0J39q0j00J23M1pj27KJ59p7j30K22q5P3K4J4j10l7LQ7j07ll2N3Q9n7
$$ -159 -109 30 -50 -150 -27 14 7 -120 -118 41 -36 -166 56 -29 44 68 82 -28 -65 -62 25 -82 -85 -117 -64 25 -32
7428c2J42l3j44l2J71q2M0Q7j12L8m2J29lr2L3j45L9l9O7Q8J2j34r6J62J0J34
$$ -32 110 77 -67 -99 72 -10 30 117 5 43 1 130 127 35 68 -77 -38 -77 -10 78 90 -44 -140 22 32 166
7454A66j28j5k6KO3j19P2j10O6m5jQ6j30J69l6m9M6K8o2m6JJ0N3rMJJ05J3j10
$$ 166 38 23 -3 -1 62 -57 15 -95 -29 -74 -75 11 -119 50 14 -35 11 39 -23 -69 -68 -58 -5 -14 -10 -9 96 109 -1
7483aR7p5r4K19j52Pk5j07J58Q3j82J21q1kQ4Mj12J94p4rn0M4r1n1O9N3K9r4J91
$$ -1 96 21 -73 146 -6 1 -24 -131 27 110 -72 49 -32 -34 50 54 -58 136 62 53 3 47 -44 -95 -26 27 56 -38 153
7512A53j17n8N7Mkl8K3M6j15M8Q3j61%J87j38P3m4J46j19r6K10j39J09p9o6N1
$$ 153 36 -22 35 39 37 -1 22 68 -47 1 84 -77 -77 110 -28 45 1 147 28 -68 142 3 112 33 -33 18
7538A8N4J9n6lQm6r9N3j5O7J5j4j6lo1Q7K5%j14J28j06qJ97j86J58pp0R7r2q3
$$ 18 72 91 35 32 40 -6 -105 -52 -67 0 15 1 -15 -18 -79 8 33 33 -81 47 -59 -67 130 -56 102 95 25 122 30 -53
7568e3M1K1K3M5j22n1P8L2n4k8j2%O2Qj5N9j59K75j93p6R1J3R4M8j56LN9L0o2
$$ -53 -12 9 32 77 -45 -96 -18 14 -40 -68 -80 -80 -18 -10 -25 34 -125 150 -43 -119 -28 -15 79 127 -29 -26 33 63 1
7597AJ7j95J81o3K4j6N4P8jp8K8j01J06o2o1J88Lk08K64k14J43j93P4K4j3n2n2
$$ 1 18 -177 4 -59 -35 -51 3 81 80 2 30 -71 35 -27 -88 100 103 -105 159 -55 88 -105 -31 -7 -20 -72 -124
7624a24J53j30Q7o4O5PL1p6KJ32j11j19K23k1J6m0J9Q6o8p5J29j49K8J1J15k01
$$ -124 29 -101 -14 -78 -13 -6 25 -51 -49 83 -28 -147 76 55 71 31 50 136 68 -7 122 -27 1 12 127 -74
7650g4J34l6N3oN9k34O6P8N4Po7n2k4J28r0Nn9R5L4j41J12l0J08ml7j45K1Q8q4
$$ -74 60 24 77 71 130 -104 -38 40 94 101 34 -18 -42 86 -4 1 -58 37 71 -70 42 12 120 116 79 -66 -45 43 -41
7679d1Q9k0K4j08M1Q5j11L8l7J65q8m0L7j3j36J42n8N3J0r8Q0J8J7Mo3K7k0J08
$$ -41 48 28 52 -56 -15 70 -41 -3 -40 125 37 -3 34 21 -115 27 -31 22 32 -66 14 32 49 53 -10 17 -3 105
7707A05M6k56J09n3Q7j0r9P2k1N5o0O3QR7kj29LM1n4j4qL8L1nJ8k08Q8J60N6j56
$$ 105 151 -105 4 -49 38 28 -71 1 -20 35 -25 38 46 143 141 12 15 56 2 -12 -20 18 49 44 62 -146 -58 102 158 2
7737Bj48J05q1JJ12J10o1j33N3N1J6%j19J11M3l7l8LR4j32K06j20n5Oj8J8O9n7
$$ 2 -146 -41 -122 -121 -9 101 40 -93 -40 11 27 27 -92 19 62 25 -13 -10 84 -48 158 38 -17 -11 -29 -11 58 1
7765An4Q9K9k6j9k4L9L0j30M2K9j05J31M8j19NK0K8p5Q5M6q2o9p8J69Q4j46N4
$$ 1 -53 36 65 39 20 -4 35 65 -65 -23 6 -99 32 80 -39 -34 -14 14 -61 24 70 -12 -81 -159 10 94 -52 2
7793BJ1o5K1J7K6K5O8j06l6J7L0M4K4k8q7P0n6J4KM2j2j2lk8R7J9n6j45L8O1j19
$$ 2 13 -52 -31 -14 12 37 105 -1 -37 -20 10 54 78 50 -37 33 -23 -9 -7 35 23 11 8 -20 77 96 40 -105 -67 -6 -125
7824a25J19Ol3j09O1N3J0R1j06O9lL8n0j50Q4J30j10P8N4p0N2j22m7K3r4k5L26
$$ -125 -6 0 -33 -142 -81 -28 -18 73 -33 36 33 71 21 -129 -45 85 -25 53 107 37 89 -33 -80 -57 -151 -176 150
7851A50j64N3k4k9J25j77Q3l6J00k13O7J16Qn5rj0j7J47j03Jj91O2N7R9j41J8
$$ 150 -14 39 15 -14 111 -66 17 -19 81 -132 -65 51 59 4 -5 -15 -32 115 12 13 -178 -116 -59 40 -101 -83
7877h3M8J16n9Q1k42J01lk5J33j2k5q0K4R4j96J52n5R9l6K3q8m6J66p4O9j12L0
$$ -83 -35 81 22 103 -139 -38 -41 -66 67 55 30 -50 -26 68 -128 24 -31 68 32 55 -33 -79 87 13 82 -30 0
7904@K5r4LJ2N5k8Q4k1L9j11J22k1m0J9k3o3QJ23j12O3l4k2pqr3l3J85r0N3P1
$$ 0 25 -69 -66 -54 1 -27 57 36 75 -36 86 65 25 44 21 -42 -34 89 -23 40 6 -16 -23 -31 -124 -157 28 -62 -9 62
7934F2j01Q4n7k3o3MJ32j35J68j20j4J21j79J34o2N6o1R8L0p8O2j10L1m0O6J9
$$ 62 -39 45 -12 -35 -98 -94 38 -97 71 -49 -63 58 -121 13 -49 7 -54 44 74 -4 58 -52 -21 -61 5 24
7960B4o0J42M8k86K59j23p1N3l7P5m9Lm2J80r1m6O0J3l8M1ro8Nm8NO8j09J07j2
$$ 24 -36 106 154 -132 127 4 -67 -14 -51 24 -25 -22 -64 116 25 -21 39 52 14 55 46 -22 -17 -65 -60 8 -101 6 -6
7989fL9l0j13L2L5qJ5M7M2j75J82j26MJ40j1m6r8J22j10L7K6q8J67j05J4JO2j06
$$ -6 33 3 -110 -78 -43 -51 -36 11 53 -122 60 -66 -62 78 67 21 -77 45 -65 -28 -2 -90 77 -28 -14 -13 49 -57
8017e7J11lp7Q4j43L7K4jJ0J8n5N9p3j1R0q9m7Q0K0M4q1O4o6N5j1l4N3j9PN8p4
$$ -57 54 51 -26 58 -85 -48 -24 -25 -15 3 -52 7 -66 -77 13 -76 -123 -43 -23 21 -60 4 -62 -7 -18 -52 1 -18 -11 47 -27
8048b7L0Q4p4q0J14R9k49J3J05J87k13l9J07j7L7q9J0J1L4j73J02k0L9J8Lk9Q4
$$ -27 3 87 13 -67 47 146 -103 -90 15 202 -11 -50 57 40 77 -12 -2 9 43 -130 -28 -48 -9 9 12 -17 67
8075F7o7J9m2RJ30Nj0j93M8p3K09r3L8Q7j44Om2J80j69j5j30K69k00NJ61j13J11
$$ 67 0 19 -23 -14 116 121 111 -82 -34 -107 102 9 47 134 -10 -4 -46 134 -35 -50 -180 89 -111 -106 55 -58 53
8102E3l8jK3n3O9K6k54K5J16O7M4q1%R3j4M8j41MMJ09q4l3qQ9j03p8Q2J38q8O6
$$ 53 15 14 37 -16 53 79 -175 -150 -34 33 77 -4 -4 89 75 123 -18 -14 -10 99 15 -18 -26 63 -40 -118 -36 102 14 80
8132H0N4j27p9M2m8P0N7q9n0O1J15k30J81o6k4J2L1o6O9o9l7K3LK28oj33j00Q3
$$ 80 134 7 -72 -30 -78 -8 49 -40 -90 -29 86 -144 37 -29 -53 -41 -10 -76 -7 -76 -113 -90 -87 141 135 2 -98 -15
8160a5J1N7M8j63J17QN2j30pM8j3j42J39n0lQ1L8N5j87q7K03j35L3L5J15m3n0
$$ -15 -4 53 101 -62 55 63 115 -15 -22 26 13 -129 10 -40 -43 38 76 131 -56 -143 60 -75 -42 -7 108 65 15
8187A5M2j52R3L
$$ 15 57 -95 -2 1
8191A
$$ Imaginary data points
##PAGE= N=2
##DATA TABLE= (X++(I..I)), XYDATA
0@%%%%%%%%%%%%%j6L2l2L2l2M0n6O4q0R6j12J28j44J76k08K29k61L04l37L85m36
$$ 0 0 0 0 0 0 0 0 0 0 0 0 0 0 -16 16 -16 16 -16 24 -32 32 -48 48 -64 64 -80 96 -112 117 -144 160 -177 208 -228
34b28M85n47O16o95P81q67R64j074J193j321J459j611J778j963K163k379K619
$$ -228 257 -290 326 -369 412 -455 509 -565 628 -693 766 -845 933 -1030 1133 -1246 1373
51A373k887L184l516L884m298M771n311N942o688P580q674J0057j1856J4310j7885
$$ 1373 -1514 1670 -1846 2038 -2260 2511 -2800 3142 -3546 4034 -4640 5417 -6439 7871 -10014
66a0014K3579l4099N9934k36351l95805M57970N09311M7245m33755k99541Q8162
$$ -10014 13565 -20534 39400 -196951 -592756 -134786 374525 421770 -11985 -311526 -223364
77b23364K88477J06575o7950p9168k0155q5406r0180P3658K49927J23916j94837
$$ -223364 65113 171688 103738 24570 4415 -80991 -171171 -97513 152414 276330 81493
88H1493l28258n6203K99926L09996n7158l32219k04256J28304K45753Q8179r5916
$$ 81493 -246765 -302968 -3042 306954 249796 -82423 -286679 -158375 87378 175557 79641
99G9641j15019m0183R249K6253P1145R0705q932j56978j36292P1182K05987Q1419
$$ 79641 -35378 -75561 -66312 -40059 31086 121791 112859 -44119 -180411 -109229 96758 178177
111A78177j33446j60358R880J30075N7422o7902n2466M7866L7567p7586q5479
$$ 178177 44731 -115627 -105747 24328 81750 13848 -38618 9248 46815 -30771 -116250
122a16250O8291J61920L2136j61055j51138O1309J96450P1638j41167j48501M0817
$$ -116250 -47959 113961 146097 -14958 -166096 -104787 91663 163301 22134 -126367 -85550
133h5550J40771K4583j02634m1565R5394P4947r1806j47742K4843J96279J00658
$$ -85550 55221 79804 -22830 -64395 30999 105946 14140 -133602 -108759 87520 188178
144A88178j54991k14860J2641K21202J40596j03868j91530l7839J29279J03128
$$ 188178 33187 -181673 -169032 52170 192766 88898 -102632 -140471 -11192 91936
154I1936l7399q0823k744L8763j3323m1366K7327Q5728K1786r6505j01804L1293
$$ 91936 54537 -26286 -29030 9733 -3590 -44956 -17629 68099 89885 -6620 -108424 -77131
166g7131J33430O3193q8514j19816m49R9469O1647l5172n9027n781K7205O7j9954
$$ -77131 56299 119492 30978 -88838 -89287 10182 71829 36657 -22370 -28151 -946 -879 -20833
179b0833J5903M4138m290o7139l5963N9080P8804j1429q5281l9277N7276O6066
$$ -20833 -4930 39208 34918 -32221 -68184 -9104 69700 58271 -27010 -66287 -9011 57055
191E7055k1872p3584j1921O7393M1463m9181o5679J6661P5097K5912n9139o1031
$$ 57055 35183 -38401 -50322 17071 58534 9353 -56326 -39665 35432 61344 2205 -58826
203e8826J9403O4916J5188m7282k7790L4444L3508k8390m6124J8392O8649J8109
$$ -58826 -39423 25493 40681 -6601 -34391 53 33561 5171 -40953 -22561 46088 64197
215F4197p4368p4894L3128J07665M1398q1108r5699R509R0840N2620l7619o4656
$$ 64197 -10171 -85065 -51937 55728 97126 16018 -79681 -70172 20668 73288 35669 -28987
227b8987j5989K8527K1884J692P591J0892k0436m6016q652N7402O0085j6048q1612
$$ -28987 -44976 -16449 5435 7127 14718 25610 5174 -40842 -49494 7908 67993 51945 -29667
240b9667m9983M3458Q5272K3948n9240o2419M623M8427K8433r743j9418j0566
$$ -29667 -79650 -36192 49080 73028 13788 -48631 -44008 4419 32852 23109 3691 -6875
252f875r817r883J1395L8852K3650l4164o0889q049O1668N4880k0275o6860l0645
$$ -6875 -16692 -26575 -15180 23672 47322 13158 -47731 -55780 5888 60768 40493 -26367 -57012
265e7012L7046N2487M926l5725k2498J1454J4495k850k476J1090M924j8486k3819
$$ -57012 -19966 32521 37447 1722 -20776 -9322 5173 2323 -153 10937 15861 -2625 -26444
278b6444M933L4831K2520k3489m1802l746L8697K6882j8742l3972m217K5886J7205
$$ -26444 -21511 13320 35840 12351 -29451 -33197 5500 32382 13640 -20332 -24549 1337 18542
291A8542j3452j9130P265K1505j514k2928o203K0963J5443j3450k2656l88K2029
$$ 18542 5090 -14040 -6775 14730 13216 -9712 -15915 5048 20491 7041 -15615 -16003 6026
304F026J3017j4309j9706N492J9381J214j8061p927J3415J3325o123j7653l672
$$ 6026 19043 4734 -14972 -9480 9901 11115 -6946 -14873 -1458 11867 5744 -11909 -15581
317a5581J9011J5914j0861k2695m12K0671J0738j2079j5684J830J4617O250j1115
$$ -15581 3430 19344 8483 -14212 -14624 6047 16785 4706 -10978 -9148 5469 11719 604
330F04r247Q728J1271q049j5698K814J7067N155j4812j4839O008K0545P804j6665
$$ 604 -8643 85 11356 3307 -12391 -9577 7490 12645 -2167 -17006 -10998 9547 17351 686
344F86j6932O482J7936L487j1298p859L455P058J491m414o88O055R14j0688o257
$$ 686 -16246 -9764 8172 11659 361 -7498 -4043 3015 4506 92 -596 5459 6373 -4315 -10572
359a0572J0308J2731m209j6373q112J0983J7323J763j7377j2638R318J4912J1
$$ -10572 -264 12467 8258 -8115 -16227 -5244 12079 13842 -3535 -16173 -6855 8057 8068
372H068j0115l784M032L184j289j011L780M793m354j0579n36J2759P375q841j2504
$$ 8068 -2047 -5831 -1799 1385 96 -915 2865 7658 3304 -7275 -7811 4948 12323 3482 -9022
387i022p81J0313R057k939j1302m813P434P266l086n832K90L232N90j708k09L482
$$ -9022 -9803 510 9567 6628 -4674 -9487 -2053 5213 2127 -3705 -3415 -183 407 -1301 -1510 1972
403A972L458l490p518J212J0068L320q687q198L238Q893L693n593p788p1O884
$$ 1972 5430 1940 -5578 -4366 5702 9022 335 -7863 -4625 4268 7961 2368 -5420 -5491 1393
418A393K647m111k836J486L27j829P90L396K256j447m783k873M312P640L53p614
$$ 1393 4040 -71 -2907 -1421 -1094 -2923 -2133 1263 3519 2072 -2711 -5584 -1272 6368 6721 -893
434h93n349K923O516L106k585n296j693K923J170j306Q64K577k804n904p07O075
$$ -893 -6242 -3319 3197 6303 3718 -1578 -3271 -348 822 -484 380 2957 153 -5751 -6458 -383
450c83O167j39p280o182K085P899M172k729m208k950m30L021N536K263k820n859
$$ -383 5784 5645 -1635 -7817 -5732 2167 6339 3610 -598 -3548 -3978 -957 4579 6842 4022 -1837
466a837l962Q76O769O071j928q561o422J540P874P536k31q629q239o9P186Q647
$$ -1837 -5799 -4923 1846 7917 5989 -2572 -8994 -7454 420 7956 7725 -904 -9143 -9212 -2026 6621
482F621L171n898j1459m692Q403J3342M424q427j2939m399P835J1570L452n922
$$ 6621 9792 3894 -7565 -12257 -3854 9488 13912 5485 -7454 -11853 -4018 7552 11004 5082
496E082q939n384J055Q349R331J014r417j2067l437R639J5199N238j1670j7358
$$ 5082 -3857 -9241 -8186 163 9494 10508 1091 -10976 -14413 -4774 10425 15663 3993 -13365
510a3365l801J3786J7225L487j3411j6182k283J2715J2473J510p542r472n072
$$ -13365 -17166 -3380 13845 17332 3921 -12261 -14544 -1829 10644 12154 4612 -4860 -9932
523i932K601R157Q480K68r411j2300l755J0392J5543M482j1805j6396n027J1959
$$ -9932 -7331 1826 10306 10574 1163 -11137 -14892 -4500 11043 15525 3720 -12676 -17703 -5744
537e744J8318N697j3167j7635l302J2497J4076L054q723j1328l638N211P762M824
$$ -5744 12574 18271 5104 -12531 -15833 -3336 10740 13794 5071 -6257 -9895 -4684 3078 7902
551G902j01n418q942m902M735J1556Q320l890j5185j2455O070J9962J2022r152
$$ 7902 7801 2383 -6559 -11461 -6726 4830 13150 9260 -5925 -18380 -12310 7652 19674 10522
565A0522k0261r391J0846J8535O288j0721j3016j769N845N237K924J785j464o786
$$ 10522 -9739 -19130 -8284 10251 16539 5818 -7198 -8967 -3122 2115 5039 6824 5360 -1426
579a426q641j789J1458J5887R74j9013j9032L190K2872J8150o398k4529j5453
$$ -1426 -10067 -11856 -398 15489 16463 -2550 -21582 -18392 4480 22630 16232 -8297 -23750
592b3750J0493K2998R536j0177j5007o155M530R282O635Q37m016q071q408M7J2990
$$ -23750 -13257 9741 19277 9100 -5907 -12062 -7532 1750 8385 9222 5206 -2865 -11273 -11226 1764
607A764J4288r09j7162j7364P36J9966K0237k921k4026j8363O450K2684J5575
$$ 1764 16052 15143 -2019 -19383 -18647 1319 21556 18635 -5391 -23754 -17304 5380 20955
620B0955o155k0374j2436P041J6241P635m099q402o509j317L288N959O597K698
$$ 20955 14800 -5574 -18010 -10969 5272 12907 8808 406 -6103 -7420 -4132 1827 8424 11122
634A1122p569j5653o330J4139K0872L737j9509k2096j55K3191K0253n487k3030
$$ 11122 3553 -12100 -18430 -4291 16581 20318 809 -21287 -21442 1749 22002 16515 -6515
647f515j2450Q788J5969O189n512p737k796R96p05R06Q298P818n666j7165r219
$$ -6515 -18965 -10177 5792 11981 6469 -1268 -4064 -3068 -3773 -2867 5431 13249 7583 -9582 -18801
662a8801J1116K1494Q047j6425k4376l711K0705K0355j221j7933j4873J255J3706
$$ -18801 -7685 13809 21856 5431 -18945 -22656 -1951 18404 17183 -750 -15623 -14368 -662
675f62J1743r7q212p685l330J566P791Q781J624q545j2061n329Q758J6868P399
$$ -662 11081 10984 2772 -4913 -8243 -6677 1114 9895 11519 2974 -9087 -14416 -5658 11210 18609
690A8609j2390j9800o629J3835K0130O100j5202k0557l554J6128J7255J438j3231
$$ 18609 6219 -13581 -20210 -6375 13755 19855 4653 -15904 -19458 -3330 13925 15363 2132
703B132j3128j171J0276R824R89m745n213m672k148M908J0421N659p237j5186
$$ 2132 -10996 -12167 -1891 7933 8922 4177 -1036 -5708 -7856 -2948 7473 13132 5895 -9291
717i291p405J0534J8717M775j5260j7363k17J5433J2881j867j2908q591L587Q880
$$ -9291 -16696 -6162 12555 17330 2070 -15293 -15510 -77 12804 10937 -1971 -10562 -6975 1905
731A905L796j913k523j275k173j806J873N577M606l004r551n210N783J0217K744
$$ 1905 5701 3788 1265 -10 -2183 -3989 -2116 3461 8067 5063 -4488 -9698 -3915 6302 9046
746I046o869q497k144O016O923J360m639m740r11K152L100K352k85k312k033r80
$$ 9046 2177 -6320 -8464 -2448 4475 5835 1196 -3544 -4455 -2303 797 3149 2864 552 -1481 -2461
762b461M11K886L815K61m451n010o48M704O247P80o536o692o8O562O093m19o120
$$ -2461 -2050 836 4651 4912 461 -4549 -5197 -493 5754 6534 -2 -6694 -6762 -200 5893 5474 -646
779f46n596O21N579M144q08k796k203j286M48L094L760P82m193n654r79N864O780
$$ -646 -6242 -5621 -42 4102 3294 498 -1705 -2991 -2543 551 4311 5093 900 -4754 -5733 131 6911
796F911p14p242n585J770O218M009j652n215l425J337L767K373k16k092k297q92
$$ 6911 6197 -1045 -6630 -4860 1358 5367 3715 -1500 -4925 -3588 179 2552 2336 244 -2053 -2945
812b945J546K778J545l80k569k960N84L661K575j332k967j814N15K124J585j30
$$ -2945 -1399 1379 2924 2544 -25 -2985 -2401 1260 3835 2503 -464 -2278 -1763 361 1946 1816
828A816j853j640l61P87J836J082j076j900n18R02J032Q78M41q33j419j20O54
$$ 1816 -37 -1677 -2038 -1251 585 1667 591 -1309 -1827 -925 107 985 1426 593 -826 -946 -292
845b92J178R83j01j929j545N45J815J230l27j874j941Q8K246J556o32j354j388
$$ -292 886 1869 1768 -161 -1706 -1161 654 1884 1557 -317 -2258 -2170 76 1632 1000 -354 -1742
862a742m38J430K147O80j669j871n25J272K625R57k008k433j55J795J467N83j186
$$ -1742 -2180 -750 1397 2077 408 -1463 -1988 -716 1909 2866 858 -1575 -1730 65 1532 2115 929
879I29k210p40J477J693L42j082j679j076J128K221M14j212j365l94M19J938J377
$$ 929 -1281 -2021 -544 1149 1491 409 -1270 -2346 -1218 1003 1417 205 -1160 -1554 -1135 803 2180
896B180j073k109l31J272J127R14r03j841o58J306J273K12o09j400j179Q88J948
$$ 2180 1107 -1002 -1333 -61 1066 1980 1077 -764 -1422 -116 1157 1369 760 -640 -1819 -931 1017
913A017L0j373j028K6O29J095Q46j076j189l3Q82Q44Q82o65j687k30J328J251
$$ 1017 1047 -326 -1354 -1328 -699 396 1242 166 -1023 -1056 -174 670 1552 887 -800 -1030 298 1549
931A549n49o09q85m52O30J436k07j300o18NL48R40L25j090o60O42N05J52M03K
$$ 1549 1000 391 -494 -946 -316 1120 913 -387 -1005 -1000 -652 288 613 -477 -1137 -495 10 162 565 567
951E67r68l32J023O50j33m12m13m26O09P96m56p71j41O6J08N71Q4q97o28O53N08
$$ 567 -401 -733 290 940 807 395 -18 -444 165 961 505 -266 -407 -341 -233 338 422 -475 -1103 -450 58
972E8l5l5Pl85j8M80K61R1J01l41o26N56Q25j2q86k79P4J49M59%p70k18K01M8
$$ 58 23 -12 -5 -390 -408 72 333 424 525 184 -442 114 939 927 41 -238 -164 -15 444 444 -326 -544 -343 -295
996b95o1J03L60m35k95K49J77K52N65k69q22K1R99M13l91l07k97k85M35L39q6
$$ -295 -356 -253 107 -328 -623 -374 -197 55 620 351 -471 -450 549 962 571 264 -33 -318 117 456 370
1017C70N3l02r01m00J044J323o75j401m08L07J260O49l89j307j72P09N64L10L35
$$ 370 423 121 -780 -1180 -136 1187 512 -889 -1297 -990 270 919 530 -777 -949 -240 324 634 969
1036I69l16r03l89N66Q72P14m41j854j054J183J898K14j414j366j26P06J174L52
$$ 969 653 -250 -639 -73 799 1513 1072 -782 -1836 -653 1245 1459 45 -1321 -1447 -741 433 785
1054G85o04n63o14k67R27J792L67j639j920M36J950J442m94j675j238O55J206
$$ 785 181 -382 -996 -1263 -336 1456 1823 184 -1736 -1300 650 2092 1598 -77 -1315 -660 546
1071E46L37k00k66o58q92k84J007J627M60j604k559k5K879K313r72l017j025J709
$$ 546 883 683 417 -241 -1133 -1417 -410 1217 1677 73 -2486 -2511 368 2681 1709 -1308 -2333 -624
1089f24K044K06j256r05N72J64o80l5J579J047j467k425o54K125K780q6l013k512
$$ -624 1420 1626 370 -535 37 201 -479 -514 1065 2112 645 -1780 -2434 -309 2471 2385 -628 -3140
1107c140Q38L058J528j019k035r91N34J521J060j21o07p84j199M36J752J370n70
$$ -3140 -2302 756 2284 1265 -770 -1761 -1227 294 1354 1233 626 -158 -1357 -921 831 2201 1631
1124A631j933j274L5J459J633L30j511k155r87J350L080J464k276l881p08L324
$$ 1631 -302 -1576 -1541 -82 1551 1881 370 -1785 -2772 -1422 1658 3122 846 -3035 -3743 -419
1140d19L558k63l178k488J232K850Q74j598q33P13K47j551o59J697K514j35l877
$$ -419 3139 2876 -302 -2790 -1558 1292 2166 568 -265 448 695 -856 -1515 182 2696 2561 -1316
1157a316l285J975N697J644m389n021O76M861L175j921m144o86K675J810j254
$$ -1316 -4601 -2626 3071 4715 326 -4695 -4019 842 4017 2096 -2048 -2734 -59 1751 497
1172D97j199J094J270j054k309j53K495K715p68m460k167K737L818Q26k878l293
$$ 497 -702 392 1662 608 -1701 -1854 641 3356 2588 -1872 -4039 -1302 2516 3342 464 -2829
1188b829k39K604K587k76j931j392N4P91J348P80o60j102l21J11K67O05J072j51
$$ -2829 -3068 -464 2123 1847 -84 -1476 -1422 -631 717 1497 837 -265 -586 -475 -208 397 1469 1318
1206A318j010j683r06J915L296K90l921l796J414M852K401k464m962q93L945L636
$$ 1318 308 -1375 -2281 -366 2930 3220 -701 -4497 -3083 1769 4170 1706 -3256 -4149 -204 3432
1222C432j342l616m82K539R83j485j565J382K813j93m213k338L447N203n48n436
$$ 3432 2090 -1526 -2008 531 1514 29 -1536 -154 2659 2466 -1747 -4085 -638 4565 4017 -1419
1238a419l718K512N485J508m134m100J011M081J039k221j515Q63J346k15j485
$$ -1419 -5137 -2625 2860 4368 234 -3866 -2855 1226 2265 44 -1471 -608 738 523 -962
1253i62k38K263J503j778k939K9K992J877q53k678j719J247K339Q45j268j377
$$ -962 -1200 1063 2566 788 -2151 -2122 870 2747 1894 -784 -2503 -1256 1083 1928 660 -717
1269g17o69P7J356J272j94j807r34O89J394N79o84p19L09O69n80j127Q46K381
$$ -717 -1386 -1309 47 1319 1125 -682 -1616 -927 467 1046 362 -357 -48 621 41 -1086 -240 2141
1287B141j27k723k139J360L553J273l222l548N84M167J719k407k961K89K602Q93
$$ 2141 2014 -709 -2848 -1488 2065 3338 116 -3432 -2848 1319 3038 631 -2330 -2041 561 1454
1303A454j423j543J084K197n69k832l40K810K373j740l512q13L031L044q42l816
$$ 1454 31 -1512 -428 1769 1200 -1632 -1972 838 3211 1471 -2041 -2854 177 3221 2379 -1437
1319a437j351K472K177p57j843l73J023L78o85n71R54J268o69j856k36J901J338
$$ -1437 -2788 -316 1861 1104 -739 -1112 -89 289 -396 -967 -13 1255 586 -1270 -1506 395 1733
1336A733p77j744m83J165J083j24q88r4M32l82o12M84J162l5j653r25Q52J767
$$ 1733 956 -788 -1271 -106 977 853 -35 -129 303 -79 -691 -207 955 920 -733 -1658 -806 961
1354I61M07j689j279Q99J641j57j258k05J051N66r39j039N84J741L17j727j569
$$ 961 1368 -321 -1600 -701 940 783 -475 -680 371 937 -2 -1041 -457 1284 1601 -126 -1695
1371a695J036K231J17k011j390J117J653j48j532p74J347J068q96j384L41J747
$$ -1695 -659 1572 1689 -322 -1712 -595 1058 910 -622 -1396 -49 1019 123 -1261 -920 827
1387H27O62j686j592R58K146M46j787j611J065J877m7j808m01J013R96q25j173
$$ 827 1489 -197 -1789 -831 1315 1761 -26 -1637 -572 1305 1258 -550 -951 62 1058 233 -940
1404i40J62J423M22j361j368R70J741K1j633j010J229J250J22j315o43J092J010
$$ -940 -778 645 1067 -294 -1662 -692 1049 1070 -563 -1573 -344 906 1028 -287 -930 162 1172
1421A172p18j301M74J332Q8j301q83Q87J220j24j495p24J117J277o45j306R9J127
$$ 1172 454 -847 -373 959 1047 -254 -1137 -250 970 846 -649 -1373 -256 1021 376 -930 -831 296
1439B96K95o89p85N79J091m8j103o18J164J115o24j436k9J131R08q54j201J84
$$ 296 591 -98 -883 -304 787 739 -364 -982 182 1297 673 -763 -792 339 1247 393 -808 -624
1457f24J084N52j212j070Q73J305l34j263m37J047R92k24j542j95J563O85q80
$$ -624 460 1012 -200 -1270 -397 908 574 -689 -1126 -79 913 689 -853 -1048 515 1200 320
1474C20j247M78J263K48r66r21M19J422j53j198o80Q13J300p24r14k56Q40O32
$$ 320 -927 -449 814 1062 96 -825 -406 1016 863 -335 -1015 -202 1098 374 -540 -796 44 676
1492F76n11j080J14J306K77j123n38P72R41l39p35l87Q96O90m10j139q1J079M64
$$ 676 165 -915 -801 505 782 -341 -879 -107 834 495 -240 -627 269 959 549 -590 -671 408 872
1511H72r85o81N37P63l23n37m47N27Q58l83q66p6J050L10n22o25J30Q70K64n53
$$ 872 -113 -794 -257 506 183 -354 -801 -274 584 201 -665 -741 309 619 97 -528 -398 472 736 183
1531A83q06M46Q74j09q95k01P14M61m88o14j99P39N21o59p89L71J004j85n08n73
$$ 183 -623 -177 697 588 -307 -508 206 667 179 -435 -634 105 626 -33 -822 -451 553 368 -140 -713
1551g13O16O19j05o21l85Q31O40n34r17J34Q50K04m53o21J57O02K21n78o12M16
$$ -713 -97 522 417 -204 -589 242 882 348 -569 -435 415 619 166 -455 -298 304 525 -53 -665 -249
1571b49O32l9p71o4N29L47k61n26j05P18N25n15p53L94O99r7l71j05%K82k43j41
$$ -249 383 344 -427 -491 38 385 124 -402 -507 211 736 221 -532 -138 561 464 93 -12 -12 270 27 -114
1593a14j46M44K18o12m48M45L68Lk97k58O4L56O4l02qK33K85j75l99K73L80l6
$$ -114 -260 184 402 -210 -658 -213 155 158 -139 -397 -333 23 87 -215 -223 10 295 120 -279 -6 374 338
1615C38l84l27L53L89J66o94l41L84L56j38k57p2J25J13O0l04q5N13L3m17k18
$$ 338 -46 -373 -20 369 535 -159 -500 -116 240 102 -155 -227 -102 11 71 -233 -318 195 228 -189 -407
1636d07M12L38J28m01k58M9M16J86k39l69j3L24j38j11J4Q4j22j55M2J33K01p
$$ -407 5 343 471 70 -188 -139 277 463 224 -145 -158 166 28 -83 -69 15 -107 -262 -220 -87 114 107
1658A07k17j99J38K23L7N1p0j37K6R8O5K59l7m40j18QM03J17l09j47j60J97K95
$$ 107 -110 -309 -171 52 89 140 70 -67 -41 57 122 381 344 -96 -214 -206 197 314 5 -142 -302 -105 190
1681A90n1k26k10R9J12J25l5Nn5N6m0j15J81J82R2k25l17P7L55J66l5l92k56J32
$$ 190 139 -87 -297 -198 -86 39 4 9 -46 10 -30 -145 36 218 310 85 -232 -155 200 366 331 -61 -317 -185
1705a85L68J84l35l76rJ89K31J64m41p3K94L3j15L2O3K00M3l96p6L41K42J38m35
$$ -185 183 367 32 -344 -353 -164 67 231 -210 -283 11 44 -71 -39 24 224 267 -129 -205 136 378 516 81
1728H1n14J92L99L02j62o37k50L65O15j16m79j12N8L40J1j95K9J48J56j95k99
$$ 81 -433 -241 158 460 298 -339 -589 -224 391 275 -204 -316 -258 82 93 -102 -73 75 231 36 -263
1749b63J63M26J3j33m84j93K94O94m8n30o04K40O43K10k42o80l5M08N84l82n05
$$ -263 -100 326 339 206 -278 -471 -177 517 469 -61 -665 -425 218 428 186 -494 -529 -121 463 81 -424
1770d24K19L48J79l79l11J47O28K37p66n49N60P37J68p55o37M3P35O96o42r93
$$ -424 -205 143 322 -57 -368 -221 407 644 -122 -671 -111 626 794 39 -598 -555 180 876 234 -759
1790g59K21N64L33j58o01J19K61L74m11k38J56N77k8m63l51K05N18L10l68p22
$$ -759 -538 26 359 201 -400 -281 -20 354 -57 -295 -139 438 410 -53 -404 -199 319 629 261 -461
1810d61o2O79M38l34n27k28J03O83l5l22l29J89K70J28l70n1K39K24M0n15k26
$$ -461 -523 156 594 260 -267 -495 -392 291 256 -66 -395 -206 64 192 -178 -229 10 234 274 -241 -467
1831d67M70O14m0o55n09L70N71L20n75p57J31Q17J43l40n30j70P25K44m79m76
$$ -467 3 617 577 -78 -587 -217 354 674 99 -658 -527 290 433 93 -437 -607 118 362 -117 -593
1851e93L53O84J1o96k58L60Q20k02m45n60K87P90J24o87m67K76M80J93n46l46
$$ -593 -240 444 455 -241 -499 -139 681 479 34 -526 -239 551 675 -12 -479 -203 277 470 -76 -422
1871d22K63K89r4l30n6M21J92l00k49Q6K64J32j5j61k92J88K59J74k03j74j22
$$ -422 -159 130 36 -294 -350 71 263 -37 -286 -200 64 196 181 20 -272 -84 175 349 146 -28 -150
1892a50j7K45R0M9l79R9l4J35J03j42j79J73K34l28k24J77N24j02k13l03J34M37
$$ -150 -167 78 168 217 -162 -63 -97 38 141 -1 -180 -7 227 -101 -325 -148 376 274 61 -242 -108 329
1914C29J74n85l92K17P46kl91n39K35L57O6k51l72L46L08j50l25m0K01M75l28
$$ 329 503 -82 -474 -257 489 487 96 -443 -208 149 215 -36 -408 -62 246 96 -229 -269 -68 407 79
1935G9l55m4M14M71m38k93q5M06K29l71r4rL02o0k53j26K39K27j61n21J64K07
$$ 79 -276 -320 94 565 127 -166 -251 155 384 13 -81 -90 212 152 -101 -227 12 239 78 -443 -279 -72
1957g2K42k59j09l1K61J50j90j8J24j3j9r6k0K99l6j49k42k1L51Ok27j75K77J41
$$ -72 170 -89 -198 -229 32 182 -8 -26 98 85 66 -30 -50 249 213 64 -178 -199 152 158 -69 -244 33 174
1981A74j16k12j07K76P0k29j75K18L33J9k96k22K87L45r1l59j07J35K98P8k54
$$ 174 58 -154 -261 15 85 -144 -319 -101 232 251 -45 -267 20 365 274 -85 -192 -57 241 319 65
2002F5j75K74J69l09m11K89K66O2k28l93J68L65M4l44k77M94J75q2l34j2K46K29
$$ 65 -110 164 333 24 -387 -98 168 230 2 -391 -223 142 186 -158 -435 59 234 152 -182 -194 52 281
2024B81l16j12oK49J41k31k16K1K27P3k50n8q0L67L2k77p2K53M1j13j69K96J28
$$ 281 -35 -147 -153 96 237 6 -210 -189 38 111 -139 -197 -277 90 122 -155 -227 26 67 -46 -215 81 209
2047B09j04n9k47P4L74l7l85mL05K26m34j02O7Q9K1Jj51PL46m8m27J52J61J36
$$ 209 105 46 -201 -127 247 210 -175 -179 126 352 -82 -184 -117 -28 -7 -6 -157 -150 196 148 -279 -127 34 170
2071A70j37j38r0J89J39qk53K0M07j14k09k32K11K46n9k96m8J27K80Lm23O6J52
$$ 170 33 -105 -195 -6 133 125 -128 -108 299 185 -24 -256 -45 201 142 -154 -202 -75 205 208 -215 -149 3
2094CK00j65k87Q9L52j7j80k29J54L60M2k51j86K43J58k17l6j44J04J32j72k25
$$ 3 203 38 -249 -160 192 175 -5 -234 -80 280 322 71 -115 128 286 69 33 -111 -7 125 -47 -272
2116b72P0K52N6k19r7K04k2J35k82r9J43L08k27k05J87K71l7j51m4J9J53J1k02
$$ -272 -202 50 106 -113 -210 -6 -28 107 -175 -274 -131 177 -50 -255 -68 203 166 15 -29 -10 143 154 -48
2139d8k26L00R9q6k62J52J83Jqm04J91J43P2k78j10L21K17r9k99J8J37K83j38
$$ -48 -274 26 125 39 -223 -71 112 113 105 -299 -108 35 107 -171 -281 40 257 158 -141 -123 14 297 159
2162A59k39j30K80K17j79l22J13J36J98k05k63K50M6j0l15j7K34K62k43k24j5
$$ 159 -80 -210 70 287 108 -214 -101 35 233 28 -235 15 61 51 -264 -281 -47 215 -28 -252 -267
2183b67L91L35l34k13l6L41k3k06j2r5J47J3j02q2J67J14j34r3q2K06J20k50j75
$$ -267 124 459 125 -88 -124 217 194 -12 -24 -119 28 41 -61 -143 24 138 4 -89 -171 35 155 -95 -270
2206b70K07K55j89L1n3n3J49Kl02K02J49m6j04j10J35K65j26j93j26J33J87j02
$$ -270 -63 192 3 34 -19 -72 77 79 -223 -21 128 82 -22 -132 3 268 142 -51 -177 -44 143 41
2228D1k21lJ05J91q1k06K3K85l5J6l72K74J45P1l04p4J91J62o6j69k59K87R0r5
$$ 41 -180 -183 -78 113 32 -174 -151 134 99 115 -257 17 162 233 -71 -145 46 208 142 -27 -286 1 91 -4
2252dp6r8K29K05l95P8j03J58J86k75j33J37J32k4n8j4pJ11M8k01J98J9j27o1
$$ -4 -80 -178 51 256 -139 -61 -164 -6 180 -95 -228 -91 41 17 -41 -55 -62 49 97 -104 94 113 -14 -75
2276g5K2J5J62k5j58o2K39j14J21j71j13K53j00P3r9O2J15j20j6r3N9K48m0j77
$$ -75 -53 -38 124 99 -59 -121 118 4 125 -46 -159 94 -6 67 -32 30 145 25 9 -84 -25 223 183 6
2300Fk57K65K53j77j58j01J59o6J20k4k05J41J58o7j69K8K00%k18O2m3K20o6P0
$$ 6 -251 14 267 90 -68 -169 -10 -76 44 20 -185 -44 114 47 -122 -94 106 106 -112 -50 -93 127 61 131
2324A31j81J14jL2j09p5R4j94K18N9r3qK6o2J28O5k47J50n0K9J59k69O4R4N0j27
$$ 131 -50 64 63 95 -14 -89 5 -189 29 88 -5 -13 13 -49 79 144 -103 47 -3 26 185 -84 -20 74 124 -3
2350cL2k09K72O4K5k23n8K4K07m1j36o5m4K28K4Ll12M8K80o5k00J23J13P9j32
$$ -3 29 -180 92 156 181 -42 -100 -76 131 90 -46 -111 -155 73 97 100 -212 -164 116 51 -149 -26 87 166 34
2375C4m2o9J15J99j16j23k1M4Mj7Mj80N0K01lj76k6J65j25K13j33m5p9N9K34k18
$$ 34 -8 -77 38 237 121 -2 -23 21 25 8 12 -168 -118 83 80 -96 -122 43 -82 131 -2 -47 -126 -67 167 -51
2401e1p7J17n0J99k40O1r0K47N1l8r5j46K94q6P5k61JP1M0l0L3j50J3R5l6mRK00
$$ -51 -128 -11 -61 138 -102 -41 -131 116 167 129 34 -112 182 96 171 -90 -89 -18 22 -8 25 -125 -112 -17 -53 -57 -48 152
2429A52N9j79j9k2J45K7o3pj84K32j08r1j0K7k1mN9o2J14n6K0k1O7j74n0K92j6
$$ 152 211 32 13 -9 136 163 100 93 -91 141 33 -58 -68 -41 -62 -66 -7 -69 45 -11 9 -12 55 -119 -169 123 107
2456A07k02J36k0p5J94j29r7P1O2J08J3j14k06K60j07o4J4j39K19P7r4n8P4P5
$$ 107 -95 41 21 -54 140 11 -86 -15 47 155 168 54 -152 108 1 -63 -49 -188 31 108 14 -44 30 105
2480A05L1j36j71J00P5J29k03j1J75K3q0j28L7R8J56j65j04j26J53R9n8L7j12
$$ 105 136 0 -171 -71 4 133 -70 -81 94 117 37 -91 -54 44 200 35 -69 -195 -42 57 -1 36 -76
2503g6M6J61j21k1P4k4j43J99p0K1m3lK3M8M4q6Pk2J25r9K5r0j00J65K9j35Q1
$$ -76 -30 131 10 -11 63 39 -104 95 25 46 3 0 23 71 115 29 36 14 139 40 65 -25 -125 40 69 -66 15
2530A5k5J33j52j81J21J17Mnj33l6J20J27n2j47J28J30j08q6o8O0J19J1l7j75
$$ 15 -10 123 -29 -210 -89 28 32 27 -106 -142 -22 105 53 -94 34 164 56 -30 -98 -38 81 92 55 -120
2554a20J34P8j6p4Lk0R4qj63o8J74M6M0k29J46J4J6mo4J60m6n7k3j12J53q3l8
$$ -120 14 92 76 2 5 -15 79 71 -92 -160 14 60 100 -129 17 31 47 43 -21 139 93 36 13 -99 54 -29 -67
2581f7Q1j10Q6j26J69j95J87n2j55o7K50J8q7M6p6J11R0r5l5J2q7K02l1k5j45
$$ -67 14 -96 -10 -136 33 -162 25 -27 -182 -249 1 19 -68 -22 -98 13 103 8 -27 -15 -102 100 69 44 -101
2606a01N7R9K4j10K6J00j06r7R2n0J82J1j04j42K8K50O1l11M6k2J24Np7m2Q7k0
$$ -101 -44 55 79 -31 -5 95 -11 -108 -16 -66 116 127 23 -119 -91 159 220 -91 -45 -67 57 62 -15 -57 30 10
2632A0j21n0k6R3K14k25kJ50j45J42N4j86J19l2o6j7P1J6M4nn4Q9p4N5k7j21O7
$$ 10 -111 -161 -187 -94 120 -105 -107 43 -102 40 94 -92 27 -5 -71 -88 -17 -1 43 38 -16 73 -1 54 27 -94 -27
2659b7P1k6qm2J68o5r4n2P0n6J55l0r7J08m2o5kJ07l2J17j33j03mJ14N7n6M7j83
$$ -27 44 18 10 -32 136 71 -23 -75 -5 -61 94 64 -33 75 33 -32 -34 73 41 158 25 -78 -82 32 89 33 80 -103
2687a03K26o8j47J21j04N3J79k98O6Q3O0J2j42J4Q0K1Nmm2lO6q2k1R5l5m7q3j0
$$ -103 123 55 -92 29 -75 -22 157 -141 -75 8 68 80 -62 -48 32 53 58 54 12 9 75 -7 -28 67 32 -15 -98 -108
2715a08M8J18jj32J3J86j33j8n4K0K12p7j14P2q9M2P3o3m6J39J0n1r9LO5J1j3
$$ -108 -60 58 57 -75 -62 124 -9 -27 -81 -61 151 74 -40 32 -57 -15 58 -5 -51 88 98 47 -52 -49 16 27 14
2742A4OPm8k7N7k4PK4P3k38K58j59P0j04j2O5NJ5m6pK2J61n7q9MM6j08K06k12
$$ 14 20 27 -21 -48 9 -15 -8 16 89 -149 109 -50 20 -84 -96 -31 -26 -11 -57 -64 -42 119 62 -27 -23 23 -85 121 -91
2771i1P6O8q9Ko3J18j13J55n8j87K85p7N3j17N2j59J77j03N9j9Pl3R3j24J22Q8
$$ -91 -15 53 -36 -34 -97 21 -92 63 5 -182 103 26 79 -38 14 -145 32 -71 -12 -31 -24 -57 36 -88 34 122
2797A22j44k6J3J25o4q9%r8J26j9Q8j18J44k14J83jK3j91Q6L2oP8q4J00l8j6K1
$$ 122 -22 -48 -35 90 26 -63 -63 -161 -35 -54 34 -84 60 -154 29 28 51 -140 -54 -22 -28 50 -34 66 28 12 33
2824C3l4J4j08K6O8pQ2r1lp5J00k4m5q2J50J9J4j12J02k3j7J42j06j00J13l0j
$$ 33 -1 13 -95 -69 -1 -8 74 -17 -20 -95 5 -19 -64 -146 4 23 37 -75 27 4 -13 129 23 -77 36 6 5
2851ENn6O5m6j8n5J92q6k1l1n8M3J65j23kQ7l8L2k5l1J8R4q1j14J09m5Qn8Q9J
$$ 5 10 -46 19 -27 -45 -100 92 6 -15 -46 -104 -61 104 -19 -21 66 28 60 35 4 22 116 35 -79 30 -15 -7 -65 24 25
2881B5p9rJ82on8j9J65j78k07J77J77j48j17K4Q5K01l83J40k6J62j86J48j93J95
$$ 25 -54 -63 119 113 55 36 201 23 -184 -7 170 22 -95 -71 14 215 -168 -28 -54 108 -78 70 -123 72
2905G2K8j05Oo8K6J43q7q0j72J79J25n5j5K9O8l4j06Q9k9M4p7Kl6nO5n0J83j63
$$ 72 100 -5 1 -67 -41 102 15 -65 -237 -58 67 12 -3 26 94 60 -46 43 14 58 -19 -17 -53 -58 7 -43 140 -23
2933b3rR3J5m4l7n9J06K2p2K2M5m5P2m1Q4j86J18k19K09m1k8Q6j37R9Nor5J8P5
$$ -23 -32 61 76 32 -5 -64 42 64 -8 14 59 14 86 45 129 -57 61 -158 51 10 -18 68 -69 30 35 29 -66 -48 27
2962B7Mm6j32K14r8q6J02n5K8Pj7O5P2j33O6qP6j06L0l6l6O4r5J15j%r8J32Mj
$$ 27 31 -15 -147 67 -31 -117 -15 -70 -42 -35 -52 13 85 -48 18 10 86 -20 10 -26 -62 2 -93 22 21 21 -77 55 59 58
2992E8q8N7J3j3m3j72K04j05J21j16K62k14j04J38o6L5N8r7R6o9O3j66K19j58
$$ 58 -30 27 40 27 -16 -188 16 -89 32 -84 178 -36 -140 -2 -68 -33 25 -72 24 -45 18 -148 71 -87
3016h7J58n3p0Lk2O2L6P6j83Q1o2J18k6o3J2Q8Kk5j31n1J99M5j45O0j04J32P2
$$ -87 71 18 -52 -49 -71 -9 27 103 -80 1 -61 57 31 -32 -20 68 70 45 -86 -137 62 107 -38 22 -82 50 122
3043A22r9J25j38rj9o7J19p8N0K3M4jm2p0O8r2J05k6J04q0k8p1Q3N4n7qpl4k2
$$ 122 23 148 10 1 -18 -85 34 -44 6 29 73 72 30 -40 28 -64 41 15 119 39 11 -60 23 77 20 12 5 -29 -51
3072e1M7J3Q0l9p3l1L8jk8oQJ49j22j20J42J13l8nL5j86M4m9J36J0n0O1n5l6n3
$$ -51 -4 9 89 50 -23 -54 -16 -17 -45 -51 -43 106 -16 -136 6 119 81 76 111 -75 -31 -80 56 66 16 77 22 -14 -67
3101f7J15n6Q9k3l7m6M1q5Q6p7K8Q8j24M3j06J11k6K0L4QO4r9J18j81Nj4J40q3
$$ -67 48 -8 81 58 21 -25 16 -69 17 -60 -32 56 -68 -25 -131 -20 -46 -26 8 16 80 -19 99 -82 -77 -91 49 -34
3129c4m7J49r2j1P6nJ06p0j5q6J1k2M3k9l1j6J02P0k33Q8Q4j6l7k1NR9m3Q3j58
$$ -34 -81 68 -24 -35 41 36 142 72 57 -29 -18 -40 3 -26 -57 -73 29 99 -134 -46 38 22 -15 -36 -31 68 25 108 -50
3158e0O6R6j71J34j23RJ88m2j55l5J46J90k23j18P3rM3J3k6j40J27o0J55j32q
$$ -50 16 112 -59 75 -48 -39 149 107 -48 -83 63 253 30 -88 -15 -24 19 32 6 -134 -7 -67 88 -44 -52
3183e2J11jn6K5k5p5N1J03j36LQ5K0j48N4J14K9q5n6J81k57J54L0j44NN7J3Q1
$$ -52 59 58 2 27 2 -73 -22 81 -55 -52 33 53 -95 -41 73 102 17 -39 142 -115 39 69 -75 -70 -13 0 81
3210H1p6pK3n5L1m2P0p9k3K20j16m8J07j7m9Qj3j60J03O9L7k1j00O8m0R7J06j93
$$ 81 5 -2 21 -34 -3 -45 25 -54 -77 143 27 -21 86 69 20 28 15 -145 -42 27 64 43 -57 11 -29 68 174 -19
3238a9l8M9rM0q5J14m3L8k1rp3L6nM8n1J3Nj3J13n4Mj24M9N5j48K6K04j48j65
$$ -19 -57 -8 -17 23 -62 52 9 47 26 17 -56 -20 -25 23 -28 -15 -10 -23 90 36 40 -84 -35 20 -128 -102 102 -46 -211
3267b11J67jJ05N2j03p8Q3j04JJ68n2k5j60Q7R1j01QJ03M8j06l6L5N4o0M8J12
$$ -211 -44 -45 60 112 9 -69 14 -90 -89 79 27 2 -158 -71 20 -81 -73 30 78 -28 -64 -29 25 -35 13 125
3293A25j92J35K8p9J30j44k6j8R6qol8n4M9%K9J8r4R0%k6n5R0j02p4R8k03K69
$$ 125 -67 68 96 17 147 3 -23 -41 55 47 41 3 -51 -2 -2 27 45 -49 41 41 15 -40 50 -52 -126 -28 -231 38
3321C8j20J24N5n8n7mj13Q1jjK8J44j85Q4J00j61j07J10P6k4j18N3J17K5j24L8
$$ 38 -82 42 97 39 -18 -22 -135 -54 -55 -56 -28 116 -69 15 115 -46 -153 -43 33 9 -109 -56 61 86 -38 0
3347@K1j00J02pj34P1O5n9JO3Nm3Nl1o4O9p8R7P1q6J24j22KL0o4J56o2j27J39
$$ 0 21 -79 23 16 -118 -47 18 -41 -40 23 28 -15 -10 -41 -105 -36 -114 -17 54 -32 92 -30 -28 2 -62 94 32 -95 44
3376D4q5K2R8n9r5J22j1Rm9l0J03%j01k4J0l6k0L4M2K6N0P3j09ojJ6K5n3N3r2
$$ 44 -41 -19 79 20 -75 47 36 45 -4 -34 69 69 -32 -56 -46 -82 -102 -68 -26 0 50 123 14 8 7 23 48 -5 48 -44
3406d4R7K3p4m1L2Q8j06K4qj6L1K4j58R4o9Q7M0j27Q4j04J2O1J8n4K66p2l03R6
$$ -44 53 76 2 -39 -7 81 -25 -1 -9 -25 6 30 -128 -34 -103 -16 24 -103 -19 -123 -111 -50 -32 -86 180 108 -195 -99
3434i9M3Q1Pn6kR0k8j03J50p9j2m7R1j8M1j20R0p7o9M1O2k6K5k1J18j35J12j77
$$ -99 -56 25 32 -24 -26 64 36 -67 83 4 -8 -55 36 18 59 -61 29 -48 -117 -76 -14 -40 -15 -36 82 -53 59 -118
3462a18J19N5o4j80K70R6j21j12P0rj4m1RJj6J06k5q6L7q2J22j29J96n2O3r4J34
$$ -118 1 56 -8 -188 82 178 57 -55 15 6 -8 -49 -40 -39 -55 51 26 -60 -23 -105 17 -112 84 32 95 1 135
3489A35j90J44q8M5p7J08n5j48K50j11kO4m6K7m6J6p7k3oqJ06n5o6J10n9J9J93
$$ 135 -55 89 1 46 -31 77 22 -126 124 13 11 75 29 56 10 26 -51 -74 -80 -88 18 -37 -103 7 -52 -33 160
3516A60j89J2m7R0p4p0R4j3R5n5q3J09j30Q3r4M4J18L1q5K9m5l3lLQ5QJ7nr0J8
$$ 160 -29 -17 -64 26 -48 -118 -24 -37 58 3 -80 29 -101 -18 -112 -68 50 81 -4 25 -20 -53 -56 -53 32 40 57 52 -38 -20
3546b0o9K33j01j65M1P4J32p4J2j29J70n8Ln8l9n9J12O3pN8j40O8m6j4n4L6m8
$$ -20 -89 144 43 -122 -81 -7 125 51 63 -66 104 46 49 -9 -48 -107 5 68 61 119 -21 47 1 -13 -67 -31 -79
3573g9J02N7r2L6P0j11j5j02K20j64m0J44Mo1q0J34j42J92j24j1m2J41k8l6j4
$$ -79 23 80 -12 24 94 -17 -32 -134 86 -78 -118 26 30 -31 -111 23 -119 73 -51 -62 -104 37 9 -27 -41
3598d1r7J25m1j9Q0p9J69j13o8O9K5P7O4j27j25J22m5Q0j3j40J28q0J47k2j23
$$ -41 -138 -13 -54 -73 7 -72 97 -16 -84 -15 10 87 151 24 -101 21 -24 56 43 -97 31 -49 98 76 -47
3623d7P4jN8q5Pm2J01q0L7p0K6p1J97q8K1p3Q3j9p7P2j46J06P2p8L4P2M1j16Q1
$$ -47 27 26 84 -1 6 -36 65 -15 22 -48 -22 -93 104 16 37 -36 47 28 -49 23 -123 -17 55 -23 11 83 124 8 89
3652H9n5j62K3J52o8L9j41K06Q1j97K2L1o6M9nN4j31J12O3j52O4n8M2k8M1K8k3
$$ 89 34 -128 -105 47 -21 18 -123 83 164 -33 -11 20 -46 3 -2 52 -79 33 96 -56 8 -50 -8 -36 5 33 10
3679A0MK0m5M1m8m3l4O7J8R2p8O1o1O6j25J33p8Q8j31K24j51m9Q6j28J08J7l7
$$ 10 14 34 -11 30 -18 -61 -95 -28 -10 82 4 65 4 70 -55 78 0 88 -43 181 30 -19 67 -61 47 64 27
3706B7M2p1Ol1O5M6o9j2l2J64q3o2J32r1M0L1j72J28n7l3L9N4j43j0RO7J41m1
$$ 27 69 -2 4 -27 38 84 15 3 -29 135 52 -10 122 31 71 102 -70 58 1 -32 7 61 -82 -92 -83 -16 125 84
3734H4j05L4P7p7q6k2Q0J17k32J18n6O1J12j48o9K23l6n5j7J0j9o5J81j18m4J25
$$ 84 -21 13 90 13 -73 -95 -15 102 -130 -12 -68 -7 105 -43 -112 111 75 20 3 13 -6 -71 110 -8 -52 73
3760G3j1m6J8N2Lr0l9R8j4j5j0J4K6n0J03l9l9o0Q6o3K1r2N8P5m0k4J16j33j9
$$ 73 62 16 34 86 89 -1 -40 58 44 29 19 33 59 9 112 73 34 -26 60 -3 18 -74 -16 59 19 -5 111 -22 -41
3789d1k3O0l5R2q8k0O6l1Q2j11J40j17K3j24K24j15k7N2j12J81j14K7RN8p6j8
$$ -41 -64 -4 -39 53 -35 -55 11 -20 62 -49 91 -26 -3 -127 97 -18 -45 7 -105 76 -38 -11 -2 56 -20 -38
3815c8NO8l5P7L8j52J59j24%K0M8J3J6k17K15j62j5LJ90j06q2J4K0P9O2j03o1
$$ -38 -33 35 0 77 115 -37 122 -2 -2 18 66 79 95 -122 93 -69 -84 -81 109 3 -79 -65 -45 34 96 -7 -68
3842f8L2n5J03j3n4j26K64l2ro2J6J19o6j01J00q9N7P2m6j46N1K5q1J11p1O2J15
$$ -68 -36 -91 12 -1 -55 -181 83 51 42 -20 -4 115 49 -52 48 -41 16 88 42 -104 -53 -28 -109 2 -69 -7 108
3869A08q9j55J12J26j34l0J44j9j05l4J80j10l5J00j2n5j62J97j20J63q4o5J11
$$ 108 19 -136 -24 102 -32 -62 82 63 -42 -76 104 -6 -41 59 47 -8 -170 27 -93 70 -14 -79 32
3892C2n1p4J42j00R6j99O5l3J22n0J7O6J36j29Qj11J4L3J03K2j07M4N3q2n8P1
$$ 32 -19 -93 49 -51 45 -154 -89 -122 0 -50 -33 33 169 40 48 -63 -49 -16 87 109 2 46 99 17 -41 30
3918C0m4K7j78J12L8n7L8J00o8Q5o0jQ7j9j60J12Pk6p9J88n4j11K0k6K6R6j67
$$ 30 -14 13 -165 -53 -15 -72 -34 66 -2 83 23 22 109 90 -70 42 49 23 -56 132 78 -33 -13 -39 -13 83 -84
3945h4J35m9j9rJ20r3o2k1n0O0qJ35j1m4k9J18j61J22J9j25K31j37j78J84j52
$$ -84 51 2 -17 -26 94 1 -61 -82 -132 -72 -80 55 44 0 -29 89 -72 50 69 -56 175 38 -140 44 -108
3970a08N2R1p9J8Qo3J08LOk0j31K54o4p1l1j8J65j39J9J05j70K7J6J13o6k1L9
$$ -108 -56 35 -44 -26 -18 -81 27 30 36 16 -115 139 75 4 -27 -45 120 -19 0 105 -65 -38 -22 91 25 4 43
3997D3m7j7M5p2J14j53J05R8j80R9j0%o1Q3rj42JJ16r5j5K10j14N5o6L4J2K1j09
$$ 43 -4 -21 24 -48 66 -87 18 116 -64 35 25 25 -36 47 38 -104 -103 13 -82 -97 113 -1 54 -12 22 34 55 -54
4025e4R6N5j26P3N6j73OK13k12J04j17O8O2lr0k9M5P3l7o0K39j61J29j86L7Q4
$$ -54 42 97 -29 44 100 -73 -67 146 -66 38 -79 -11 51 48 -42 -71 -26 47 10 -50 189 28 157 -29 8 92
4051I2j91R5nnQ6j04m4L6P7r2QQ0o2Q7r6K7K4J17l5o5R1j48J03j7j00Q0J2j46
$$ 92 -99 -4 -9 -14 72 -32 -76 -40 37 -55 -47 33 -29 58 -38 -11 13 130 95 30 121 -27 76 59 -41 39 51 -95
4079i5J04n7J04l0j24J23o2O1N4QL9j04k7M8q4R0l7J6j08O4J21j43rK0l9J17p7
$$ -95 9 -48 56 26 -98 25 -37 24 78 86 125 21 -6 42 -42 48 11 27 -81 -17 104 -39 -48 -28 -67 50 -27
4106b7M0M2j0j7j11J88l7j2j60J05K0j33J69k0n6m2J53j80K13j74j2M4Qj8Q9o1
$$ -27 13 55 45 28 -83 105 68 56 -104 1 21 -112 57 37 -19 -61 92 -88 125 -49 -61 -17 -9 -27 62 1
4132Am6P3j39J36Q4j01l2k3L8L8n8M1m0n9J71k16J29N4r1K3MO9K5M8j33J22j25
$$ 1 -45 28 -111 25 109 8 -24 -47 -9 29 -29 12 -28 -87 84 -132 -3 51 -40 -17 -13 56 81 129 -4 118 -7
4159gpj2R6q1j17J15k5R7%k3o4J48%r6j19J90j30N9q3J51r1L6Rj38J24p0O5l2
$$ -7 -14 -26 70 -11 -128 -13 -38 59 59 36 -28 120 120 24 -95 95 -35 24 -59 92 1 37 46 -92 32 -38 27 -5
4187eR7l5r8j0N2Q4o2Rj24LQ0L4K2K4n9q4R2k4L7n3Q2N3k18j13K38p2P9l7j03
$$ -5 92 57 -41 -51 1 85 23 32 -92 -89 -9 25 47 71 12 -72 20 -4 33 -20 62 115 -103 -216 22 -50 29 -8 -111
4216a11J23q6J6rN0j72J24K2L8L2N3n2j55J80o7o9Q1Pm1P2k0L7j02NM3nK5j42
$$ -111 12 -74 -58 -67 -17 -189 -65 -43 -5 27 80 28 -127 53 -14 -83 -2 5 -36 36 16 53 -49 -44 -1 -6 19 -123
4244a23R8L9K0q6J12j04kj4j02J32K9K6j20PK0LK4J30l5j19L7J1J35q7j6j45Q9
$$ -123 -25 14 34 -52 60 -44 -46 -60 -162 -30 -1 25 -95 -88 -68 -65 -41 89 54 -65 -28 -17 118 31 15 -130 -41
4271d1Q5r7P6K6r7L1M9r8J9k4Q4O4j10R4j23K03j49Rr2P7O6K2l4j71R5J8m1M8
$$ -41 44 -53 23 49 -48 -17 32 -66 -47 -71 13 77 -33 61 -62 141 -8 1 -91 -14 52 74 40 -131 -36 -18 -59 -11
4299a1K9P8k00P6J00j54J36j16J20k16J97k5m4J38J9j38O2j03j43K93n7lk3m2
$$ -11 18 96 -104 -28 72 -82 54 -62 58 -158 39 14 -30 108 127 -11 51 -52 -195 98 41 38 15 -27
4323b7P5Qr9k3N9kJ8J05j41J05j79J57Mj1k22J04J29r4J65n8j40R7j19J01J1k8
$$ -27 48 56 -43 -66 -7 -9 9 114 -27 78 -101 56 60 49 -173 -69 60 -34 131 73 -67 30 -89 12 23 -5
$$ [...]
8191H9
##END NTUPLES=NMR FID
##END=
