##TITLE=1H ikalashn
52
22.10.2024
##JCAMPDX= 6.0         $$ Bruker NMR JCAMP-DX V2.0
##DATA TYPE= NMR FID
##DATA CLASS= NTUPLES
##ORIGIN= UXNMR, Bruker Analytische Messtechnik GmbH
##OWNER= root
$$ TOPSPIN		Version 1.3
$$ 2024-10-22 11:31:02.656 +0400  Irina@DPX200
$$ Compression mode = diff/dup
##.OBSERVE FREQUENCY= 200.131300845
##.OBSERVE NUCLEUS= ^1H
##.DELAY= (6, 6)
##.ACQUISITION MODE= SIMULTANEOUS
##.ACQUISITION SCHEME= undefined
##.AVERAGES= 32
##.DIGITISER RES= 18
##SPECTROMETER/DATA SYSTEM= spect
##.PULSE SEQUENCE= zg
##.SOLVENT NAME= D2O
##.SHIFT REFERENCE= INTERNAL, D2O, 1, 17.49637
##AUDIT TRAIL= $$ (NUMBER, WHEN, WHO, WHERE, WHAT)
$$ ##TITLE= Audit trail, TOPSPIN		Version 1.3
$$ ##JCAMPDX= 5.01
$$ ##ORIGIN= Bruker BioSpin GmbH
$$ ##OWNER= Irina
$$ $$ F:/spectra/data/iren/nmr/1H/4/audita.txt
$$ ##AUDIT TRAIL=  $$ (NUMBER, WHEN, WHO, WHERE, VERSION, WHAT)
(   1,<2024-10-22 11:30:44.515 +0400>,<Irina>,<DPX200>,<TOPSPIN 1.3>,
      <created by zg
	started at 2024-10-22 11:28:32.078 +0400,
	POWCHK disabled, PULCHK disabled
       configuration hash MD5:
       BE 6D 3F 07 2A EA 11 49 91 17 2B D3 AF B3 58 0D
       data hash MD5: 16K
       AB 19 FF 07 79 21 57 BF 32 F1 3C F7 4A 4F 50 05>)
$$ ##END=
$$ 
$$ $$ hash MD5
$$ $$ 4A D5 3A EF 43 38 28 56 64 6C 50 DA EC 40 3C 9D
##$RELAX= 
##$RELAX= 
##$RELAX= 
##$RELAX= 
##$RELAX= 
##$RELAX= 
##$RELAX= 
##$RELAX= 
##$RELAX= 
$$ Bruker specific parameters
$$ --------------------------
##$DU= <F:/spectra>
##$EXPNO= 4
##$NAME= <1H>
##$PROCNO= 1
##$TYPE= <nmr>
##$USER= <iren>
##$AMP= (0..31)
100 100 100 100 100 100 100 100 100 100 100 100 100 100 100 100 100 100 
100 100 100 100 100 100 100 100 100 100 100 100 100 100 
##$ANAVPT= -1
##$AQSEQ= 0
##$AQ_mod= 1
##$AUNM= <au_zg>
##$AUTOPOS= <>
##$BF1= 200.13
##$BF2= 200.13
##$BF3= 200.13
##$BF4= 200.13
##$BF5= 200.13
##$BF6= 200.13
##$BF7= 200.13
##$BF8= 200.13
##$BYTORDA= 1
##$CFDGTYP= 0
##$CFRGTYP= 5
##$CHEMSTR= <none>
##$CNST= (0..63)
1 1 145 1 1 1 1 1 1 1 1 1 1 1 1 1 1 1 1 1 1 1 1 1 1 1 1 1 1 1 1 1 1 1 
1 1 1 1 1 1 1 1 1 1 1 1 1 1 1 1 1 1 1 1 1 1 1 1 1 1 1 1 1 1 
##$CPDPRG= <>
##$CPDPRG1= <>
##$CPDPRG2= <>
##$CPDPRG3= <>
##$CPDPRG4= <mlev>
##$CPDPRG5= <mlev>
##$CPDPRG6= <mlev>
##$CPDPRG7= <mlev>
##$CPDPRG8= <mlev>
##$CPDPRGB= <>
##$CPDPRGT= <>
##$D= (0..63)
0 2 0 0 0 0 0 0 0 0.06 0 0.03 0 0 0 0 0.0002 0 0 0 0 0 0 0 0 0 0 0 0 0 
0 0 0 0 0 0 0 0 0 0 0 0 0 0 0 0 0 0 0 0 0 0 0 0 0 0 0 0 0 0 0 0 0 0 
##$DATE= 1729582239
##$DBL= (0..7)
120 120 120 120 120 120 120 120 
##$DBP= (0..7)
150 150 150 150 150 150 150 150 
##$DBP07= 0
##$DBPNAM0= <>
##$DBPNAM1= <>
##$DBPNAM2= <>
##$DBPNAM3= <>
##$DBPNAM4= <>
##$DBPNAM5= <>
##$DBPNAM6= <>
##$DBPNAM7= <>
##$DBPOAL= (0..7)
0.5 0.5 0.5 0.5 0.5 0.5 0.5 0.5 
##$DBPOFFS= (0..7)
0 0 0 0 0 0 0 0 
##$DE= 6
##$DECBNUC= <off>
##$DECIM= 32
##$DECNUC= <off>
##$DECSTAT= 4
##$DIGMOD= 1
##$DIGTYP= 9
##$DL= (0..7)
0 120 120 120 120 120 120 120 
##$DP= (0..7)
150 150 150 150 150 150 150 150 
##$DP07= 0
##$DPNAME0= <>
##$DPNAME1= <>
$$ [...]
##$SW= 21.9926040160658
##$SWIBOX= (0..15)
0 0 2 0 0 0 0 0 0 0 0 0 0 0 0 0 
##$SW_h= 4401.40845070422
##$TD= 16384
##$TD0= 1
##$TE= 300
##$TE2= 300
##$TE3= 300
##$TEG= 300
##$TL= (0..7)
0 120 120 120 120 120 120 120 
##$TP= (0..7)
150 150 150 150 150 150 150 150 
##$TP07= 0
##$TPNAME0= <>
##$TPNAME1= <>
##$TPNAME2= <>
##$TPNAME3= <>
##$TPNAME4= <>
##$TPNAME5= <>
##$TPNAME6= <>
##$TPNAME7= <>
##$TPOAL= (0..7)
0.5 0.5 0.5 0.5 0.5 0.5 0.5 0.5 
##$TPOFFS= (0..7)
0 0 0 0 0 0 0 0 
##$TUNHIN= 0
##$TUNHOUT= 0
##$TUNXOUT= 0
##$USERA1= <user>
##$USERA2= <user>
##$USERA3= <user>
##$USERA4= <user>
##$USERA5= <user>
##$V9= 5
##$VALIST= <valist>
##$VCLIST= <CCCCCCCCCCCCCCC>
##$VD= 0
##$VDLIST= <DDDDDDDDDDDDDDD>
##$VPLIST= <PPPPPPPPPPPPPPP>
##$VTLIST= <TTTTTTTTTTTTTTT>
##$WBST= 1024
##$WBSW= 25
##$XGAIN= (0..3)
0 0 0 0 
##$XL= 0
##$YL= 0
##$YMAX_a= 810019
##$YMIN_a= -1236428
##$ZGOPTNS= <>
##$ZL1= 120
##$ZL2= 120
##$ZL3= 120
##$ZL4= 120
##$ABSF1= 10
##$ABSF2= 0
##$ABSG= 5
##$ABSL= 3
##$ALPHA= 0
##$AQORDER= 0
##$ASSFAC= 0
##$ASSFACI= 0
##$ASSFACX= 0
##$ASSWID= 0
##$AUNMP= <proc_1d>
##$AXLEFT= 0
##$AXRIGHT= 0
##$AXTYPE= 0
##$AXUNIT= <>
##$AZFE= 0.1
##$AZFW= 0.1
##$BCFW= 1
##$BC_mod= 2
##$BYTORDP= 1
##$COROFFS= 0
##$CY= 7568.61572265625
##$DATMOD= 1
##$DC= 2
##$DFILT= <>
##$DTYPP= 0
##$F1P= 17.9538593292236
##$F2P= -4.03888763876832
##$FCOR= 0.5
##$FTSIZE= 32768
##$FT_mod= 4
##$GAMMA= 1
##$GB= 1
##$INTBC= 1
##$INTSCL= 1
##$ISEN= 128
##$LB= 0.01
##$LEV0= 0
##$LPBIN= 0
##$MAXI= 945.577
##$MC2= 0
##$MEAN= 0
##$ME_mod= 0
##$MI= -402.1523
##$NCOEF= 0
##$NC_proc= 0
##$NLEV= 6
##$NOISF1= 8.587773
##$NOISF2= 6.764455
##$NSP= 1
##$NTH_PI= 0
##$NZP= 0
##$OFFSET= 17.49637
##$PC= 1
##$PHC0= -46.44487
##$PHC1= 14.20711
##$PH_mod= 0
##$PKNL= yes
##$PPARMOD= 0
##$PPDIAG= 0
##$PPIPTYP= 0
##$PPMPNUM= 100
##$PPRESOL= 1
##$PSCAL= 0
##$PSIGN= 0
##$REVERSE= no
##$SF= 200.13
##$SI= 32768
##$SIGF1= 18.5376
##$SIGF2= -6.396296
##$SINO= 400
##$SIOLD= 32768
##$SREGLST= <1H.CDCl3>
##$SSB= 3
##$STSI= 0
##$STSR= 0
##$SW_p= 4401.40845070422
##$SYMM= 0
##$S_DEV= 0
##$TDeff= 0
##$TDoff= 0
##$TI= <>
##$TILT= no
##$TM1= 0
##$TM2= 0
##$TOPLEV= 0
##$USERP1= <user>
##$USERP2= <user>
##$USERP3= <user>
##$USERP4= <user>
##$USERP5= <user>
##$WDW= 1
##$XDIM= 8192
##$YMAX_p= 0
##$YMIN_p= 0
$$ End of Bruker specific parameters
$$ ---------------------------------
##NTUPLES= NMR FID
##VAR_NAME=  TIME,          FID/REAL,        FID/IMAG
##SYMBOL=    X,             R,               I
##VAR_TYPE=  INDEPENDENT,   DEPENDENT,       DEPENDENT
##VAR_FORM=  AFFN,          ASDF,            ASDF
##VAR_DIM=   8192,          8192,            8192
##UNITS=     SECONDS,       ARBITRARY UNITS, ARBITRARY UNITS
##FACTOR=    0.0002272,     1,               1
##FIRST=     0,             0,               0
##LAST=      1.8609952,     10,              -128
##MIN=       0,             -1236428,        -1236428
##MAX=       1.8609952,     810019,          810019
$$ Real data points
##PAGE= N=1
##DATA TABLE= (X++(R..R)), XYDATA
0 0 0 0 0 0 0 0 0 0 0 0 0 11 -32 32 -32 32 -64 64 -96 96 -128 160 -161 193 -229 288 -321 384 -443 511 -577
31 -577 645 -737 833 -957 1062 -1196 1346 -1506 1675 -1865 2076 -2306 2549 -2822 3118 -3439
47 -3439 3792 -4179 4603 -5073 5592 -6160 6799 -7512 8315 -9227 10277 -11493 12931
60 12931 -14648 16764 -19412 22871 -27583 34419 -45315 65406 -115120 507185 499329 -253148
72 -253148 392943 810019 597530 215209 436919 424903 -72809 -385803 91154 384704
82 384704 -112619 -708297 -461974 12996 -101285 -501952 -365283 -30029 -153074 -454840
92 -454840 -201128 240478 95892 -396118 -300477 299763 496179 76604 -191647 -615
102 -615 154427 28998 46350 297807 290998 -90612 -242324 93583 365335 165230 -109439
113 -109439 -49376 105541 33631 -60294 61382 144256 -73759 -303322 -182296 71941 31221
124 31221 -223998 -298633 -155813 -76372 -114314 -96290 -30013 -60081 -118433 -25366 148028
135 148028 179531 80531 59155 152956 205071 167542 147775 166812 133814 54066 31039 56734
147 56734 22069 -71888 -115765 -93777 -85579 -100356 -95209 -104204 -165294 -191812 -98337 24329
159 24329 33454 -34375 -37831 31381 65702 51483 65896 100115 75991 19870 26713 73997 59593
172 59593 1770 645 32635 -4936 -79356 -66378 15455 31160 -26809 -32351 34594 49432
184 49432 -23099 -60959 -768 59729 42593 5049 1196 -8642 -40795 -36040 5612 1574 -56171
197 -56171 -71181 -19299 6162 -28278 -36439 18058 50079 11342 -19567 18539 64585 56107
209 56107 35076 47880 52688 19419 -3245 8117 -734 -38802 -36181 8453 -1462 -78625 -102625
222 -102625 -29501 20438 -26293 -68086 -16826 43657 18697 -20758 20350 77936 53508 5249
234 5249 27177 64485 27730 -18993 15001 55498 -1944 -77931 -41857 35537 2696 -90827
246 -90827 -76290 24581 34782 -55594 -71899 20979 59939 -8433 -36337 35798 70534 4904
258 4904 -29897 32370 64169 -4229 -46579 17762 59185 -16202 -80613 -15161 62251 7228
270 7228 -82205 -43511 52588 38153 -44017 -34169 44059 40652 -31757 -29700 44434 50092 -24297
283 -24297 -44030 17876 37568 -21244 -43060 11578 28999 -33988 -57883 14241 61520 1308
295 1308 -57963 -13783 54553 37744 -16347 -10493 29737 23237 -11350 -2749 28386 12075 -32174
308 -32174 -29257 10006 10266 -26597 -29883 1972 2414 -29994 -27192 17363 31640 -7923 -33057
321 -33057 -229 40536 32465 -866 -7410 8691 13934 8281 10488 11653 -3184 -16220 -7986
334 -7986 4835 56 -11316 -9906 -4364 -10066 -15540 -2428 16832 12538 -14039 -24979 -1558
347 -1558 26294 23487 -3755 -19848 -10348 9730 16876 5680 -10200 -13816 -4670 3196 3659 1148
361 1148 -119 -1163 -3019 -4304 605 11077 17167 7503 -9846 -12556 5694 23321 16301 -10203
375 -10203 -25035 -9810 14143 15129 -5967 -20440 -15587 -2690 3630 2196 -2718 -6630 -5800 -1477
389 -1477 3274 5627 6939 6006 1184 -4177 -1436 11430 19610 8453 -12285 -14358 5026 18532
403 18532 8089 -10798 -15352 -3989 6558 4815 -4488 -10280 -7285 -642 1937 -1642 -5709 -4443
417 -4443 1807 4013 -1860 -5517 1359 9974 7857 -1680 -4730 3244 11217 8701 -1549 -5523 2062
432 2062 8647 3541 -5389 -5763 236 1332 -4228 -8550 -6355 -1620 -262 -2045 -4667 -6408 -4489
447 -4489 3925 10206 3018 -9255 -5880 12225 17489 1336 -10165 251 13280 7604 -5512
460 -5512 -3482 6922 3619 -9455 -9149 3764 5859 -5346 -9293 -1953 -561 -5031 -134 8005
474 8005 -657 -16279 -8817 16461 19810 -6878 -21946 -826 21151 9387 -12844 -7384 12458
487 12458 10695 -5396 -5168 7881 6962 -5106 -4316 6633 5843 -3931 -2905 6267 781 -14148 -10352
502 -10352 9802 10900 -12845 -22005 583 17703 1430 -19969 -12144 9320 10392 -4807 -7210
515 -7210 5859 11124 1552 -4519 1598 6381 2837 2013 6153 4431 -3239 -2339 6870 6328 -7287
530 -7287 -12370 1988 14838 5728 -12897 -12317 5662 12193 -3350 -14894 -4622 9365 5149
543 5149 -8162 -8732 842 2223 -5885 -8442 -1518 2529 -1325 -1372 5078 4539 -4665 -3751 9918 13951
559 13951 1163 -3820 11705 21440 5356 -12844 -3850 15994 11377 -10068 -13195 3908 7690
572 7690 -9165 -16707 -6788 -4109 -14516 -13882 1529 4316 -10925 -13938 3189 10863 -4518 -11979
586 -11979 6468 21129 8403 -5701 7527 23989 11755 -9652 -3680 16681 16031 557 -2093
599 -2093 5820 1609 -7069 -1808 4886 -7774 -22985 -11249 12924 8551 -17736 -23497 -4168 2052
613 2052 -12180 -14221 2980 7242 -7781 -9896 7720 13352 -1883 -7213 7388 14323 4676 5536
627 5536 21181 19488 -5939 -11763 15197 26636 -1185 -22280 -792 22834 6579 -19769 -14213
640 -14213 1352 -8126 -21728 -7350 10993 -3118 -24582 -12315 12150 2692 -20482 -9008
652 -9008 19321 11427 -17218 -7162 29585 25683 -15944 -23163 15641 32142 1488 -16545 7941
665 7941 24509 1088 -17473 2768 17689 -4705 -20883 4373 24910 -1674 -29357 -7935
677 -7935 20563 1225 -31425 -15577 20624 11383 -25398 -21596 15399 17261 -19360 -26765 7953
690 7953 23049 -1295 -12242 11472 21069 -3570 -15099 9894 25002 3226 -12491 8899
702 8899 25776 2701 -22463 -5423 21437 7706 -23177 -18584 10777 12645 -12366 -18977 -1340
715 -1340 3535 -12141 -14810 2476 9782 -3289 -8809 5157 11815 -2536 -12190 1566 15778
728 15778 8048 -3502 3015 13903 5878 -9670 -7113 9494 13326 -1243 -11312 -3791 7313
741 7313 5319 -3764 -7470 -5221 -4824 -4411 516 4650 513 -7137 -6453 1086 3009 -3476 -6095 2319
757 2319 9215 3277 -4441 458 8682 2974 -8868 -4697 11667 14003 -1959 -12063 -1881 9350
771 9350 4594 -5508 -4988 -534 -3052 -3340 5451 8692 -4573 -15592 -5309 9315 4223 -8179
785 -8179 -3018 9667 5149 -9709 -7460 9217 10537 -6344 -11275 4630 13295 1331 -8068 -761
799 -761 5462 -1499 -4533 3861 5371 -5559 -7788 6878 12795 -3844 -16080 -3563 11978 4607
813 4607 -8737 -2653 9669 2115 -12327 -6584 9342 7654 -6753 -7200 3918 4199 -3881 -1157
827 -1157 7251 1081 -11741 -5471 12358 11186 -8458 -11303 7155 12772 -4320 -12695 2026 11547
841 11547 210 -8108 2030 8867 -2446 -10750 140 9928 -117 -10221 -1008 9195 -114
854 -114 -11232 -765 12431 1369 -15859 -7139 13938 11812 -8393 -11439 4630 9202 -3243
867 -3243 -6523 5784 8165 -4718 -7743 5724 9893 -3988 -10043 3461 10086 -3559 -11966 1647
881 1647 12652 335 -13328 -4051 11383 5623 -10669 -7978 7691 9428 -3231 -6322 2237
894 2237 3389 -3907 -2174 7900 5296 -7682 -9190 3993 8874 -1998 -8524 484 6890 -1894
908 -1894 -9623 -817 10196 4733 -7877 -6422 5045 7496 55 -2719 1585 2634 -460 196 3826
923 3826 2381 -3707 -3603 3497 5290 -2227 -7072 -2047 2509 -1212 -5557 -1438 3991 -38 -8262
938 -8262 -7237 2929 7636 1614 -6091 -4633 2327 5632 4253 2110 9 -1445 760 5985 7314
953 7314 1679 -3415 -1261 3782 3598 -1083 -2415 -186 -924 -4811 -4467 1478 3276 -3982 -10822 -6621
969 -6621 2342 4457 -926 -5549 -4801 -982 2668 4791 3470 -887 -3172 1198 7530 6988 1008 -914
985 -914 2529 4438 2171 1191 3215 2857 -2129 -4340 -102 4201 1452 -4677 -6858 -3835 -400 88
1001 88 -1395 -4235 -6811 -5289 654 3406 -1019 -5464 -3210 2508 3704 520 61 2581 3999 2422
1017 2422 2167 4783 5210 2996 1713 2827 3378 2401 2152 2083 -568 -3576 -2024 1206 -169 -5627 -7638
1034 -7638 -3641 -580 -3285 -6990 -5706 -1953 -1742 -3247 -2854 -890 452 1177 2311 2868 1710 2314
1050 2314 5458 7123 4366 1473 3462 7017 6331 1289 -496 2196 3655 182 -2957 -2393 -1085
1065 -1085 -2173 -4500 -5341 -4690 -3946 -3761 -4144 -5144 -5030 -3004 -234 175 -2398 -3149 535 4770 4481
1082 4481 1170 760 4053 6568 5555 3020 2863 4346 5051 3064 1137 1058 1789 888 -1525 -2970 -2570
1099 -2570 -1409 -1698 -3973 -6072 -5249 -2558 -1516 -3086 -4570 -4112 -1041 1393 1051 -1384 -1803 1421
1115 1421 4198 3495 1292 1267 3850 5004 2899 521 1669 3821 2666 -134 -939 819 1661 47
1131 47 -1933 -2770 -2427 -1399 -498 -1164 -2805 -3745 -1903 588 117 -3176 -3804 -418 2743 935 -1626
1148 -1626 -490 1887 1571 -594 -447 2542 3454 1034 -832 875 2610 1883 367 -11 308 -477 693
1165 693 2765 2150 -1860 -3481 -4 3229 544 -3963 -3312 1137 2258 -1488 -3499 -1251 -30 -2216
1181 -2216 -3154 208 1969 -173 -2301 -815 1134 687 -90 1179 2294 268 -787 3008 6141 2276
1197 2276 -3793 -2335 4037 4889 -294 -3096 -28 1923 -345 -2265 -928 -501 -2817 -3548 -581 2001
1213 2001 -32 -2532 -1551 -9 -1621 -1887 1818 3867 290 -3717 -334 5067 3944 -2268 -4083
1228 -4083 566 4081 2217 -293 323 1054 -654 -1194 976 1276 -1166 -1667 784 1945 -367 -1569
1244 -1569 180 593 -2307 -4062 -290 3825 1691 -3322 -3650 73 1575 -304 -1007 64 789 574
1260 574 1327 2305 940 -988 -400 1676 1457 -118 369 2230 1474 -2103 -2739 -37 1770 -604 -3005
1277 -3005 -1643 1017 1413 -196 -1074 -1503 -1470 -370 1508 2055 383 -366 488 1054 -504 -1746 -146
1294 -146 1740 683 -1591 -1005 1482 1424 -907 -2445 -1345 785 1695 1454 624 -192 -273 488 1147 341
1312 341 -1265 -1235 676 1444 -147 -1179 -874 -587 -1488 -2334 -1409 914 1763 193 -1010 -462 1157 1457
1330 1457 978 2 318 1289 2112 2106 543 -941 -1222 -504 -102 -820 -1475 -1110 334 -199 -2078 -2452 -510
1349 -510 943 27 -1256 -77 2387 2728 706 -929 -164 1221 1444 884 522 -10 -508 -97 623 -249
1367 -249 -2066 -1981 -53 843 -693 -1127 700 1977 -240 -2506 -906 2198 2280 -468 -1106 921 1509
1384 1509 -436 -1024 -287 -503 -1196 -150 1488 647 -1561 -1456 1374 1701 -846 -1643 1337 2988 661
1401 661 -1745 600 2411 448 -2573 -1854 820 728 -1111 -1150 -217 -1124 -2102 -686 1385 116 -2061
1418 -2061 -587 3023 2669 -701 -1114 2204 2924 -100 -1473 1265 2361 -442 -2661 -1115 722 -668
1434 -668 -2417 -1233 76 -1193 -1900 431 2140 -275 -2139 301 3597 2033 -1088 -311 2924 2438
1450 2438 -1039 -1467 981 1511 -1250 -2116 -187 768 -1329 -2501 -539 376 -808 -861 1415 2012 -678
1467 -678 -1675 1028 3542 1292 -1730 -598 2202 1498 -1380 -2135 502 523 -1880 -2130 -322 315 -1097
1484 -1097 -956 1026 1219 -436 -744 1453 2274 644 -340 1664 2959 418 -2140 -770 1511 422
1500 422 -2214 -2300 -229 428 -1260 -1969 -863 95 -265 -352 652 1100 254 462 2037 2554 686 -584
1518 -584 642 1738 296 -1096 -475 670 112 -2273 -2398 -270 788 -781 -1841 -1005 708 698 111
1535 111 264 660 513 624 1376 1451 162 -842 111 1233 629 -1536 -1645 -144 376 -1163 -1700 198
1553 198 774 -283 -1119 -66 1523 1216 -229 -196 720 917 456 201 379 -391 -868 -414 454 -482 -1885
1572 -1885 -1527 460 961 -517 -1257 187 1681 978 -152 499 1617 1512 426 695 741 279 -685 -683
1590 -683 -458 -804 -1603 -1284 -575 -1142 -1860 -1249 253 352 -813 -808 903 1999 1459 631 1052 1884 1549 973
1610 973 982 674 116 35 173 -13 -1141 -1489 -1046 -748 -1113 -1737 -1012 -160 -309 -926 -603 653 861 190
1630 190 -320 176 1077 654 445 80 -108 -95 447 565 -72 -824 -505 425 462 -291 -505 423 810 511 -220
1651 -220 296 702 411 121 -38 -82 -92 -352 -483 -844 -1072 -935 -547 -255 -891 -1181 -205 678 510 -346 -104
1672 -104 791 1316 810 348 541 1283 1162 553 151 143 194 79 -182 -343 -687 -859 -199 -123 -730 -1062 -576
1693 -576 288 96 -619 -426 441 822 201 -581 -81 259 567 -48 -307 89 61 76 -95 37 2 84 441
1714 441 563 283 -100 -41 765 650 -250 -334 308 615 124 -802 -501 -6 28 -539 -961 -415 -261 -339 -529
1735 -529 -408 -298 -234 4 213 36 122 443 845 790 259 186 338 801 533 -126 -131 413 390 -642 -815 -112
1757 -112 49 -185 -495 -455 -95 9 -110 -222 -212 -358 -182 429 645 -16 -189 72 675 338 -150 -229 193
1778 193 578 29 -299 73 336 158 -273 -418 209 386 153 -229 -94 -23 90 -111 10 -92 -421 -134
1798 -134 201 121 -84 -603 -78 250 -125 -385 -114 390 122 -89 -264 205 264 147 -135 -44 349 522 172
1819 172 55 134 -84 -104 141 174 -220 -303 44 388 56 -320 -572 -6 185 -446 -530 -145 428 11 -609 -328
1841 -328 157 667 138 36 423 300 102 262 300 69 -208 -4 531 507 63 -324 206 205 -217 -652 -262
1862 -262 136 18 -349 -524 115 62 -159 -546 -185 206 256 157 163 200 -95 78 456 596 -87 -137 284 648
1884 648 407 -201 -33 249 323 -388 -421 143 227 -81 -338 -259 -112 -227 -236 -255 -53 175 -103 -104 196 -114 -103
1907 -103 -60 566 253 -191 7 702 578 103 -61 54 313 311 -168 -28 142 265 -211 -344 -264 -218 -166 -199
1929 -199 40 -180 -323 -88 6 -29 -260 -368 229 449 -87 -139 166 581 221 -378 -208 209 350 23 42
1950 42 -129 49 -17 -52 -209 -104 -229 -91 213 -69 -150 -309 -15 161 -290 -179 -107 447 42 -115 -140 14
1972 14 192 15 -161 -74 159 74 -13 174 109 -91 52 98 -85 76 -262 75 116 -70 -285 -140 89 -162
1994 -162 -5 -130 -46 161 -77 -204 -304 168 205 120 163 68 99 272 72 -47 77 -58 151 53 -206 -126 14
2017 14 -165 -98 -254 -170 -27 -110 -161 125 -57 -71 -62 135 13 -133 148 280 351 187 -13 51 282 125 -143
2040 -143 -67 167 108 -22 -212 -44 -93 -264 -56 -10 -315 -387 -116 -43 30 -215 -277 -158 161 -161 24 265 144
2063 144 -97 -48 45 82 174 53 363 80 136 157 114 -69 65 -121 -38 71 182 -93 -195 -110 -16 -403 -140
2086 -140 7 -41 -49 -246 -248 32 91 105 -27 252 299 144 268 3 84 -45 66 275 246 -346 -218 1 288
2109 288 -137 -252 -133 -199 -25 -327 -285 -29 11 -207 -106 237 -93 15 -8 -82 -30 -67 22 319 -45 -8 -24
2132 -24 211 19 -22 33 -90 75 73 -44 26 32 126 97 34 81 144 -9 -4 -86 82 192 13 -49 144 -257 -73 167
2158 167 342 32 -61 -40 180 84 -70 21 -108 51 19 -54 87 26 46 8 47 179 -80 -209 132 223 105 -25
2182 -25 -3 175 32 -59 -298 -53 -20 -150 -61 -144 123 -51 6 -81 135 133 6 -26 11 24 -49 86 -98 -129 -212
2207 -212 26 108 123 -150 -165 163 171 -127 -13 5 82 47 -52 -316 -63 14 18 5 0 22 130 56 2 -192 -98 -18 254
2234 254 101 -104 33 152 133 -54 -161 -130 -33 94 -103 -55 -23 65 -74 -51 34 -23 68 94 -43 -231 8 -1
2258 -1 -33 -40 -108 -100 184 214 -213 -67 74 166 -35 -145 -127 -103 -165 84 -133 -114 -173 68 211 27 -159 -102 130
2283 130 -119 -118 -122 13 152 87 -123 -254 -49 167 81 129 -147 -85 176 74 122 -39 -118 62 140 103 -119 -36
2307 -36 8 350 -130 57 30 139 -24 -42 -153 100 64 -27 -110 -176 -4 192 -137 91 86 -133 109 100 58 -77
2331 -77 -248 20 64 -225 -162 -1 58 92 25 -116 36 70 101 -50 -42 -104 79 -63 118 19 -43 -44 92 69 -144
2356 -144 -203 -124 199 -54 -233 -36 166 40 -215 -163 226 71 -43 -157 4 52 -108 -103 -59 81 88 37 141
2379 141 -75 10 -172 53 221 -214 -258 -68 98 98 -252 -52 -4 222 4 29 82 201 101 33 152 -73 -28
2402 -28 37 213 -64 -4 -121 119 134 -49 -238 -193 203 61 -260 -164 95 203 -21 -217 -1 130 202 -164
2424 -164 -126 -117 -60 -35 -30 89 -108 -179 163 240 36 -205 2 331 16 -137 -298 -100 223 267 52 -162 131
2447 131 66 -224 25 132 16 -52 -12 120 -19 -26 120 -8 -79 -289 164 158 229 -75 -241 81 179 -30 -214
2470 -214 -132 243 49 -33 -156 -72 94 2 -79 -120 91 144 14 212 -55 -190 -306 44 156 -160 -263 92
2492 92 299 255 21 -256 91 201 120 -206 -22 135 192 80 -141 -141 93 -6 9 -99 123 -194 -15 -13 -67 -225
2516 -225 -108 126 390 -33 -407 141 161 -7 -388 -239 39 -8 -112 -279 168 236 87 -73 66 2 188
2537 188 19 15 18 -154 -118 -16 165 -86 -238 73 169 202 -152 -251 129 163 -107 -189 66 335 50 11 39 -3
2561 -3 -8 -141 -184 -143 -171 30 -14 273 -248 -232 6 56 231 -271 -334 252 362 41 -299 -233 246 72 -131 4
2585 4 202 271 13 -171 -70 4 -66 -71 122 63 -239 -223 87 57 -421 -466 53 166 17 -183 -127 90 88 -53 -218
2610 -218 250 141 192 153 42 123 97 -2 -64 -97 -120 116 198 -119 -90 -261 10 152 -96 -450 -165 217 17
2633 17 -18 -120 -105 38 51 70 86 -2 164 -18 -77 72 -55 -76 92 106 -193 -171 88 238 139 -128 -185 188
2657 188 165 3 -98 -43 69 -4 -221 -252 -219 145 -37 -91 100 133 -94 83 -160 -79 -28 18 301 113 -63
2680 -63 -90 224 83 -85 -177 -20 249 -11 56 -75 159 239 4 -80 -88 -124 162 -14 -141 -102 -85 102 -234 -37
2704 -37 -228 -139 -42 72 -49 -131 -78 87 36 91 -198 -113 141 107 -48 26 104 99 208 -73 -164 89 148 50 -98
2729 -98 -92 -69 -105 -9 -37 -216 -30 -117 113 114 -43 -237 56 81 131 -133 -42 242 159 -103 -215 209 235 154 -284
2754 -284 -293 37 143 -109 -32 -215 14 -91 -58 -31 -72 -80 192 160 51 -27 -110 166 211 -95 -289 43 142 166 -226
2779 -226 -145 212 239 -9 43 -122 -18 4 -144 -48 60 -50 43 184 41 -77 -150 108 90 -93 -309 -147 208
2802 208 37 -285 -340 96 290 -11 48 107 185 166 -26 -60 24 253 87 128 -17 -106 -34 160 162 25 -187 113
2826 113 277 69 17 -133 163 251 -219 -208 -127 -21 120 33 -13 52 -13 80 -31 -28 -25 -218 106 16 -184 -328 -3
2851 -3 85 80 -285 -144 112 258 35 -282 -2 -100 169 -49 -51 -243 61 9 58 -183 -139 -192 130 19 -217 -226 39
2876 39 111 44 -124 165 204 203 52 44 164 326 148 44 100 -116 -164 47 -33 -163 -81 -142 -114 -167 -184 -147 -48 48
2902 48 -124 -207 -27 169 167 19 17 139 44 162 221 28 33 76 182 155 -96 -44 -46 20 -86 -170 -284 176 63 -13
2928 -13 -268 -90 113 168 -138 -285 -200 114 -72 -109 39 -148 -85 -67 90 -185 -119 15 172 -157 -79 -138 133
2951 133 305 -4 -176 27 254 152 -152 98 -147 101 -126 -121 -157 -159 147 94 189 -173 64 209 266 63 -164
2974 -164 -138 -27 296 -21 -204 45 -159 33 -94 -56 65 102 -20 -27 -376 -83 -8 -6 4 110 -2 81 245
2997 245 4 -160 188 199 251 0 -80 -55 -37 -84 -149 -328 67 -62 -76 -111 -87 -292 -18 37 98 -140 91 273
3021 273 151 -205 -103 81 158 78 -156 6 18 -67 -67 112 -163 -57 166 1 -216 -184 -110 5 76 43 -344
3044 -344 -89 141 24 -87 32 20 341 -130 -346 -157 60 110 -178 -124 -6 -5 41 -32 -41 21 -10 -30 227 30
3068 30 -272 -78 146 176 -222 -386 -76 137 145 -176 -195 28 150 -11 -247 -183 -34 -59 -81 -7 -108 84 -7
3091 -7 8 -85 -126 -231 103 54 -87 -255 134 247 -51 -346 -412 341 293 187 -225 -159 -26 84 -27 -127 33
3114 33 145 -19 119 56 -17 -378 5 118 -125 -332 -140 89 254 -245 -371 15 360 60 -105 -84 239
3135 239 202 -160 -234 100 -106 65 92 -74 -63 6 -23 229 -62 -367 12 113 145 3 -144 14 424 166
3157 166 -181 -61 300 183 123 -99 71 46 -45 -158 -184 -210 46 -77 -111 20 37 -81 -43 73 30 -210 162
3180 162 350 176 -92 -163 209 340 147 -190 -131 294 346 -11 -202 -55 -19 -125 -164 -79 -217 -229 -150 114 -90
3203 -90 -241 -143 85 131 45 -199 164 470 -141 -117 -162 236 281 196 -72 221 367 102 -37 -28 13 6 -137 -58 21
3228 21 -114 -174 157 78 -98 -284 -23 321 -57 -263 -49 225 245 -178 -223 -34 197 99 -88 81 148 55 39
3251 39 -88 -39 -23 146 262 -71 63 -160 52 54 -72 -429 -144 273 322 -138 -177 -204 243 133 -72 -210 190
3274 190 164 174 46 -178 87 193 88 3 10 -152 0 265 233 -294 -272 201 126 -94 -235 -125 132 109 -158
3297 -158 -256 2 85 144 -179 -140 117 -31 -40 -59 -2 -174 141 101 125 118 -145 -51 217 43 -94 -2 65 109 -160
3322 -160 1 59 62 -4 -86 -34 77 84 -33 -203 -41 -143 -36 -98 -195 -218 -200 64 103 -255 -387 31 263 252 285
3347 285 -46 257 165 147 2 -13 189 216 293 -67 -204 -138 -51 -40 -282 -128 -116 -102 -57 -244 -190 40 98 24 -152
3372 -152 -107 160 179 247 96 26 9 220 87 220 -69 -139 273 158 -164 -329 25 196 -5 -118 -325 73
3394 73 10 -33 44 -176 18 8 -5 -141 -29 10 -37 61 -97 -106 45 225 271 11 -85 -31 233 198 -57 -111 -40 27
3420 27 27 -105 -225 -14 -103 -60 -142 21 43 -176 106 -59 -181 -7 186 83 -44 -89 38 335 295 13 24
3443 24 12 263 64 -20 16 36 -73 28 -300 -138 -141 5 25 -105 -27 79 15 -1 -89 -167 139 115 158 -108 -82
3468 -82 240 250 90 26 186 268 -2 72 -164 -145 107 -125 -84 -223 -100 -104 107 105 -68 -76 74 158 -31 -133 73
3493 73 55 28 57 -6 -158 167 54 -140 -20 137 168 90 142 11 41 103 239 38 -160 7 -34 272 77 -224
3517 -224 -197 -197 15 -112 -213 -434 16 83 -88 -200 -213 -42 224 100 -130 30 148 211 69 -90 98 229
3539 229 172 62 -134 26 180 224 -100 -160 8 -144 37 -411 -338 3 38 97 -202 -25 -41 -29 150 -129 -193
3562 -193 -26 197 264 -81 -144 -26 256 131 82 -54 175 351 136 -31 105 -71 -81 164 31 -106 -101 -1
3584 -1 58 -2 -65 -112 -76 204 97 -47 -105 231 253 113 33 139 137 46 -30 144 200 92 166 -173 -56 65 33 -145
3610 -145 -85 27 -103 -148 89 52 -148 45 62 -6 -273 -83 20 313 30 45 19 145 265 205 -76 68 211
3633 211 163 24 -69 -106 45 33 -74 -26 -15 -8 0 15 -48 -199 -141 144 203 70 -250 74 232 15 -101 -165 7
3658 7 118 64 -243 67 68 119 -61 -83 -140 -84 -107 175 -28 -467 -157 -55 238 -96 -200 -215 209 -2 -86 52
3682 52 293 135 7 -95 -98 136 99 -88 -105 68 38 45 -15 -74 -5 -69 39 245 -29 -160 -54 103 149 59 -227
3707 -227 -78 216 182 -283 -197 161 222 -38 -90 -192 72 82 2 59 -59 25 -13 -184 -38 19 -76 205 48 23
3731 23 -108 -1 266 161 -36 -155 78 159 45 -29 9 225 110 -158 -148 56 57 -99 181 7 -36 -8 118
3754 118 29 110 -27 -48 99 111 -108 -110 -111 365 117 -186 -245 183 158 -181 -141 55 -36 -52 -18 65 -77 68 93
3779 93 225 -70 -223 -215 81 284 140 -111 12 45 68 -85 -286 292 148 22 -145 -19 131 119 -58 17
3801 17 81 -28 61 87 16 -35 -25 2 84 -3 -193 11 71 281 -65 -264 -117 174 196 -289 11 188 56 -12
3825 -12 -93 -83 -230 38 63 -35 183 66 46 226 -118 -140 -85 126 46 47 -241 75 98 -101 -38 -142 11 32 15
3850 15 -139 83 101 -22 -90 59 -161 70 36 -33 51 34 -23 8 28 -60 32 -25 57 131 10 -115 117 111 163 -263
3876 -263 160 86 64 -116 65 -196 42 24 -330 -211 -81 -74 -39 85 14 -71 -185 -131 152 -159 -87 164 197 92
3900 92 -141 -128 229 184 -101 -10 -47 49 227 140 -184 -5 -40 -88 -132 -45 -152 -239 24 -107 -119 -188 18 -17 22
3925 22 23 190 143 84 213 -106 -62 63 210 -30 -179 222 12 -105 -59 149 12 -39 126 121 -152 68 48 136
3949 136 14 -172 1 107 -49 -94 -88 -35 119 138 50 -171 -30 148 -79 -102 14 68 182 -188 -71 -44 -158
3972 -158 117 63 62 3 17 28 59 16 -103 -93 120 116 -20 25 -86 -75 79 -62 4 -123 -20 26 -86 -167 -65
3997 -65 -104 -5 108 42 34 84 259 35 -183 102 121 255 29 -2 5 -1 41 -77 -30 145 314 125 -120 -252 -11
4022 -11 54 -30 27 -114 -75 -40 59 -68 -174 58 -32 -12 -252 -210 140 136 67 -175 -74 -11 76 158 96 -69 104 230
4048 230 51 65 -15 184 -40 133 -79 49 40 101 20 137 -161 73 254 -115 -169 68 -66 78 232 -151
4070 -151 -56 66 25 3 -100 -137 37 137 45 -95 -225 1 98 7 -38 -224 127 261 -4 45 60 -55 88
4093 88 -16 -73 -56 -143 390 -84 -18 -127 -50 192 56 6 -74 -63 61 18 44 -66 53 -4 231 -125 -158 -49
4117 -49 71 139 42 -152 114 105 75 32 -19 -75 40 -72 -141 -171 30 60 -153 82 14 -43 47 -19 62 -125 -101 -137
4143 -137 65 60 -66 223 247 -76 62 -110 -121 157 64 15 135 178 97 77 -68 69 163 157 3 -37 11 203 100
4168 100 102 93 -99 -57 41 92 -159 71 -53 94 -33 -37 -56 -9 39 -62 18 -287 -161 60 -54 -71 -34 16 140
4193 140 99 41 13 -44 -56 50 128 -109 259 288 83 10 -151 -55 132 70 -47 9 -10 112 -8 51 -96 87
4217 87 126 138 17 105 23 121 114 67 18 -130 222 16 -38 82 55 97 103 -184 -227 192 -7 -216 -163 132 43 -51
4243 -51 84 18 56 -274 55 44 154 95 -85 97 -65 -53 -167 -97 67 128 19 -124 125 -10 -117 -145 -68
4266 -68 5 -187 20 106 114 -110 44 199 -126 -117 104 -32 87 155 28 94 -116 106 -215 62 142 156 -30 -68
4290 -68 59 308 91 31 -195 99 72 -52 126 -16 -53 -12 32 -42 -91 -120 -15 54 53 10 -38 173 58 44 -121
4315 -121 17 44 64 -24 -83 -71 59 18 -19 -127 141 90 -25 -16 19 -31 72 93 240 -6 4 20 292 55 37
4340 37 61 101 88 -8 2 44 -120 -116 -48 7 34 7 -49 -91 -20 179 1 116 -181 -43 -86 15 216 170 -9 -5 -7
4367 -7 5 13 -93 -16 41 181 -104 113 13 158 -99 -186 82 84 198 9 12 -29 -2 -156 -11 -126 -7 -102 17
4392 17 71 88 -14 -52 70 184 -99 -113 -64 43 120 -164 -271 -112 58 102 -43 -22 -89 8 162 31 63 -26
4416 -26 113 184 32 72 -37 140 -12 11 -109 157 166 114 116 -66 -32 11 -35 -69 54 -35 -164 117 -145 95 139
4441 139 31 -41 88 -113 -128 33 80 93 -68 -9 -116 84 -204 -89 125 92 -24 -90 236 -54 80 53 5
4464 5 -25 67 28 57 71 -18 -58 78 30 -47 -176 18 103 159 -40 -53 -127 67 72 -133 -151 54 10 -56 -30 61 41 8
4492 8 27 9 201 93 49 88 1 -67 -44 81 152 52 -55 80 201 -50 78 -184 24 84 -41 -31 -151 -209
4516 -209 108 10 -17 -140 74 -40 -20 -66 13 -44 -64 -23 -62 8 -212 141 -30 -50 -145 81 51 -28 -116 -121 -17 180
4542 180 -38 -130 -30 -27 79 5 -17 9 -101 24 -69 63 -52 64 -83 8 -128 -79 -58 36 -18 -237 76 -79
4566 -79 -79 -14 -81 -55 -120 121 -61 -127 -130 163 10 97 115 -60 44 -140 229 136 28 -73 71 176 -141 -127 -33
4591 -33 -71 165 -109 -173 67 19 -32 -132 28 35 -109 -31 -8 19 -163 -23 31 51 -46 -100 18 -102 -199 -169 -42
4616 -42 -187 130 -17 -146 42 91 63 -114 -190 -124 68 139 -64 -91 93 74 208 49 46 53 104 87 35 -73 -126
4641 -126 -30 144 -165 52 78 179 -8 -182 -42 9 -73 -163 -38 -66 153 112 -5 -112 10 218 197 -87 47
4664 47 -4 179 101 -86 132 160 23 26 -54 160 22 -168 39 -83 -20 -24 121 64 15 -24 -31 13 30 45 -263 -109
4690 -109 -44 3 65 -111 81 192 -22 150 -81 -53 22 -66 49 -91 -55 122 -102 -58 -217 80 106 -14 -44
4713 -44 67 -15 -66 114 -45 11 35 -21 179 72 -26 -85 -6 47 -1 -145 -114 -57 -45 100 -17 -178 145 131 67
4738 67 -90 64 37 -20 47 -36 26 141 1 -117 21 4 28 -30 10 -158 1 136 96 -203 80 -5 183 -150
4762 -150 -112 -89 -144 117 179 22 -142 -9 -8 54 -115 -40 105 54 -65 -37 17 -79 -33 14 90 31 -77 200 -157
4787 -157 -182 -151 64 46 17 36 115 -34 -145 138 -21 93 63 46 -66 189 -48 73 46 136 8 -141 -50 -85
4811 -85 -16 105 -170 19 14 117 -2 -70 71 -53 1 -17 180 59 -79 -62 208 -72 -50 -24 91 -214 4
4834 4 93 140 11 -39 -77 46 -115 -32 -100 -18 36 99 -18 -97 10 49 20 -55 116 117 -1 -131 80 -18 69 83 -144
4861 -144 52 -80 -212 -82 144 -93 -91 156 -15 64 63 -72 99 127 -54 145 -148 52 9 -91 24 -21 -40
4884 -40 75 152 43 38 -48 93 -6 98 20 -184 128 6 -36 -118 -66 189 -48 49 -109 106 -62 -51 63 77
4908 77 -19 122 -96 131 69 -190 -217 40 232 -46 -47 -44 12 86 -119 -47 -80 57 112 -126 -84 -37 9 86 -29 233
4934 233 -30 -131 -19 39 -27 38 71 -58 -34 -44 106 173 144 -55 -106 11 5 46 -45 113 105 -106 1 -232 69
4959 69 -15 51 -174 -41 -9 19 -28 252 -8 -72 27 46 -73 -12 -172 -15 -52 -20 -211 9 144 208 -123 -79 21
4984 21 83 27 10 169 6 -16 205 61 16 132 -87 -74 -11 40 -110 105 -28 -49 -101 -37 125 104 132 22 -32
5009 -32 32 -24 -145 -86 -35 6 91 132 58 -72 84 -3 136 22 -80 -33 99 -3 54 -17 -23 -45 -60 -94 -108 7
5035 7 -133 -34 195 -111 115 71 -149 172 82 110 7 62 160 -33 -152 48 55 -123 -49 70 129 55 -231 -156 85
5060 85 182 187 -20 -71 -15 66 -177 -37 16 66 -31 -159 32 -8 -12 -29 -34 90 -188 -17 150 -43 -64 -86 -146 184
5086 184 12 -188 -24 62 -96 62 -81 -110 184 23 -127 -96 185 -35 -88 38 -23 -106 -37 179 24 59 32
5109 32 3 131 0 -46 -66 180 -27 -125 -71 -36 173 59 -1 -45 87 60 147 32 -94 -23 48 -123 44 -46 -233
5134 -233 10 171 -24 -134 -8 91 45 -59 9 -214 31 -36 78 -116 50 63 -137 -50 52 42 151 164 -112
5157 -112 39 57 -234 69 207 -137 -2 61 58 1 25 -60 -19 59 -111 91 -4 160 91 56 -34 -126 105 -98 155
5182 155 27 100 -64 12 -31 -75 39 -19 52 24 -134 68 143 78 44 105 -69 35 -8 -108 -169 -64 -60 42 -197
5207 -197 200 73 158 46 174 -14 -162 -85 -39 45 -197 -144 18 64 -68 -52 -208 194 38 -127 -100 36 -202
5230 -202 80 90 12 99 -15 88 16 -69 0 49 -93 -28 29 83 117 151 21 67 -58 -67 78 -80 -56 -81 93 -9
5256 -9 -56 -97 159 217 132 140 -96 8 -84 -32 54 -50 148 -38 -106 5 158 35 85 26 -117 100 -25 252 -108
5281 -108 -52 48 -29 180 288 19 -133 -103 -5 77 -92 -22 -25 19 210 27 -39 85 -26 109 -61 -69 -45 -56 -167
5306 -167 -256 -33 71 95 -47 177 -108 -12 48 -10 4 -31 79 -114 -90 168 -50 38 -150 -13 -35 -107 22 100
5330 100 -105 -169 -143 -46 185 142 -54 -142 -67 75 -39 115 196 198 -49 73 -54 -48 237 17 -14 -5 -172 17 93
5355 93 -148 1 -12 155 16 -33 -3 18 7 146 -21 -138 159 70 -7 -73 81 93 -91 5 -130 104 -151 64
5379 64 28 132 36 25 228 216 -99 -102 -68 64 163 -202 56 124 115 26 -39 -102 -78 -214 -34 58 3 168 19 -11
5405 -11 -32 -137 -244 -70 90 88 50 -46 -152 95 98 -124 -91 7 48 41 31 -18 -79 -83 19 -132 -24 -24 95 -27 -50
5432 -50 -148 150 35 31 -99 -187 14 61 -137 194 90 -151 -115 -31 156 27 -82 73 148 104 52 9 115 23
5456 23 -107 77 134 94 49 290 -89 79 106 114 77 -11 -35 165 -10 -157 -50 48 -90 -23 -53 -148 32 128 24
5481 24 -122 -119 -8 -79 -30 -197 43 50 -29 -93 -36 -73 42 -56 65 -209 72 52 86 72 -124 42 -26 64 -93 -28
5507 -28 -40 101 93 143 130 -27 61 130 191 -78 -21 70 33 171 10 -74 126 64 8 -14 29 76 35 114 76 24 -13 -247
5535 -247 -158 111 300 68 -35 -46 -244 -57 70 54 -67 -103 -102 -16 -102 -16 37 -29 22 8 -49 -41 130 -111 -83 -48
5561 -48 -14 117 60 37 -8 181 3 104 -31 6 49 -153 101 86 9 -199 -135 -2 81 -25 -72 -71 197 -114 11
5586 11 -54 -35 23 12 -33 -129 119 153 58 -18 -200 -87 33 22 -174 -56 -6 230 187 48 -156 74 115 85 -16
5611 -16 -130 -104 153 33 -198 -72 -26 116 33 0 12 -36 -67 -109 -23 -144 47 -93 -52 -139 0 -4 25 107 -152
5636 -152 -72 81 35 67 17 -65 18 -174 -91 -110 40 -14 27 -158 167 -59 -10 -10 81 40 -79 -25 -123 160 -341 -1
5662 -1 108 -49 -8 -197 76 -16 -54 65 194 15 14 -8 156 143 63 -99 159 32 133 -136 -118 -68 144 9
5686 9 -198 -154 21 137 -188 73 -34 14 -120 -61 100 37 30 162 46 -151 47 138 173 -35 -3 45 96 53 0
5711 0 -40 -26 35 -11 86 -102 119 -124 -121 -156 70 118 37 -16 31 -127 43 44 116 -7 15 126 35 74 -28 -21 60 88
5739 88 15 -13 -174 36 -8 130 32 -83 -19 10 -164 -94 64 25 41 -200 25 -79 -17 -40 32 -133 -128 91 275
5764 275 -125 -110 61 80 -97 112 11 -4 -93 4 56 -263 29 84 75 38 -117 -46 87 -40 -29 41 -90 21
5788 21 86 74 24 -33 -13 30 -9 -20 19 51 -131 149 113 -42 3 -96 -16 -52 -72 86 15 37 23 -103 -146 39 1
5815 1 2 -264 -102 125 84 99 197 -29 -73 11 -96 25 38 38 37 139 6 8 156 12 -186 70 16 -11 9 113
5841 113 65 -96 139 -90 -154 -46 -45 33 29 -21 46 81 -42 33 106 -20 54 83 -175 18 -84 30 -36 -16 -125
5866 -125 46 262 48 -97 58 -56 56 -18 80 -50 188 134 -65 108 -190 -68 111 17 -38 -13 -45 127
5888 127 -78 -89 34 23 207 117 32 112 144 39 -74 -23 -195 76 61 144 -72 -35 -8 186 77 16 75 -115
5912 -115 59 -67 137 -101 -133 181 171 5 -119 69 24 22 -232 149 -43 40 33 -4 -39 103 -77 108 73 36
5936 36 -117 -48 118 -47 46 0 -20 59 18 -45 78 117 2 44 -19 -112 -93 105 -81 -63 90 -128 -30 -95 65
5961 65 221 -177 -24 86 94 -2 -29 53 171 113 -346 138 33 -40 38 126 31 -21 23 -166 47 101 43 192 7
5986 7 179 36 51 155 117 63 76 -20 -76 61 198 -12 -34 5 7 42 9 130 -8 16 -7 -10 -145 -23 -135 43
6012 43 77 -69 68 -10 44 55 6 -1 -55 -54 -4 -75 -8 -152 42 25 62 77 -77 -6 150 131 136 -130 93 -36 -224
6039 -224 -62 -76 37 -5 77 -80 108 71 -37 -170 33 -80 136 -81 -71 -259 -55 11 37 8 -31 -56 -196
6062 -196 -57 -71 135 -15 -23 -41 35 68 61 -110 -27 161 -77 -136 -143 208 -93 -67 -9 52 -41 -5 64 -30 53 121 -138
6089 -138 89 -55 12 70 241 106 81 83 25 159 -54 -6 -84 -75 -57 -3 9 -24 127 -23 10 62 -25 72 47 -105
6115 -105 50 10 -17 -161 54 -88 -53 161 -166 0 62 -14 -132 79 62 90 3 391 -64 -24 21 -106 49
6138 49 -101 63 38 247 -5 111 1 90 -94 45 57 15 21 35 262 -166 -79 -48 102 -36 -14 -65 -26 -175
6162 -175 46 73 -8 -16 -15 -75 -3 -12 -74 -31 37 117 86 -70 77 -91 56 22 -35 -87 91 317 -207 -91 31 82
6188 82 -48 -55 19 -75 -50 53 -51 169 -132 -106 -57 -102 13 117 -7 61 69 131 -99 117 -79 33 113 -87 177
6213 177 216 -89 -124 -4 -147 -23 25 -116 -22 148 36 17 66 -10 74 110 33 20 -42 -125 48 -147 20 83 -142
6238 -142 -142 141 103 -109 175 39 193 76 -44 -28 -14 111 71 -81 11 25 -91 151 -40 -119 -65 80 -31
6261 -31 -50 -46 -89 -96 -2 -80 -48 87 -17 84 -59 -54 -34 -35 6 142 36 -38 69 153 -37 -11 -123 -62 56 -4 112
6288 112 -38 73 -75 218 167 79 141 -84 25 27 -44 -56 -16 -107 70 -48 -6 45 80 128 -31 98 20 204 17
6313 17 1 -78 -58 101 17 54 -101 189 44 15 -12 -13 42 -30 3 -117 -151 -57 128 -39 126 -3 20 105 45 -11
6339 -11 -34 67 166 -27 -88 54 -24 33 -7 -46 18 -245 -93 83 67 122 -65 160 37 -91 -70 -156 -12 -157
6363 -157 67 -21 1 -43 139 53 -22 5 260 -44 -25 -43 104 86 -35 -147 -59 101 -22 -57 -142 27 28 77 70 -12
6389 -12 -59 0 -32 133 -13 26 -57 64 -136 -154 96 -34 157 30 111 43 156 -5 11 -84 -28 -5 -28 46 -25
6414 -25 4 -17 -3 136 -114 86 151 -113 -63 -74 -86 -98 -32 -66 56 67 82 -143 15 22 40 79 -20 17 -86 60
6440 60 -30 -23 -65 58 48 16 -34 -46 -7 -22 -43 -6 -21 -79 110 -87 89 -63 146 -1 138 1 -27 -101 104 83
6466 83 11 -59 -40 -111 53 -180 -136 95 24 113 68 108 -59 -86 78 -63 -46 -65 48 -297 19 175 -80 94
6490 94 -14 11 22 24 -117 50 206 181 -186 -26 134 18 -79 6 1 142 -102 118 105 -152 85 -31 -42 47
6514 47 -360 96 125 31 44 42 73 200 -23 25 -148 -56 -155 -253 -15 -46 -86 19 83 98 -133 -156 23 -21 145 -51
6540 -51 -31 112 -1 -80 -49 113 135 117 158 37 -139 154 -273 -70 36 60 -36 -27 -34 7 136 -8 -90 65 32
6565 32 -140 -193 -23 90 -119 -57 -25 45 -59 -29 97 47 17 -65 -134 71 34 -22 5 -76 29 -25 5 24 -13 -121
6591 -121 -90 137 110 6 -46 -123 -21 -68 66 -79 173 128 -21 146 150 -41 8 49 -79 39 61 117 -144 -98
6615 -98 265 -158 -3 71 -56 -67 -119 4 18 73 67 40 33 -33 -82 -104 -16 -60 31 -65 -81 6 -27 61 28 -43 -16 -28 13
6644 13 -96 11 201 -22 54 56 -60 2 183 -130 99 48 159 77 -105 -81 98 -128 -77 -39 -102 159 186 -169
6668 -169 -24 58 136 -68 159 76 3 -103 86 32 -21 -97 9 52 -98 26 115 -24 56 70 -174 44 -129 78
6692 78 96 72 -123 116 36 -64 181 -231 3 -16 -118 -57 -126 41 121 155 124 -11 159 83 52 -84 -51 79
6716 79 2 -201 -14 -328 -91 -16 49 53 -93 -134 -42 -22 317 57 -14 -17 48 87 -27 -61 23 -140 28 -108 -12 114
6742 114 -50 -111 -64 115 3 -30 99 52 -47 -70 260 114 -83 38 96 -34 -55 -92 149 4 82 15 62 -47
6766 -47 77 -81 -48 136 108 222 -17 242 3 -110 -44 -173 52 142 43 254 -17 36 -145 61 -107 56
6788 56 162 -68 229 174 81 -5 40 92 74 -57 -86 -49 35 98 -35 -172 -131 -32 127 105 85 -86 -182 218 52
6813 52 58 -24 92 181 12 16 83 148 32 147 -111 63 14 46 -126 -60 43 -145 -25 -60 -57 -70 75 -2 -149 -125
6839 -125 27 -136 52 15 -118 29 24 223 5 -47 161 112 -123 103 -111 54 119 -18 -33 120 115 10 -79
6862 -79 -101 132 -28 -32 -136 55 -42 -37 -22 2 37 52 -89 28 -12 107 84 16 -128 69 -86 -99 10 -53 -29 -219
6888 -219 -55 -125 -35 -58 10 111 -54 11 -91 -104 -45 12 114 151 40 -179 21 195 245 -119 -48 82 134 -97
6912 -97 -54 66 16 100 -24 25 139 2 264 132 -1 -26 -28 153 27 133 -91 61 27 -31 -57 -192 112 145
6936 145 -65 -131 4 -18 99 -108 67 -50 30 79 -49 13 -42 -4 37 0 25 32 -85 29 27 150 -255 41 21
6961 21 156 -6 -120 200 -56 139 -56 31 29 173 -161 -42 -26 60 49 -52 36 110 -5 94 90 25 -105 12
6985 12 -55 28 -86 -81 -116 -159 -79 -53 -71 -4 -79 -54 -32 86 52 22 154 12 114 47 -9 10 184 -30 -138 57
7011 57 185 40 -21 63 65 37 58 51 67 31 24 -75 118 107 -24 44 0 -25 -1 -65 -158 -77 35 176 84 -56 -19 96
7039 96 182 97 -26 -66 100 -85 -34 109 -50 -170 -96 -50 -62 3 17 30 15 73 59 165 121 -22 147 54 142 11
7065 11 124 -47 -58 114 9 37 -102 -160 -91 223 -132 -19 54 25 -75 26 118 139 25 -32 33 -217 -173 -29
7089 -29 55 180 87 102 32 -26 204 88 -76 65 -49 97 16 -248 -31 20 4 -59 -3 -130 66 94 -164 -119
7113 -119 49 26 5 224 44 23 58 -37 -52 10 -150 -43 -26 82 -110 73 -23 144 -13 99 29 -60 144 22
7137 22 -13 -46 49 66 49 -26 151 135 63 46 -97 38 -104 -60 -71 -155 81 64 -78 -44 -71 82 -5 89 -12 -172
7163 -172 113 -3 -143 -47 -2 18 0 158 10 -56 -27 164 43 16 90 -86 -35 153 80 73 16 67 87 127 -39
7188 -39 -23 -161 -167 -16 22 -11 -237 -34 -54 -80 -85 -5 -81 -21 49 -168 -23 -61 -36 -16 5 87 -210 -63 116 -48
7214 -48 -95 26 -5 -144 -35 -103 75 -58 -3 -90 -11 71 71 153 47 113 217 155 -80 -118 79 -33 164 -102 107
7239 107 51 -20 -85 40 31 -29 42 -95 -23 -12 11 -68 211 -39 151 -176 6 7 -15 -16 -68 186 44 -62 -48 156
7265 156 -65 139 94 165 -38 -131 -203 100 98 56 94 -106 52 158 -28 62 -114 98 24 -14 102 96 75 37 -119
7290 -119 249 -111 -49 -152 84 -53 107 -109 -50 136 -155 215 182 63 -63 5 -109 103 -143 -34 2 83
7312 83 -105 146 35 9 -7 -64 85 -123 -178 -93 -112 81 139 -3 -248 -148 106 74 -60 139 115 115 -4 -44
7336 -44 116 25 221 54 176 61 28 105 -25 -53 -93 28 -59 103 -86 -329 126 -57 -136 -124 -54 28 39 -106
7360 -106 -23 41 10 13 69 150 -77 -74 103 112 -23 -73 9 -10 94 -227 27 3 47 -32 160 66 -181 -40 78 -98
7386 -98 82 -38 117 -23 39 51 34 -8 50 -7 64 19 -20 -176 -3 -193 84 -129 0 -159 2 -122 -40 -102
7410 -102 -123 163 -8 -58 69 32 -46 20 -200 -35 -7 158 -64 -47 105 139 -106 97 87 -2 -150 -175 -138 -3
7434 -3 -57 -205 7 57 46 78 3 34 3 -52 108 -16 11 89 -189 83 -1 47 -47 7 178 90 6 16 -118 100
7460 100 40 -33 60 111 23 -249 67 -55 41 -7 -107 96 184 -17 153 222 23 16 8 90 59 18 15 56 71 -13 -12 -29
7488 -29 16 85 -10 -103 78 125 -6 8 -80 11 -268 3 -49 -1 -98 -168 -19 258 -133 -21 -91 94 1 -85 -115 124
7514 124 138 -28 -66 -44 13 -173 -86 -13 30 49 143 9 -47 19 61 -21 232 89 84 -124 124 99 109 177 68 77 -127
7541 -127 -26 -27 -5 -62 -188 144 145 -21 -28 -51 155 149 -103 -83 92 -48 -33 -11 -63 61 -94 -95 90 -70 -160 -110
7567 -110 -52 43 150 -113 -174 64 -29 -54 -25 -32 155 -46 123 -75 -72 1 0 8 -174 -58 56 -32 114 -32 -61 12
7593 12 74 5 -79 52 110 169 -54 77 44 69 126 79 -13 121 134 71 94 79 -21 -288 -53 -75 -190 49 -23 -44
7619 -44 69 -131 -101 -39 -143 -76 -92 -20 -69 115 -106 -148 146 -49 87 187 3 39 -42 -122 90 -82 53 193
7643 193 14 216 -17 60 -23 19 63 -23 83 -27 -165 18 -27 302 -8 34 53 58 -104 56 -25 -95 28 -25
7667 -25 -77 -190 50 92 -57 55 -34 22 108 -65 197 -56 41 76 -72 128 52 44 -26 39 31 -96 -52 -198 58
7692 58 223 -67 -39 55 -5 -38 36 -73 -13 -67 19 131 79 -81 86 -134 -70 -194 -52 -14 38 148 137 165 -174
7717 -174 -52 20 -71 -5 -10 109 78 132 -51 65 -89 -141 157 17 -151 95 64 -87 -167 -82 -35 -117 -163 -129 130
7742 130 26 -84 -27 74 -64 21 -64 162 49 59 -28 -59 -156 -12 -79 -14 -131 15 155 -106 8 73 -104
7765 -104 160 29 -71 50 166 -42 97 -119 -44 46 -62 -12 -110 -136 11 -88 -68 -31 23 67 -57 61 113 -134
7789 -134 83 70 -108 122 134 157 -54 -39 49 86 -6 -84 -42 192 -23 -153 -100 -82 -192 228 69 -136 -56 -3
7813 -3 73 -74 114 6 48 -55 81 -88 -36 2 91 46 -64 99 59 -52 33 -61 71 143 -41 9 -42 -159 -57
7838 -57 -83 -29 9 44 -19 102 94 -70 67 58 -109 31 -23 -26 52 11 -85 -155 61 -2 78 -25 63 2 -133 -135 82 16
7866 16 -48 139 -66 -225 43 1 -62 69 60 -9 -96 27 -19 94 -182 -35 72 66 51 147 -136 71 -131 249
7890 249 -76 -66 98 -39 103 79 -13 17 81 -76 43 17 -113 32 67 33 -83 -6 247 81 -14 62 -60 -52
7914 -52 78 -105 -131 194 -42 25 -82 97 -36 -112 -221 60 -25 95 36 -110 20 -87 31 -14 44 -106 52
7937 52 -56 -71 -68 12 -45 -31 0 183 -25 -190 -49 -84 -45 -100 83 80 34 -47 73 233 104 -211 -87 -46 85
7962 85 -14 -86 -170 40 51 -84 -97 -162 -48 2 36 8 -5 -205 -38 -119 -23 74 -23 49 -34 -66 -87 -205 69 78 91
7989 91 -71 36 -4 -117 -76 -83 62 26 71 -181 24 197 -89 72 110 2 -17 15 10 3 -39 24 58 52 -17 -54 -12
8016 -12 -110 58 122 32 -45 102 10 -27 19 -74 76 111 -97 -13 -86 -82 -35 -176 3 -223 38 0 -25 -45 75 -110
8042 -110 -54 -19 -122 41 31 -83 -54 28 -15 -26 -73 60 198 -42 44 31 -268 5 -94 86 -58 47 1 131
8066 131 93 38 35 -26 -150 -56 113 72 123 91 -18 -66 24 46 -143 91 96 217 31 43 -49 -144 -40 74 -3 -18
8092 -18 -194 -164 -10 -63 65 -52 -172 -48 58 154 63 101 104 -66 38 119 201 118 23 -67 144 -105 32 -10 136
8117 136 -43 113 -20 -42 -110 40 40 3 30 -65 173 -86 -137 128 90 22 -57 44 109 -102 -77 -37 -92 -191 -48
8142 -48 25 40 40 -36 -121 -317 -43 23 -98 -147 62 -110 166 -24 -104 -29 -52 148 56 87 146 62 101 147 39 122
8168 122 48 -5 -180 26 3 -63 -175 89 28 89 -29 -99 -38 41 61 11 -17 -59 -94 -9 50 127 10
8191A0
$$ Imaginary data points
##PAGE= N=2
##DATA TABLE= (X++(I..I)), XYDATA
0 0 0 0 0 0 0 0 0 0 0 0 0 0 2 -32 32 -32 32 -64 64 -64 96 -97 128 -160 162 -193 226 -273 320 -353 416 -474
32 -474 540 -609 673 -769 865 -961 1075 -1194 1331 -1476 1640 -1812 2004 -2217 2445 -2696
48 -2696 2968 -3271 3603 -3967 4378 -4832 5342 -5919 6577 -7336 8223 -9269 10538 -12103
62 -12103 14097 -16729 20387 -25820 34746 -52036 97984 -478223 -1236428 -250239 364044
73 364044 155336 -216941 87434 271643 -9530 -130191 410984 685256 172655 -341596
83 -341596 -2663 481158 262513 -252932 -194012 98867 -68466 -419053 -243971 102736
93 102736 -102420 -563723 -404358 180482 259996 -249432 -479160 -154520 108345 2732
103 2732 -32718 154439 129398 -193914 -248978 137468 371490 106489 -172798 -42470 191550
114 191550 153504 51496 153696 235029 57213 -97478 77346 315713 211762 -82168
124 -82168 -139640 27838 79084 -41854 -113709 -105409 -162553 -240485 -180564 -59589 -83919 -208526
136 -208526 -211586 -77478 6166 -11139 -3831 62559 91921 75906 108931 180035 181062 117596
148 117596 102968 144369 146125 93158 48060 5647 -64811 -99846 -40323 17861 -42916 -154787
160 -154787 -167830 -92667 -56695 -76846 -65443 -20819 -18934 -42058 -5164 65247 66669 19109
172 19109 23599 61998 36383 -23311 -3335 69525 62652 -17858 -38546 15130 20332 -49168 -68663
185 -68663 10229 72722 42155 -4683 1990 17388 7083 16920 51338 38906 -21373 -37364
197 -37364 7138 17911 -34686 -60337 -23588 -9444 -58128 -86555 -38850 12947 3779 -16909
209 -16909 4854 28480 16678 13019 43418 56658 35019 38876 72587 53166 -22238 -42038
221 -42038 21529 47048 -25575 -83882 -43192 4109 -33733 -80552 -41258 15672 -7047 -48699
233 -48699 -13766 41495 24483 -6770 35643 81656 34905 -25417 17311 87460 43603 -52284
245 -52284 -38355 49734 38662 -65340 -84703 4294 32276 -46600 -77247 -2239 35339 -25890
257 -25890 -52874 18342 58025 -1904 -34807 32744 74024 2859 -52316 15361 81996 15697
269 15697 -73664 -30511 59996 31919 -59416 -48636 32503 28819 -43259 -36789 39444 43816 -28483
282 -28483 -39651 30235 50908 -9629 -32762 19602 34825 -26709 -49085 16663 48720 -21098
294 -21098 -76030 -22137 45247 18017 -41611 -28569 22759 22378 -9712 1084 35439 23552
306 23552 -14010 -4526 36617 32778 -9128 -15619 14045 12130 -22814 -23791 12164 14532 -30064
319 -30064 -49523 -10203 26777 9013 -26755 -24483 4192 15445 8446 8531 11766 2842 -3881 8156
333 8156 20716 12124 -3442 -4129 1726 -3303 -9047 -358 10803 302 -23278 -25104 2801 25002
347 25002 11990 -16075 -22617 -1905 19328 19378 2761 -11429 -8663 3732 9878 4985 -1911 -5076
361 -5076 -5749 -6450 -5726 -1251 5175 5637 -5178 -15810 -9646 11515 23503 10040 -13505 -16906 5538
376 5538 26042 18051 -7005 -17658 -5485 8685 9057 408 -7647 -11062 -8680 -3735 -848 -1368
390 -1368 -3008 -4633 -6834 -7347 -887 10159 13296 827 -13525 -7257 14754 23300 7325 -10615
404 -10615 -8509 7148 15235 8100 -3643 -7624 -1827 4130 3481 -2766 -7610 -6025 -1314 -834 -7232
419 -7232 -9632 -2988 3686 -591 -9261 -8894 1062 8150 3782 -4914 -5026 5355 11782 5945 -1962
434 -1962 352 7825 8086 1987 -1785 1242 4804 3409 -1592 -5116 -5834 -3596 1206 2597 -5519 -14746
450 -14746 -8398 8263 9901 -7022 -14777 -727 13311 6188 -6501 -2561 9138 6585 -5078
463 -5078 -3577 9470 9800 -3582 -7857 952 3620 -2582 -1343 4198 -3388 -14865 -5768 15472
477 15472 12817 -13888 -23082 1905 21531 5402 -17344 -8857 12594 9503 -8269 -7531 7347
490 7347 7182 -4966 -3770 8090 7749 -2349 -1700 7328 3962 -7525 -2409 14630 12078 -11317
504 -11317 -17001 5946 18562 -2202 -22629 -11084 10658 7560 -10946 -13174 912 5357 -5401
517 -5401 -10235 -1608 5067 1830 -326 3678 3604 -2399 -641 8004 7100 -4602 -6424 7910 16330
532 16330 3488 -13079 -8411 10402 13404 -3301 -12360 402 13389 5855 -8438 -7330 3624
545 3624 4426 -4665 -7276 -467 2314 -3907 -7047 -3017 -3758 -11320 -9797 2593 5310 -6913 -10159
560 -10159 5433 13961 -747 -13266 1998 22466 17020 -3170 -2589 16682 18953 1352 -6406
573 -6406 5514 9205 -2247 -4921 5756 4080 -13649 -18314 -3536 1405 -14853 -21681 -3892
586 -3892 8423 -6378 -19663 -5636 10993 30 -16935 -4916 18375 17146 -85 -1120 10786
599 10786 10599 2976 7184 14442 4771 -6396 6064 24687 13880 -14063 -17011 4574 10574 -6987
613 -6987 -12170 2204 3761 -13673 -17689 -2371 1302 -15193 -19928 -3793 4467 -5560 -7474 6026
627 6026 5398 -13469 -12607 15875 26801 177 -15028 10967 33831 14068 -12437 -3306 16868
640 16868 9060 -5885 4361 17831 676 -21352 -10011 11682 -16 -24158 -14060 11939
652 11939 2765 -25225 -15159 17743 10874 -27603 -27875 14940 28881 -4868 -22068 5504 23414
665 23414 47 -17050 4985 22203 1798 -13287 10583 28082 981 -23567 -82 27621
677 27621 6859 -23788 -6577 27191 13394 -24568 -19515 16253 14286 -23269 -28382 7675 19889
690 19889 -9625 -23531 -130 10482 -12742 -21580 5307 20386 -1313 -15375 6852 23580
702 23580 1956 -18129 2801 29098 14010 -15830 -7089 22895 20503 -8608 -15199 4504 9028
715 9028 -8101 -12174 3606 7961 -8180 -15150 -2195 3629 -10227 -17147 -1335 11857 2209
728 2209 -10296 -3014 8454 1745 -10428 -3609 13708 14742 -1073 -8466 2606 13434 8526
741 8526 -2660 -4700 232 2687 2199 4243 4963 -1301 -8092 -6108 1317 1783 -5049 -7138 351 5037
757 5037 -2033 -9257 -3897 4356 -358 -9079 -3054 11838 10806 -6008 -12010 1760 13023 6009
771 6009 -5361 -3499 3837 3308 1079 5847 6610 -5841 -13515 -1177 11987 4711 -9127 -4904
785 -4904 7245 2319 -11296 -7498 8746 8367 -8271 -11207 5792 12678 -1617 -10945 -1447 6738
799 6738 119 -4109 3242 5272 -4412 -5659 7002 10224 -5803 -14924 229 14847 5182 -9620
813 -9620 -3515 8907 2039 -10998 -4261 11559 7521 -8069 -7575 4845 5499 -3830 -2733 4892
827 4892 25 -10348 -3165 12454 8285 -11018 -11652 7381 11793 -5725 -12677 3262 12733 -105
841 -105 -9583 1155 8514 -1747 -9318 1995 11187 473 -9758 -614 9707 403 -10195 -455
855 -455 11395 189 -14920 -4402 14922 9232 -12247 -12827 5431 9919 -3911 -7709 4346
868 4346 7216 -4918 -7411 5686 9450 -4222 -9211 4319 10624 -2863 -10358 3120 12658 -786
882 -786 -13176 -2435 12178 4185 -11728 -7326 8790 8625 -5862 -8626 2020 4817 -2639 -2146
896 -2146 6431 3918 -7774 -7057 6498 10000 -2391 -8471 1081 7160 -1790 -8617 131 9692 1905
911 1905 -10346 -6777 5653 6650 -2720 -5569 217 2731 -400 -355 3188 2249 -2539 -1242 5392 6087
927 6087 -1321 -5123 985 5971 1453 -3495 132 4391 -656 -7818 -5046 4139 5745 -3057 -10114
942 -10114 -5834 1940 3509 -527 -3733 -3944 -3020 269 4606 4421 -820 -3843 735 6561 5700 879
958 879 87 3204 3637 643 1064 5434 5198 -2675 -7341 -1881 5778 4155 -4103 -8547 -5747 -1130
974 -1130 673 -222 -3241 -6510 -6548 -1151 3985 1780 -3878 -4364 1183 4078 1703 703 3195 3685
990 3685 357 82 4853 8336 4247 -1882 -2171 2588 5274 3393 319 -2633 -3998 -1798 2266 2167
1006 2167 -3728 -8138 -4748 281 -353 -4578 -5623 -2511 -1235 -2736 -2915 -27 757 -596 -1037 1580
1022 1580 3418 3123 3478 3979 2900 2037 4298 7316 5352 451 -514 3518 5449 1023 -3305 -2584
1038 -2584 316 -859 -4434 -5319 -3834 -3655 -4524 -4411 -4714 -5303 -4326 -1359 6 -2285 -3530 -124 4374
1055 4374 3911 255 708 5299 7375 4486 2225 4029 6009 4682 2303 1723 2383 2260 1101 -724
1071 -724 -2376 -2941 -2345 -1381 -3072 -6308 -6895 -3650 -1034 -3000 -6549 -5991 -1801 614 -778 -2271
1087 -2271 -937 2232 3304 2684 1885 3128 4864 4713 3140 2846 4066 5077 3949 1195 -570 359
1103 359 1962 1154 -1893 -4086 -3637 -1681 -785 -2998 -5826 -5634 -2319 -314 -1799 -3912 -2975 9
1119 9 1426 -326 -1452 761 3458 2996 944 1267 3764 4271 2577 966 1022 1759 2703 2486 1143 -744
1137 -744 -1320 125 1213 -227 -3490 -3725 -380 1448 -1271 -4030 -2811 -246 -640 -2751 -2068 578
1153 578 1289 -1032 -2123 -358 1900 1020 -713 -281 613 793 1729 3026 1638 -1456 -1978 2088 4555
1170 4555 1490 -2512 -983 3843 3956 -549 -2638 -143 1584 -890 -1839 648 1849 -1507 -3814
1185 -3814 -2477 -171 -1037 -2233 -1177 -305 -1822 -2278 983 3169 -613 -4812 -1437 5070 5560 -183
1201 -183 -2147 1932 4281 1636 -576 765 1887 -124 -984 1576 2821 -335 -3394 -2225 -279
1216 -279 -1397 -2185 352 1650 -1787 -4795 -1123 3819 1569 -4388 -4478 1591 4448 1600 -1733 -889
1232 -889 656 -238 -409 1543 1683 -528 -881 1433 2390 -33 -1300 486 1407 -899 -1818 1685 4292
1249 4292 1120 -3840 -3559 793 1688 -917 -2235 -922 -98 -611 -420 -3 -1085 -2174 -749 1472
1265 1472 1586 69 407 2077 1443 -1295 -1306 2108 3382 409 -2156 -324 2061 1400 -951 -2266
1281 -2266 -1653 -1096 304 1150 811 -845 -1462 -229 564 -345 -1091 652 2363 1093 -1143 -500 1695
1298 1695 1018 -1761 -2653 -700 1365 1359 263 -896 -1301 -681 297 955 606 -698 -71 2069 2348 335
1316 335 -840 -341 239 -577 -1202 -398 1259 824 -1564 -2988 -1952 -129 76 -1033 -1120 -353 1065 1656
1334 1656 1146 149 -271 414 1524 2057 1330 593 787 1390 147 -1623 -2222 -382 503 -1024 -2462 -1127
1352 -1127 557 357 -1932 -2714 -763 1293 1330 708 464 479 577 963 1608 800 -942 -570 1223 1546 -483
1371 -483 -1437 -65 823 -1281 -2999 -799 2286 1810 -1118 -1810 906 1705 -43 -634 317 756 -73
1388 -73 499 1463 129 -2201 -1810 686 987 -1625 -2109 903 2277 -228 -2026 404 2679 767 -1869
1405 -1869 -123 2730 2300 -314 -663 417 -208 -1458 -483 829 -695 -2765 -1598 1346 774 -2739
1421 -2739 -2526 1275 2390 -540 -1246 1925 3408 536 -1128 818 2621 1040 -1046 -178 995 -659
1437 -659 -1796 -446 490 -1856 -3555 -972 1969 144 -2845 -1483 2223 2087 -1150 -1031 2089 2756
1453 2756 376 -787 1434 1958 -436 -1704 -56 789 -931 -1703 116 657 -2075 -2957 312 2631
1469 2631 302 -2304 -301 3156 2239 -743 -806 1780 1790 -610 -1041 652 753 -1220 -1481 -174 -294
1486 -294 -2124 -2053 13 781 -536 -1082 1093 2318 177 -1215 849 3482 1897 -617 -591 1392 1793
1503 1793 -666 -1697 -636 -240 -971 -1671 -984 -762 -1526 -1314 245 935 -782 -1047 643 2197 1257
1520 1257 -55 1078 2310 1257 -682 -656 1226 1418 -668 -2107 -1129 435 -119 -1289 -1366 -682 -544
1537 -544 -341 620 676 17 -291 1036 2095 1160 -673 -493 1251 1272 -417 -1180 24 595 -682 -2072
1555 -2072 -727 386 -47 -1425 -916 381 826 511 359 495 415 197 663 1170 246 -1119 -908 666
1573 666 528 -1360 -2125 -624 466 -405 -1311 -556 766 753 -93 333 1221 1288 704 931 1476 1058 573
1592 573 494 668 -97 -1240 -869 32 -603 -2294 -2275 -975 -49 -1020 -1846 -989 229 589 224 748 888
1611 888 972 1431 1628 1366 897 410 1079 1280 258 -502 -389 85 -454 -1239 -1154 -123 -393 -1185 -1175 -402
1631 -402 391 19 -75 -162 -215 282 503 728 95 -445 -81 627 567 -602 -881 -17 454 -1 -539 -161 619
1652 619 502 164 244 696 854 665 494 338 166 -52 354 280 -516 -1173 -600 -135 -733 -1411 -1441 -303 31
1673 31 -519 -955 -410 491 499 234 283 931 728 658 760 527 447 242 658 454 -275 -537 63 235 -168 -779
1695 -779 -774 -8 229 -291 -842 -180 489 165 -408 -255 -13 126 48 -141 -398 -285 -108 -39 174 -290 -392
1716 -392 119 620 208 -623 -301 666 995 321 -67 359 906 758 -37 -330 274 321 -225 -415 -345 -460 -446
1737 -446 -522 -478 -639 -466 -503 50 71 -503 -589 113 716 475 -47 130 992 774 51 -144 456 721 287 -252
1759 -252 -268 137 172 -231 -431 -392 -270 -313 96 78 -518 -617 -247 281 -47 -426 -384 253 426 -108 -206 11 342
1782 342 147 -455 -206 294 345 4 -220 -85 227 116 291 316 -51 -140 132 428 285 -241 -402 -51 242
1803 242 -83 -531 -141 418 109 -391 -572 -179 210 -293 -451 -72 242 243 12 -183 -7 -125 -2 280 281
1824 281 98 -247 10 469 172 -416 -344 260 203 -134 -448 -137 239 -175 -941 -446 184 151 -259 -387 -133
1845 -133 35 22 -138 97 -169 -155 61 468 453 -83 -266 283 381 -61 -65 171 593 272 -364 -230 67 226
1867 226 -399 -729 -209 -37 -74 -303 -218 -123 -530 -336 44 3 -178 -335 374 420 119 -428 74 389 396 50
1889 50 62 434 479 141 -124 -81 292 -24 -30 -145 58 -103 -217 -245 -235 -434 -509 -308 -44 -101 -274 -306 141 92
1913 92 -363 -397 45 502 426 -39 109 304 249 -49 -46 52 246 112 172 111 -97 -303 -351 -138 -289 -597 -285
1936 -285 197 245 -127 -299 -120 262 -65 -329 -43 391 359 -32 -94 33 246 68 78 139 -166 -47 97 200
1958 200 160 -142 -251 4 53 -38 -205 43 169 -78 -235 -399 78 217 -171 -72 -26 64 95 -80 -105 -332 -41
1981 -41 85 170 134 69 -213 339 290 -86 -116 85 50 -32 79 -265 81 -28 -303 -256 -206 23 127 -76 86
2004 86 -57 -147 176 59 -33 -128 189 256 125 125 -25 88 120 -120 -107 130 -50 21 42 3 -271 -61 -77 -58 -415
2029 -415 -180 -185 225 -180 -72 -154 53 218 -50 -21 24 239 135 47 111 -66 -25 135 227 91 84 -52 -60 157
2053 157 179 -226 -146 39 -141 -233 -210 -91 -62 -164 -375 -203 172 36 -3 -56 -40 13 101 192 95 69 35 218 320
2078 320 225 -47 5 169 -23 -119 -154 -72 217 -163 -252 -150 35 5 -217 -186 23 57 -108 -52 92 75 76 56 80
2103 80 147 -76 11 235 323 10 -273 158 296 136 45 -201 59 259 -149 -244 180 9 -103 -36 -29 -63 -59 -47
2127 -47 22 91 -83 -138 224 140 -46 -113 -128 218 67 -139 -106 49 144 -54 -37 -34 90 -107 -96 -47 -7 246 -139
2152 -139 31 28 88 -196 24 60 -30 -113 -111 99 166 -31 -233 82 205 -147 -51 -142 119 269 -64 31 -79 43
2176 43 -65 2 115 -59 -152 85 140 -69 37 -336 -29 178 -161 -195 73 202 -151 13 56 195 39 47 -177
2199 -177 -8 -64 56 0 71 -135 -223 -17 125 -104 -80 -4 79 59 98 -156 -38 169 -87 -56 60 78 147 43
2223 43 -178 20 20 -28 -141 48 -172 17 99 22 35 -259 -1 63 217 225 -130 -169 -11 96 38 -61 -94 148 -60
2248 -60 24 59 -103 -52 51 -120 -164 -66 125 144 -163 -38 -110 98 102 -49 -70 111 145 8 146 -45 -41 178 -16
2273 -16 -83 39 -8 13 -74 112 -196 -5 221 60 -123 93 -120 206 -54 -79 26 152 238 49 -41 -249 -58
2296 -58 211 49 -2 88 77 -32 10 26 -70 -34 0 -37 -69 -176 -149 141 -6 -148 17 134 263 148 -50 14
2320 14 69 236 -125 37 -32 -24 -71 -61 -20 -192 -65 74 -21 -46 -126 -7 133 49 -59 -126 95 149 -102 -154 -2
2345 -2 1 155 -18 112 19 148 -10 -58 -1 -59 -86 14 83 -32 -68 -92 258 -4 -82 -41 257 313 76 -39 73
2370 73 150 119 60 72 -52 -94 -118 139 -9 -218 -117 50 151 -33 -252 145 363 102 -256 -196 213 50 -272
2393 -272 -229 72 -26 -65 -20 -156 27 -34 -109 106 -135 -189 208 61 -13 -126 -273 -1 352 78 -225 34 105
2416 105 216 -100 -332 -70 50 28 22 -89 122 -84 18 -43 46 -128 71 300 189 -66 -273 -264 134 88 -135
2439 -135 -114 110 299 65 -216 -97 96 49 -123 26 -20 148 207 -132 69 -5 -60 12 -130 -72 -159 -23 89
2462 89 119 61 -271 109 149 34 -120 34 299 207 -117 -148 84 13 -75 -196 91 372 167 -71 224 -37 -97
2485 -97 -233 5 113 127 -28 120 16 -8 -213 -150 71 248 -74 -233 4 263 52 -121 -98 -42 45 105 24
2508 24 16 78 -66 164 33 -62 -119 -17 220 23 -298 -204 66 76 -168 -296 29 254 -9 -188 7 132 157
2531 157 -182 -218 -56 162 236 51 2 55 38 -112 38 83 59 -101 -63 114 -39 -364 -204 32 117 -158 -320
2554 -320 -28 288 -92 -239 -3 235 260 -52 -63 89 244 64 97 125 -63 -363 -114 266 -21 -156 -118 143
2576 143 234 -226 -432 81 311 62 -183 41 189 287 -68 -171 253 220 -37 277 52 -71 -122 -3 25 139
2598 139 -147 -76 46 307 -208 -408 -270 94 5 -147 -58 40 50 126 -231 -38 70 -90 112 -65 131 -76
2620 -76 132 246 61 -111 -151 97 274 -4 -171 -59 170 103 -145 -130 -91 170 81 -147 -202 -48 106 -64
2642 -64 -54 -70 28 67 227 125 -190 49 80 -48 -42 -220 -206 183 169 -106 -313 34 203 54 -257 -170 6 3
2666 3 -15 30 -145 94 75 -47 -264 -121 44 93 117 -183 -131 -189 45 194 -9 -193 -153 390 123 -121 -144 -152
2690 -152 60 99 -34 -270 215 78 -57 -85 -130 66 247 -26 -3 36 -162 -31 -41 45 -31 -138 -41 -15 -70 -110
2714 -110 -35 65 -143 -149 -286 -40 230 37 -70 13 14 182 35 62 110 110 397 192 -53 -111 10 111 12 15 -84
2739 -84 -160 -168 55 -374 -164 -79 246 9 -186 -39 6 343 74 -235 -87 109 130 -200 3 6 166 112 27 -43
2763 -43 -99 4 -228 -76 -103 -90 -83 140 8 -160 -187 -191 224 115 -157 -247 204 -52 -1 -192 41 256 131 -72
2787 -72 -223 -85 22 13 136 209 -116 -243 124 46 -216 -248 -5 168 -13 -195 -98 34 175 -226 -200 -104 -177
2810 -177 -15 -111 -118 -150 133 -76 120 5 13 153 254 96 -77 -60 193 327 125 -269 -209 244 173 -228 -77
2833 -77 128 124 -2 -183 -127 -125 120 194 -73 -99 -76 -36 192 122 -78 -28 60 96 -236 -219 53 85 149 -10 -70 -112
2859 -112 -103 100 -56 59 -70 174 222 -25 86 -207 -42 -45 -8 -142 -168 37 135 -104 -184 -94 163 -38 -126 -319
2883 -319 19 45 133 83 5 175 123 102 253 39 98 201 199 52 -112 -129 -4 22 -20 -381 -348 -30 70 -305
2907 -305 -277 -61 -28 166 -90 -72 -137 53 94 34 82 24 140 137 65 10 -159 128 191 -92 22 175 165 144 -35
2932 -35 -72 161 166 -95 -127 3 24 -58 205 -60 -248 -101 54 236 -28 -167 -49 259 11 -112 -286 -4
2954 -4 340 131 -156 -3 46 186 112 -30 -198 -2 102 68 -218 -257 -173 57 107 -126 -274 6 -94 253 -146
2977 -146 -277 90 64 263 -43 -45 -6 207 -139 26 -167 -51 188 -15 -215 -50 -44 97 28 -93 -136 31 232
3000 232 201 -93 -78 196 238 153 -85 -59 -183 206 89 -196 -286 -72 -156 -72 -46 -139 -239 239 30 -254 -257 28
3024 28 213 -17 -189 -36 159 173 34 -196 24 11 91 -8 193 -63 -82 141 166 -182 -368 -14 -50 276 31
3047 31 0 102 283 13 -208 82 102 199 114 -64 -42 183 -74 -13 -157 -185 -321 19 187 -53 -305 -124 3
3070 3 235 -102 -282 78 223 204 -248 -173 199 151 -178 -91 107 289 181 -122 -181 3 15 -202 -11 -55 25
3093 25 110 157 136 26 -214 -155 217 112 -382 -163 202 285 -33 -307 -152 121 42 -41 9 60 171 8 74 -4
3117 -4 93 -86 -67 89 55 -264 126 179 -136 -502 -317 -94 351 35 -95 -128 188 169 -141 -153 69 154 130 207
3141 207 59 125 12 54 32 -169 -152 -319 234 100 -100 -155 18 292 76 -420 -30 408 249 -134 -134 90
3163 90 155 87 -78 -59 139 87 -123 -121 -155 -183 -217 -18 -127 -261 -133 -92 19 12 -281 -241 78 277 -101 -109 94
3188 94 371 212 -14 -244 155 188 21 27 148 279 62 -49 -69 -35 -416 -127 15 61 -296 -169 13 112 -263
3211 -263 -404 -32 116 148 -212 -279 103 177 21 -161 134 177 32 235 91 33 -99 50 53 129 -242 -206 -4
3234 -4 140 137 -333 -167 57 97 -349 -250 155 101 272 -230 -85 163 -38 -58 -34 68 147 200 188 193 91 1 12
3259 12 246 161 5 62 148 127 -199 -150 -86 80 24 -296 -246 102 -63 -71 -98 -47 -92 -134 -131 106 204 -132 119 323
3285 323 -53 -323 -165 86 436 82 -143 -10 302 77 -146 -205 192 301 9 -76 38 200 94 -78 22
3306 22 42 -46 -67 16 -80 -192 -104 -27 -131 -94 -305 -263 165 32 -218 -212 25 84 92 -65 -33 236 32 120 85 -38
3332 -38 91 69 202 -111 -242 -22 129 -44 -78 -300 -253 8 9 -199 -224 108 -61 94 -119 -10 -25 258 108
3355 108 24 210 190 304 342 -182 50 178 81 58 -237 -302 -87 101 -25 -398 -51 41 -148 37 -249 -57
3377 -57 34 52 110 152 -183 43 282 192 -189 -104 10 313 141 -102 -73 84 167 -102 17 -37 7 35 -12 -51 -101
3402 -101 -94 -116 -102 -58 -57 -110 108 171 -121 -65 -9 136 130 -91 23 154 146 -3 -111 -22 85 218 -46 -92 -121 49
3428 49 7 -75 -374 -286 -95 200 -25 -425 -175 39 261 -86 -171 -165 218 350 -31 -19 47 308 107 62 224
3451 224 31 -33 67 35 12 -92 -84 45 -108 -273 -175 -52 -9 -119 -327 -97 76 42 82 29 58 99 71 -55
3475 -55 74 -100 76 -47 -29 27 -117 -210 42 9 -174 -93 2 34 -209 21 -142 15 -12 -200 -275 40 -31 147
3499 147 -132 -246 -74 -56 152 -185 -40 -4 37 313 94 41 -22 177 245 -2 -176 -98 196 -1 -188 -192 11
3522 11 -54 -84 -61 -106 -21 211 -23 -142 -228 -324 -5 88 -157 -94 -146 41 195 88 -232 102 261 30 -224 -16
3546 -16 -36 87 19 -39 18 -37 186 -6 -106 -46 46 -94 83 117 -219 -195 83 18 -153 17 26 84 87 43 -161 83
3572 83 264 24 -195 -103 180 326 170 147 -95 -106 183 0 65 7 -150 74 -161 -57 -246 2 6 250 -225
3595 -225 -255 -89 57 -38 104 -34 -45 298 -60 -14 120 218 30 234 -229 -35 83 -108 57 -206 -225 -101
3617 -101 -71 90 -195 -234 108 142 -22 -183 -69 -17 127 49 -268 176 -13 14 86 -22 112 -44 14 21 29 -66
3641 -66 -75 28 118 -213 -165 -315 166 134 -184 -12 50 123 -133 -74 -127 4 6 32 173 193 -66 174 -90 -65 43
3666 43 33 -45 198 -70 -94 32 -26 -51 -148 -154 18 -42 55 -45 -127 56 21 39 -315 -129 36 -10 67 -82 112
3691 112 -86 -166 30 -120 -160 18 47 37 214 -126 -201 50 132 70 -293 -12 284 -46 -19 -113 42 102 102 -208
3715 -208 -125 -31 144 28 53 -90 40 -269 -87 38 -17 -133 42 135 -74 -270 51 85 -102 -219 6 89
3737 89 230 184 -46 8 269 33 7 -119 -42 105 35 -92 87 45 123 6 67 39 -52 -114 8 74 -105 -68 -121
3762 -121 237 188 -226 35 105 113 -167 -16 227 21 135 69 104 119 128 -195 69 -65 -151 4 191 147 -25 -29
3786 -29 -125 107 -74 -154 -118 157 215 -175 -168 -229 10 -110 -238 -59 26 -116 258 -68 48 -189 -203 -241 -29 23
3810 23 -4 42 183 145 -188 -213 82 266 -162 -27 -181 262 -17 -146 -92 -110 180 40 5 3 36 -19 126 -161
3834 -161 1 -152 72 -37 -13 -172 98 -80 80 122 -288 -5 112 78 60 -48 206 285 89 -172 -82 -46
3856 -46 38 -41 -107 122 -24 -255 236 -66 -74 -62 -46 110 21 -11 -9 193 178 -61 -20 187 312 212 0 -70 166
3881 166 -59 24 -240 -129 80 -43 126 -24 -57 -92 -147 32 -129 -98 -76 -110 201 -87 -74 -167 216 180 -119
3904 -119 -30 5 301 -15 67 44 131 148 73 97 134 10 -106 33 12 -20 -16 -95 56 -88 -236 -120 264 -125 -4
3929 -4 -69 12 27 127 -26 -100 101 176 174 -188 1 -40 72 -82 77 39 -21 -138 109 -7 -171 -110 63 -19 -210
3954 -210 -27 -227 67 9 -178 59 16 340 -215 36 -24 -99 -118 82 -137 -137 44 45 41 -141 -151 -1 -3 -25 -22 -96
3980 -96 75 106 -102 -154 -5 -59 199 38 19 115 188 62 -81 57 -47 -51 -33 -64 -11 -77 68 -48 -63 5 -233
4005 -233 -90 17 39 99 -147 135 26 -107 -203 -75 -78 -183 107 -101 18 -92 31 125 -66 20 26 71 -73
4028 -73 -132 53 -74 21 128 -108 -80 -72 -4 -25 -81 -132 49 175 199 50 -128 15 -27 171 83 -81 -23 -57 123
4053 123 -184 -58 111 77 42 -40 48 -13 -4 -227 -4 93 69 57 -65 49 46 29 86 141 -187 35 53 17 41 -56
4079 -56 -22 -16 143 71 -98 16 123 -24 47 11 -197 60 109 157 104 46 45 6 -147 -192 -17 15 95 -9 -111 -102
4105 -102 -29 175 -87 -111 -62 48 0 -78 97 57 32 82 5 -26 -160 -90 50 -100 68 -26 84 107 89 -13 -213
4130 -213 -37 89 -264 -97 -29 -106 31 1 18 -66 28 48 157 -67 -60 -17 -5 153 -43 6 54 -4 249 -95 -2
4155 -2 -72 187 -19 -104 -65 47 83 26 -51 -182 -11 13 -218 -211 -179 -209 83 1 -195 80 2 100 -185 -79 116
4180 116 126 159 13 51 -154 -5 87 -74 -116 65 -48 129 -44 -68 -80 43 -85 72 -40 -206 60 180
4202 180 86 -138 60 97 210 -122 -68 123 178 -29 -98 -161 -8 63 -9 126 -9 -121 109 -104 -12 88 -90
4225 -90 -128 68 133 -185 -124 128 190 -60 2 93 96 123 -80 -11 252 -136 17 27 119 33 -143 5 147 40 -68
4250 -68 2 -43 153 -180 7 41 45 -169 8 24 -108 116 -59 -1 -37 34 -243 -148 10 -158 -37 -268 50 -33
4274 -33 -124 -102 -2 168 -11 -104 57 75 11 -10 -100 161 51 -102 36 59 262 162 -82 12 30 64 63 23 -21
4299 -21 13 -22 1 -4 0 -6 -174 202 13 -171 -57 111 40 -19 -17 105 216 183 -229 -108 -8 -21 -54 -79 -52 -4 61
4326 61 -211 -20 -129 63 -36 43 -31 -95 -19 24 97 102 -122 -78 205 185 -12 -77 178 97 44 -91 -29 161 141 -59
4352 -59 55 97 56 -88 7 -103 -34 -4 77 55 2 20 76 33 70 53 -47 -20 164 153 -58 28 131 125 -135 94
4378 94 -76 -91 24 -193 -244 -40 -157 -50 -122 60 77 42 -120 120 123 -154 -9 152 30 -103 27 129 131
4401 131 -23 -151 -65 0 74 68 -97 2 40 -141 -20 118 -134 -207 6 -171 -56 -49 -67 47 -105 -4 35 -2
4425 -2 39 40 72 -23 126 -25 -36 -131 123 172 -79 -86 11 -68 -17 38 35 -11 -36 73 174 84 -38 -93 -16 125 153 -66
4453 -66 -153 96 100 142 -117 -51 -28 -111 -53 -92 79 -61 158 189 -62 -280 54 -65 -23 -125 -27 65 26 -260 -146
4478 -146 -70 194 25 -33 -82 -58 -1 -26 -52 -190 65 -31 31 -10 -124 37 35 93 -24 4 -39 79 33 -118 31
4503 31 -98 25 35 79 16 50 29 279 -157 -174 -164 161 71 -58 52 -93 91 -154 65 -55 -144 -69 -23 61
4527 61 -64 37 -61 297 -67 -135 -87 -11 6 60 -146 71 50 194 -9 8 -81 -21 -48 26 49 -9 -98 -137 -18 123
4553 123 -100 13 3 41 -4 32 15 66 45 -3 -173 -31 52 -127 -44 -123 145 -16 -12 23 -15 102 88 2 -40 -11
4579 -11 106 24 51 5 -171 -107 122 108 -17 -23 90 111 84 -92 80 45 230 -97 35 -64 130 219 -195 21
4603 21 -1 63 106 26 41 -17 66 -4 167 113 -50 -31 72 78 -48 -209 82 79 -110 -131 -159 132 -108 -52 -77 -214
4629 -214 -75 -29 -47 32 -58 -66 87 71 85 -179 2 5 -137 -81 -222 -11 66 127 -130 -33 133 -136 31 49 114
4654 114 -30 -65 54 -128 -122 118 16 -27 -133 100 129 -51 37 11 -84 18 76 224 87 -3 142 -87 -34 -10
4678 -10 -73 -110 -52 -170 -196 41 -49 -35 -38 -146 -42 92 -87 -93 -74 -20 148 202 -19 -92 130 -12 9 18 -63 -35 15
4705 15 11 -86 67 155 -123 -17 113 -104 -43 -70 -45 -52 -77 -57 70 -15 -118 19 -61 148 -216 -15 -170 -24 86
4730 86 183 -123 -307 66 38 -64 -31 -216 -102 2 114 -39 6 -17 -37 -46 -61 -39 83 67 73 -141 56 110 201
4755 201 -79 170 -47 -25 12 70 -23 60 79 21 -5 -158 -142 -48 88 -115 84 -81 25 269 177 -205 -106 48
4779 48 -5 115 4 -180 -47 1 -25 -86 -78 -64 -86 17 -65 116 -98 -40 132 -53 -63 -22 144 135 106 -57 -169
4804 -169 5 133 -29 91 -64 22 99 44 22 -81 -39 23 -151 -45 61 28 8 14 5 -108 -137 0 -218 -171 161
4829 161 5 10 -19 -78 12 7 18 -38 1 -71 180 25 -105 -91 59 -2 13 20 -49 -32 113 -62 -135 -29 129 -56
4855 -56 68 42 -136 17 34 196 84 -40 -130 279 18 -28 -97 11 97 29 -32 7 67 66 -61 -116 -103 40 -28
4880 -28 24 234 -21 -57 -114 206 47 -136 105 -22 178 -143 -259 84 258 31 -255 -78 121 -115 -182 17
4902 17 41 -58 125 -241 -194 -129 -18 35 29 -1 51 -16 39 67 -33 -96 -86 120 -46 -140 28 -81 97 -15 -124
4927 -124 -64 -64 -135 -277 -15 -9 98 40 -10 4 51 109 80 100 12 66 111 107 54 -172 -108 172 55 53 -23 64 122 -154
4955 -154 31 3 132 52 -193 115 40 -127 -164 -26 -36 5 -33 40 -13 2 -58 -107 -65 -15 -13 -34 -19 188 78 -126
4981 -126 -93 -49 38 -29 -50 -51 34 23 -78 105 86 -54 16 102 11 89 -10 53 153 -83 -297 2 222 109 -124
5006 -124 23 -9 49 4 -335 -66 -77 6 -77 -23 24 31 -77 210 -12 -40 -24 -12 106 73 56 -32 56 139 -79 -148
5032 -148 -124 63 236 -180 -122 9 -97 66 -99 -42 29 -3 -37 -102 39 -165 -25 135 -75 -118 -78 -167 74
5055 74 3 -8 82 138 171 45 -101 117 57 273 8 -146 87 79 -19 -91 62 -43 -97 77 -12 -104 104 -2 164
5080 164 234 -194 86 -26 -14 -178 -144 12 148 -64 -92 -5 -132 157 -220 5 83 4 75 34 -15 126 47 -16
5104 -16 93 -158 -160 -36 -65 259 -46 -193 -28 -1 -51 -33 -86 32 44 -249 4 103 -28 100 -69 -28 120 100
5128 100 31 -34 -168 -13 178 -85 -145 -220 -129 7 251 68 -73 -121 -11 151 -97 -195 -127 -28 38 -79 174
5151 174 -73 -20 120 96 1 10 -119 -254 -91 -198 31 -37 75 -10 53 127 -104 115 -22 -56 -110 164 39 23
5175 23 -86 -29 66 170 -3 -11 47 80 -75 -87 10 18 -58 -122 -25 -194 6 83 -16 107 -48 -82 10 141 -186 -61
5201 -61 -26 -40 102 -21 -172 169 31 207 247 -67 -237 15 33 -17 52 42 -173 59 69 -97 -121 71 41 -3
5225 -3 36 65 187 -6 -34 3 -159 -56 111 -48 -142 -108 12 -31 -96 -85 -217 -89 117 -14 159 -65 107 174
5249 174 53 66 -185 -34 -32 117 -129 -153 144 52 138 32 -53 -9 31 -66 -107 -46 100 101 -97 64 21 99 21 128
5275 128 88 -59 -50 245 -67 -13 57 -71 76 66 -33 18 26 -103 11 39 -32 76 237 94 145 0 -19 106 82
5300 82 -129 -79 37 39 -49 -107 -38 17 83 23 -50 -55 97 163 169 -140 7 12 1 -21 -199 -38 29 80 111 29 70 -106
5328 -106 19 121 -9 -63 -24 -18 33 -72 -104 -108 128 -27 -68 14 -19 -34 -151 -262 90 9 -45 -15 -106 -12 40 73
5354 73 13 -64 18 4 68 96 177 80 -90 -22 -46 -66 39 -60 142 -107 -54 68 91 -135 47 -81 133 -9 48
5379 48 130 -163 -62 -30 160 -29 -90 126 -32 43 -4 -66 -64 -228 -25 -44 25 26 98 18 12 -193 96 18 32 -30 60
5406 60 33 17 -153 28 -10 21 53 162 -42 -65 19 161 -9 -117 -10 118 139 79 -44 87 -80 30 106 17
5430 17 45 -37 -15 -87 124 -131 -87 94 -66 170 4 98 -55 96 40 -149 149 51 16 -40 -9 6 13 -76 -11 -6
5456 -6 46 -266 -97 131 -73 -167 26 32 -60 -12 65 220 33 -127 -151 -48 137 -70 34 -98 14 98 149 -8
5480 -8 57 104 -52 90 72 -12 8 -117 271 -50 66 157 130 69 -99 -86 -131 -13 0 -86 -264 -18 138 -57 -24
5505 -24 -8 -10 -31 41 -207 -39 192 -64 -8 -72 60 -12 -75 110 -76 -212 68 93 93 -101 -22 -16 18 25 -183 -34
5531 -34 -109 -50 1 -3 -163 11 -88 -120 -153 78 137 15 203 306 214 58 -12 -59 72 54 -12 191 -67 -163 -137 -43
5557 -43 37 -140 -136 -57 -69 57 -12 69 -117 251 237 69 -19 11 4 47 213 -27 -5 -30 70 -2 -70 76 -167 21
5583 21 -53 47 -63 152 65 -83 76 121 -166 35 68 151 98 -10 85 3 -78 -212 41 53 0 -72 -103 72 27
5608 27 -159 62 -12 6 170 -38 -146 120 59 191 -55 157 21 -121 -51 52 36 88 110 -108 -33 -9 6 99
5632 99 60 68 -62 -105 70 41 79 -101 114 -62 -199 -136 -94 -43 76 36 69 -23 25 -13 -136 83 -59 26 2 121
5658 121 211 120 -135 31 159 -243 -137 -60 43 -123 -14 -259 90 90 46 154 -104 140 -70 4 139 19
5680 19 -49 78 128 131 -61 -69 52 52 -52 50 124 57 77 -136 7 132 162 -47 -113 -48 22 164 156 63 -105 52
5706 52 49 -28 104 -106 -47 113 12 -51 -87 101 -44 90 -5 -11 -48 53 -121 19 16 -290 132 -41 126 -100
5730 -100 146 121 -85 -38 -98 -107 58 19 -4 7 84 -3 -38 -142 112 -141 33 -1 42 -66 32 -37 -118 -249 -18
5755 -18 306 -79 39 -123 -2 16 138 -195 112 53 -116 86 23 90 -159 17 -27 -87 -88 67 16 -1 98 -52
5779 -52 78 -164 -64 11 72 84 68 -26 13 -176 -84 23 143 -67 91 140 124 39 -51 29 -6 -37 93 -47 -27
5804 -27 -114 -43 2 -80 -91 25 131 179 -8 -50 31 10 110 95 -70 21 19 49 3 -106 -67 -103 96 -43 -30 14 15
5831 15 -12 8 22 7 61 -167 -183 -77 61 155 163 128 -55 120 57 239 0 24 71 -58 76 -19 -112 -101 -16 23
5857 23 29 -56 89 66 17 25 -94 -120 -212 39 -30 -3 174 -47 224 -128 6 74 13 23 -3 -82 94 80 37 -97
5883 -97 -19 -135 -65 -162 -9 -154 47 69 -54 164 -295 10 7 -70 -77 130 153 5 54 -44 -4 147 -65 67 94
5908 94 158 -170 -135 4 34 36 -9 13 -49 -129 -21 71 125 -56 107 -13 17 -31 70 -44 -154 38 10 107 -70
5933 -70 -235 -25 55 -44 125 -22 170 154 73 -104 -50 -170 98 253 205 -1 -88 27 2 -138 -39 138 95 4
5957 4 52 13 22 158 28 -40 74 1 -26 -164 24 -29 -207 -24 -212 56 -72 51 99 30 -44 94 -192 -110 -132
5982 -132 61 -92 21 21 77 209 -180 -149 3 -143 -59 62 -231 128 38 -74 -125 -86 -57 -6 -110 -77 -17 -162
6006 -162 59 136 129 -14 -142 59 -83 -216 36 116 41 150 -45 87 89 78 -90 -50 -118 -37 -11 43 -16 -63 68
6031 68 196 60 -103 -63 141 -28 -49 49 -11 6 -22 46 -9 -3 70 23 129 19 -96 220 -28 -115 -115 14 76 15
6057 15 -37 25 36 -64 -25 33 79 -46 67 108 -3 -23 -55 -30 34 -110 -176 67 68 -25 -181 -75 0 128 132 -62
6083 -62 -156 101 -75 -225 -49 111 15 -127 178 6 -35 -113 -1 49 118 -144 -85 64 58 53 -41 11 21 -39 -100 29
6109 29 156 26 -30 -32 -132 42 177 -73 108 -44 -101 -30 -76 -24 66 -81 -58 186 76 23 -68 -34 -33 -186 -18
6134 -18 -262 169 -93 -171 -51 -16 101 -56 2 44 -224 90 -65 -61 -98 -7 105 -27 -133 -48 4 -120 -136 153
6158 153 -6 -167 -68 80 -19 100 -60 -55 147 -11 -98 104 95 -18 -136 -9 -38 -106 41 -87 52 -62 -26
6181 -26 127 17 -34 -75 109 87 37 -73 62 40 45 -77 -24 -26 -31 42 -28 113 -69 72 -29 -60 1 21 -73 -18 -5
6208 -5 54 -57 2 -132 -91 -34 2 -129 -103 33 47 199 144 13 100 -107 66 -19 -100 81 23 -142 53 -105 -161
6233 -161 -62 -93 74 -35 -101 47 -16 -171 -167 118 48 61 -97 -181 96 45 10 151 28 -129 1 51 -2 28 -18
6258 -18 -40 -47 -34 32 140 9 -11 -25 -27 -99 -18 -42 -90 6 53 -36 -155 -52 -89 11 140 47 -175 72 106 -103 100
6285 100 -24 45 102 103 -165 -173 -166 2 -158 6 -104 53 30 -112 -44 271 43 109 -29 43 -2 -146 -36 65
6309 65 36 -112 109 -29 10 187 -78 -110 -61 -6 14 60 56 -163 -45 143 148 92 -53 148 -8 23 66 -164 109
6334 109 -95 87 -218 -121 24 91 -212 -19 -40 -110 118 -69 5 -79 34 43 -91 -61 26 35 -23 -91 -46 -105 149
6359 149 125 -164 -64 79 173 53 44 8 37 -100 -10 131 107 34 -33 39 260 112 5 -66 183 2 -15 15 140
6384 140 59 66 -161 -73 -136 55 59 -222 -159 -85 -46 223 43 20 28 28 -106 107 -220 -31 -41 -187 -4 -123 260
6409 260 26 150 -133 -82 131 -143 -144 -30 -29 -148 51 -67 49 80 -3 150 120 18 -21 -35 -31 34 65 43 29
6434 29 -165 -125 187 -51 -166 0 65 36 -130 22 -117 -65 65 -62 -6 20 -91 -227 -47 77 -136 37
6456 37 -39 -26 31 30 -49 -356 124 139 4 125 -192 -190 64 103 99 -13 179 114 -77 -19 66 -20 93 -85 26 -60
6482 -60 -77 26 -15 27 156 -2 -68 48 33 115 -66 -181 -139 81 -69 28 80 -126 84 4 -56 27 -31 24 54
6507 54 32 144 -200 30 -141 -162 73 110 145 28 -28 61 -60 225 93 -8 -57 86 -52 -71 -13 -90 -7 -45
6531 -45 13 72 34 40 10 -39 27 15 -25 -35 31 -256 -170 114 24 158 -200 71 -178 -171 11 87 6 -49 2 6 -68 -169
6559 -169 -47 -132 27 -101 -73 26 141 -3 -193 -14 1 -207 188 28 23 31 16 39 -5 63 -24 104 189 154 -64
6584 -64 43 52 -46 -18 -104 -197 70 -66 -154 -95 -40 105 15 67 -202 -111 -46 47 40 51 115 0 16 -189 20 130 -63
6611 -63 102 -182 -78 -54 -9 71 -69 -310 -98 11 137 -137 -119 161 39 69 -20 51 108 -53 53 106 54 207
6635 207 -39 98 1 38 -31 -18 214 -44 -139 -19 53 -91 -49 -114 -84 50 -113 201 -97 313 -121 10 -112
6658 -112 10 -127 18 52 114 56 -79 -24 53 -28 169 -52 15 -17 -156 -73 5 -31 -168 -56 64 -111 -72 100
6682 100 -185 -213 -29 16 -7 -94 41 -65 -121 -3 145 -47 -27 17 94 -58 -72 -71 -3 -20 -200 5 192 48
6706 48 15 -21 73 30 129 -38 -66 -60 44 -8 -62 21 115 6 -152 87 88 -112 -50 -20 186 110 47 84 203 24 -174
6733 -174 31 3 13 82 -146 114 -73 -43 -109 12 27 -72 -76 14 -202 -31 -38 -111 -29 -5 -8 -27 -87 -132 188 -152 -109
6760 -109 52 -30 -118 -49 25 130 -128 -86 -68 114 -80 -56 6 -115 45 -10 -26 135 4 -65 16 -14 -74 -49 -75
6785 -75 20 -16 -87 38 104 -168 -171 -66 38 192 -4 -62 37 41 76 -24 -71 -94 -39 59 8 43 -174 -43 -14 -15 170
6812 170 113 -41 -36 4 -75 100 -119 175 32 -61 12 -107 -21 -70 61 103 -64 -14 -173 -18 -53 128 -82 -70
6836 -70 144 73 -65 53 111 41 13 -43 166 127 139 19 22 -131 -150 32 5 -14 20 -172 235 -95 -57 -35 -19 76
6862 76 -78 92 -146 29 -79 -153 15 -15 80 3 81 99 -107 -28 60 -45 200 -42 61 -27 -32 15 -20 91 -63
6887 -63 113 77 187 -182 -217 0 184 163 -45 88 78 -132 220 199 -62 30 128 58 -89 -150 32 116 -84 -24
6911 -24 -70 81 -92 -90 29 18 59 -4 74 79 -137 50 -262 40 -36 121 -136 -189 -74 -41 -134 -124 29 218 6
6936 6 -102 93 7 -161 -97 5 -93 -118 79 4 -136 -213 -84 58 -89 38 87 53 -42 132 38 -91 187 113
6960 113 -16 50 -120 24 -95 -9 -126 58 5 -49 106 -115 124 -25 -54 -128 57 -200 -26 9 37 -80 1
6983 1 -66 -69 313 99 200 -101 59 -115 -314 26 142 -35 31 6 109 16 -136 -26 -199 58 33 40 -8 -48
7007 -48 -75 -78 -17 10 6 -41 -6 -124 -156 -50 110 -103 -93 -154 -173 -147 144 109 -52 -221 -88 64 -74 -25 122 21
7033 21 110 29 -169 -63 -197 29 -72 -143 -146 93 -98 -55 -29 -47 -11 76 -30 -74 116 46 63 -169 -34 29 -7
7058 -7 -15 -194 215 -68 45 43 59 159 -171 -52 101 -40 14 84 81 -33 -81 -40 -60 -21 96 -69 -16 -43 53 -34
7084 -34 -82 7 -25 -189 -148 187 -181 75 66 63 -16 -101 59 31 74 -63 -81 8 -88 -18 -63 -52 -198 -13 120 -74
7110 -74 104 46 160 -112 -21 -124 -129 -215 99 75 -17 -133 -32 131 -39 -208 44 22 133 24 116 -123 -87 45
7134 45 -8 -83 49 142 193 -61 26 32 48 18 -58 24 56 14 41 -178 -7 -206 43 63 237 16 24 15 0 -75 -136 -11
7162 -11 -203 11 -45 -27 -226 4 -1 -166 -45 47 19 -43 60 -11 -114 47 53 141 129 -29 -5 -72 2 -15 -121 -67
7188 -67 -49 53 100 64 -43 20 171 -28 39 49 47 -108 140 -54 58 -70 -44 -42 20 276 -73 -108 -140 140 -206
7213 -206 79 -87 7 56 -121 7 23 -73 -1 -62 50 -146 -103 -64 -38 -64 -57 130 19 56 22 -46 -22 61 126 -137
7239 -137 -44 -78 -29 114 64 -14 -91 22 -2 96 62 -117 -99 -48 249 120 25 -26 74 -10 79 -17 28 106 -37 -62
7265 -62 19 78 208 -26 61 42 107 -102 -124 -22 -61 196 -13 -88 -118 59 49 122 -129 -42 106 -70 30 60 -49
7290 -49 -14 -112 104 -122 -23 -112 -63 -98 -4 62 -130 -187 54 -72 -107 202 -78 56 13 35 -148 -67 77 86 120 -19
7316 -19 -62 40 -47 -36 111 48 -55 212 -58 55 -199 74 62 -97 -57 4 -191 -18 127 2 -74 -115 69
7339 69 131 -56 -59 134 19 -117 109 148 -10 -31 9 -38 1 122 -14 -124 61 -22 -80 116 -4 26 318 139
7363 139 -134 -243 -69 80 210 101 72 14 35 115 -151 10 -69 48 -17 135 -43 -156 -56 25 74 -69 80
7386 80 -103 -40 -144 -64 39 -18 109 6 7 43 46 61 81 18 -40 -271 1 4 1 -43 112 30 -38 -57 147 -97 -111
7413 -111 -17 18 -25 -7 123 133 5 57 41 96 19 26 146 -98 148 -62 -45 102 71 21 12 -33 13 -71 -58 -160 -53
7440 -53 41 -15 -77 -20 -96 10 -53 39 5 -57 175 51 202 -72 -202 -43 52 99 3 -51 -103 -28 28 -139 -30 12
7466 12 -60 -133 13 207 12 -71 29 21 -31 -141 9 31 -33 30 -203 113 177 183 112 -159 -104 141 159 -156 53
7491 53 -115 71 -32 -3 58 31 -79 5 118 21 79 235 -221 53 -47 -54 14 63 26 63 24 153 -84 9 -80
7516 -80 -86 -228 -112 33 5 -8 -5 -34 95 -68 44 -7 23 -79 -24 -46 19 49 -74 -73 -110 -35 145 38 -154 81
7542 81 164 -62 -21 -81 116 110 -174 169 -82 25 -54 29 -82 30 -23 -53 11 -41 31 -159 88 126 46 -1 -44 -52
7568 -52 -14 -102 33 112 124 -95 25 -104 29 -27 66 -72 12 100 59 -1 -89 -106 87 92 118 61 -109 142 -23 180
7594 180 14 -63 141 4 4 -139 -151 -21 -23 -17 133 103 -15 55 -87 -84 141 132 -44 161 -100 109 81 25 62 124
7620 124 -30 -46 73 39 98 -75 -126 -148 113 -155 -22 13 -80 -52 25 73 -90 -88 104 -8 -93 1 111 95 -96
7645 -96 -194 94 2 70 -36 -23 9 32 -105 -41 92 -91 -31 91 -85 -59 35 67 10 106 212 43 22 -21 44 -54
7671 -54 -50 31 198 -192 26 -9 -19 120 -90 -102 11 1 -158 -22 87 -35 -28 -104 17 -51 16 -190 -151 24 4
7696 4 50 28 -130 -57 -16 -88 -47 51 -118 34 182 -33 -188 -29 -35 77 78 -58 -26 -81 93 194 -141 21 77
7721 77 160 -74 133 29 -3 -137 87 -1 -41 111 69 146 -10 247 81 -67 239 -55 -18 102 -22 -131 -101
7744 -101 153 -30 59 129 42 7 -124 94 97 -6 -111 -201 -42 -15 50 85 14 43 160 -161 18 -42 -51 -168 22
7769 22 -64 33 74 -151 15 -26 -58 -35 -20 -135 -42 -110 50 5 -104 -74 2 112 -84 -152 -37 40 -27 -29 -11 -52 -61
7796 -61 -7 95 27 132 24 28 37 75 -24 12 65 48 9 34 -53 92 126 40 -72 177 -34 -28 59 -80 -32 94 105
7823 105 2 -60 27 66 89 226 40 35 -71 146 -27 70 -4 -110 -76 -27 -60 -28 170 90 -3 -44 -37 -85 -70 -81 36
7850 36 -140 -12 -143 46 156 -42 -236 -11 -114 -19 67 60 -67 104 150 50 -31 96 2 -260 -21 45 128
7873 128 -250 -80 -50 77 -50 -108 26 12 115 -40 85 107 -45 46 -67 32 -101 287 48 -20 37 -98 67
7896 67 -49 -7 6 -58 8 21 -82 -230 -124 21 -12 -94 -39 -36 -31 61 -55 -11 -29 139 -32 15 -57 -154 -11 -79 -46
7923 -46 -87 15 61 43 -72 -122 14 136 -53 -98 -41 30 -20 -124 167 -81 -6 -56 14 -30 -111 -146 6 114 126
7948 126 -61 11 154 -129 50 -71 9 70 -61 17 148 -31 41 -45 2 -78 -95 134 -41 -150 52 137 -96
7971 -96 -72 152 55 49 84 111 -64 43 72 61 16 -125 -16 67 -24 -35 -78 -3 66 61 45 -100 -17 174 46 -16 42
7998 42 53 -31 -104 59 -3 -107 -172 144 52 84 -110 89 25 -67 12 -60 4 -214 59 -16 -11 2 15 -79 147 -208
8024 -208 136 -184 10 48 -62 36 91 -1 41 -82 -74 104 189 99 16 -92 -30 27 37 -6 -2 59 -46 126 108 196
8050 196 -88 -104 79 44 54 -84 169 -3 -34 151 174 51 -19 1 -115 -55 134 -97 -51 153 -84 -58 51
8073 51 -60 113 78 55 -40 11 34 -178 27 69 -194 -19 104 84 99 8 93 51 48 108 69 118 88 126 61 111 300
8100 300 137 138 -32 -41 -97 58 -37 129 30 36 19 43 76 -42 -133 82 227 -93 -358 15 -99 -173 -240 -67 -107
8125 -107 10 -139 133 123 -54 83 57 128 97 -22 14 192 193 -11 -55 -37 -135 -187 -163 131 141 89 19 -62 -40 -74
8151 -74 13 47 89 -33 111 15 26 33 -24 -60 -28 -110 -58 34 85 -115 73 -74 10 101 -30 -102 -78 105 96 8 5 -19
8179 -19 1 29 47 66 -55 -88 44 -162 107 -6 -45 -128
8191a28
##END NTUPLES=NMR FID
##END=
