##TITLE=1H ikalashn
52-n
23.10.2024
##JCAMPDX= 6.0         $$ Bruker NMR JCAMP-DX V2.0
##DATA TYPE= NMR FID
##DATA CLASS= NTUPLES
##ORIGIN= UXNMR, Bruker Analytische Messtechnik GmbH
##OWNER= root
$$ TOPSPIN		Version 1.3
$$ 2024-10-23 16:27:36.562 +0400  Irina@DPX200
$$ Compression mode = diff/dup
##.OBSERVE FREQUENCY= 200.131300845
##.OBSERVE NUCLEUS= ^1H
##.DELAY= (6, 6)
##.ACQUISITION MODE= SIMULTANEOUS
##.ACQUISITION SCHEME= undefined
##.AVERAGES= 64
##.DIGITISER RES= 18
##SPECTROMETER/DATA SYSTEM= spect
##.PULSE SEQUENCE= zg
##.SOLVENT NAME= DMSO
##.SHIFT REFERENCE= INTERNAL, DMSO, 1, 17.49637
##AUDIT TRAIL= $$ (NUMBER, WHEN, WHO, WHERE, WHAT)
$$ ##TITLE= Audit trail, TOPSPIN		Version 1.3
$$ ##JCAMPDX= 5.01
$$ ##ORIGIN= Bruker BioSpin GmbH
$$ ##OWNER= Irina
$$ $$ F:/spectra/data/iren/nmr/1H/4/audita.txt
$$ ##AUDIT TRAIL=  $$ (NUMBER, WHEN, WHO, WHERE, VERSION, WHAT)
(   1,<2024-10-23 16:27:08.421 +0400>,<Irina>,<DPX200>,<TOPSPIN 1.3>,
      <created by zg
	started at 2024-10-23 16:22:55.500 +0400,
	POWCHK disabled, PULCHK disabled
       configuration hash MD5:
       BE 6D 3F 07 2A EA 11 49 91 17 2B D3 AF B3 58 0D
       data hash MD5: 16K
       60 60 83 F9 24 C3 C8 B9 B8 5C 21 83 55 97 C8 EB>)
$$ ##END=
$$ 
$$ $$ hash MD5
$$ $$ 3B FF 0A FD 3F CD C4 9E BE 28 84 B2 F1 AF 6B D1
##$RELAX= 
##$RELAX= 
##$RELAX= 
##$RELAX= 
##$RELAX= 
##$RELAX= 
##$RELAX= 
##$RELAX= 
##$RELAX= 
$$ Bruker specific parameters
$$ --------------------------
##$DU= <F:/spectra>
##$EXPNO= 4
##$NAME= <1H>
##$PROCNO= 1
##$TYPE= <nmr>
##$USER= <iren>
##$AMP= (0..31)
100 100 100 100 100 100 100 100 100 100 100 100 100 100 100 100 100 100 
100 100 100 100 100 100 100 100 100 100 100 100 100 100 
##$ANAVPT= -1
##$AQSEQ= 0
##$AQ_mod= 1
##$AUNM= <au_zg>
##$AUTOPOS= <>
##$BF1= 200.13
##$BF2= 200.13
##$BF3= 200.13
##$BF4= 200.13
##$BF5= 200.13
##$BF6= 200.13
##$BF7= 200.13
##$BF8= 200.13
##$BYTORDA= 1
##$CFDGTYP= 0
##$CFRGTYP= 5
##$CHEMSTR= <none>
##$CNST= (0..63)
1 1 145 1 1 1 1 1 1 1 1 1 1 1 1 1 1 1 1 1 1 1 1 1 1 1 1 1 1 1 1 1 1 1 
1 1 1 1 1 1 1 1 1 1 1 1 1 1 1 1 1 1 1 1 1 1 1 1 1 1 1 1 1 1 
##$CPDPRG= <>
##$CPDPRG1= <>
##$CPDPRG2= <>
##$CPDPRG3= <>
##$CPDPRG4= <mlev>
##$CPDPRG5= <mlev>
##$CPDPRG6= <mlev>
##$CPDPRG7= <mlev>
##$CPDPRG8= <mlev>
##$CPDPRGB= <>
##$CPDPRGT= <>
##$D= (0..63)
0 2 0 0 0 0 0 0 0 0.06 0 0.03 0 0 0 0 0.0002 0 0 0 0 0 0 0 0 0 0 0 0 0 
0 0 0 0 0 0 0 0 0 0 0 0 0 0 0 0 0 0 0 0 0 0 0 0 0 0 0 0 0 0 0 0 0 0 
##$DATE= 1729686427
##$DBL= (0..7)
120 120 120 120 120 120 120 120 
##$DBP= (0..7)
150 150 150 150 150 150 150 150 
##$DBP07= 0
##$DBPNAM0= <>
##$DBPNAM1= <>
##$DBPNAM2= <>
##$DBPNAM3= <>
##$DBPNAM4= <>
##$DBPNAM5= <>
##$DBPNAM6= <>
##$DBPNAM7= <>
##$DBPOAL= (0..7)
0.5 0.5 0.5 0.5 0.5 0.5 0.5 0.5 
##$DBPOFFS= (0..7)
0 0 0 0 0 0 0 0 
##$DE= 6
##$DECBNUC= <off>
##$DECIM= 32
##$DECNUC= <off>
##$DECSTAT= 4
##$DIGMOD= 1
##$DIGTYP= 9
##$DL= (0..7)
0 120 120 120 120 120 120 120 
##$DP= (0..7)
150 150 150 150 150 150 150 150 
##$DP07= 0
##$DPNAME0= <>
$$ [...]
##$SW= 21.9926040160658
##$SWIBOX= (0..15)
0 0 2 0 0 0 0 0 0 0 0 0 0 0 0 0 
##$SW_h= 4401.40845070422
##$TD= 16384
##$TD0= 1
##$TE= 300
##$TE2= 300
##$TE3= 300
##$TEG= 300
##$TL= (0..7)
0 120 120 120 120 120 120 120 
##$TP= (0..7)
150 150 150 150 150 150 150 150 
##$TP07= 0
##$TPNAME0= <>
##$TPNAME1= <>
##$TPNAME2= <>
##$TPNAME3= <>
##$TPNAME4= <>
##$TPNAME5= <>
##$TPNAME6= <>
##$TPNAME7= <>
##$TPOAL= (0..7)
0.5 0.5 0.5 0.5 0.5 0.5 0.5 0.5 
##$TPOFFS= (0..7)
0 0 0 0 0 0 0 0 
##$TUNHIN= 0
##$TUNHOUT= 0
##$TUNXOUT= 0
##$USERA1= <user>
##$USERA2= <user>
##$USERA3= <user>
##$USERA4= <user>
##$USERA5= <user>
##$V9= 5
##$VALIST= <valist>
##$VCLIST= <CCCCCCCCCCCCCCC>
##$VD= 0
##$VDLIST= <DDDDDDDDDDDDDDD>
##$VPLIST= <PPPPPPPPPPPPPPP>
##$VTLIST= <TTTTTTTTTTTTTTT>
##$WBST= 1024
##$WBSW= 25
##$XGAIN= (0..3)
0 0 0 0 
##$XL= 0
##$YL= 0
##$YMAX_a= 2356173
##$YMIN_a= -3093900
##$ZGOPTNS= <>
##$ZL1= 120
##$ZL2= 120
##$ZL3= 120
##$ZL4= 120
##$ABSF1= 10
##$ABSF2= 0
##$ABSG= 5
##$ABSL= 3
##$ALPHA= 0
##$AQORDER= 0
##$ASSFAC= 0
##$ASSFACI= 0
##$ASSFACX= 0
##$ASSWID= 0
##$AUNMP= <proc_1d>
##$AXLEFT= 0
##$AXRIGHT= 0
##$AXTYPE= 0
##$AXUNIT= <>
##$AZFE= 0.1
##$AZFW= 0.1
##$BCFW= 1
##$BC_mod= 2
##$BYTORDP= 1
##$COROFFS= 0
##$CY= 7568.61572265625
##$DATMOD= 1
##$DC= 2
##$DFILT= <>
##$DTYPP= 0
##$F1P= 17.9538593292236
##$F2P= -4.03888763876832
##$FCOR= 0.5
##$FTSIZE= 32768
##$FT_mod= 4
##$GAMMA= 1
##$GB= 1
##$INTBC= 1
##$INTSCL= 1
##$ISEN= 128
##$LB= 0.02
##$LEV0= 0
##$LPBIN= 0
##$MAXI= 945.577
##$MC2= 0
##$MEAN= 0
##$ME_mod= 0
##$MI= -402.1523
##$NCOEF= 0
##$NC_proc= 0
##$NLEV= 6
##$NOISF1= 8.587773
##$NOISF2= 6.764455
##$NSP= 1
##$NTH_PI= 0
##$NZP= 0
##$OFFSET= 17.49637
##$PC= 1
##$PHC0= -49.1772
##$PHC1= 10.96906
##$PH_mod= 0
##$PKNL= yes
##$PPARMOD= 0
##$PPDIAG= 0
##$PPIPTYP= 0
##$PPMPNUM= 100
##$PPRESOL= 1
##$PSCAL= 0
##$PSIGN= 0
##$REVERSE= no
##$SF= 200.13
##$SI= 32768
##$SIGF1= 18.5376
##$SIGF2= -6.396296
##$SINO= 400
##$SIOLD= 32768
##$SREGLST= <1H.CDCl3>
##$SSB= 3
##$STSI= 0
##$STSR= 0
##$SW_p= 4401.40845070422
##$SYMM= 0
##$S_DEV= 0
##$TDeff= 0
##$TDoff= 0
##$TI= <>
##$TILT= no
##$TM1= 0
##$TM2= 0
##$TOPLEV= 0
##$USERP1= <user>
##$USERP2= <user>
##$USERP3= <user>
##$USERP4= <user>
##$USERP5= <user>
##$WDW= 1
##$XDIM= 8192
##$YMAX_p= 0
##$YMIN_p= 0
$$ End of Bruker specific parameters
$$ ---------------------------------
##NTUPLES= NMR FID
##VAR_NAME=  TIME,          FID/REAL,        FID/IMAG
##SYMBOL=    X,             R,               I
##VAR_TYPE=  INDEPENDENT,   DEPENDENT,       DEPENDENT
##VAR_FORM=  AFFN,          ASDF,            ASDF
##VAR_DIM=   8192,          8192,            8192
##UNITS=     SECONDS,       ARBITRARY UNITS, ARBITRARY UNITS
##FACTOR=    0.0002272,     1,               1
##FIRST=     0,             0,               0
##LAST=      1.8609952,     118,             108
##MIN=       0,             -3093900,        -3093900
##MAX=       1.8609952,     2356173,         2356173
$$ Real data points
##PAGE= N=1
##DATA TABLE= (X++(R..R)), XYDATA
0 0 0 0 0 0 0 0 0 0 0 0 0 1 -64 64 -64 64 -128 128 -129 192 -256 257 -321 385 -449 513 -578 706 -792
29 -792 900 -1047 1192 -1350 1541 -1734 1957 -2199 2461 -2762 3067 -3425 3808 -4212 4676 -5171
45 -5171 5708 -6308 6950 -7665 8442 -9298 10251 -11290 12463 -13770 15236 -16913
57 -16913 18827 -21054 23689 -26817 30674 -35513 41795 -50366 62762 -82385 118461 -206676
69 -206676 892798 472911 -1654255 -1669824 -1482105 -528546 1007289 2356173 2054567 1038311
79 1038311 -152653 -1382363 -2165828 -1246453 550008 1721714 1871529 1526171 375864
88 375864 -1170821 -1893735 -1324099 -344534 746320 1803214 1964165 714994 -744854
97 -744854 -1362621 -1342569 -930756 204008 1495298 1825035 1116412 145344 -822213 -1542720
107 -1542720 -1318164 -94116 1074479 1477014 1266567 588083 -482257 -1315926 -1324752 -671207
117 -671207 227678 1108461 1466432 880464 -212324 -1001859 -1254673 -1032649 -247720 797152
127 797152 1324168 1029411 305451 -491237 -1130694 -1177637 -472758 450691 1011213 1104087
137 1104087 744237 -41443 -851786 -1138413 -778913 -26741 771017 1168721 872630 140810
147 140810 -522686 -902483 -916226 -423503 380307 926601 918901 506908 -137551 -796747
157 -796747 -1016421 -584165 110379 618003 847794 742263 203983 -499735 -866798 -720477
167 -720477 -226696 399632 854414 817920 349638 -179896 -564594 -740870 -533005 62691
177 62691 632950 795205 562291 83874 -483955 -803612 -610430 -110512 317096 574749
187 574749 639936 352045 -219309 -652309 -669458 -367199 82617 518460 681416 442243
197 442243 -374 -389696 -610125 -545048 -141574 355567 599834 510247 202144 -212165
207 -212165 -544657 -565992 -283914 85157 396782 554139 402049 -36609 -445088 -562179
217 -562179 -407642 -90811 279191 499722 417807 123673 -200923 -448294 -498021 -255466
227 -255466 141453 420374 460827 291520 -29378 -348895 -453005 -302079 -33315 249322
237 249322 452345 410384 102651 -238109 -402080 -375945 -186394 121104 364429 372856 195359
248 195359 -41792 -288212 -429804 -306670 15577 282143 366377 296142 84566 -195893
258 -195893 -351378 -289474 -110813 101003 313066 383508 198547 -100953 -289218 -313424
268 -313424 -208278 12319 243814 319752 224299 56013 -145980 -321941 -311416 -82211
278 -82211 165358 271170 254037 139081 -74212 -264758 -285146 -158928 10880 185859
288 185859 298903 228561 1473 -194258 -250222 -196988 -62363 125751 258242 242635 110097
299 110097 -63927 -217034 -256364 -130940 63824 191213 218356 159116 9760 -168867
309 -168867 -247617 -183588 -47654 100131 215320 212137 63682 -113511 -196237 -181687 -105687
320 -105687 28216 170973 218950 134251 -15603 -147112 -203885 -153000 -19031 116898 184649
331 184649 160152 52459 -87981 -177446 -168238 -82656 38399 152242 188200 102872 -40464
342 -40464 -139615 -162827 -125575 -28209 100530 172597 131696 20919 -84958 -150258 -151267 -70655
354 -70655 55842 147057 149839 76443 -25960 -110636 -142020 -102580 -3550 107371 158967 113738
366 113738 11059 -79130 -124125 -120501 -57662 49372 132455 128543 54632 -32262 -101151 -130308
378 -130308 -87654 15553 107254 127531 85642 18492 -56032 -113568 -109666 -31733 66622 118106
390 118106 102910 45502 -26598 -90932 -114333 -69913 20607 95887 110864 72733 10897 -54387
402 -54387 -98840 -87119 -15405 66068 102997 89170 43552 -22456 -87117 -103903 -50008 31532
414 31532 80628 85217 61335 11271 -56788 -97962 -72060 -696 59452 84496 78801 40490
426 40490 -26179 -82430 -83738 -32226 29918 69263 77689 54349 1407 -58006 -84059 -57338
438 -57338 265 50897 75713 70805 31280 -32357 -75821 -63578 -15129 27094 53902 71091
450 71091 56649 -2547 -64434 -75774 -39973 3778 39037 62826 59063 17843 -35511 -63835
462 -63835 -55275 -20086 24270 58663 65691 38384 -10557 -50600 -56335 -32262 342 32772 59866
475 59866 56759 8568 -46709 -61499 -40432 -16102 11466 45536 57541 26498 -20206 -46964
487 -46964 -51900 -38140 -2321 38736 51922 30582 -5111 -35557 -51975 -46247 -21385 12022
499 12022 40974 47127 17273 -27756 -48435 -40479 -25672 -4590 28906 47762 27364 -10604
511 -10604 -33969 -45834 -48427 -24068 17873 35674 20469 -2313 -22400 -43890 -54111 -36239
523 -36239 -2825 24416 33573 18973 -13654 -37788 -39130 -29588 -15164 11498 34672 29862 4356
536 4356 -18196 -35970 -46128 -27519 11411 29886 18834 6753 -3166 -25795 -44670 -35061 -8054
549 -8054 13914 26147 24482 284 -27166 -34541 -29453 -22376 -3157 22307 26792 8516 -10627
562 -10627 -26597 -38624 -27750 3749 19947 14940 15645 15290 -11065 -38974 -31304 -5571 7676
575 7676 16425 24684 8968 -20689 -28773 -22156 -25115 -19840 9434 26653 9787 -10816 -18869 -28766
589 -28766 -31177 -9582 10894 9861 11268 18429 -1530 -34130 -31271 -4484 3910 5076 20878
602 20878 20806 -7013 -19794 -9737 -14838 -23756 3825 36272 23651 -6068 -10510 -9594 -21140 -14624
616 -14624 9065 14455 8263 15395 11524 -18098 -30822 -9700 4459 3149 15192 26471 6878
629 6878 -13036 -5385 -2865 -15543 466 35958 31921 -1067 -5668 7241 -5564 -18589 -777
642 -777 15392 10135 11511 17762 -3469 -29384 -18167 7068 9519 7540 16307 11606 -3346 -2420
656 -2420 -130 -14001 -10546 20747 30006 5420 -3569 7610 -3350 -21327 -6001 17047 11922
669 11922 6543 17154 7316 -20896 -18594 6887 8822 -2547 6808 16672 5461 -5417 -8121
682 -8121 -17877 -16110 12527 26449 4363 -8910 2687 -484 -17448 -7230 13410 5668 -1484
695 -1484 18080 19768 -12624 -22563 3120 10807 -2832 4675 20069 7279 -11212 -7973 -5436
708 -5436 -10548 833 15012 3783 -6827 5752 7311 -13895 -15157 5399 6793 -534 14175
721 14175 19386 -10022 -23930 2133 13121 -7724 -7309 16963 13406 -9080 -7230 2784 -8026
734 -8026 -11700 7753 15129 3262 2170 4028 -10184 -16307 809 8315 -1874 2359 11227 -5008
748 -5008 -19096 -1835 7488 -12712 -14275 15728 21007 -6585 -14136 675 -1851 -9143 5939
761 5939 16373 2010 -5199 5211 2507 -10719 -6526 3903 939 1171 8783 1097 -12309 -5220
775 -5220 3355 -9012 -10653 13083 18455 -6949 -14221 4706 6037 -8679 -3287 9861 2867 -3302
789 -3302 8553 7952 -11736 -15077 1584 8249 3582 3962 2372 -5819 -3062 4485 -3944 -10135 5830
804 5830 15752 -266 -9763 2854 3483 -12646 -9423 8735 6609 -4527 2334 6469 -9843 -15061
818 -15061 4049 12298 -339 -3438 5230 4019 -1620 170 -3063 -9166 1344 15099 5081 -9655
832 -9655 -3137 3718 -5853 -7232 5952 5402 -5907 354 10664 -2081 -14191 -810 10387 -882
846 -882 -6047 6302 8225 -3588 -6355 -1500 -3795 -2015 7601 5448 -6864 -5219 5117 351
860 351 -8530 -2621 4061 581 2255 8395 -525 -12910 -4420 9207 2359 -7275 309 6736 -2126
875 -2126 -7830 -2717 -2665 -5797 681 6257 -987 -5595 1215 2334 -6081 -5652 3777 5156 1042 1564
891 1564 -509 -6646 -4119 4056 1403 -6644 -2045 6224 2231 -5404 -3793 -1388 -2779 1111 6441
906 6441 1549 -4652 79 4347 -1738 -5970 19 4572 1577 -112 813 -1628 -3441 -294 784
921 784 -2174 -442 4480 3208 -2489 -3275 -1003 -111 1355 3276 902 -1254 1734 3467 -2251 -5888
937 -5888 -264 4428 1616 -662 867 -23 -2330 -1474 1226 307 -45 2864 4061 752 -2282 -1432
953 -1432 106 1550 1485 -612 -509 2447 1843 -3527 -5142 556 4044 660 -625 2287 2289 -892 -18
970 -18 2223 725 -390 3157 5030 907 -2999 -1668 1327 1422 -509 -1036 1110 3494 1732 -2601
986 -2601 -2734 1993 3477 466 631 3773 2562 -1176 358 3015 398 -1875 2304 5993 1530 -3695
1002 -3695 -1321 2756 1125 -1914 -976 2356 3164 651 -1591 -1187 620 899 54 1221 2476 -19
1018 -19 -2145 -283 1565 -1845 -4427 -364 3979 -359 -5497 -2944 1705 -759 -4786 -2132 2212
1033 2212 1184 -2472 -2531 -636 -1515 -3398 -2367 -159 -535 -3387 -4039 -1598 -1118 -4261 -5519 -1221
1049 -1221 1708 -1769 -5177 -2538 383 -2493 -5405 -2053 1213 -1631 -5016 -2754 -214 -3341 -6148
1064 -6148 -3017 650 -1325 -4490 -3285 -166 -1391 -4860 -4188 -24 830 -2403 -3627 -1046 -163 -3417
1080 -3417 -4685 -1138 697 -2495 -4691 -1628 318 -3224 -5965 -2808 990 -1162 -4305 -2373 653
1095 653 -1062 -4410 -2890 367 -409 -3187 -2269 -44 -1859 -5132 -4168 -513 -1382 -5065 -4253 -664
1111 -664 -858 -4769 -5471 -1835 104 -2339 -3708 -1813 -232 -2339 -4576 -2940 -986 -2482 -4476 -3054
1127 -3054 -659 -2922 -6317 -4221 -96 -1924 -5669 -3617 565 -701 -4987 -4116 -243 -656 -2840
1142 -2840 -2327 -772 -1435 -2671 -2073 -1693 -2069 -2303 -1755 -501 -343 -2028 -3575 -1627 1163 -263 -3693
1159 -3693 -1782 2440 945 -3584 -2474 1478 625 -2116 -543 1692 -550 -1916 633 1377 -1542
1174 -1542 -1962 1221 2674 220 -1407 76 1419 1471 608 -1409 -266 2666 2487 -1383 -2383 980
1190 980 1185 -1000 -636 1153 -321 -999 1652 2202 -1698 -1860 2825 4015 108 -1536 1497 2410 966
1207 966 -36 -2 42 1538 2213 -136 -1609 184 2160 522 -65 650 333 456 2225 1826 -1915 -2099
1225 -2099 2934 3456 -1168 -2297 1152 1752 -419 -344 267 -713 289 2516 1230 -1853 -888 2118 1685
1242 1685 -231 83 801 1042 1733 1063 -1951 -1656 2724 2722 -2138 -3230 992 1396 -1559 -1254 -538 -2015
1260 -2015 -1383 2554 1565 -3379 -2470 3035 2839 -1400 -1111 1480 1282 909 1327 -313 -1732 1103 2753
1277 2753 -644 -1981 1127 2161 -1070 -724 879 -1104 -1335 2500 1923 -4028 -3716 2960 2791 -3651
1293 -3651 -3726 1512 1894 -856 -486 302 -1468 -224 3228 1417 -1840 -122 2429 886 -218 1067
1309 1067 -109 -1100 2019 2544 -2573 -3438 2352 2426 -4379 -3990 2707 1576 -4167 -2750 1392 -977
1325 -977 -2685 981 1362 -3302 -2096 2738 1730 -1923 -1330 767 -143 708 1836 -1670 -3336 2185
1341 2185 4201 -2695 -4072 2857 3221 -3366 -2140 4103 868 -4345 -223 3485 -2148 -3978 2602
1356 2602 2844 -4298 -3953 2201 1850 -2001 -852 320 -1022 1097 4134 -966 -4213 2181 6041 -376
1372 -376 -2662 3165 2524 -3188 51 5513 -342 -5611 1150 5384 -2328 -5244 2555 3592 -2972
1387 -2972 -3188 2276 1220 -2162 442 981 -2454 -356 4358 614 -4156 187 3849 -149 -1404
1402 -1404 2318 90 -4493 840 6270 -1363 -7409 226 5520 -1678 -5437 867 2114 -3403 -2572
1417 -2572 1734 -895 -4125 -729 1154 -2829 -2919 1386 251 -3377 -1030 1151 -1237 -567 2999 -355
1433 -355 -5049 90 5628 -503 -6440 -844 3250 -1647 -3910 30 -564 -4770 -1795 2634 -1485
1448 -1485 -5910 -1650 1966 -1132 -2662 -338 -419 -1395 343 386 -2117 -649 3099 130 -3801 -130
1464 -130 3894 67 -3060 628 2206 -1747 -1355 2418 -95 -4483 -1368 3579 332 -4495 -2661
1479 -2661 797 -179 -1302 -963 -1961 -2181 32 390 -1900 -1475 940 146 -1121 597 1621 -680 -362
1496 -362 2389 1724 -1464 284 3447 1110 -2891 -728 2630 1019 -2011 -1846 -608 -414 -55 -426
1512 -426 -1844 -2023 -91 241 -885 -800 -762 -995 64 1531 10 -2019 -232 2559 966 -1394 511
1529 511 2537 737 -474 921 1707 702 719 1037 -142 -344 919 1309 -453 -826 -55 -35 254 970
1547 970 -458 -1757 723 2971 819 -1902 468 2982 1463 350 2342 2206 720 1722 3575
1562 3575 1910 189 2360 3732 1462 103 2018 2451 1309 1029 1475 582 832 2429 1484 -709
1578 -709 635 3207 1608 -472 1207 2122 619 653 2847 1330 -1306 904 3642 1274 -1588 834
1594 834 2988 952 -262 1379 1533 76 1084 1861 21 -705 991 1479 -652 -654 807 69 -583
1611 -583 460 18 -1754 -510 2004 388 -2647 -514 2339 157 -1980 190 1681 -469 -938 1642
1627 1642 1128 -1427 -496 1762 588 -1186 -68 1096 -5 -326 65 -554 -643 518 402 -1473 -610
1644 -610 1454 324 -1615 -21 1750 -28 -1367 724 1757 -1194 -1036 1696 1625 -1175 -807 1638
1660 1638 1096 -960 -251 1040 556 -188 166 176 -82 94 139 -612 -592 434 -167 -1191 -77 878 -779
1679 -779 -1378 825 1371 -1137 -1176 1380 1380 -1431 -1168 1225 705 -1344 -974 515 337 -1141 -564 200
1697 200 -286 -583 -526 -182 55 -232 -662 -596 320 298 -917 -974 661 805 -797 -1305 979 970 -973 -986 979
1718 979 645 -1278 -760 884 513 -985 -551 923 440 -595 -255 635 612 -319 -446 266 548 151 -525
1737 -525 -143 600 238 -1077 -518 732 414 -1008 -526 1299 558 -1127 -565 981 790 -983 -472 888
1755 888 630 -870 -501 696 635 -595 -417 719 720 -269 -377 748 1172 28 -592 154 933 267 -725
1774 -725 -23 862 324 -639 -177 545 253 -857 -137 1092 393 -888 -379 1122 400 -934 -596 987
1792 987 527 -704 -563 630 813 -402 -660 175 672 22 -449 196 414 17 -363 211 664 -38 -806
1811 -806 -78 765 265 -1069 -401 1120 496 -870 -652 569 333 -743 -562 493 121 -522 123 635
1829 635 26 -216 197 992 529 -235 9 801 768 78 -496 79 1052 448 -552 -127 883 447 -319 35
1849 35 924 180 -540 359 910 -254 -711 496 1056 -71 -662 176 723 569 51 -113 300 514 489 -65
1869 -65 -263 531 189 -99 117 126 -276 -703 467 694 -981 -1051 651 805 -748 -1032 329 548 -497
1888 -497 -629 -11 -260 -320 213 1 -349 -144 284 -13 -321 -121 -362 -412 270 369 -1050 -939 780 880
1908 880 -905 -1193 606 851 -807 -478 590 297 -400 802 970 -168 -246 975 904 -119 103 684
1926 684 672 452 577 278 -42 997 1342 -298 -567 977 1222 -410 -292 1130 742 -554 230 1293
1944 1293 -97 -823 774 1476 -399 -716 920 1357 -48 -17 635 288 271 1015 465 -170 632 1124 232
1963 232 -348 847 782 -498 -120 921 -271 -1156 640 1408 -985 -1625 507 1324 -789 -966 375
1980 375 575 -403 122 532 -311 -276 909 861 -177 -139 520 483 372 635 -10 -373 631 1486 -317 -1108
2000 -1108 654 1542 -622 -1312 512 908 -571 -488 613 20 -743 656 1154 -394 -992 764 1674
2017 1674 641 0 280 458 1072 1159 264 -406 997 1922 156 -668 855 1273 -152 -138 1199 426
2035 426 -748 330 1285 -36 -896 745 1580 -138 -861 147 952 758 457 -34 -233 763 1334 2
2053 2 -698 484 898 4 174 934 126 -849 478 1760 173 -1315 341 1459 252 -1042 215
2070 215 760 -46 -448 4 112 -4 374 89 -267 101 690 316 19 774 375 -284 748 1678 -121
2089 -121 -1275 720 2285 350 -947 573 1329 272 5 1009 539 -379 487 1196 235 -293 583
2106 583 766 199 737 746 319 770 1472 751 -493 1142 2414 731 -714 1064 2260 921 57 1100
2124 1100 1168 -23 771 1771 688 -387 723 1908 740 -92 767 835 640 994 909 43 550 1500
2142 1500 733 -486 932 1979 341 -490 772 1389 -20 -85 1065 550 -941 54 1379 31 -1270
2159 -1270 27 1157 -3 -623 68 -144 -258 373 545 -537 -519 449 279 -432 177 506 -638 -753
2177 -753 752 692 -1010 -786 928 275 -1129 -375 954 -242 -1069 -18 563 -468 -672 431 -86
2194 -86 -762 -147 502 -175 -489 -57 -207 -291 120 226 -616 -604 920 486 -828 -492 839 445 -761 115
2214 115 881 -152 -581 529 624 -661 -510 657 342 -705 -352 279 44 -244 -186 -130 -66 228 88 -563
2234 -563 -264 164 190 -735 -276 410 -63 -458 90 537 -292 -504 526 491 -602 -449 617 336 -803
2253 -803 -498 258 84 -431 -349 -62 -156 -82 -70 -357 -368 95 24 -378 0 134 -312 -216 390 207 -214 -489
2275 -489 408 355 -203 -171 457 234 -426 71 404 44 -492 -23 241 148 -218 -215 0 46 60 37 60 285 174
2298 174 -348 -125 576 -77 -520 -156 436 7 -532 -76 233 -221 -494 166 248 -119 -423 126 568 191
2318 191 -202 -172 242 434 178 -230 -50 90 -129 -175 64 331 -56 -105 300 444 -346 -416 361 262 -377 -607
2340 -607 346 529 -201 -330 178 401 -11 -124 17 264 316 -110 -289 -35 326 -75 -180 9 31 -378 -242
2361 -242 282 177 -450 -548 363 250 -408 -159 359 463 -228 -252 181 250 -243 -251 162 309 34 -172 -99 245
2383 245 91 -260 -313 112 237 -219 -214 140 127 -231 4 494 335 -320 -108 677 349 -311 -27 213 296 77
2405 77 -90 257 364 -139 -72 137 381 231 -76 102 300 305 -29 234 369 234 -166 275 744 263 -293
2426 -293 198 859 530 -262 81 733 345 -141 79 539 466 156 137 452 173 -7 86 581 534 241 99
2447 99 472 681 394 69 370 503 51 152 522 546 88 -94 179 937 53 -31 152 715 416 -66 428
2468 428 739 471 84 168 562 609 87 152 554 643 308 255 512 525 312 354 638 442 194 78 670 620 65
2491 65 -99 465 658 355 -76 232 749 427 66 203 431 236 6 168 439 278 -91 129 482 147
2511 147 -267 -11 523 87 -345 116 245 309 -268 -187 219 521 76 -273 -9 322 195 -302 -161 194 135
2532 135 -169 -15 -17 -349 -464 -25 76 -432 -449 59 149 -228 -480 -280 117 -30 -390 -195 210 -132 -215 -230
2554 -230 -208 -195 -199 -191 -272 -159 -226 -354 192 135 -448 -474 232 165 -404 -301 -41 185 -252 -141 121 -17 -113 1
2578 1 145 61 -141 109 156 122 130 -244 -116 363 314 -395 -443 170 230 -85 -314 144 71 -258 29 125 -223 -336
2602 -336 126 136 -61 -297 53 93 91 -101 -304 -6 200 -227 -326 -161 254 256 -219 -292 96 73 -218 -219 233 -173
2626 -173 -228 302 377 -272 -539 158 415 55 -361 -107 -4 210 47 -113 -218 -10 456 -180 -223 239 97
2647 97 -108 -120 218 36 -249 109 321 -302 -553 310 237 -295 -635 363 305 -194 -155 113 -73 -9 138 -64
2669 -64 -186 -238 212 24 -116 281 -86 -81 336 589 133 -281 555 705 196 -317 337 578 -168 -86 247 198
2691 198 -372 25 541 85 -401 48 323 -48 -180 23 131 187 117 -161 -374 29 375 25 -424 70 272
2712 272 -216 -167 271 158 -494 -107 448 74 -416 23 490 -17 -615 58 663 -1 -211 71 0 24 232
2733 232 351 -463 -165 189 83 -248 91 87 -215 70 335 27 -589 -88 590 50 -586 -106 631 175 -383
2754 -383 71 450 -71 -373 22 14 -191 122 10 -34 -166 2 164 -104 119 -119 -260 57 525 -111 -549
2775 -549 55 722 55 -385 -43 425 -78 -156 376 268 -467 -56 368 229 -439 -82 161 21 113 -128 -41
2796 -41 -42 181 -30 -221 17 202 67 -337 133 351 -138 -156 298 239 -154 -215 488 175 -329 -285 93 200
2818 200 -251 -382 -208 170 -56 -58 -168 -113 209 162 -284 82 7 164 -58 108 106 -223 142 511 66 -345
2840 -345 -130 427 203 -233 -151 208 127 -84 218 -62 30 12 -6 -69 -21 -10 -94 -23 -172 41 -346 235 297 -146
2864 -146 -430 25 606 -120 -536 -51 152 18 -38 -135 -163 -229 -139 17 93 -36 -22 227 362 -62 -273 -312 36
2887 36 297 -136 -335 -213 344 27 -367 -268 203 -248 -361 278 128 -290 -325 34 66 -393 -407 224 -137 -285
2909 -285 -253 -13 -39 16 -88 -136 -124 181 -110 -353 -268 60 -111 -231 55 10 -220 -286 356 297 -534 -295 322
2932 322 348 -234 -120 367 229 -56 83 230 -90 -90 111 130 -53 55 27 -156 50 265 -163 -141 165 158 -166
2955 -166 -474 381 333 -185 -67 461 221 -340 -166 398 20 -408 72 339 -3 -145 92 134 -400 -29 51
2976 51 101 100 42 -267 -385 46 197 -158 -123 195 201 -100 -206 224 64 -332 74 415 -26 -141 152 312 -46
2999 -46 -215 26 177 -82 -109 141 187 198 -326 80 11 33 132 -22 14 341 101 -138 99 224 -27 -244 200
3022 200 355 92 -266 70 534 54 -307 165 252 45 33 207 216 35 49 278 112 75 9 76 200 280 99
3045 99 -59 150 144 46 9 -50 265 -29 -422 244 265 -80 -300 -38 357 -98 -239 70 266 -119 -142 85 97
3068 97 -293 -179 56 25 -161 -119 -93 148 25 -144 -209 46 35 -174 -37 224 33 -43 -196 -10 85 -296 -235
3091 -235 142 264 20 -127 113 39 113 -69 126 130 49 -208 116 20 120 -96 -104 242 36 -212 87 247 225
3114 225 25 -71 17 -14 -169 -175 49 0 17 -185 120 65 -1 -192 243 101 -150 9 114 284 -53 -95 90
3137 90 376 -56 -54 -25 79 -53 26 3 131 29 -10 18 156 112 -63 -120 93 -25 -210 -306 -2 106 -297 -151
3161 -151 -105 68 -113 -214 -87 -28 -201 -56 -74 -114 -187 -232 11 64 -30 -246 25 79 -88 -236 32 124 -111
3184 -111 -118 -49 52 146 61 -69 202 -24 -146 88 249 109 -81 52 89 54 -120 67 271 57 -133 -82 -33
3207 -33 90 -45 -9 -45 144 251 -215 68 145 -226 -138 132 49 -83 -125 36 107 22 -130 -65 261 57 -45
3230 -45 -28 92 -144 -101 22 -102 -25 -44 -58 64 -11 -4 0 178 271 -146 -108 206 214 -13 -156 130 161 28 -54 87
3256 87 74 -109 -132 109 -47 -281 -10 38 50 19 -208 -101 76 249 -28 -167 327 60 -86 -186 182 33
3278 33 -204 -143 245 -203 -142 46 171 132 -278 34 55 -107 -247 4 195 188 -50 31 223 81 217 -129 50
3301 50 219 47 72 128 157 -8 -194 82 271 -5 -160 45 345 -109 -136 126 241 -85 -29 226 -43 158
3323 158 -92 48 -95 -38 46 -116 76 125 131 -49 -50 99 129 7 101 363 66 -235 60 223 79 -188 298
3346 298 257 -92 -222 211 75 -32 -106 142 46 -15 -91 51 104 154 -7 -203 -81 61 -40 -124 35 116 25
3369 25 -267 -23 84 -109 -69 -38 62 -82 -2 71 -121 -264 -197 24 29 -84 -154 -138 -6 -77 -203 -203 -59 128
3393 128 -236 -312 192 209 6 -155 153 -38 -186 15 -2 -71 -62 -142 68 -58 -105 -345 155 -223 -114 -65 -11
3416 -11 86 90 9 -137 203 -43 -35 126 6 57 -46 19 241 189 -134 293 393 -59 -227 107 166 35 18 55
3440 55 80 -89 77 115 130 -132 -66 22 32 63 -53 -1 -52 158 -98 -285 24 259 80 -316 184 151 -68 -119
3464 -119 62 103 -75 -236 105 72 -302 -59 -94 -122 -204 -120 -204 -128 -187 -129 -182 -64 -75 -118 -378 -25 21 -281 -359
3489 -359 23 110 -156 -47 91 27 -226 0 269 200 -203 -64 345 168 -96 38 96 69 -153 140 -24 -125
3511 -125 27 -34 -82 151 112 37 -54 49 91 -94 -85 254 119 -210 48 241 265 23 54 55 38 -40 -114 77 -241
3536 -241 -35 105 99 -69 -64 -83 -38 234 -35 -52 -144 145 -13 -4 -59 119 -90 -11 -37 118 -36 -258 -36 4 6
3561 6 -229 152 140 -93 -193 78 125 -26 71 -49 92 -54 -166 30 67 78 78 -47 -73 256 24 -79 107
3584 107 157 74 -21 166 143 -78 -145 -49 163 110 -86 94 57 -22 42 261 161 153 -64 83 -24 -50 41 8 197
3609 197 149 30 -86 -14 190 -77 -288 54 134 -63 2 -81 20 -339 -44 -60 144 36 32 -113 10 29 -177
3632 -177 120 -63 -13 -122 56 35 138 -150 -27 39 130 -128 -181 4 48 -32 78 210 35 28 78 8 33 41 153
3657 153 186 37 0 69 -117 151 -86 -55 -13 133 115 8 -19 62 -65 43 155 136 68 25 28 286 142 -135
3681 -135 18 -53 -86 -202 -145 3 -12 -14 9 32 27 -27 -38 59 102 77 -20 -25 229 26 13 -30 60 104 -87 57 224
3708 224 -83 -30 131 95 49 -88 102 69 88 -21 -58 42 -188 -66 -103 24 67 10 38 64 105 -120 -41 25 80
3733 80 1 -61 -42 130 -221 120 124 -40 61 -55 19 146 95 54 64 86 0 -117 153 64 267 -9 -149 11
3757 11 11 -128 22 55 126 -38 126 130 9 -52 -110 114 -23 -138 30 78 21 -8 -68 125 120 -71 -55 34 74 -179
3783 -179 -123 -69 -35 -120 -121 -102 2 48 -52 -38 79 -5 39 124 59 -83 -143 45 151 11 -240 -24 255 -42 -62
3808 -62 23 55 -11 -222 31 -20 83 -94 -46 41 -41 -100 -126 39 202 99 -63 46 165 -71 -141 58 -2 94
3832 94 -84 -145 82 21 -175 -11 206 -34 -82 -131 40 -27 -111 59 -80 -84 -224 -114 49 137 -225 -11 82 7
3856 7 -123 -35 216 127 -57 -84 59 127 -206 -34 16 65 25 -80 102 80 -24 -62 -1 104 -33 -265 -187 -5
3880 -5 2 83 88 86 -20 -139 84 114 -103 -210 -145 92 188 32 16 106 55 9 -61 207 180 -183 -2 149 217 181 -175
3907 -175 93 149 36 -78 38 180 13 34 -7 -124 -57 -68 95 60 -11 68 34 12 153 -64 -56 131 17 -15
3931 -15 -12 -42 3 41 -15 1 -33 82 7 89 -53 -119 15 -55 118 7 47 107 53 -130 26 141 161 -98 -151 71
3957 71 241 123 39 -86 -19 40 101 12 114 -17 -288 -56 42 124 -42 -178 36 43 -16 -158 105 -143 -106 -74
3981 -74 53 75 -20 -18 122 81 159 -104 -58 241 63 52 -44 240 158 -172 105 152 1 -104 -48 321 68 45 -52
4006 -52 65 84 10 -73 107 172 123 11 70 -2 -24 -231 -1 37 -58 27 110 151 -27 -61 -40 -85 -93 -97 31 29 -147 -115
4034 -115 14 164 90 -45 81 -16 27 -27 -126 6 -105 -91 90 -119 -123 -157 -13 144 268 75 -143 140 124
4057 124 -157 -23 14 79 -132 -16 152 106 -43 -150 209 70 106 -146 -98 66 72 56 -5 127 142 15 -16 -1
4081 -1 55 63 -56 3 21 -115 76 14 92 -27 134 235 208 28 -35 126 14 -121 -116 -46 -10 -30 125 170 40 114
4107 114 -17 -74 -1 163 -6 119 148 56 -95 7 49 78 -76 102 45 86 -37 -138 86 -257 -248 169 78 16
4131 16 145 -14 50 -50 -17 -12 56 47 -124 -26 20 -13 -30 -244 -94 34 -123 -105 -18 -106 -23 -92 2 20 -7 52 30
4158 30 86 -61 -24 -4 82 -63 -44 -212 110 -108 -214 125 -57 -168 -71 -189 40 -165 21 -13 -164 138 -183
4181 -183 -163 -40 30 -244 -70 -149 99 -26 -71 36 138 50 85 21 -237 73 -40 130 4 191 -50 57
4203 57 155 52 -247 -92 141 -29 -140 42 25 47 165 -61 38 -145 -150 65 -30 -63 0 -94 -95 65 95 61 124
4228 124 28 -27 -19 -8 110 137 -98 -79 85 217 -9 65 16 -10 -73 32 98 28 4 -127 108 -69 100 2 77
4253 77 146 73 30 -107 188 -12 -115 101 26 -9 37 136 82 52 51 10 -46 39 -42 72 88 81 76 -117 19 38 -159
4280 -159 -105 26 -144 -16 5 -108 -194 65 -51 -43 91 -58 -67 -30 85 -65 -239 77 80 -30 -206 54 121 -76
4304 -76 -25 -64 246 -26 24 -116 141 -23 -17 55 -30 -160 63 -33 54 -13 46 67 -39 -25 -119 26 26 -28 3 -166
4330 -166 -73 143 113 -92 -84 123 86 -42 6 -74 -14 -26 -28 63 -52 -35 22 -37 -28 -216 68 -59 199 -25 -70 113
4356 113 -124 104 -99 -26 46 -134 203 13 -16 109 -77 193 115 -111 203 96 -37 -108 -126 114 -165 -12
4378 -12 47 -140 -104 -154 -14 67 -46 -153 166 -53 -6 138 106 40 -21 -1 139 -128 72 90 -100 -63 -5 86 -207
4403 -207 79 28 4 -191 -44 100 12 -118 -11 -18 -39 35 202 219 -62 219 -62 -12 -55 -114 -66 118 22 -15 -31
4428 -31 55 74 19 -181 80 110 15 -132 -16 -13 -67 -105 0 53 -24 33 -181 91 113 5 81 60 -22 -77 152 -54
4454 -54 -18 -30 198 -63 159 -147 -25 117 100 -64 52 117 25 10 12 -24 85 74 -19 155 37 -85 37 61
4478 61 23 -38 75 143 104 160 -176 -75 3 165 -71 28 41 38 76 190 -29 82 -48 17 121 -61 264 117
4502 117 80 24 -98 -85 -51 111 97 130 139 -12 -82 78 22 54 165 -157 -28 119 7 86 29 -66 -50 -33 -47 109
4528 109 -96 50 -11 85 -163 -220 23 96 -82 30 -27 27 -37 -33 -51 29 52 -43 106 110 -5 -94 -114 138 112 -154
4554 -154 23 62 153 40 60 70 98 79 -132 -210 187 8 46 123 -79 205 -79 -6 184 16 -21 -132 95 16
4578 16 47 -49 -87 22 40 -300 15 231 -191 -30 -200 39 -27 -30 -139 -12 -131 -129 87 45 -38 -92 55 29 -17
4603 -17 55 176 229 88 -80 -8 -40 -29 -85 -35 14 202 -105 35 209 -99 -133 124 37 65 -52 -121 39 17 -73
4628 -73 83 -48 -4 -46 -54 -36 -172 -48 22 31 -134 165 -122 17 108 -52 -213 -146 -25 66 -65 -155 -19 -36 -160
4653 -160 -110 223 -80 -29 89 69 68 36 -41 57 -7 -41 165 -134 -46 195 41 -3 107 -32 -114 41 -193 11
4677 11 -105 20 -22 -4 -132 -107 129 46 -168 24 -124 -71 1 -143 172 -2 -8 -147 -32 -174 129 -18 31
4700 31 64 -17 -48 -27 -22 -68 110 102 30 -17 24 -1 48 -18 111 153 46 -6 80 109 151 -41 6 9 -71 -8 28 48 -129
4729 -129 125 25 150 152 -1 -127 -115 56 -14 -213 23 -78 -138 -22 -45 56 2 -100 -80 57 79 -78 12
4752 12 207 -27 111 -51 -59 76 -46 -46 -36 35 55 -2 108 89 89 -55 22 -162 -58 -72 -85 19 -126 -100 100
4777 100 7 -99 -16 -130 102 66 24 132 127 -68 -37 -140 -1 -70 17 -59 -33 -59 -13 6 -224 198 -68 -87 -240
4802 -240 -55 -40 76 90 173 -60 -33 220 191 -126 -57 126 38 66 53 -59 101 -105 83 109 5 121 -7
4825 -7 -117 30 127 -70 34 32 13 90 -31 -21 32 -4 -69 -112 -6 -138 24 86 57 -41 0 -83 44 81 -127 -97
4851 -97 54 100 101 195 6 81 29 107 95 138 3 -91 46 80 -140 -76 -8 72 125 109 98 -148 -20 110 -64 81
4877 81 13 84 218 119 -30 -102 -68 78 226 -23 -110 163 16 -107 -144 -12 58 235 79 150 176 -97 123 -167
4901 -167 -47 70 63 120 77 -96 116 -90 -80 292 -20 107 109 -204 -12 45 29 -129 -124 -93 -81 -25 79 142 106
4926 106 23 130 118 153 80 -96 -130 102 74 22 23 81 31 24 -90 54 70 -71 -19 79 -12 -25 -101 -22 162 -176 -56
4953 -56 -148 -29 -88 59 -22 144 -37 -96 23 109 -15 -60 86 23 -53 -61 49 -1 -19 65 -40 224 73 25 29 141
4979 141 70 42 -167 103 162 70 -111 120 -126 -114 -71 88 215 37 59 44 66 66 -40 61 17 -32 -16 -57 75
5004 75 -148 107 25 -12 124 176 -9 -14 75 20 -140 33 -103 135 156 53 64 -78 -28 156 161 -107 93 93 -103
5029 -103 -52 -61 -123 194 -104 -60 215 20 90 84 192 -88 82 43 -103 14 -7 -54 -35 46 5 58 -129 -29 67
5054 67 8 101 83 -10 94 -149 166 18 47 -90 -53 66 -37 -26 -53 42 178 48 66 94 -21 -48 -27 -48 -71
5079 -71 32 207 174 74 120 -138 -20 8 53 88 60 41 -53 -133 -68 -173 20 252 -75 59 -79 7 34 -43 9
5104 9 38 -37 13 -72 -5 -31 32 33 115 -95 13 81 -163 2 -154 63 -165 19 26 -8 42 40 65 38 157 143 128 -64
5132 -64 -39 -52 -32 -153 50 -57 -107 -140 21 -52 -50 -214 -35 -4 40 -15 -6 7 -41 102 -38 -41 94 -36 64 2
5158 2 -26 -88 45 -221 -77 -22 -33 31 82 -5 113 -48 30 43 85 -1 -16 20 -36 76 25 194 85 -31 -22 61 59
5185 59 -94 -79 -21 46 -19 16 -47 -140 -126 -127 24 62 -189 -67 -10 -107 -6 -46 63 -106 -113 -31 -5 -197 137 -222
5211 -222 36 59 70 143 43 51 -42 -14 -72 109 -101 -147 80 26 122 -59 -33 11 29 17 -99 -155 -80 110 22 86
5237 86 -148 -18 -125 17 78 0 79 -108 180 -107 -8 -203 -38 -145 44 47 32 15 -119 202 -96 -101 33 -201
5261 -201 -3 17 87 79 79 58 59 12 -5 140 32 -69 38 61 125 43 151 -22 92 -25 43 106 73 21 199 -62
5287 -62 81 30 59 16 -84 -2 -143 60 -40 -224 116 68 -35 8 100 -68 -34 -74 -91 111 39 -63 -21 118
5311 118 116 -128 -10 -26 -37 53 48 88 9 -65 -78 -40 -78 -13 45 -121 -40 131 -101 64 -89 -43 214 186 136 -2
5337 -2 -126 -98 -23 -39 54 74 226 128 81 -107 -131 66 61 -101 39 46 -61 -32 -57 78 -29 60 21 88 -17 -87 52
5364 52 107 16 32 130 229 22 54 176 -15 129 96 -75 -117 89 136 124 126 -20 -131 -49 44 197 3 -86 21
5389 21 126 -68 29 -133 16 -25 -122 -13 -9 -167 26 -168 -173 -12 -243 -117 -7 -13 -138 141 61 58 -82 21
5413 21 30 -26 77 67 112 254 24 25 98 73 149 -21 -19 -6 109 -47 85 223 -15 68 181 91 -170 -12 -127
5438 -127 82 -10 21 -61 -127 -43 -89 95 18 -74 -19 -120 188 -62 -7 -138 48 109 -72 35 -58 -75 -127 -49 104
5463 104 46 -26 69 -114 154 -44 -38 59 42 -9 -39 145 -50 42 -176 196 -155 174 48 24 -68 83 30 -159
5487 -159 -33 11 -130 -42 12 34 -121 52 -23 -87 7 22 -143 -264 -191 64 43 -108 40 29 -85 106 51 -46
5511 -46 -39 -49 -57 79 61 150 106 44 10 -146 -52 -16 -52 10 183 -25 68 49 298 -9 -113 -24 94 -124 -24 -125
5537 -125 -99 -26 -92 90 35 -74 -3 -49 -105 -100 36 60 -190 44 15 64 62 -30 -113 -48 -32 -65 17 53 109 -75 -86 5
5565 5 -24 -14 -75 -64 26 -93 42 -34 -15 -89 -7 76 40 68 -77 151 -23 58 40 -4 46 -176 -78 -2 -198 -53 -62
5592 -62 131 -85 1 102 -13 49 -61 55 -46 62 -21 -217 15 31 -89 79 -13 -58 122 156 -86 -211 57
5615 57 60 -13 167 42 -46 -222 226 -37 -41 -84 75 -25 199 73 146 25 63 -50 -181 9 32 -29 124 45
5639 45 57 196 -177 31 -40 75 120 -118 64 -162 120 -15 -68 -38 126 -135 98 26 -2 -12 -2 4 -50 20 62
5664 62 64 81 -85 46 113 -89 126 17 9 6 -62 127 54 121 -24 37 -59 180 -68 42 87 85 -8 3 119 47 -156
5691 -156 283 45 -233 58 -81 113 -89 -31 -108 177 109 -59 -281 -201 152 40 9 -82 22 -40 52 -6 80
5714 80 -5 -5 1 -131 207 151 -44 108 81 43 49 -45 47 -123 -121 85 85 -12 -189 -39 -54 -49 -1 -11 80 -108 36 140
5742 140 5 -53 107 89 42 -83 23 49 -237 78 -44 -151 48 124 44 144 -117 -97 61 169 36 -51 39
5765 39 -36 147 -169 52 59 -72 45 -23 221 64 76 -20 16 218 -75 -17 -41 33 -138 69 77 56 -141 47 -6
5790 -6 -84 42 -44 0 -35 -53 6 80 -111 129 -50 50 80 79 -11 -159 -20 25 79 -205 -92 -82 55 -68 -14 43
5816 43 102 -53 -48 83 100 -118 35 148 96 -118 83 -91 137 24 -67 -43 -127 38 37 -8 195 -50 -86 154
5840 154 161 -107 -235 -97 -105 -49 -93 28 49 -142 -55 -80 67 33 98 140 -1 226 -15 -112 15 -89 54 18 -204
5865 -204 42 -43 158 -133 -174 -15 -116 52 -18 -69 -76 78 56 145 -8 112 -65 150 -72 -70 154 54 84 -14
5889 -14 -132 -5 -32 -119 43 -79 -62 -70 40 19 -43 18 -174 -133 -46 -227 -27 123 157 19 -5 -71 15 -36 81
5914 81 8 42 -184 -53 66 -117 -58 78 28 18 165 -46 -51 8 23 203 -104 -19 -67 -58 95 101 -108 151 -42
5939 -42 62 47 -79 98 47 47 -107 -31 35 -17 -25 107 8 81 -51 201 43 30 -45 22 88 -143 -31 108 6
5964 6 -184 -108 94 67 -148 129 -17 -59 102 -55 14 -193 68 -82 39 -53 264 -49 165 72 -7 13 61 -62
5988 -62 99 110 28 48 -92 14 -35 88 -16 -83 -32 80 -9 97 -88 41 171 40 -182 -150 91 -46 231
6011 231 35 -76 -61 49 -150 -46 -70 -23 -39 -92 74 -45 -72 -101 -52 121 -144 -3 85 188 66 21 -26 -76
6035 -76 -93 38 49 235 77 -49 9 237 186 56 205 95 -7 -7 -87 -47 62 57 83 43 44 79 -117 -61 -6 -113
6061 -113 48 -109 18 -166 5 -84 -5 85 -56 -135 132 -13 -48 40 70 -146 -7 61 99 -2 26 118 28 -179
6085 -179 -5 44 23 104 74 20 -118 197 -63 -30 43 -106 0 92 168 -67 -42 -57 -60 -54 -341 66 73 -178 -73 -42
6111 -42 86 -85 60 -5 44 -85 -83 90 34 -30 63 -79 -87 45 -29 -21 110 41 -108 4 16 -95 -35 25 22 43 43
6138 43 53 76 -50 225 -6 -96 151 21 40 37 93 127 -11 -88 -32 -106 148 38 -136 66 -76 7 -87 -55 125
6163 125 -59 -20 -33 75 18 -71 3 3 -17 -44 -91 -97 58 -44 169 -197 -83 25 -84 -5 128 10 95 87 1 -152
6189 -152 -25 -9 -59 -17 -54 -73 83 36 -197 -123 11 45 -63 -47 -228 10 168 79 -53 -29 52 4 -62 -31 -68
6214 -68 105 172 -69 99 92 -28 -72 -41 92 -105 -114 -119 -115 88 -116 -60 -5 -13 -56 -133 9 54 57 28 -54 79 -76 218
6242 218 -66 197 -114 77 -138 208 -39 112 50 31 -157 -4 -68 -33 17 -57 44 -204 13 31 -11 71 -59
6265 -59 -6 53 53 -87 -142 -126 -117 -189 -36 59 -26 -144 163 41 73 6 75 156 128 -203 -12 99 -86 11 -171 61
6291 61 117 -123 65 46 -110 53 85 -113 -59 -18 13 -135 30 68 21 -108 -166 74 -45 -33 35 95 -22 -40 -78
6316 -78 -25 122 -24 28 -89 -204 -81 38 105 -14 -66 60 82 62 -45 -101 111 138 -78 -57 164 -34 -176
6339 -176 137 -13 -104 36 26 100 -95 -31 127 137 108 -33 2 -75 -188 -33 -133 -49 -34 -74 108 -23 4 -30
6363 -30 45 -25 -3 59 80 -84 70 100 -5 168 65 133 101 -74 -9 76 3 -247 113 125 155 269 1 185 122
6388 122 32 -61 121 9 7 126 11 -9 -91 118 5 -31 64 69 102 -37 26 -127 -106 -63 14 23 -5 99 -137 100
6414 100 61 -147 -66 -55 95 147 -22 -23 -62 12 -52 129 -190 61 -70 -22 -180 1 -36 76 -7 -34 -71 -16 -221
6439 -221 -20 71 -47 -19 -114 -51 15 167 -85 26 2 -14 34 25 142 122 -30 11 -179 235 96 -98 -8 57 34
6464 34 159 62 160 -9 77 -210 -13 -43 2 81 -62 40 -50 68 -88 14 95 63 29 63 -30 83 -9 138 105
6489 105 -158 -5 -8 -7 -218 101 -60 -206 58 -81 -7 12 -55 -77 -37 -155 -134 151 116 -64 42 99 -8 39
6513 39 38 -22 3 -68 3 -173 -7 -162 -53 96 26 -161 50 2 -42 -174 -111 162 -48 25 75 171 -223 -32 29
6538 29 91 158 83 60 126 62 136 129 41 40 86 -24 -60 23 49 -38 56 -122 -184 -27 29 24 -91 114 -62 -240 -38 51
6566 51 -119 -170 163 -48 24 -134 -40 -58 50 -71 -26 -99 7 2 -185 -94 192 128 74 21 110 19 31 44 65 54
6592 54 -57 -35 74 -35 -64 -103 -127 139 -55 -48 109 40 -30 193 -122 -68 35 98 -82 34 17 -42 79 1 -21
6617 -21 160 158 18 103 -122 39 -2 -54 -52 23 84 110 -74 -99 41 24 -27 41 135 101 44 117 21 -51 -75 17 63 -5
6645 -5 -55 32 136 -19 -32 65 -124 85 52 -58 71 2 110 -22 -44 74 122 -3 -40 135 35 -48 68 -135
6669 -135 -248 0 125 18 -40 51 -36 55 75 188 140 92 174 63 18 41 105 115 77 -9 69 115 82 74 52 -141 69
6696 69 33 87 -123 -41 39 134 101 -128 31 33 -66 -129 77 14 98 135 -34 128 -104 3 -39 -164 37 -114 -147
6721 -147 -154 93 41 -6 -91 -50 39 -68 -154 9 53 -21 32 -200 106 29 2 26 -81 0 -107 -176 -86 146 -143 18
6747 18 47 46 -20 24 108 -33 -61 18 -116 -26 -35 118 74 -25 1 -156 -36 -113 -75 158 -60 -103 -85 72 -81 -64 -8
6774 -8 -108 57 -261 -137 -74 -104 71 -198 -69 77 83 -89 47 -99 63 126 -124 -58 80 27 -174 1 58
6797 58 -63 7 129 -22 -142 5 138 28 5 226 20 -159 20 58 129 -172 -109 -51 28 5 41 21 -94 -181
6821 -181 58 -162 -65 -37 17 20 8 -73 -144 -126 76 -3 -122 59 -9 -26 -134 -75 -51 9 64 -81 64 -32 7 96
6847 96 56 -173 28 75 118 39 42 -75 109 67 11 38 -51 95 56 176 43 -133 -121 6 -100 -18 93 -11 94
6872 94 -33 155 -12 -34 -98 57 22 -53 -105 138 42 -151 9 -169 121 -88 -21 144 -45 163 -29 -186 -76
6895 -76 202 85 -79 19 203 44 -72 57 -166 -275 2 146 -115 -182 -23 -86 -128 14 81 -68 -65 62 50
6918 50 30 88 -4 -116 -15 139 -37 -72 -14 -21 -16 162 75 120 72 -145 137 -6 -41 -160 -115 -27 154 78 -13 -33
6944 -33 -95 -3 54 14 82 -91 66 80 -85 98 121 262 -34 -70 -12 76 41 -119 -104 -15 -54 42 -19 -20 -35 -97 36
6971 36 -110 11 -60 1 -160 132 -123 8 102 97 -76 116 -69 36 -134 -56 -22 207 166 23 51 -78 15 13
6995 13 60 140 150 -70 -31 -51 158 142 82 -22 -64 -25 51 32 4 -40 -101 -108 6 -14 57 35 28 91 -18 -90 -58 -171
7023 -171 40 46 -33 1 -103 81 -185 -194 -53 -4 136 -15 7 -51 30 11 -151 -21 10 60 -51 -78 29 7 -23
7048 -23 50 -72 117 123 -60 26 -15 -88 30 -8 167 29 -160 239 21 6 -13 62 74 -29 4 31 78 24 -135
7073 -135 -65 -12 -49 33 -40 63 51 -160 -119 44 58 -173 -146 94 60 -23 50 76 95 144 -126 75 51 -86 184
7098 184 -111 -77 -65 -104 -68 57 -152 8 112 102 -38 -32 13 -23 137 39 44 15 131 -90 22 74 116 58 -54
7123 -54 -157 -149 222 -9 15 2 -179 16 -63 96 -43 120 66 -66 41 -113 -20 90 -7 21 77 -20 76 36 -41
7148 -41 28 -29 -54 180 59 33 48 142 91 46 92 -23 -59 -38 76 -112 -29 8 -56 -56 -72 -81 -49 110 40 1 5 -102
7176 -102 -14 -141 -117 -14 -72 -6 -6 -28 0 -23 97 3 -132 46 -26 -47 -70 15 45 0 -80 90 -48 176 -16 39
7202 39 -110 33 60 -68 93 122 6 187 20 98 25 -58 -54 9 -130 23 10 -22 -36 33 40 75 100 -24 57 175
7228 175 49 -101 55 -36 174 -38 -104 -34 123 -84 163 -64 48 -25 71 235 -43 67 -184 -152 38 35 26
7251 26 49 19 -33 -79 -1 -12 13 -8 21 36 12 -40 198 23 -18 -186 -199 163 85 23 12 100 -187 -1 -116 -84 51
7278 51 -43 -44 -11 43 -3 137 61 51 15 -4 122 -98 -16 49 -72 49 -10 96 40 62 -176 -98 43 118 -120 -14
7304 -14 8 78 60 -61 35 27 -22 -68 155 -27 -27 -126 96 115 127 70 147 61 57 -136 52 23 49 -101 65 52 145 -69
7332 -69 112 -5 7 148 48 -7 -54 75 179 54 107 33 -31 -119 -117 44 37 44 15 84 -122 -4 55 142 -91 9
7358 9 142 -70 -46 53 -101 -90 51 -108 -74 -126 40 74 80 -17 -14 0 7 -14 -55 19 58 -97 -31 6 168 181 -65 -26
7386 -26 36 -130 22 -61 -105 92 26 21 -5 -42 -44 73 5 -77 -80 23 34 -183 111 51 16 195 -17 91 151 31
7412 31 -72 -131 -93 115 13 -47 81 -55 -2 0 -2 123 21 -9 -38 -88 -50 -97 -16 -222 17 27 -74 109 -42
7437 -42 202 7 -93 36 124 -57 103 -7 -130 -72 20 109 -22 99 27 63 169 63 -69 92 59 58 2 104
7461 104 -126 9 -52 -171 101 -169 -33 -187 -44 85 -42 23 -39 28 21 41 -8 -94 24 140 -95 -179 -97 128
7485 128 43 20 -125 59 -59 -124 5 7 1 -12 51 -58 -69 26 38 -159 102 -38 43 -165 -122 33 -80 37 -21
7510 -21 49 -52 7 -185 -94 5 124 -220 7 55 12 -25 -44 -128 -121 105 -63 -166 212 60 22 66 -129 -37 146
7535 146 25 -62 80 -7 -81 18 14 -24 -97 -92 -37 165 6 -157 -9 104 41 47 106 65 25 177 9 -42 170 119
7561 119 -2 81 -92 69 61 60 52 11 38 -24 -115 141 -29 -43 107 158 19 -37 6 -3 -47 22 201 172 -15 -85 -64
7588 -64 -78 113 90 -117 17 191 -60 70 -89 -4 -62 235 86 105 37 -73 81 -7 104 -32 113 -72 -117
7611 -117 -77 -68 -64 55 24 -72 70 52 -15 25 21 130 94 -13 -81 170 -20 62 117 119 205 88 -4 -138 -11 -28 -47
7638 -47 -196 -81 31 -92 -78 -69 91 99 -177 85 93 160 -116 -54 79 -38 -22 10 -33 93 -53 -71 189 -94 123
7663 123 62 50 -61 -19 53 -31 101 149 3 23 -99 -110 77 -83 -52 -114 -106 43 -53 -88 -100 -30 210 57 20 68
7689 68 81 -138 -11 219 108 -39 52 86 -109 -169 -78 16 11 19 -16 -102 -219 48 -45 -105 113 -7 29 -10 -126 112
7715 112 -38 201 -71 131 68 -117 1 -16 -99 -31 214 51 3 79 -102 -60 50 29 -28 -1 -36 -148 92 -37
7739 -37 -33 -94 85 89 25 -74 52 68 -119 -13 -31 -29 -54 -53 32 202 52 -69 185 20 34 -93 -10 -82 74 -97
7765 -97 16 -73 -24 123 24 61 -98 -122 -62 -192 241 131 -126 -224 -69 143 -44 -132 52 29 -140 52 -145
7788 -145 -61 -47 186 32 -33 -98 -64 7 123 -116 -2 -108 -66 -36 97 81 -120 208 133 61 -15 -12 138 24 62
7813 62 -84 35 177 172 171 -2 -53 -30 68 -5 0 1 76 48 69 24 101 -121 -76 11 -23 -18 -119 -25 -27 119 -22 -121 53
7842 53 8 -100 4 89 0 -83 -49 78 129 -103 -92 -142 77 99 -34 -44 -113 -80 82 83 33 -31 -56 -131 71 51 -5
7869 -5 -40 -77 -51 69 96 70 -4 -2 113 51 42 62 30 -44 -54 -41 169 116 97 -16 179 40 37 -20 -129 -1 28 -56
7897 -56 41 14 -48 58 50 25 209 -59 -82 181 13 59 -143 -95 62 219 4 162 -111 67 29 39 124 -14
7921 -14 -46 -28 15 -83 -128 11 98 24 -11 -56 96 91 -34 43 51 130 -70 72 -20 70 103 153 49 56 -127 -212 -7 31
7949 31 152 95 79 15 -69 40 68 50 -10 -58 29 -24 102 67 46 -18 195 -3 -87 -26 -87 -7 -16 -45 30 141 12
7976 12 6 75 -20 76 20 44 -199 60 -41 32 107 182 -25 -14 42 -3 -14 51 175 -23 8 -193 -50 -60 -81 -97 60
8003 60 68 30 76 -127 -131 77 -124 39 45 -30 -59 -116 -54 -29 103 122 -20 -48 -28 -32 -191 -8 -154 -48 158 106 73
8030 73 -125 -7 -56 -112 40 74 58 -31 -70 137 88 135 52 71 104 56 90 -67 -30 141 -13 -59 32 5 -121 197
8056 197 -12 -116 19 -136 31 149 63 100 -84 -15 19 -28 -75 164 67 67 231 -68 64 -183 -49 -39 15 -27
8080 -27 -27 -74 -1 -48 -132 -31 -74 -87 8 72 81 -78 174 -90 59 -73 47 -195 -69 160 -25 -97 111 -22 20
8105 20 81 -9 210 154 135 -144 -114 -36 -74 -2 226 -41 55 -91 -86 -54 -53 12 58 -91 -62 -82 -51 -4 -25 -34 67 93
8133 93 35 198 -93 15 168 -64 -66 167 90 82 186 -15 -6 -60 97 38 -58 75 58 139 -118 -128 85 128 9
8158 9 -29 41 76 -178 45 142 -22 66 -166 77 202 -64 105 126 37 44 -41 -175 85 98 -6 54 -30 -40 6 36
8184 36 51 15 -3 29 -47 -86 118
8191A18
$$ Imaginary data points
##PAGE= N=2
##DATA TABLE= (X++(I..I)), XYDATA
0 0 0 0 0 0 0 0 0 0 0 0 0 -64 64 -64 64 -64 96 -128 128 -192 193 -256 258 -321 385 -449 514 -604 706
29 706 -797 902 -1027 1180 -1342 1500 -1693 1893 -2136 2384 -2652 2961 -3280 3631 -4024 4445
45 4445 -4912 5421 -5976 6588 -7251 7998 -8811 9708 -10722 11851 -13131 14591 -16268
58 -16268 18235 -20560 23363 -26841 31247 -37077 45169 -57181 76976 -115345 217870
69 217870 -1086417 -3093900 -1665790 -309651 883990 1781386 2064910 726952 -866069
78 -866069 -1719950 -1831525 -1385627 212395 1897441 2191191 1126341 -46517 -1151961
87 -1151961 -1943492 -1627219 -175049 1084317 1604126 1576499 794087 -800456 -1903282
96 -1903282 -1609702 -596239 312277 1208140 1741041 1159286 -205577 -1190519 -1462154 -1197935
106 -1197935 -259893 1087362 1758555 1281874 305709 -578600 -1238285 -1309775 -546416 531381
116 531381 1241061 1403959 947600 -112014 -1133793 -1345385 -802818 -17127 786460 1336244
126 1336244 1122612 189071 -738324 -1174029 -1109980 -522559 438369 1133932 1086033 505087
136 505087 -219575 -884225 -1175473 -793963 51388 822305 1154723 897449 124587 -687398
146 -687398 -1006646 -788029 -273764 398540 968518 995541 428043 -288034 -796316 -967517
156 -967517 -637881 122943 775411 885031 567660 67813 -518434 -923467 -789634 -189273
166 -189273 449414 823463 797320 326548 -327097 -714885 -690600 -401219 80423 631336
176 631336 871751 576431 3611 -488714 -738375 -609418 -77714 500990 714614 570559
186 570559 261319 -179176 -621315 -709078 -332418 192577 557564 661052 440156 -46575
196 -46575 -490261 -624943 -462493 -101559 357689 658387 557410 151315 -264264 -520295
206 -520295 -531879 -242160 200759 502709 540648 362794 400 -420532 -599607 -392644
216 -392644 2391 336423 502999 423544 94020 -284191 -481824 -452564 -231697 130996
226 130996 445414 479381 235360 -97508 -372606 -478090 -319489 18644 306705 421291
236 421291 360670 109941 -247842 -458937 -374502 -113685 161944 372810 404716 192196
246 192196 -113963 -316098 -374198 -282420 -10077 306676 413819 261919 12551 -221164
256 -221164 -373702 -329866 -89517 162093 294998 314089 189197 -91007 -340718 -354041
266 -354041 -168882 57107 250701 341131 239063 6881 -186365 -277132 -265751 -99377
276 -99377 175338 339176 269808 82346 -100334 -252488 -299072 -162683 61851 214302
286 214302 258017 201157 17026 -214064 -304071 -197030 -16103 141592 246054 237821 89702
297 89702 -102541 -224298 -237482 -131388 66979 233089 246477 133273 -13585 -151773
307 -151773 -232951 -178585 -8846 150209 220221 198961 79183 -106754 -229886 -196306 -65551
318 -65551 62626 160313 201071 130579 -30734 -171987 -210920 -143822 -7882 132954 198963
329 198963 154852 37312 -93909 -178769 -165514 -57719 73273 161404 179283 109558 -32710
340 -32710 -158995 -178188 -99832 5287 101367 163329 137348 17068 -112662 -167720 -139333
351 -139333 -56387 54840 145751 152694 67147 -50727 -132392 -145156 -90804 4928 101282 149770
363 149770 112793 3614 -106500 -146649 -110543 -36639 49652 123213 132769 55135 -54428
374 -54428 -120511 -122308 -75346 10221 102530 135893 80977 -13493 -85242 -115464 -103434 -39956
386 -39956 55946 120666 105269 28183 -53371 -101577 -106296 -64720 16020 95429 117873 67409
398 67409 -13568 -75556 -99366 -82766 -22658 59258 107698 86709 20103 -45153 -87503 -97749
410 -97749 -57061 25856 93867 96341 46161 -11724 -58558 -88338 -75435 -8285 68250 96323
422 96323 68393 17808 -34894 -79570 -88428 -41404 32402 79549 75887 37562 -12648 -59454
434 -59454 -82836 -60530 591 60934 82168 61128 17718 -32446 -73049 -73246 -21999 41010
446 41010 68154 58089 34768 -2826 -55266 -83110 -50858 14034 57298 63922 49065 16067
458 16067 -31939 -65136 -56346 -13391 33531 61917 61419 32218 -13888 -53839 -62761 -33670 12726
471 12726 44984 54513 47192 17330 -33391 -66170 -45902 3994 37434 49085 53228 36578 -9379
484 -9379 -48885 -48460 -21291 11161 41829 58373 41178 -2382 -38575 -48828 -36421 -8556 23854
497 23854 44830 45965 24297 -16356 -49864 -45421 -11439 18220 33560 45411 39280 2072 -36434
510 -36434 -42370 -26840 -7840 20346 47305 41934 5010 -25960 -35008 -35096 -24545 4639 33750
523 33750 39319 21892 -8950 -39036 -47509 -28760 -4112 11786 24244 27008 4466 -28383 -42125
536 -42125 -37450 -24539 3319 35031 36565 7258 -15882 -21759 -29291 -31023 -8126 22049 31181
549 31181 21102 1854 -24826 -42452 -34060 -12449 1721 13776 23338 11551 -17795 -35339
561 -35339 -35271 -28207 -7616 21299 27034 6700 -6341 -9772 -26594 -39162 -16928 17049 24368
574 24368 15776 8766 -10199 -34117 -31146 -10039 -2347 1792 20080 23813 -5198 -30152 -28621
587 -28621 -22551 -15507 5562 20074 7311 -6840 -8496 -23734 -44846 -30744 4500 12338 617
600 617 2490 -2066 -27639 -35275 -14535 -6026 -10271 9918 30853 6875 -29799 -29299 -14386 -15237
614 -15237 -8267 12284 12122 -5393 -9040 -12026 -32077 -35378 -5910 12530 3389 1892 5247 -14672
628 -14672 -32520 -18253 -3914 -9469 1039 26250 14331 -23772 -26788 -4242 -6200 -15631 3210
641 3210 20114 8137 -1760 403 -13895 -30055 -10604 19092 17139 3092 3789 -917 -15654
654 -15654 -13780 -3880 -8785 -5404 19253 21765 -8960 -21409 -4930 -5064 -16686 307 24212
667 24212 14670 -949 4146 -270 -20410 -12508 17382 19201 1070 3285 11316 -2394 -15104
680 -15104 -11272 -9107 -3955 17530 23516 -4287 -21282 -5619 85 -12629 -3203 17800 9534
693 9534 -4976 6946 8957 -18814 -24136 7609 19163 532 486 13401 892 -17855 -9406
706 -9406 3083 988 7179 17436 4867 -9863 383 5841 -11190 -11447 11427 14352 20
719 20 5014 9019 -15064 -24557 4938 19701 -2769 -7521 14677 11278 -13620 -11258 5595 906
733 906 -3550 13235 18813 1585 -4906 538 -6267 -9375 8378 16325 2202 -1242 6236 -5690
747 -5690 -17804 -731 12592 -4821 -9388 15993 18225 -12624 -20286 1215 5527 -3705 6284
760 6284 14873 -1636 -11866 -35 1840 -9437 -4551 8833 6038 744 5155 177 -11491 -3734
774 -3734 8174 -320 -4990 13189 15285 -11429 -18953 3290 8316 -8059 -5200 8926 2809 -7202
788 -7202 1426 3491 -12231 -12495 7909 14189 3347 -435 -140 -5407 -2975 5574 835 -5301 7095
803 7095 14750 -2459 -13932 -226 4986 -9093 -6642 11501 8753 -6819 -3289 3119 -8374
816 -8374 -11707 7580 15180 -699 -7097 2953 3254 -4284 -2651 -1048 -4266 3427 13330 1744
830 1744 -13591 -6046 5607 -1634 -5201 7361 7861 -4530 -1518 8445 -1549 -12744 1231 13514
844 13514 1010 -7415 3685 6388 -6602 -9108 -232 912 306 6581 3899 -7628 -5886 5600
858 5600 2749 -6662 -819 7383 2710 -237 3585 -2688 -12049 -2504 11264 4175 -7636 -756 6641
873 6641 -2421 -8689 -1363 2183 -1407 2274 6290 -1470 -7357 -380 2581 -4721 -4517 4617 5222 -2029
889 -2029 -3310 -2851 -6343 -3554 4194 1699 -6116 -2757 5535 683 -7640 -4831 556 -91 1184 4546
905 4546 -475 -6882 -2596 2715 -2690 -7153 -720 4061 -890 -4327 -2481 -3293 -4329 -752 1368
920 1368 -971 -723 3174 1254 -4651 -4436 -22 996 676 964 -1337 -3894 -1601 521 -4232 -6571
936 -6571 103 4580 536 -3340 -1446 -567 -2562 -1289 1714 808 -567 1167 1521 -2365 -4320 -2174
952 -2174 383 708 -158 -1820 -2095 34 -600 -4798 -5081 1140 3989 -540 -2956 -100 303 -2421 -1827
969 -1827 990 169 -1165 1294 2603 -1674 -5120 -2309 1331 1000 -1217 -1558 406 1812 -145 -3666
985 -3666 -2528 2446 3568 -35 -890 1982 901 -2465 -1275 1887 288 -1841 1655 4645 169
1000 169 -4215 -625 4452 3068 -150 1174 4259 4313 1276 -654 738 2988 3079 1789 2437 2728 1064
1017 1064 -838 1383 3693 1322 -475 3816 7091 2636 -2176 1378 6249 3604 -289 2219 6331
1032 6331 4453 166 448 2909 2771 1024 1864 3901 3184 362 125 2828 3159 639 362 4057 6157
1049 6157 2103 -1145 1705 4631 2049 -758 2220 4999 1627 -1786 561 3020 317 -2204 954
1064 954 4480 1912 -1491 35 3405 2015 -982 351 4358 4249 481 -845 2128 2778 -242 -1309
1080 -1309 2074 3843 446 -1528 1483 3575 131 -1835 1964 5269 2497 -1078 905 3804 1879
1095 1879 -1126 535 3640 2786 -257 434 2688 1270 -1501 220 3747 2513 -692 -321 3277 2744
1111 2744 -1404 -1515 2359 3575 776 -1107 785 2368 18 -1653 -59 2178 664 -1460 26
1126 26 1810 -245 -3130 -763 2764 880 -3002 -1226 2634 689 -3719 -2538 1463 833 -2177 -2270
1142 -2270 -527 -1070 -2512 -2150 -1435 -1604 -1845 -1083 -308 -624 -1989 -2805 -877 1175 -438 -3482 -1982
1159 -1982 1580 -272 -5153 -3748 510 -561 -3907 -2630 82 -1812 -3567 -1019 80 -2403 -2966
1174 -2966 661 1586 -1394 -2979 -949 442 45 -1291 -2252 -1087 1324 642 -2980 -3380 421 934
1190 934 -1385 -1715 263 -470 -1916 357 851 -2327 -2718 2030 2485 -1940 -3484 78 1676 -696
1206 -696 -1691 -877 -329 594 705 -1091 -2173 121 1788 323 -726 258 796 436 1546 1192 -1968
1223 -1968 -1571 2769 2916 -1774 -2979 963 1553 -1100 -1352 -9 -129 147 1871 681 -2062 -512
1239 -512 2568 1648 -1000 -321 1209 882 984 545 -1589 -960 2975 3094 -1796 -2293 2491 2907 -464
1256 -464 -747 1042 -24 -229 2392 1313 -3464 -2658 2719 2045 -3096 -2719 1028 729 -657 -302 -933
1273 -933 -1528 912 2605 -448 -1853 1733 2981 -193 -329 1843 772 252 2609 2340 -2724 -2455
1289 -2455 3877 3179 -3772 -3751 2256 2269 -1890 -1868 -169 -1234 -536 2126 819 -2385 -459 2484 1033
1306 1033 -789 841 591 -292 1771 2738 -1759 -2409 3406 3729 -2648 -2395 4326 3680 -2990 -1785 2971
1323 2971 1040 -1926 793 1371 -2956 -2328 2472 1192 -3316 -2477 548 -86 -322 673 -1648 -2847
1339 -2847 2058 3609 -2259 -3891 3145 4168 -2747 -2279 3974 1815 -3843 -156 4114 -881 -3607
1354 -3607 2204 3002 -4150 -4073 2855 2237 -3145 -2265 281 -1040 -224 1861 -1655 -4609 1143 4879
1370 4879 -1303 -4367 1603 2825 -2855 -671 4864 306 -5139 1550 6279 -934 -4765 3116 5459
1385 5459 -2016 -2855 3516 2821 -1964 -272 1512 -1469 -808 2949 155 -4724 -332 4126 241 -2409
1401 -2409 1809 1651 -2377 1865 6747 379 -5514 2156 7903 299 -4353 2469 4805 -1392 -1847
1416 -1847 3033 1105 -3098 288 2541 -1233 -2171 1903 1170 -3056 -704 2303 -64 -772 2161 101
1432 101 -3466 1216 6330 431 -5360 631 5984 562 -2832 1629 2246 -1673 12 4183 163
1447 163 -4420 -206 3786 -156 -2829 -340 564 -1291 -231 296 -2148 -1400 1707 -497 -4073 -451
1463 -451 3645 -16 -3616 421 3022 -483 -974 3058 1443 -2627 552 4952 1380 -3663 -1015
1478 -1015 2981 1190 -1049 -743 -880 -1213 387 532 -1769 -1727 629 -3 -2043 -503 642 -1215 -1660
1495 -1660 1033 916 -1951 -614 2665 750 -2486 -6 3765 1973 -1424 -588 1675 1697 1113 669
1511 669 -472 -457 1030 1301 -406 -931 -596 -723 -424 506 -1112 -2893 -1189 1451 -323 -2924 -820
1528 -820 1633 -81 -1743 342 1473 359 93 833 274 67 1497 1604 -365 -821 465 315 6
1545 6 196 -1130 -1917 27 1717 -933 -3329 -823 1831 -255 -2158 -342 341 -1300 -554 1223 -99
1562 -99 -1798 562 2012 -7 -1246 1024 2132 524 402 1207 1116 820 2042 1560 -789 599 3018
1579 3018 1205 -978 347 2181 572 267 1932 1166 -1119 773 3401 1402 -1447 1116 3440
1594 3440 1259 -277 1808 2543 860 1453 2772 1315 335 2281 3005 720 580 2372 1752 555
1610 555 1423 1620 -66 788 2959 1330 -1254 734 3373 1213 -1423 602 2488 248 -534 1593
1626 1593 1510 -879 -46 2345 1384 -568 265 1830 1211 330 1023 988 590 1340 1346 -275 5 1779 850
1645 850 -1158 -80 1820 288 -1425 529 1679 -735 -917 1503 1775 -1051 -749 2121 1542 -735
1661 -735 -97 1436 1181 64 664 1007 407 544 801 251 180 1162 497 -405 323 1419 -179 -744 998
1680 998 1445 -607 -1195 1606 1552 -1000 -852 1539 1408 -847 -569 1333 931 -376 -206 796 501 -175
1698 -175 229 636 423 62 -229 58 666 556 -500 -805 731 1020 -1042 -1243 700 796 -1082 -865 930
1717 930 764 -1164 -634 1346 604 -924 -405 1047 394 -912 -526 532 413 -659 -542 -15 445 -122
1735 -122 -620 -23 778 218 -805 -210 816 323 -1115 -429 1085 568 -1186 -758 993 400 -1129 -825
1753 -825 862 552 -1010 -596 393 341 -730 -409 672 420 -636 -627 617 941 -125 -756 124 996 106
1772 106 -950 -66 696 107 -787 -266 529 167 -793 -121 913 370 -1044 -123 1247 675 -855 -488
1790 -488 1043 451 -988 -883 448 630 -431 -869 47 525 -77 -347 128 302 108 -361 300 743 77
1809 77 -568 235 1074 197 -935 -212 957 401 -870 -482 766 382 -832 -732 331 33 -644 -249
1827 -249 407 -191 -882 -7 450 -54 -947 -312 531 514 -389 -756 150 911 370 -553 -252 1117 539 -260
1847 -260 -133 698 292 -476 393 874 -172 -634 533 661 -278 -737 165 845 106 -329 42 194 833
1866 833 538 17 266 902 831 70 472 731 224 -20 714 947 -538 -575 1088 1296 -529 -851 920
1885 920 854 -158 -350 282 299 69 535 310 -252 64 617 378 -15 83 189 -153 670 488 -634 -595 863
1906 863 983 -1257 -1289 774 887 -977 -852 385 35 -913 -111 543 -855 -929 443 358 -748 -649 65
1925 65 116 -303 -208 5 -230 461 730 -486 -564 903 1165 -409 -604 1097 837 -475 -36 943 -226
1944 -226 -1027 835 1376 -686 -1198 1005 1116 -161 -448 562 523 69 584 472 -92 587 1097 319 -88
1963 -88 1038 1416 212 286 1293 723 -408 1054 1872 -92 -925 1115 1885 -340 -1084 626 908 -223
1981 -223 -139 421 -450 -613 615 810 -534 -620 495 488 92 424 276 -329 737 1288 -149 -889 1013
2000 1013 1664 -484 -1210 803 1369 -450 -803 502 -47 -912 114 502 -813 -1566 279 930 -548
2017 -548 -1023 -530 157 510 522 -401 -1132 531 1186 -283 -1172 349 1101 -346 -350 958 293 -741 148
2036 148 1384 -181 -1136 468 1283 -331 -1429 -1 789 103 -342 -463 -411 511 861 -390 -913 363
2054 363 942 11 -237 577 242 -665 264 1560 -21 -1365 144 1474 120 -1102 246 747 -416
2071 -416 -841 61 12 -240 59 -219 -927 -354 166 -374 -762 -73 -333 -833 -24 745 -778 -1836 -65
2090 -65 1510 -503 -1871 -127 801 -444 -978 149 -105 -774 -131 439 -362 -1221 -264 161 -556 -751
2108 -751 -318 -494 -470 190 -646 -1576 39 1166 -590 -1889 111 1521 -82 -1139 120 631 -442
2125 -442 3 1045 45 -1223 276 1575 -83 -726 181 634 267 157 377 -220 20 1272 466 -592
2143 -592 330 1669 187 -794 825 1638 351 69 1309 909 -392 721 1870 709 -911 745
2159 745 1735 738 -401 424 864 192 600 723 -24 -61 825 595 -195 221 827 -121 -331 876 875 -665
2179 -665 -222 1281 832 -847 31 1406 386 -891 260 1122 -27 -577 607 237 -505 -54 678
2196 678 107 -752 -45 255 7 155 204 -555 -412 564 428 -927 -435 922 406 -795 -173 855 -39
2215 -39 -476 482 765 -407 -457 760 423 -526 -411 899 443 -212 -206 239 132 261 185 -416 -386 407 262
2236 262 -482 -312 223 -50 -699 117 522 -464 -582 506 602 -559 -360 736 617 -634 -196 736 366
2255 366 -393 -179 94 14 -117 187 -203 -203 98 126 -189 -262 141 -321 -294 180 233 -503 -403 316 94 -483
2277 -483 -477 515 77 -487 -160 406 95 -359 -120 233 -18 -443 -69 -80 -141 -107 -336 73 307 43 -244 -95
2299 -95 381 -56 -456 -98 566 -13 -399 42 396 -222 -240 145 406 -70 -306 259 229 49 -342 -241 38
2320 38 178 -20 -380 -157 288 100 -251 -96 266 -61 -169 262 425 -303 -465 280 488 -429 -481 217 467
2341 467 -297 -521 168 450 -113 -235 -161 214 234 -31 -120 88 364 -88 -370 72 323 -46 -319 192 171
2362 171 -560 -407 274 335 -315 -458 268 366 -311 -481 390 157 -332 -192 54 238 -286 -239 -109 173 207
2383 207 -364 -326 160 186 -339 -456 3 0 -432 -446 201 102 -659 -364 580 160 -499 -296 363 141 -196 -181
2405 -181 194 79 -311 -243 3 98 -128 -427 -250 154 -6 -155 -195 106 -171 -325 -129 407 -330 -616 -311
2426 -311 306 67 -726 -234 363 212 -570 -248 168 121 -99 42 -10 4 -287 -129 222 33 -259 -119 127
2447 127 201 -37 -272 -109 157 106 -350 67 193 -55 -369 133 411 -211 -498 -108 294 28 -397 -180 260
2468 260 74 -252 -146 346 132 -347 -315 226 373 -100 -272 12 37 -104 107 187 -40 -60 -132 203 373 -85
2490 -85 -238 175 330 91 -444 -124 368 231 -91 141 334 295 -8 298 562 210 -63 271 398 254 8
2511 8 217 347 -20 -39 223 497 327 39 217 459 406 101 -137 200 480 332 -181 14 156 293 170
2532 170 399 385 -14 -93 455 441 -113 -364 267 433 -10 -230 -38 241 -51 -128 -33 187 228 -124 -94 69
2554 69 255 50 -177 -75 79 -73 -203 110 157 -351 -328 320 207 -486 -375 40 256 -332 -343 -173 -51
2575 -51 -252 -249 -128 -160 -212 -45 10 47 -107 -376 -143 307 96 -461 -420 203 284 -430 -392 113 250 -286 -271 162
2599 162 -225 -302 -90 366 52 -410 -23 41 33 -176 17 92 169 -148 -389 -293 163 197 -536 -206 122 232 -286
2622 -286 -280 1 -222 -390 -60 228 -556 -690 173 474 -318 -631 -238 157 -98 -130 -347 -165 -168 83 -307 -544
2644 -544 -24 -155 -339 -223 143 -262 -434 -124 266 -422 -495 157 508 -491 -531 -10 421 -113 -654 -111 -61
2665 -61 -98 0 -13 -234 -220 -34 61 -337 -96 -116 -174 -63 232 -174 -592 -89 620 -230 -668 164 386 -183 -334
2688 -334 161 434 -266 -84 277 30 -434 94 513 -128 -284 -63 7 98 176 36 -174 -6 301 111 -438
2709 -438 46 310 -198 -443 294 160 -224 -257 255 153 -396 15 607 75 -663 -24 582 53 -350 -141
2729 -141 232 -5 238 22 -261 -37 383 319 -170 84 86 -294 -81 478 -4 -501 -46 673 -14 -367 -162
2750 -162 446 43 -324 226 454 38 -114 189 145 -52 -10 160 -69 -68 267 287 71 81 -46 -354 139 336
2772 336 -168 -681 -38 624 -60 -722 -247 199 3 -163 165 195 -307 -239 298 332 -268 -248 16 107 -44 89
2794 89 -56 -26 59 54 -220 -103 260 -90 -508 -144 241 14 -102 203 245 -149 -170 255 244 -420 -268 462 232
2817 232 -209 -141 26 85 -55 -198 -146 78 108 88 -196 -184 136 85 -71 16 -123 -242 -177 399 83 -496 -73
2840 -73 358 201 -236 -256 239 49 -93 95 1 -43 190 149 30 -71 111 -50 179 106 -42 -151 -69 341
2862 341 -18 -294 95 493 169 -394 -60 481 45 -255 42 243 6 -5 356 95 -350 -63 204 108 -30
2883 -30 -211 -151 61 74 182 -448 -178 405 207 -483 -278 134 -99 -431 47 124 -213 -302 115 -22 -276 -371
2905 -371 101 -62 -288 -158 -96 62 -200 -296 -103 28 3 -33 -401 -67 55 -79 -465 -232 86 -392 -296 -80
2927 -80 33 -510 -575 268 154 -602 -568 -46 -110 -405 -398 -171 -152 -294 -6 -223 -260 -172 -133 -177 -45 67 -114 -303
2951 -303 25 11 -260 -455 119 74 -586 -341 273 112 -441 -285 130 -96 -336 -120 201 -96 -90 62 62 -107
2973 -107 -161 122 60 -138 -88 -291 -369 20 41 -85 -361 174 144 -500 -417 178 56 -323 -222 55 -100 -411
2995 -411 -247 187 -121 -348 -22 128 -336 -350 -78 65 -262 -197 -209 -3 -189 -82 -181 -315 -4 1 -306 -80
3017 -80 235 -85 -224 -37 196 -293 -439 -166 182 -79 -456 22 277 -221 -151 -158 -78 -62 -134 210 63 -46
3039 -46 -165 -179 -115 139 60 -187 154 182 39 61 16 222 -86 -95 57 350 -231 -145 122 177 -82 -177 -15 228
3063 228 -14 -117 95 192 -115 -98 101 63 63 -34 74 -15 76 -126 -324 149 170 34 -51 4 42 -141 -146 118 101
3088 101 -224 -84 -14 -87 -208 -178 -17 115 -139 -182 97 189 -161 -182 4 132 40 -217 78 57 -24 -311 -212
3111 -212 -22 4 -37 -113 104 -5 -130 -28 356 334 -38 -40 -4 387 -108 -29 113 -2 125 242 215 250 -66
3134 -66 -214 16 203 72 -85 -8 276 111 -106 10 -64 16 -61 289 114 6 -144 24 227 191 -95 -107
3156 -107 35 134 -165 -101 165 2 -88 42 207 259 -56 -2 212 129 21 -290 276 200 -60 -71 221 -99 -15
3179 -15 -171 54 150 -49 -27 -100 114 1 -224 -75 123 -39 -192 93 62 -159 -42 -30 9 -30 -39 -110 183 8
3203 8 -45 -403 -3 40 39 -162 95 126 -58 25 166 199 -21 -35 74 196 41 46 132 293 4 37 -16 250 160
3228 160 -11 193 176 -104 -28 -128 11 87 -57 -151 82 -10 -177 33 158 220 -113 81 60 126 -220 -89 92
3251 92 17 -109 -2 238 35 -73 23 168 64 -27 25 7 107 -109 -8 -74 174 81 11 -73 239 105 -279
3274 -279 -136 226 143 -45 -39 86 11 20 -1 124 -91 -66 -36 91 5 -188 15 125 27 -13 -180 48 189 10
3298 10 -114 -89 104 -87 -72 -31 28 118 -79 -137 313 -118 -269 165 250 81 -209 -9 291 22 -115 16 150
3321 150 3 71 20 -6 -202 -18 19 8 -102 -137 -175 59 2 10 -53 -26 37 -105 -345 63 400 17 31 67 207
3346 207 -53 -3 65 -4 70 28 156 30 -108 -82 116 67 9 32 -79 157 116 40 -26 70 277 -29 0 234 260
3371 260 -74 33 212 329 -55 122 219 35 97 186 158 74 71 -215 -5 0 -42 -32 -177 -106 136 -67 -210 119
3395 119 99 -139 -202 41 -56 -233 -51 334 -65 -211 -76 335 -55 -135 -65 10 -75 18 -11 35 48 77 94 -65
3419 -65 -122 49 -63 -34 50 -5 -151 87 329 98 -211 0 143 -132 -273 107 343 -5 -27 156 37 -196
3441 -196 9 -109 32 -57 54 173 4 -209 103 -74 47 138 -85 -14 -1 300 -46 -396 93 485 65
3462 65 -310 42 90 41 109 144 -4 -202 66 131 86 8 107 -74 -51 56 -21 -73 -131 272 -243 -190 -64 225 6
3487 6 -316 -90 104 -148 -73 154 48 -310 38 57 19 -356 -97 -15 185 -100 -171 156 -17 29 55 -83 -127
3510 -127 90 -5 -261 -9 148 29 -81 185 136 -321 -141 158 114 -164 -118 242 203 -232 -24 208 -29 -111
3532 -111 17 289 -95 -90 -43 -76 -96 -92 153 -83 40 -39 -187 -84 199 58 -186 -154 168 -56 -164 -114 74
3555 74 -108 -258 8 253 100 -170 195 17 25 59 130 56 -72 71 116 -105 41 97 -114 29 -13 -30 -56 10
3579 10 -14 -11 20 69 52 -77 14 86 37 -31 -177 87 111 -66 -134 90 55 -54 -131 -104 187 59 -58 -46 35 -40
3605 -40 -130 75 33 67 -89 44 165 81 -51 15 191 8 101 15 122 -76 71 -155 10 -36 -3 141 162 73
3629 73 -102 46 62 182 -75 -50 186 225 -12 -160 -24 333 199 -151 -140 30 190 -76 -46 92 185 -114
3651 -114 -94 151 170 -253 -124 307 -70 -9 21 94 152 89 -125 99 34 47 -100 30 264 -30 -148 -124 -88 -47
3675 -47 -139 -72 11 37 -218 24 163 53 -126 -99 78 50 -93 -164 -94 -3 24 -21 -94 164 54 -180 17 137
3699 137 -85 -167 -117 33 8 -138 4 261 -46 -127 -35 52 -63 -117 -39 116 89 -55 -110 1 -147 -3 -53 24
3723 24 105 -136 188 -34 95 -36 106 57 32 -4 82 66 136 -102 28 43 38 -111 -71 -71 -74 -44 -212 52 87 -21
3749 -21 -81 19 13 -21 60 155 -82 -145 35 -93 151 117 -27 25 88 150 30 -132 153 -166 -69 -157 80 152 -133
3774 -133 -42 44 106 129 -248 112 122 -71 24 -100 74 -125 -33 164 104 10 -2 28 -86 -132 183 20 99 0 -30
3799 -30 23 102 44 -237 60 63 -82 -268 -101 16 -9 -16 -73 84 -90 -54 -113 103 231 -18 -13 33 59 17 0 -51
3825 -51 193 -145 -81 -65 38 -123 -179 3 132 -32 132 -21 -7 40 -20 178 34 -78 30 -33 -10 201 -243
3848 -243 32 2 -115 -210 -67 4 -34 47 -109 -75 134 60 -127 48 121 140 -219 -9 94 -92 -42 -15 11 25
3872 25 -144 -48 178 -151 -112 -22 41 6 16 -12 117 82 9 -24 101 -134 106 -106 90 35 -39 57 80 -5 -179
3897 -179 -173 104 16 -254 -180 36 120 -102 40 58 236 -29 -157 78 -139 24 79 -91 -71 -126 -6 62 91 -12
3921 -12 -103 -91 -23 90 -19 -66 -39 304 -89 -153 93 23 -25 35 108 107 23 -21 219 107 103 -69 72 174 2 -52
3947 -52 -11 72 -163 -107 -74 44 -62 -41 8 0 31 -113 78 72 39 117 45 119 111 -293 -277 -10 2 -80 -210 154 235
3974 235 -89 -81 69 79 86 66 11 113 24 44 -23 126 125 62 -36 147 112 -95 274 123 6 -153 10 111 173
3999 173 33 47 -21 74 134 -142 -68 -50 -189 49 49 89 46 -131 41 196 -30 -157 127 111 95 5 24 64 38
4024 38 -85 -89 122 57 -65 81 106 95 30 203 80 65 -25 111 112 -79 -16 -107 19 -29 197 42 25 102 -125
4049 -125 -67 -150 52 -149 -167 14 106 -81 -120 -23 40 -71 -6 277 -43 170 62 157 54 78 -120 106 60 236
4073 236 -6 -99 -171 10 117 -17 20 -86 -84 57 164 -8 -92 20 19 -87 -148 -36 129 -103 51 119 -3
4096 -3 125 -62 27 19 -67 71 110 7 -18 -33 -200 55 9 6 -165 36 -5 55 -155 -71 79 52 11 -21 -92 -144 63
4123 63 15 160 -75 -36 50 58 86 -65 61 87 69 68 -66 79 -20 155 -137 62 -190 20 13 57 35 36 33 88 167
4150 167 72 44 64 14 -68 -27 68 162 -118 56 81 -271 121 -101 -78 -52 64 -91 6 44 0 -47 12 89 -118 -100
4176 -100 -135 265 -83 -128 -37 -5 159 -128 61 55 51 -99 -94 -38 127 2 49 -5 48 -51 35 71 -79 -8 122 71
4202 71 -17 100 -92 -71 73 88 42 -55 72 21 -24 -58 165 100 12 -9 -13 61 149 -42 192 210 5 -59 157 46
4228 46 17 4 90 0 8 -164 -142 88 110 -84 -89 55 8 -71 18 29 -123 -28 -96 5 -125 -9 -59 99 100 -22 -102
4255 -102 12 8 -137 42 -5 131 132 -67 -223 178 -94 -74 -84 131 -26 -79 50 153 33 -144 102 -55 -28
4278 -28 44 153 -93 31 -164 170 28 25 -21 -70 106 168 75 -67 -98 74 74 -73 -50 149 -136 -52 -63 38 -48
4303 -48 -102 33 87 -46 -88 125 44 221 -115 -167 1 -98 -146 -11 359 68 52 -90 62 158 -131 -137 87 188
4327 188 13 173 198 133 -78 -169 73 63 -34 -73 70 86 13 -15 106 -51 -42 -62 22 239 -156 -12 60 213 -59
4352 -59 196 69 66 76 -118 -16 -118 -62 -104 69 94 -24 -138 70 -9 26 -147 6 75 5 -152 -100 82 22
4376 22 65 -196 70 10 55 -6 -38 -7 154 -104 83 -73 -88 25 -26 -75 93 63 -12 15 -59 -38 -41 25 -124 130
4402 130 1 -15 49 70 40 34 -5 111 -92 193 -7 -327 86 -82 -81 -42 -138 -145 57 -58 -161 -75 79 22 -120
4427 -120 155 3 202 -24 -108 194 27 -10 -39 -37 88 -175 87 -32 -38 -231 -29 -27 -48 -235 55 95 140 -4
4451 -4 -9 -80 71 98 54 57 -20 152 43 -43 -55 4 -15 -44 27 36 2 -31 -142 66 90 -4 -110 5 31 -172 -27 136
4479 136 -45 -59 -11 68 57 55 20 -31 -134 -44 237 -43 -166 17 96 96 110 -4 -16 -68 151 13 98 87 -45 -87
4505 -87 114 3 -131 -92 37 -85 -79 -67 -88 19 -106 -181 -47 -20 44 193 84 18 26 32 -73 -131 72 -106 -73
4530 -73 233 71 -36 -31 101 72 50 -62 8 74 -13 -26 23 77 121 46 -75 75 77 198 -40 46 1 26 -12 107
4556 107 -8 3 -68 8 17 -136 138 -45 16 -82 -101 -38 33 43 -248 -23 -118 -174 -104 120 -17 155 3 34 -18
4581 -18 -86 77 209 106 -69 -29 96 56 23 88 -136 218 33 -51 15 87 -103 -20 -90 151 -36 23 236 133
4605 133 -88 -30 7 21 -13 -151 -87 -12 143 14 50 11 201 -38 -162 -43 -31 14 -117 -23 39 0 -31 -11 -12 -98
4631 -98 -21 146 15 -81 -81 -65 153 -24 -10 -78 111 68 -15 -34 114 190 50 -142 137 71 12 75 68 -24 -105 -109 0
4658 0 127 74 86 55 26 -58 -55 -14 126 88 -22 87 -55 -54 12 -45 13 2 -32 155 175 29 -217 37 70 113 -69
4685 -69 7 102 16 -59 25 -216 79 -11 191 5 41 -3 -76 54 133 175 -128 31 102 81 -8 69 107 -105 12 -27
4711 -27 16 47 -127 101 -176 70 -47 35 84 125 113 -8 177 -53 180 -97 50 -28 -115 -60 -54 -12 135 55 90
4736 90 184 -18 135 -10 21 -108 -50 -38 57 -31 -95 68 84 -129 21 3 11 22 -144 -175 75 65 49 -58 195
4761 195 187 -134 -4 299 -36 7 -32 6 58 -140 -61 51 0 40 -2 57 -15 101 -44 -1 -114 38 -1 -25 44
4786 44 -3 72 67 121 65 123 81 -71 56 -34 57 81 69 6 200 -31 -110 -133 -75 -84 92 205 159 35 -35 -121 53
4813 53 39 -120 -32 -61 119 -4 14 -115 139 -106 6 -206 8 -2 -84 -64 -127 53 -25 -32 -54 145 -189 -98 -119
4838 -119 -46 -20 -25 -43 169 116 -84 100 -3 -33 73 104 5 54 -177 -42 153 155 65 24 62 225 -22 173 -110
4863 -110 50 -174 33 124 81 -100 -23 31 -10 -37 25 166 -58 84 -43 100 189 -62 -116 38 73 -89 -51 55
4887 55 47 132 -109 36 73 153 23 -9 72 36 88 -44 110 81 118 -1 64 102 63 -48 19 64 -115 -126 193 75
4913 75 -59 6 13 -40 -50 -49 -15 70 -123 -138 -47 -95 44 -115 145 130 -98 -133 194 40 -58 17 26 1 113 -71 78
4940 78 215 -41 -135 105 75 -114 55 -133 23 -15 -44 3 88 35 60 95 -32 36 -224 -21 54 -80 -7 119
4964 119 125 -24 -183 5 27 10 134 -10 -87 -126 39 -183 -188 -182 -89 6 -274 -218 -60 -43 -31 82 9 -126 -47 117
4990 117 -70 -18 -75 128 75 -49 -137 -16 -88 -100 85 -11 5 -126 -18 120 144 -36 -26 -59 72 53 -12 -172
5014 -172 88 110 40 2 244 -18 -29 -23 3 -11 -127 74 -80 27 224 70 65 -106 -111 93 -56 58 150 -45
5038 -45 -131 -43 56 14 -66 104 3 -93 -67 77 -43 -228 -104 -63 128 -84 49 25 -6 64 -116 -16 -52 -14 -13
5063 -13 39 70 -32 26 -20 -71 -18 -87 87 -118 56 -2 -37 65 52 104 25 -77 -26 -40 1 35 18 -71 -48 150 40
5090 40 -84 2 14 -73 118 2 32 32 16 -9 36 55 -24 123 182 -3 -11 59 266 -59 24 0 0 278 -22 62 -21
5117 -21 -53 -71 -24 163 -127 62 87 -58 25 125 -267 45 75 52 -66 -55 117 147 -139 -61 89 -7 -11 -132 149
5142 149 -52 68 -130 87 50 -85 -166 106 -216 -119 -9 -58 -7 87 -140 73 -100 -204 46 -17 198 136 -41
5165 -41 -107 221 -33 -120 -16 122 -91 -169 -36 -19 -131 48 79 185 11 72 -169 -107 -121 -129 -53 -2 -67 78 22
5190 22 35 33 -32 -69 22 97 -85 -67 -118 186 -45 -102 -12 97 -52 163 -142 -139 -100 -59 -66 -86 124 44 49 45 57 -23 -62
5219 -62 50 -219 34 -57 71 -4 -70 -169 23 -121 17 27 15 153 87 -86 -230 130 -85 -41 -19 192 -97
5242 -97 -206 -145 -52 44 -60 118 129 6 109 -46 -63 -38 -52 -132 53 206 -16 171 115 161 83 -50 61 -38
5266 -38 50 -264 -76 124 -49 -111 15 -181 46 -66 126 -48 -56 100 -33 45 15 43 -101 203 -7 32 -54
5289 -54 -17 125 -122 -15 24 32 -148 -3 -77 -64 -91 8 -31 82 -108 11 31 105 27 -75 -4 118 -132 6 -112
5314 -112 -45 -16 -17 -1 133 180 -59 6 41 112 -63 176 -35 -16 86 -27 21 -67 -73 -76 66 50 -153 -10 63 162
5340 162 -19 -50 44 -98 127 -103 55 100 4 -154 -131 77 72 -54 -2 18 118 39 -20 -50 17 -23 44 128 -108
5365 -108 -21 50 61 -7 -50 -1 173 33 -87 -153 23 -39 -181 -75 16 -38 -54 -57 68 -128 -46 13 -159 -124 126
5390 126 80 -54 21 -204 166 124 126 68 -118 -33 56 19 -37 13 64 13 209 -93 192 19 -16 110 -253 -157 -145
5415 -145 -24 40 59 -104 46 -221 -103 -58 33 176 -52 50 -23 -35 80 64 -4 -89 -68 -14 16 59 90 98 -59
5440 -59 -137 -4 -2 6 -26 -268 -163 -62 174 8 24 -4 67 130 6 63 -31 -73 -40 97 -138 67 50 -18 23 -227
5466 -227 27 -93 -77 58 58 33 -133 16 47 -95 151 12 -44 -57 72 86 -125 51 -218 -111 -141 -32 98
5489 98 70 18 -52 -12 67 103 64 98 48 -1 113 58 -92 -51 -157 -25 -42 18 43 -96 -25 19 211 111 -16 124
5515 124 -63 -50 -79 -13 18 -12 -27 -95 18 -90 17 8 -86 -66 -206 -58 -47 -157 24 -57 22 15 -81 6 -27 -45 40
5542 40 -23 74 39 48 13 125 -21 -176 64 110 182 6 86 12 29 3 -106 52 78 -108 -264 -96 106 -46 -132
5567 -132 -27 49 108 115 -146 212 91 -64 20 -99 -8 184 87 207 -74 -52 95 144 63 -57 32 -49 -42 100 30
5592 30 140 6 24 -17 20 33 -190 6 -94 32 206 -14 74 62 -61 -108 136 33 -19 44 -38 -22 7 17 77
5617 77 -52 -85 -45 -155 170 33 237 -65 -102 113 -125 48 -101 74 -18 -159 -88 -102 -82 -89 -97 6 54 -70
5641 -70 4 -16 41 24 -45 14 -113 -44 -50 -44 -71 -64 107 67 -212 -42 20 -100 -135 75 34 165 167 -128 -42 10 -91 -85
5669 -85 -138 44 -4 -25 199 -131 -70 141 121 102 18 -9 -84 236 35 -18 117 -97 -24 -2 85 92 -54 -40 41 226
5695 226 41 -23 71 38 75 -27 -88 79 79 -134 -51 -108 -29 -113 -41 -77 -57 -2 52 12 39 45 19 119 -30 -18 -112 185
5723 185 98 -106 -33 -61 -8 -72 14 -128 -213 -5 -8 -9 -39 -118 -57 -47 22 -69 59 98 -51 -33 96 56 -124 147 92
5750 92 -133 21 -33 39 128 -170 114 -42 -62 4 17 86 103 -40 39 162 -171 44 -38 128 1 20 132 71
5774 71 57 43 -47 29 50 56 32 121 59 -62 -158 159 62 159 81 9 86 -32 -3 36 58 162 93 -20 53 -99 99
5801 99 -136 -32 80 -5 -136 69 119 -20 106 -44 -141 -61 -7 -41 -12 -81 -70 183 130 -89 -146 47 -116 -38
5825 -38 -52 -16 -72 -181 80 19 183 63 -16 -88 253 67 64 -88 23 76 130 81 65 -75 -20 87 -98 84 90
5850 90 -108 123 -5 -81 92 136 -41 106 43 -86 24 -170 155 90 -101 -23 108 -13 51 94 53 77 20 -74
5874 -74 -9 94 173 205 -5 54 72 157 0 -193 -155 -42 -62 71 45 -101 -60 -43 8 168 11 141 142 -54 84
5899 84 97 96 83 -79 -90 77 6 22 26 -11 -22 164 39 14 -151 -9 -159 -78 128 -182 -106 2 -1 93 63 -88
5925 -88 92 213 53 -41 52 -175 11 -8 -35 -33 -212 74 -61 42 -59 -131 80 -24 107 -5 159 -10 -44
5948 -44 -30 12 143 -27 93 34 187 36 7 -35 240 54 -16 145 134 -22 -17 200 9 -122 -55 -104 -26 -36 130
5973 130 -235 13 -70 103 -3 -66 22 -13 -163 13 118 -73 -16 103 61 -94 105 26 -70 147 -14 -87 -123
5996 -123 -11 72 120 107 -117 -101 -18 -5 -40 129 -3 97 152 -34 -39 -223 -57 -70 -137 19 -79 -77 126 149 45
6021 45 94 151 33 283 -5 -147 -50 -32 -58 82 142 -140 -20 65 183 119 91 -49 -32 89 4 -29 153 101 -48
6046 -48 -132 49 178 -41 53 -84 15 -78 -40 -44 -90 -109 -58 -188 112 -30 -36 69 -117 87 -62 -30 103 153 -111
6071 -111 -45 -75 -125 -36 13 -13 -6 124 141 192 -135 15 -10 -43 -4 -150 -89 -41 148 -68 -23 98 20 -70 -33 -94 20
6098 20 -123 -121 35 9 22 -11 -58 80 55 -166 125 57 -57 -5 -216 73 -17 -11 134 97 118 74 -114 97 145 102
6124 102 60 -54 23 -38 -126 -57 209 144 -61 -32 -117 90 -65 -52 55 29 -46 -31 86 11 -58 114 -108 132 -7
6149 -7 -44 97 37 -79 213 49 -20 75 170 161 -12 87 -214 -69 -135 47 -168 8 104 -79 62 83 87 12 20 163
6175 163 62 -74 32 -140 113 19 -82 -19 -38 97 152 124 -46 86 15 -4 93 84 43 32 71 61 93 84 162 -31
6201 -31 -186 -49 -3 -157 -18 -19 -30 -56 93 -94 9 32 -33 -67 -51 31 -35 34 65 35 -38 -224 -186 -114 102 70
6227 70 -69 129 34 -50 69 196 -76 78 -60 87 64 -69 -77 152 -36 -42 -41 -56 102 112 -117 -19 -8 -132 -114
6252 -114 -5 169 -87 73 -129 95 51 -45 -71 5 14 -97 -46 -9 212 -1 -5 76 51 -45 41 11 182 14 -176
6277 -176 -3 174 -8 -55 123 66 -178 294 67 45 20 -272 -99 75 36 -64 -17 -28 -12 -99 -83 -50 20 -22
6301 -22 -42 82 70 118 39 37 -124 50 20 10 -54 -25 75 -314 -160 -63 24 9 41 -52 11 11 32 108 -47 8 -57 -233
6329 -233 61 46 8 -159 -25 -21 -47 53 100 59 49 89 165 -28 -28 28 47 18 104 -117 -30 -58 -138 8 116 -39
6355 -39 24 -106 59 -26 51 50 -144 -56 23 107 41 -53 77 -80 -12 29 -120 -88 44 84 79 -85 94 -36 -57 71
6381 71 -84 11 32 45 94 49 73 73 106 80 -17 90 -25 -86 48 -148 83 -50 -97 194 -81 221 185 -164 5
6406 5 83 -157 6 -4 33 -59 -112 37 45 -134 87 20 30 -47 -12 -62 125 63 -16 25 97 -112 82 -30 45 192
6432 192 -19 25 -37 -137 28 -141 11 1 39 127 89 56 -81 -22 5 -123 -90 -63 -192 49 -57 27 -55 59
6456 59 -25 51 -152 -160 209 -88 -69 20 -5 36 53 -42 65 15 -74 -108 -49 -19 -60 -15 46 -171 -18 19 114 -8 52
6483 52 210 119 65 -14 147 7 -71 9 2 -84 124 42 1 -14 -19 -18 -45 -166 87 120 -10 -59 81 16 -1 -143 -26
6510 -26 -69 62 71 50 121 -102 83 -112 -14 68 19 -107 42 137 -157 30 -14 -99 99 113 -40 -78 -23 -64 -82 136
6536 136 -46 -116 -209 43 23 -34 -143 50 33 -23 17 143 -24 20 131 -38 190 -3 -20 76 -100 -55 75 177
6560 177 -100 -51 -82 25 -46 -72 -59 -56 75 -37 44 -81 -189 -33 -108 99 13 -33 50 -34 89 11 8 -26 -42 93
6586 93 128 -7 -152 -18 181 -59 -189 -100 -117 22 54 23 18 -171 -86 44 177 61 -44 -20 -143 55 22 20
6610 20 -106 -122 -110 -26 12 -117 -103 85 14 43 -113 249 -63 28 -6 -135 -65 15 89 123 -58 62 -16 -34 -18 75
6636 75 150 49 153 -46 3 78 64 87 53 99 -52 78 20 192 -16 -119 79 15 -66 108 19 111 62 45 -140
6661 -140 -29 67 38 124 29 -79 -14 57 -3 6 20 -42 47 -61 39 46 41 75 129 -82 -142 12 55 -36 102 21 -11 -16
6689 -16 -20 -20 59 -8 124 103 59 152 64 18 -112 95 107 25 85 -131 -184 -141 116 75 38 10 -64 76 155 116 -49 -24
6717 -24 7 -108 -128 128 90 -80 59 -6 78 25 32 -32 -100 6 -36 14 -66 -2 -28 51 -113 52 33 42 98 61 -111
6744 -111 -131 -5 55 67 -65 -74 -59 105 70 17 -92 -32 2 -22 113 -47 -75 42 55 63 -132 241 -35 45 -127
6769 -127 84 -17 11 -57 -37 -187 -29 -27 122 101 -71 -50 -92 94 -16 -226 -9 -195 -129 -18 -77 -89 -206 -70
6793 -70 109 86 -145 80 -15 -140 -132 -10 32 8 27 -52 -21 -166 80 70 -60 61 -125 34 -74 -146 -93 -86 -43
6818 -43 -62 145 -91 -70 -147 -135 -39 14 14 -80 -55 -42 64 -21 123 46 38 81 49 63 -50 -130 -119 -79 11 38 -62 63
6846 63 37 43 -74 -80 -68 -80 -140 -24 116 -89 42 63 41 224 -38 147 -27 308 51 23 -31 -22 -108 71 175
6871 175 -149 -74 -17 39 -98 -237 -55 -63 81 49 -228 -109 25 -23 96 -29 -36 -46 -28 64 -22 65 151 151 45 46
6897 46 179 46 104 89 -72 90 -68 6 -20 -44 34 79 74 74 -173 -1 83 -25 108 141 19 -79 -126 35 321
6922 321 -97 30 1 -88 235 54 134 -59 104 70 85 151 -65 49 1 54 70 -48 163 55 -125 -5 -51
6945 -51 24 -150 -83 84 -158 -77 84 56 -54 -22 -16 65 56 -18 -36 36 -276 -20 7 -14 -31 36 -17 48 -3 85 67 90
6973 90 98 30 -69 -134 -122 -237 236 -180 124 50 -84 71 -149 135 201 -1 52 1 44 -113 -117 53 31 -63 74
6998 74 34 59 -121 -46 -16 218 -20 111 70 -42 -41 202 48 -9 -5 3 -84 -43 -20 146 -32 1 108 203 -23 -112
7024 -112 33 -67 -34 -123 -35 46 -148 6 -52 172 -65 51 14 46 219 -144 -92 197 264 -240 -87 -55 -225
7047 -225 22 -70 -192 66 -52 -61 -5 -127 78 -63 65 -89 76 -155 13 -10 -100 -11 39 -175 -8 -120 -224
7070 -224 46 92 33 -32 -104 107 64 -19 -89 34 -124 18 127 -141 -62 89 32 20 -135 229 -123 -58 232 113
7094 113 224 22 -27 274 -122 -13 -34 137 177 -58 15 -169 11 -19 -77 93 -20 67 140 -14 -93 1 -110
7117 -110 8 -83 40 -81 -71 -22 15 32 -37 -133 31 41 10 -29 29 302 9 -40 -130 -65 202 -18 -4 62 -87
7142 -87 60 -109 -40 32 37 -142 -86 -8 -77 4 -102 -70 -160 -137 29 -90 -101 -12 102 -80 60 -136 -4 99 -192
7167 -192 5 -6 -35 -81 -18 -82 -20 -14 87 -2 -97 71 -138 38 -148 64 0 8 105 2 93 -7 57 36 213 50
7193 50 -52 166 -63 -32 12 97 6 -113 92 -115 -142 89 98 16 21 -142 -146 -84 -25 29 -77 1 -2 311 65 -49
7219 -49 -17 137 159 55 -111 141 94 -111 14 -32 99 -13 -28 -205 131 -141 -49 107 124 34 -56 -180 -42
7242 -42 2 -75 83 -16 71 4 -39 39 -67 32 25 72 -12 95 -179 -20 20 -86 186 -80 -72 62 -29 -226 -18 12
7268 12 10 -25 70 29 -39 82 30 -82 -26 5 -97 -127 51 249 -101 116 -65 13 94 -91 -57 218 17 -33 -89
7293 -89 91 48 9 33 -83 20 -10 27 38 251 -14 -100 -111 -32 51 -34 -143 2 -113 100 -66 -91 -90 -54 -44 -33
7319 -33 -6 -213 -180 -160 30 74 -33 -7 73 -2 -15 73 -54 31 -21 101 18 143 56 8 -25 34 -82 127 15 -63
7345 -63 -27 -1 139 70 60 102 -71 -148 9 -63 110 -45 36 32 63 60 -86 2 -49 172 -31 -29 -125 -65 105 -148 51
7372 51 -117 47 -9 -133 -54 19 118 -41 37 139 83 9 -137 22 -2 12 -113 189 119 19 52 -74 3 -89 56
7397 56 -91 58 105 -56 -120 24 -336 -27 -14 38 -23 -26 7 -100 81 0 -127 -62 -222 -151 -43 -84 -87 -59 1 103
7423 103 -113 -51 -59 -3 6 23 -135 82 104 -23 64 -27 35 -121 39 237 23 -48 5 -138 6 -40 17 2 -45 -97
7449 -97 -100 -114 0 -25 69 116 134 -34 -46 66 31 122 47 -65 55 76 -117 84 99 -54 -101 55 147 12 -139
7474 -139 -162 -61 168 55 -81 -7 -77 38 -38 -101 158 -112 -115 3 26 29 3 -58 -8 89 -160 -21 -137 -111 -23
7499 -23 155 -24 -33 122 -73 -20 -89 -62 54 -87 27 -41 -54 50 -2 24 -54 -198 -59 154 -94 13 -50 89
7523 89 49 67 -11 -94 -22 106 251 56 -125 -95 -106 54 29 79 -77 -151 55 26 11 -50 -6 -97 -75 173 187 82
7549 82 -57 -25 36 -150 41 -187 -27 -12 31 18 -47 101 -31 42 0 -24 -84 20 -119 -325 161 10 94 -19
7573 -19 35 8 -73 79 41 -13 76 132 -99 124 -80 -7 0 -45 -95 -32 54 -17 65 -22 18 -65 -40 -16 -145 48 59 -37
7601 -37 -66 -176 138 -53 -74 43 40 36 -82 188 75 -36 57 107 -30 -125 -134 -68 40 82 102 103 -11 -23 24 -36 77
7628 77 -75 122 26 -10 22 -132 19 -8 -29 -76 -63 46 3 -94 76 92 -82 116 -93 88 -55 20 -17 35 -76
7653 -76 105 -163 103 51 126 202 -102 21 70 63 -27 54 -76 -22 -90 -128 -56 -76 -131 -62 -27 -116 -120 -162 96 -19 -187
7680 -187 29 -45 192 8 -15 -59 -10 -37 -70 34 26 -116 -50 -138 111 -55 132 -24 45 -207 -59 -73 28 -64
7704 -64 92 159 -47 38 156 104 -167 99 136 107 13 14 -103 -73 -120 -163 12 -174 -34 57 53 -142 43 34 66 91
7730 91 1 55 114 4 73 -79 -11 177 72 -109 -49 -128 46 99 69 115 102 -6 173 79 41 -80 -131 -18 -156
7755 -156 -62 36 19 -35 -51 -51 44 110 69 138 -4 77 28 -96 -38 -86 -49 39 -98 25 -37 151 -100 106 -58 102
7781 102 39 -49 71 -27 6 57 -36 -52 92 162 -159 48 59 -67 -43 33 -155 -53 -93 -53 0 -20 97 11 33 -105
7807 -105 55 42 139 107 -98 81 183 -114 53 -354 116 56 -94 164 -141 17 10 166 -240 -143 -42 46 -139
7830 -139 -50 40 -135 -60 61 -58 47 -24 -106 14 101 106 18 29 42 -81 -34 78 -207 204 -33 -147 5 65
7854 65 137 -101 -83 31 -111 62 81 -95 33 -53 141 132 12 92 22 -71 -100 43 25 -126 95 165 86 -110 147
7879 147 -35 -136 -12 58 139 -41 12 164 112 -6 -30 -31 13 27 -20 101 130 -83 -125 90 43 -182 115 136 145
7904 145 96 -45 60 -66 159 -57 -69 -210 -189 17 31 75 86 -38 14 46 -112 -190 69 -17 -65 27 9 -106
7928 -106 -150 67 43 -206 -245 -64 -108 21 34 -14 5 -149 -148 -43 -80 -58 -6 55 -20 -19 -205 -22 -50 29 14 118
7954 118 26 -220 -104 26 202 -3 -16 104 2 57 -244 71 5 110 50 -69 -58 22 -108 -161 95 -112 52
7977 52 -17 -34 232 115 -31 -120 23 -56 86 -133 -65 -46 93 -98 -23 105 -182 -146 66 4 -20 -17 62 68 -72
8002 -72 20 -14 65 -14 94 64 94 27 12 -87 21 -42 62 18 -114 230 -22 56 2 -52 -54 29 28 28 -5 -162 -65 -60 60
8031 60 -91 84 50 139 -81 35 141 -30 -5 125 -72 2 177 16 -91 18 -164 -45 -140 -148 -79 -97 -47 32
8055 32 84 -72 -34 -72 -38 -72 -60 -76 -105 50 -115 33 72 -7 -37 104 -134 141 122 -40 51 -209 19 33 72
8080 72 -9 -86 52 -205 -81 -43 31 -28 93 -56 -3 67 -37 -34 73 40 -80 -57 -179 -33 96 71 -4 73 12
8105 12 -55 242 -93 35 52 5 185 12 2 4 -19 65 109 27 -6 -50 -159 33 -16 43 -145 54 121 167 -231 186
8131 186 66 -3 137 -57 -228 35 -151 -25 55 -141 28 -100 -114 -57 -57 34 -90 -98 -1 71 -12 -48 -88 51 6
8156 6 -87 112 122 74 32 -1 -38 -6 89 -63 54 104 -114 -32 -25 32 24 8 109 -35 -24 39 -199 104 6 -72 -78 1
8184 1 -89 25 116 -80 -38 -77 108
8191A08
##END NTUPLES=NMR FID
##END=
