##TITLE=1H ikalashn
52-Et
23.10.2024
##JCAMPDX= 6.0         $$ Bruker NMR JCAMP-DX V2.0
##DATA TYPE= NMR SPECTRUM
##DATA CLASS= NTUPLES
##ORIGIN= UXNMR, Bruker Analytische Messtechnik GmbH
##OWNER= root
$$ TOPSPIN		Version 1.3
$$ 2024-10-23 14:48:36.062 +0400  Irina@DPX200
$$ Compression mode = diff/dup
##.OBSERVE FREQUENCY= 200.131300845
##.OBSERVE NUCLEUS= ^1H
##.ACQUISITION MODE= SIMULTANEOUS
##.ACQUISITION SCHEME= undefined
##.AVERAGES= 64
##.DIGITISER RES= 18
##SPECTROMETER/DATA SYSTEM= spect
##.PULSE SEQUENCE= zg
##.SOLVENT NAME= CDCl3
##.SHIFT REFERENCE= INTERNAL, CDCl3, 1, 17.49637
##AUDIT TRAIL= $$ (NUMBER, WHEN, WHO, WHERE, WHAT)
$$ ##TITLE= Audit trail, TOPSPIN		Version 1.3
$$ ##JCAMPDX= 5.01
$$ ##ORIGIN= Bruker BioSpin GmbH
$$ ##OWNER= Irina
$$ $$ F:/spectra/data/iren/nmr/1H/4/pdata/1/auditp.txt
$$ ##AUDIT TRAIL=  $$ (NUMBER, WHEN, WHO, WHERE, VERSION, WHAT)
(   1,<2024-10-23 14:32:40.875 +0400>,<Irina>,<DPX200>,<TOPSPIN 1.3>,
      <created by zg
	started at 2024-10-23 14:28:28.031 +0400,
	POWCHK disabled, PULCHK disabled
       configuration hash MD5:
       BE 6D 3F 07 2A EA 11 49 91 17 2B D3 AF B3 58 0D
       data hash MD5: 16K
       B9 B4 A0 37 8E CC FF A4 24 59 C4 66 61 6D 82 A3>)
(   2,<2024-10-23 14:48:10.703 +0400>,<Irina>,<DPX200>,<TOPSPIN 1.3>,
      <Start of raw data processing
       efp BC_mod = 2 LB = 0.08 FT_mod = 6 PKNL = 1 PHC0 = -75.87412 PHC1 = 65.93152 SI = 32K 
       data hash MD5: 32K
       FA 5D 14 8D D4 9B F2 54 5F 68 23 2B 6C 00 75 6C>)
(   3,<2024-10-23 14:48:20.375 +0400>,<Irina>,<DPX200>,<TOPSPIN 1.3>,
      <pk fgphup PHC0 = 27.86162 PHC1 = -52.8 
       data hash MD5: 32K
       C9 C4 CE A9 84 AF 2B A0 82 1A 6E 49 19 7A 8C 79>)
(   4,<2024-10-23 14:48:24.000 +0400>,<Irina>,<DPX200>,<TOPSPIN 1.3>,
      <abs n ABSG = 5 
       data hash MD5: 32K
       16 B1 64 05 EB CC FA A1 94 AF 1B 7E 78 5F A6 8D>)
$$ ##END=
$$ 
$$ $$ hash MD5
$$ $$ AB BB AC 2D AF DD 63 6A C6 2A FF 7C E7 74 A5 C7
##$RELAX= 
##$RELAX= 
##$RELAX= 
##$RELAX= 
##$RELAX= 
##$RELAX= 
##$RELAX= 
##$RELAX= 
##$RELAX= 
$$ Bruker specific parameters
$$ --------------------------
##$DU= <F:/spectra>
##$EXPNO= 4
##$NAME= <1H>
##$PROCNO= 1
##$TYPE= <nmr>
##$USER= <iren>
##$AMP= (0..31)
100 100 100 100 100 100 100 100 100 100 100 100 100 100 100 100 100 100 
100 100 100 100 100 100 100 100 100 100 100 100 100 100 
##$ANAVPT= -1
##$AQSEQ= 0
##$AQ_mod= 1
##$AUNM= <au_zg>
##$AUTOPOS= <>
##$BF1= 200.13
##$BF2= 200.13
##$BF3= 200.13
##$BF4= 200.13
##$BF5= 200.13
##$BF6= 200.13
##$BF7= 200.13
##$BF8= 200.13
##$BYTORDA= 1
##$CFDGTYP= 0
##$CFRGTYP= 5
##$CHEMSTR= <none>
##$CNST= (0..63)
1 1 145 1 1 1 1 1 1 1 1 1 1 1 1 1 1 1 1 1 1 1 1 1 1 1 1 1 1 1 1 1 1 1 
1 1 1 1 1 1 1 1 1 1 1 1 1 1 1 1 1 1 1 1 1 1 1 1 1 1 1 1 1 1 
##$CPDPRG= <>
##$CPDPRG1= <>
##$CPDPRG2= <>
##$CPDPRG3= <>
##$CPDPRG4= <mlev>
##$CPDPRG5= <mlev>
##$CPDPRG6= <mlev>
##$CPDPRG7= <mlev>
##$CPDPRG8= <mlev>
##$CPDPRGB= <>
##$CPDPRGT= <>
##$D= (0..63)
$$ [...]
##$SW_h= 4401.40845070422
##$TD= 16384
##$TD0= 1
##$TE= 300
##$TE2= 300
##$TE3= 300
##$TEG= 300
##$TL= (0..7)
0 120 120 120 120 120 120 120 
##$TP= (0..7)
150 150 150 150 150 150 150 150 
##$TP07= 0
##$TPNAME0= <>
##$TPNAME1= <>
##$TPNAME2= <>
##$TPNAME3= <>
##$TPNAME4= <>
##$TPNAME5= <>
##$TPNAME6= <>
##$TPNAME7= <>
##$TPOAL= (0..7)
0.5 0.5 0.5 0.5 0.5 0.5 0.5 0.5 
##$TPOFFS= (0..7)
0 0 0 0 0 0 0 0 
##$TUNHIN= 0
##$TUNHOUT= 0
##$TUNXOUT= 0
##$USERA1= <user>
##$USERA2= <user>
##$USERA3= <user>
##$USERA4= <user>
##$USERA5= <user>
##$V9= 5
##$VALIST= <valist>
##$VCLIST= <CCCCCCCCCCCCCCC>
##$VD= 0
##$VDLIST= <DDDDDDDDDDDDDDD>
##$VPLIST= <PPPPPPPPPPPPPPP>
##$VTLIST= <TTTTTTTTTTTTTTT>
##$WBST= 1024
##$WBSW= 25
##$XGAIN= (0..3)
0 0 0 0 
##$XL= 0
##$YL= 0
##$YMAX_a= 487242
##$YMIN_a= -732508
##$ZGOPTNS= <>
##$ZL1= 120
##$ZL2= 120
##$ZL3= 120
##$ZL4= 120
##$ABSF1= 17.49637
##$ABSF2= -4.496376
##$ABSG= 5
##$ABSL= 3
##$ALPHA= 0
##$AQORDER= 0
##$ASSFAC= 0
##$ASSFACI= 0
##$ASSFACX= 0
##$ASSWID= 0
##$AUNMP= <proc_1d>
##$AXLEFT= 0
##$AXRIGHT= 0
##$AXTYPE= 0
##$AXUNIT= <>
##$AZFE= 0.1
##$AZFW= 0.1
##$BCFW= 0
##$BC_mod= 2
##$BYTORDP= 0
##$COROFFS= 0
##$CY= 7568.61572265625
##$DATMOD= 1
##$DC= 0
##$DFILT= <>
##$DTYPP= 0
##$F1P= 17.9538593292236
##$F2P= -4.03888763876832
##$FCOR= 0.5
##$FTSIZE= 32768
##$FT_mod= 6
##$GAMMA= 0
##$GB= 0
##$INTBC= 0
##$INTSCL= 1.936888e-010
##$ISEN= 128
##$LB= 0.08
##$LEV0= 0
##$LPBIN= 0
##$MAXI= 945.577
##$MC2= 0
##$MEAN= 0
##$ME_mod= 0
##$MI= -402.1523
##$NCOEF= 0
##$NC_proc= -7
##$NLEV= 6
##$NOISF1= 8.587773
##$NOISF2= 6.764455
##$NSP= 0
##$NTH_PI= 0
##$NZP= 0
##$OFFSET= 17.49637
##$PC= 1
##$PHC0= -48.0125
##$PHC1= 13.13152
##$PH_mod= 1
##$PKNL= yes
##$PPARMOD= 0
##$PPDIAG= 0
##$PPIPTYP= 0
##$PPMPNUM= 100
##$PPRESOL= 1
##$PSCAL= 0
##$PSIGN= 0
##$REVERSE= no
##$SF= 200.13
##$SI= 32768
##$SIGF1= 16.12182
##$SIGF2= -4.496377
##$SINO= 3.521527
##$SIOLD= 32768
##$SREGLST= <1H.CDCl3>
##$SSB= 0
##$STSI= 32768
##$STSR= 0
##$SW_p= 4401.40845070422
##$SYMM= 0
##$S_DEV= 0
##$TDeff= 16384
##$TDoff= 0
##$TI= <>
##$TILT= no
##$TM1= 0
##$TM2= 0
##$TOPLEV= 0
##$USERP1= <user>
##$USERP2= <user>
##$USERP3= <user>
##$USERP4= <user>
##$USERP5= <user>
##$WDW= 1
##$XDIM= 32768
##$YMAX_p= 451712309
##$YMIN_p= -1949527
$$ End of Bruker specific parameters
$$ ---------------------------------
##NTUPLES= NMR SPECTRUM
##VAR_NAME=  FREQUENCY,     SPECTRUM/REAL,   SPECTRUM/IMAG
##SYMBOL=    X,             R,               I
##VAR_TYPE=  INDEPENDENT,   DEPENDENT,       DEPENDENT
##VAR_FORM=  AFFN,          ASDF,            ASDF
##VAR_DIM=   32768,         32768,           32768
##UNITS=     HZ,            ARBITRARY UNITS, ARBITRARY UNITS
##FACTOR=    0.134324425510551, 1,           1
##FIRST=     4401.40845070422, -241779,      -2527505
##LAST=      0,             556158,          -3013708
##MIN=       0,             -1949527,        0
##MAX=       4401.40845070422, 451712309,    0
$$ Real data points
##PAGE= N=1
##DATA TABLE= (X++(R..R)), XYDATA
$$ [...]
$$ plain form
11080 90274726 91186083 91576910 92124717 93223910 94334061 94906325 95186593 95679343 96457022
11071 96457022 97413040 98601288 99882533 100784620 101191766 101687784 102740781 104015572 104993729
11062 104993729 105805794 106871752 108146431 109389395 110841455 112890199 115268270 117336743
11054 117336743 119084119 121117613 123661154 126298801 128846561 131766358 135397282 139329058
11046 139329058 142937452 146180207 149498024 153153482 156942643 160398606 163122946 165129622
11038 165129622 167001240 169462415 172656434 176108079 179532406 183311323 187897929 193099563
11030 193099563 198365173 203540995 208832049 214095527 218721203 222353232 225293215 227929594
11022 227929594 230089630 231299344 231499625 231122763 230510509 229650003 228572400 227616369 227002980
$$ packed form
11080I0274726R11357L90827N47807J099193J110151N72264K80268M92750P77679
11071I6457022R56018J188248J281245R02087M07146M96018J052997J274791R78157
11062A04993729Q12065J065958J274679J242964J452060K048744K378071K068473
11054A17336743J747376K033494K543541K637647K547760K919797L630924L931776
11046A39329058L608394L242755L317817L655458L789161L455963K724340K006676
11038A65129622J871618K461175L194019L451645L424327L778917M586606N201634
11030A93099563N265610N175822N291054N263478M625676L632029K939983K636379
11022B27929594K160036J209714K00281l76862o12254q60506j077603r56031o13389
$$ plain form
11013 227002980 226401792 225321147 223863107 222695697 222215152 222100756 221859141 221486187 221349232
11004 221349232 221685785 222535473 223977211 226070516 228646001 231483519 234639257 238254462
10996 238254462 242061455 245449846 248085152 250135089 251819845 253109783 254014563 254793502
10988 254793502 255607515 256247889 256535857 256801912 257619253 259128456 260902982 262436690 263510620
10979 263510620 264115774 264301137 264164920 263790486 263098789 261878564 259995926 257470826 254367531
10970 254367531 250776524 246917048 243058327 239250519 235291463 231075952 226849953 222972111
10962 222972111 219503722 216195024 212852073 209567123 206565577 203953256 201677102 199655001
10954 199655001 197876683 196416957 195389356 194841347 194666810 194697639 194938041 195609171 196830892
$$ packed form
11013B27002980o01188j080645j458040j167410m80545j14396k41615l72954j36955
11004B21349232L36553Q49688J441738K093305K575485K837518L155738L615205
10996B38254462L806993L388391K635306K049937J684756J289938R04780P78939
10988B54793502Q14013O40374K87968K66055Q17341J509203J774526J533708J073930
10979B63510620O05154J85363j36217l74434o91697j220225j882638k525100l103295
10970B54367531l591007l859476l858721l807808l959056m215511m225999l877842
10962B22972111l468389l308698l342951l284950l001546k612321k276154k022101
10954A99655001j778318j459726j027601n48009j74537L0829K40402O71130J221721
$$ plain form
10945 196830892 198313810 199549399 200352057 201073285 202179954 203673914 204986787 205427203
10937 205427203 204752198 203383667 202047305 201079708 200098013 198487596 196168265 193633701
10929 193633701 191236609 188802070 186103683 183333049 180757341 178202398 175325246 172257344
10921 172257344 169528104 167397581 165674438 164160883 162847078 161671992 160566207 159779163
10913 159779163 159651949 159959157 160045089 159814755 159951930 160772906 161506741 161331541 160611833
10904 160611833 160307866 160474335 160271174 159405750 158599657 158381829 158283629 157723420 157019725
10895 157019725 156879288 157322099 157839233 158418731 159682519 161922897 164573150 166865431
10887 166865431 168642703 170263195 171926280 173340520 173986287 173578673 172311640 170666643
$$ packed form
10945A96830892J482918J235589Q02658P21228J106669J493960J312873M40416
10937B05427203o75005j368531j336362r67597r81695j610417k319331k534564
10929A93633701k397092k434539k698387k770634k575708k554943k877152l067902
10921A72257344k729240k130523j723143j513555j313805j175086j105785p87044
10913A59779163j27214L07208Q5932k30334J37175Q20976P33835j75200p19708
10904A60611833l03967J66469k03161q65424q06093k17828r8200n60209p03695
10895A57019725j40437M42811N17134N79498J263788K240378K650253K292281
10887A66865431J777272J620492J663085J414240O45767m07614j267033j644997
$$ plain form
10879 170666643 168893904 166721967 163760118 160157360 156578336 153464851 150649962 147866350
10871 147866350 145269846 143120358 141236010 139245116 137244495 135689556 134645469 133680014
10863 133680014 132579456 131597395 130774636 129603255 127782115 125810885 124283223 122954106
10855 122954106 121129452 118731819 116309030 114128600 111979985 109849480 108037637 106482859
10847 106482859 104701621 102649181 100951671 99945363 99151706 98151755 97334373 97165257
10839 97165257 97261311 96966045 96505982 96743587 97883322 99182542 100000525 100482522 101069188
10830 101069188 101906668 102978791 104373185 106120977 108042754 109983183 112022336 114292205
10822 114292205 116692088 118869020 120418474 121122825 121056583 120372129 118959152 116575971
$$ packed form
10879A70666643j772739k171937k961849l602758l579024l113485k814889k783612
10871A47866350k596504k149488j884348j990894k000621j554939j044087r65455
10863A33680014j100558r82061q22759j171381j821140j971230j527662j329117
10855A22954106j824654k397633k422789k180430k148615k130505j811843j554778
10847A06482859j781238k052440j697510j006308p93657r99951q17382j69116
10839I7165257R6054k95266m60063K37605J139735J299220Q17983M81997N86666
10830A01069188Q37480J072123J394394J747792J921777J940429K039153K269869
10822A14292205K399883K176932J549454P04351o6242o84454j412977k383181
$$ plain form
10814 116575971 113434036 110257917 107457072 104628551 101318672 97878164 94941705 92384032
10806 92384032 89590017 86615766 84202402 82575799 81095430 79324772 77651613 76483012
10798 76483012 75527427 74341757 73033613 71939516 71039871 70130379 69215351 68368988 67551827
10789 67551827 66852531 66513036 66453468 66256030 65911906 66008056 66773946 67564951 67849628 68131081
10779 68131081 69181671 70806752 72125287 72750818 72931859 72779664 72168119 71276389 70446269
10770 70446269 69512158 67981911 65919606 63987577 62525389 61188277 59621071 57957465
10762 57957465 56506518 55378797 54521752 53757547 52784886 51529353 50421998 49880054 49603566
10753 49603566 48913754 47730281 46650641 46085461 45890094 45837496 45841497 45681413 45118597
$$ packed form
10814A16575971l141935l176119k800845k828521l309879l440508k936459k557673
10806I2384032k794015k974251k413364j626603j480369j770658j673159j168601
10798G6483012r55585j185670j308144j094097q99645r09492r15028q46363q17161
10789F7551827o99296l39495n9568j97438l44124R6150P65890P91005K84677K81453
10779F8131081J050590J625081J318535O25531J81041j52195o11545q91730q30120
10770G0446269r34111j530247k062305j932029j462188j337112j567206j663606
10762E7957465j450947j127721q57045p64205r72661j255533j107355n41944k76488
10753D9603566o89812j183473j079640n65180j95367n2598M001j60084n62816
$$ plain form
10744 45118597 44339424 43705431 43096403 42177598 41253459 40989212 41222267 41022294 40160909
10735 40160909 39512959 39610780 39825674 39555832 39228896 39351003 39457550 38968691 38374537
10726 38374537 38511423 39183562 39596754 39786072 40463311 41624948 42476624 42810309 43400089
10717 43400089 44774718 46481219 47909368 49104093 50338305 51450597 52070756 52165352
10709 52165352 52002220 51765742 51399447 50675395 49383946 47659345 46044089 44913112 43921893
10700 43921893 42437550 40464060 38661464 37438424 36545403 35664155 34873437 34312716 33821777
10691 33821777 33185977 32430598 31659952 30874404 30108899 29477049 28923404 28196358 27212724
10682 27212724 26207284 25411265 24838873 24482430 24418111 24571955 24639344 24392590 23885636
$$ packed form
10744D5118597p79173o33993o09028r18805r24139k64247K33055j99973q61385
10735D0160909o47950R7821K14894k69842l26936J22107J06547m88859n94154
10726C8374537J36886O72139M13192J89318O77239J161637Q51676L33685N89780
10717D3400089J374629J706501J428149J194725J234212J112292O20159R4596
10709E2165352j63132k36478l66295p24052j291449j724601j615256j130977r91219
10700D3921893j484343j973490j802596j223040q93021q81248p90718n60721m90939
10691C3821777o35800p55379p70646p85548p65505o31850n53645p27046r83634
10682B7212724j005440p96019n72392l56443o4319J53844O7389k46754n06954
$$ plain form
10673 23885636 23287556 22722422 22291957 22001559 21665678 21177687 20829967 20974610 21378988
10664 21378988 21395318 20841399 20212081 19888262 19676229 19352518 19112771 19129389 19135656 18856114
10654 18856114 18466737 18234514 18068107 17842776 17807109 18169714 18562614 18441333 17835758
10645 17835758 17215496 16768895 16327943 15920301 15865660 16261352 16765015 16974756 16773562
10636 16773562 16309679 15877674 15758238 15929274 16021314 15785163 15437323 15270650 15170854 14927949
10626 14927949 14787447 15118802 15640186 15624775 14960703 14395552 14512019 14988580 15170731
10617 15170731 14923916 14556657 14254743 14005701 13855300 13838506 13781567 13520598 13244159 13307606
10607 13307606 13728067 14116978 14105733 13634561 12871492 12103044 11699852 11896887 12494999
$$ packed form
10673B3885636n98080n65134m30465k90398l35881m87991l47720J44643M04378
10664B1378988J6330n53919o29318l23819k12033l23711k39747J6618O267k79542
10654A8856114l89377k32223j66407k25331l5667L62605L92900j21281o05575
10645A7835758o20262m46601m40952m07642n4641L95692N03663K09741k01194
10636A6773562m63883m32005j19436J71036R2040k36151l47840j66673r9796k42905
10626A4927949j40502L31355N21384j5411o64072n65151J16467M76561J82151
10617A5170731k46815l67259l01914k49042j50401j6794n6939k60969k76439O3447
10607A3307606M20461L88911j1245m71172p63069p68448m03192J97035N98112
$$ plain form
10598 12494999 12982231 13058038 12858754 12585920 12195837 11693952 11469726 11892982 12634329
10589 12634329 12875221 12336245 11671021 11588511 11972790 12233050 12177637 12043855 11906756 11659260
10579 11659260 11477805 11674256 12067237 12134739 11876059 11836473 12094560 11998725 11300821 10791767
10569 10791767 11187782 11998389 12246417 11841493 11419640 11181407 10822545 10450675 10592204
10560 10592204 11215004 11624380 11534054 11455892 11746609 12004288 11812275 11456197 11414356 11608650
10550 11608650 11656028 11513336 11403130 11358522 11274916 11224267 11324872 11433919 11323631 11080497
10540 11080497 11025689 11275836 11611690 11749642 11573505 11155227 10712455 10516315 10702675
10531 10702675 11141431 11510558 11505698 11072046 10534217 10385507 10766996 11252174 11352117 11101955
$$ packed form
10598A2494999M87232P5807j99284k72834l90083n01885k24226M23256P41347
10589A2634329K40892n38976o65224q2510L84279K60260n5413j33782j37099k47496
10579A1659260j81455J96451L92981O7502k58680l9586K58087r5835o97904n09054
10569A0791767L96015Q10607K48028m04924m21853k38233l58862l71870J41529
10560A0592204O22800M09376r0326p8162K90717K57679j92013l56078m1841J94294
10550A1608650M7378j42692j10206m4608q3606n0649J00605J09047j10288k43134
10540A1080497n4808K50147L35854J37952j76137m18278m42772j96140J86360
10531A0702675M38756L69127m860m33652n37829j48710L81489M85178R9943k50162
$$ plain form
10521 11101955 10887508 10869479 10955039 11174793 11587680 11892233 11698770 11202617 11010162 11236050
10511 11236050 11385468 11236983 11155680 11315317 11331102 11023474 10862499 11179233 11540638 11445871
10501 11445871 11112831 11001846 11035874 10903825 10726772 10792576 10964142 10949706 10846858 10847176
10491 10847176 10750608 10390047 10181135 10549957 11109680 11148259 10715875 10490841 10739618 11135985
10481 11135985 11450881 11679197 11626385 11142898 10663433 10734773 11106873 11097988 10746084 10688374
10471 10688374 10959431 10930920 10520878 10396163 10746677 10917151 10623697 10518472 11043236
10462 11043236 11643238 11702667 11448982 11332227 11258134 11042574 10913162 10956926 10790907 10399385
10452 10399385 10511697 11411308 12167965 11953851 11388294 11523359 12128629 12204230 11753341
$$ packed form
10521A1101955k14447j8029Q5560K19754M12887L04553j93463m96153j92455K25888
10511A1236050J49418j48485q1303J59637J5785l07628j60975L16734L61405r4767
10501A1445871l33040j10985L4028j32049j77053O5804J71566j4436j02848L18
10491A0847176r6568l60561k08912L68822N59723L8579m32384k25034K48777L96367
10481A1135985L14896K28316n2812m83487m79465P1340L72100q885l51904n7710
10471A0688374K71057k8511m10042j24715L50514J70474k93454j05225N24764
10462A1043236O00002N9429k53685j16755p4093k15560j29412M3764j66019l91522
10452A0399385J12312Q99611P56657k14114n65557J35065O05270P5601m50889
$$ plain form
10443 11753341 11704392 12243860 12557094 12298231 12078469 12244287 12305558 11982788 11825443 12262772
10433 12262772 12855482 13046572 12976803 12998935 12981073 12695623 12426616 12570035 12956001 13136363
10423 13136363 13113462 13260888 13670484 14049712 14203129 14238085 14325953 14554150 14981179 15604512
10413 15604512 16313609 17033015 17799185 18549241 19049283 19289314 19726310 20727109 21866665
10404 21866665 22269475 21749191 21148161 21255405 21745828 21653889 20719142 19670305 19096986
10395 19096986 18680209 17946996 17245690 17238096 17668290 17526590 16538052 15618175 15488651 15652642
10385 15652642 15345475 14789716 14654347 14770884 14419092 13680023 13426798 13884321 14201050
10376 14201050 13768547 13104238 12947291 13164482 13118853 12633734 12035446 11587642 11386853
$$ packed form
10443A1753341m8949N39468L13234k58863k19762J65818O1271l22770j57345M37329
10433A2262772N92710J91090o9769K2132j7862k85450k69007J43419L85966J80362
10423A3136363k2901J47426M09596L79228J53417L4956Q7868K28197M27029O23333
10413A5604512P09097P19406P66170P50056N00042K40031M36996J000799J139556
10404B1866665M02810n20284o01030J07244M90423r1939r34747j048837n73319
10395A9096986m16777p33213p01306p594M30194j41700r88538r19877j29524J63991
10385A5652642l07167n55759j35369J16537l51792p39069k53225M57523L16729
10376A4201050m32503o64309j56947K17191m5629m85119n98288m47804k00789
$$ plain form
10367 11386853 11545137 11995353 12306613 12128327 11691812 11504954 11659655 11777929 11566230
10358 11566230 11125315 10747086 10621990 10706270 10745983 10539561 10269395 10360303 10859684 11223661
10348 11223661 10975146 10359827 10038170 10251882 10596278 10579220 10174642 9809272 9904437 10402069
10338 10402069 10752574 10529910 10019646 9880530 10197678 10330135 9893104 9393870 9490888
10329 9490888 10016304 10259206 9986819 9647880 9662991 9996429 10397918 10638573 10512026 10002675
10319 10002675 9481841 9378324 9616724 9713960 9465351 9189063 9210711 9435823 9580572 9571538
10309 9571538 9540144 9573469 9619461 9581218 9446737 9350876 9467077 9778386 10049546 10122549
10299 10122549 10113414 10178108 10227595 10066781 9703272 9326427 9082794 9039899 9227545 9525285
$$ packed form
10367A1386853J58284M50216L11260j78286m36515j86858J54701J18274k11699
10358A1566230m40915l78229j25096Q4280L9713k06422k70166R0908M99381L63977
10348A1223661k48515o15319l21657K13712L44396j7058m04578l65370R5165M97632
10338A0402069L50505k22664n10264j39116L17148J32457m37031m99234R7018
10329I490888N25416K42902k72387l38939J5111L33438M01489K40655j26547n09351
10319A0002675n20834j03517K38400R7236k48609k76288K1648K25112J44749r034
10309I571538l1394L3325M5992l8243j34481r5861J16201L11309K71160P3003
10299A0122549r135O4694M9487j60814l63509l76845k43633m2895J87646K97740
$$ plain form
10289 9525285 9682376 9670300 9812560 10289317 10735890 10703513 10344609 10202398 10406775 10537728
10279 10537728 10300429 9912865 9728556 9807686 9974605 10057365 9991945 9867989 9891266 10166841
10269 10166841 10582167 11011335 11440052 11737139 11643278 11295543 11365835 12173622 13003627 12955887
10259 12955887 12227665 11795534 11961775 12076668 11749605 11452255 11656973 12133981 12456725
10250 12456725 12581160 12579772 12361969 11988924 11750310 11651231 11368064 10958624 10958625 11433524 11650115
10239 11650115 11186009 10690630 10916296 11572062 11857852 11684453 11601843 11825700 12075175
10230 12075175 12186636 12219151 12081796 11660846 11218532 11125562 11296937 11383804 11386811 11566493
10220 11566493 11870486 11984979 11894472 11900993 12120616 12395030 12671639 13084440 13678494 14342837
$$ packed form
10289I525285J57091j2076J42260M76757M46573l2377l58904j42211K04377J30953
10279A0537728k37299l87564j84309P9130J66919Q2760o5420j23956K3277K75575
10269A0166841M15326M29168M28717K97087r3861l47735P0292Q07787Q30005m7740
10259A2955887p28222m32131J66241J14893l27063k97350K04718M77008L22744
10250A2456725J24435j388k17803l73045k38614r9079k83167m09440JM74899K16591
10239A1650115m64106m95379K25666O55766K85790j73399q2610K23857K49475
10230A2075175J11461L2515j37355m20950m42314r2970J71375Q6867L007J79682
10220A1566493L03993J14493r0507O521K19623K74414K76609M12801N94054O64343
$$ plain form
10210 14342837 14933996 15266337 15211729 15019585 15175566 15681100 15957914 15801674 15782689 16183551
10200 16183551 16306440 15643568 14986995 15264017 15864530 15482425 14274699 13677811 14121074
10191 14121074 14462725 13949754 13264329 13125629 13189958 13011271 12923150 13195283 13315829 12905219
10181 12905219 12465404 12455097 12460670 12062660 11688312 11752619 11752246 11149370 10431299 10300446
10171 10300446 10476242 10353619 10225670 10670158 11222643 10953874 10078653 9706441 10117002
10162 10117002 10522293 10522343 10561357 10808011 10777193 10354094 10117710 10275277 10257294 9806714
10152 9806714 9563663 10040960 10789987 11136776 11095451 11013343 10888086 10589694 10291697 10168730
10142 10168730 10050818 9806978 9685906 9872580 10093486 10067962 9984428 10123234 10349637 10384807
$$ packed form
10210A4342837N91159L32341n4608j92144J55981N05534K76814j56240j8985M00862
10200A6183551J22889o62872o56573K77022O00513l82105j207726n96888M43263
10191A4121074L41651n12971o85425j38700O4329j78687q8121K72133J20546m10610
10181A2905219m39815j0307N573l98010l74348O4307l73o02876p18071j30853
10171A0300446J75796j22623j27949M44488N52485k68769q75221l72212M10561
10162A0117002M05291N0L9014K46654l0818m23099k36384J57567j7983m50580
10152I806714k43051M77297P49027L46789m1325q2108j25257k98392k97997j22967
10142A0168730j17912k43840j21072J86674K20906k5524q3534J38806K26403L5170
$$ plain form
10132 10384807 10273607 10209752 10192108 10188585 10308782 10479693 10338901 9851022 9621674 10082315
10122 10082315 10699087 10589077 9724574 8944417 8865445 9311097 9783136 10006200 9950613 9703168
10112 9703168 9416313 9176836 8938681 8717080 8662107 8742585 8646990 8308388 8193678 8626456
10102 8626456 9148536 9151189 8893709 9154207 9946353 10391014 9999789 9331463 9084908 9209003
10092 9209003 9304050 9313860 9323581 9156403 8745799 8548250 8968230 9612353 9758230 9437734
10082 9437734 9374084 9821226 10165908 9911806 9433101 9330407 9511719 9470529 9206354 9239070
10072 9239070 9726789 10142832 10015820 9566393 9329022 9423687 9513594 9332897 8976358 8731653
10062 8731653 8826121 9264034 9739350 9821259 9432777 9027961 9053705 9360574 9447632 9176702
$$ packed form
10132A0384807j11200o3855j7644l523J20197J70911j40792m87879k29348M60641
10122A0082315O16772j10010q64503p80157p8972M45652M72039K23064n5587k47445
10112I703168k86855k39477k38155k21601n4973Q0478r5595l38602j14710M32778
10102H626456N22080K653k57480K60498P92146M44661l91225o68326k46555J24095
10092I209003R5047R810R721j67178m10604j97549M19980O44123J45877l20496
10082I437734o3650M47142L44682k54102m78705j02694J81312m1190k64175L2716
10072I239070M87719M16043j27012m49427k37371R4665Q9907j80697l56539k44705
10062H731653R4468M37913M75316Q1909l88482m04816K5744L06869Q7058k70930
$$ plain form
10052 9176702 8856965 8676864 8516916 8376408 8482116 8794029 8891612 8640449 8513433 8845670
10042 8845670 9177697 8887974 8215736 8021055 8587046 9263212 9396899 9093322 8839391
10033 8839391 8810663 8870764 8962057 9118637 9207576 9003451 8557030 8238017 8280156 8433926
10023 8433926 8273522 7818927 7596918 7941438 8461849 8520512 8132650 7980534 8479923 9239586
10013 9239586 9612222 9421963 8954080 8595368 8708038 9426416 10251394 10303652 9431550 8625694
10003 8625694 8766058 9392493 9456289 8916626 8629308 8820217 8783984 8242683 7898333 8194858
9993 8194858 8497023 8144378 7543664 7449953 7743473 7737641 7310784 6924680 6760666 6610549
9983 6610549 6502487 6698560 7074914 7166359 6897331 6679577 6678250 6553362 6132873 5832863
$$ packed form
10052I176702l19737j80101j59948j40508J05708L11913R7583k51163j27016L32237
10042H845670L32027k89723o72238j94681N65991O76166J33687l03577k53931
10033H839391k8728O0101R1293J56580Q8939k04125m46421l19013M2139J53770
10023H433926j60404m54595k22009L44520N20411N8663l87862j52116M99389P59663
10013I239586L72636j90259m67883l58712J12670P18378Q24978N2258q72102q05856
10003H625694J40364O26435O3796n39663k87318J90909l6233n41301l44350K96525
9993H194858L02165l52645o00714r3711K93520n832m26857l86104j64014j50117
9983F610549j08062J96073L76354R1445k69028k17754j327j24888m20489l00010
$$ plain form
9973 5832863 6089078 6717170 7166544 7199289 7026723 6897860 6835351 6787694 6830140 7068687
9963 7068687 7382519 7430200 7042443 6516456 6318876 6534932 6841926 6973128 6879589 6486057
9953 6486057 5788667 5262597 5540830 6423928 6875217 6440456 5985166 6368472 7052218 6964190
9943 6964190 6249094 5997971 6435061 6620187 6074492 5517063 5608545 5990996 6092291 6010911
9933 6010911 6026682 5995171 5835164 5932434 6428175 6742941 6466684 6101151 6196967 6374582
9923 6374582 6061092 5638248 5824455 6307519 6150966 5414596 5182590 5856965 6534461 6438304
9913 6438304 6014323 6063395 6512156 6684864 6359789 5982589 6031522 6538278 7103243 7216903
9903 7216903 6770566 6312498 6484713 7168181 7607099 7447783 7133586 7109424 7210847 7140407
$$ packed form
9973E832863K56215O28092M49374L2745j72566j28863o2509m7657M2446K38547
9963G068687L13832M7681l87757n25987j97580K16056L06994J31202r3539l93532
9953F486057o97390n26070K78233Q83098M51289m34761m55290L83306O83746q8028
9943F964190p15096k51123M37090J85126n45695n57429R1482L82451J01295q1380
9933F010911J5771l1511j60007R7270M95741L14766k76257l65533R5816J77615
9923F374582l13490m22844J86207M83064j56553p36370k32006O74375O77496r6157
9913F438304m23981M9072M48761J72708l25075l77200M8933N06756N64965J13660
9903G216903m46337m58068J72215O83468M38918j59316l14197k4162J01423p0440
$$ plain form
9893 7140407 7004994 6974426 6877081 6601437 6506173 6926521 7576873 7937828 7979624 8009978
9883 8009978 8037799 7824810 7427005 7169123 7150315 7220339 7362559 7652143 7903819 7827378
9873 7827378 7524614 7413460 7659442 8058320 8439154 8783940 9005341 9046613 9153087 9562293
9863 9562293 9962545 9813756 9228894 8928486 9215388 9645350 9913616 10344056 11082202 11475811
9853 11475811 10924159 9932323 9606039 10255652 11114251 11413587 11223572 11147679 11561454 12278138
9843 12278138 12785090 12784066 12575529 12769043 13510059 14263635 14571668 14691069 15134979 15898872
9833 15898872 16611623 17207609 17894271 18605858 19097140 19537801 20399313 21694851 22918086
9824 22918086 23848667 24841185 26154994 27587006 28990694 30532433 32083527 32971457 32840968
$$ packed form
9893G140407j35413l0568r7345k75644r5264M20348O50352L60955M1796L0354
9883H009978K7821k12989l97805k57882j8808P0024J42220K89584K51676p6441
9873G827378l02764j11154K45982L98878L80834L44786K21401M1272J06474M09206
9863I562293M00252j48789n84862l00408K86902M29962K68266M30440P38146L93609
9853A1475811n51652r91836l26284O49613Q58599K99336j90015p5893M13775P16684
9843A2278138N06952j024k08537J93514P41016P53576L08033J19401M43910P63893
9833A5898872P12751N95986O86662P11587M91282M40661Q61512J295538J223235
9824B2918086R30581R92518J313809J432012J403688J541739J551094Q87930j30489
$$ plain form
9815 32840968 32256320 31868668 31424260 30289305 28626680 27225626 26272239 25145385 23571531
9806 23571531 22194504 21614482 21432638 20743313 19259026 17519173 16179181 15470462 15244096
9797 15244096 15184649 14973885 14502684 13979808 13693413 13656044 13602720 13336864 12954981 12685251
9787 12685251 12576998 12430187 12062253 11596302 11353955 11406494 11409713 11081404 10687486 10699720
9777 10699720 11007617 10947370 10302676 9808318 10221536 11184121 11574159 10934577 10002315 9697137
9767 9697137 10072372 10523515 10625401 10374615 9880398 9294739 8962262 9176696 9714457 9970372
9757 9970372 9679730 9205251 8973246 8943906 8867428 8769351 8820213 8891164 8672297 8251580
9747 8251580 8182889 8786735 9615470 9861273 9258209 8421315 8219764 8831251 9515223 9458180
$$ packed form
9815C2840968n84648l87652m44408j134955j662625j401054r53387j126854j573854
9806B3571531j377027n80022j81844o89325j484287j739853j339992p08719k26366
9797A5244096n9447k10764m71201n22876k86395l7369n3324k65856l81883k69730
9787A2685251j08253j46811l67934m65951k42347N2539L219l28309l93918J2234
9777A0699720L07897o0247o44694m94358M13218R62585L90038o39582r32262l05178
9767I697137L75235M51143J01886k50786m94217n85659l32477K14434N37761K55915
9757I970372k90642m74479k32005k9340p6478r8077N0862P0951k18867m20717
9747H251580o8691O03846Q28735K45803o03064q36894k01551O11487O83972n7043
$$ plain form
9737 9458180 8780403 8387935 8735162 9195747 9051235 8662602 8926298 9762440 10095237 9515279
9727 9515279 8992549 9392489 10113674 10042484 9284484 8914050 9255985 9501298 9111966 8617499
9717 8617499 8672908 9118561 9446426 9594958 9761766 9878860 9810518 9761818 9978226 10244914
9707 10244914 10167481 9836243 9760800 10152083 10639925 10774236 10551409 10347426 10465958 10830788
9697 10830788 11102922 11094150 11005187 11152555 11541035 11908924 12122055 12225048 12149779 11779611
9687 11779611 11344878 11289778 11597068 11705812 11309478 10770644 10495285 10409354 10390468 10658082
9677 10658082 11241764 11572331 11219114 10628896 10476743 10643880 10566816 10292943 10359184 10801445
9667 10801445 11143405 11291856 11567673 11843882 11580038 10864361 10515353 10872336 11334033
$$ packed form
9737I458180o77777l92468L47227M60585j44512l88633K63696Q36142L32797n79958
9727I515279n22730L99940P21185p1190p58000l70434L41935K45313l89332m94467
9717H617499N5409M45653L27865J48532J66808J17094o8342m8700K16408K66688
9707A0244914p7433l31238p5443L91283M87842J34311k22827k03983J18532L64830
9697A0830788K72134q772q8963J47368L88480L67889K13131J02993p5269l70168
9687A1779611m34733n5100L07290J08744l96334n38834k75359q5931j8886K67614
9677A0658082N83682L30567l53217n90218j52153J67137p7064k73873O6241M42261
9667A0801445L41960J48451K75817K76209k63844p15677l49008L56983M61697
$$ plain form
9658 11334033 11439415 11558875 12052801 12563071 12754317 13049143 13894723 14848251 15178177
9649 15178177 15005291 15083387 15662608 16253176 16405302 16161143 15818081 15690447 15966129 16399766
9639 16399766 16362444 15613386 14754754 14451074 14502441 14260786 13677255 13245853 13083794 12808258
9629 12808258 12287332 11813520 11499001 11151996 10806466 10722719 10782670 10564749 10155642 10162406
9619 10162406 10659737 10850470 10197753 9273634 8947343 9209764 9385327 9160389 8792306
9610 8792306 8508209 8300036 8255327 8544135 9008364 9208464 9025831 8879542 9149659 9631454
9600 9631454 9806259 9523440 9143198 9002956 9014647 8948263 8897299 9141842 9613641 9887484
9590 9887484 9796857 9673345 9783414 9927188 9904778 9982546 10437092 10946996 10980404 10577315
$$ packed form
9658A1334033J05382J19460M93926N10270J91246K94826Q45580R53528L29926
9649A5178177j72886P8096N79221N90568J52126k44159l43062j27634K75682M33637
9639A6399766l7322p49058q58632l03680N1367k41655n83531m31402j62059k75536
9629A2808258n20926m73812l14519l47005l45530q3747N9951k17921m09107O764
9619A0162406M97331J90733o52717r24119l26291K62421J75563k24938l68083
9610H792306k84097k08173m4709K88808M64229K00100j82633j46289K70117M81795
9600I631454J74805k82819l80242j40242J1691o6384n0964K44543M71799K73843
9590I887484r0627j23512J10069J43774k2410P7768M54546N09904L3408m03089
$$ plain form
9580 10577315 10197446 9977059 9729156 9505645 9477886 9383961 8860152 8264545 8317681 8885360
9570 8885360 9048135 8531737 8063121 8019328 7825540 7213954 6954682 7520577 8021956 7512882
9560 7512882 6573096 6424409 7048712 7413861 7191168 6988197 7051004 6965656 6651050 6510958
9550 6510958 6515256 6215635 5807501 6066053 6966832 7462668 7034619 6437234 6389889 6509367
9540 6509367 6218709 5859353 6070046 6673750 7007182 6938391 6823769 6787797 6724338 6752452
9530 6752452 7046798 7407832 7530131 7502353 7578025 7698607 7710572 7763080 7966410 7953413
9520 7953413 7393653 6711414 6617750 7055290 7296410 7067127 6885310 7164082 7589838 7631108
9510 7631108 7228578 6751542 6572447 6816982 7255766 7372259 6838352 5986599 5515860 5685209
$$ packed form
9580A0577315l79869k20387k47903k23511k7759r3925n23809n95607N3136N67679
9570H885360J62775n16398m68616m3793j93788o11586k59272N65895N01379n09074
9560G512882r39786j48687O24303L65149k22693k02971O2807q5348l14606j40092
9550F510958M298k99621m08134K58552R00779M95836m28049n97385m7345J19478
9540F509367k90658l59356K10693O03704L33432o8791j14622l5972o3459K8114
9530F752452K94346L61034J22299k7778P5672J20582J1965N2508K03330j2997
9520G953413n59760o82239r3664M37540K41120k29283j81817K78772M25756M1270
9510G631108m02530m77036j79095K44535M38784J16493n33907q51753m70739J69349
$$ plain form
9500 5685209 6105791 6350487 6396531 6380296 6299672 6143315 6022096 5983854 5913413 5750839
9490 5750839 5598839 5502764 5344250 5074012 4846064 4800260 4893447 5045516 5261944 5502093
9480 5502093 5609091 5502382 5308191 5195504 5186714 5193267 5139375 5019847 4922486 4961856 5080974
9469 5080974 5018968 4667138 4344337 4444955 4891659 5250693 5327022 5277991 5176652 4913479
9459 4913479 4588430 4531082 4780776 4982281 4979017 5058849 5364059 5521835 5225057 4782769
9449 4782769 4656092 4761847 4720559 4565561 4672370 5069967 5322292 5140338 4733097 4470924
9439 4470924 4476702 4617708 4699169 4621353 4469535 4422062 4492340 4502286 4416326 4460707 4716236
9428 4716236 4881533 4746341 4609315 4805164 5068141 4903698 4443284 4313826 4662503 4934704
$$ packed form
9500E685209M20582K44696M6044j6235q0624j56357j21219l8242p0441j62574
9490E750839j52000r6075j58514k70238k27948m5804R3187J52069K16428K40149
9480E502093J06998j06709j94191j12687q790O553n3892j19528r7361L9370J19118
9469E080974o2006l51830l22801J00618M46704L59034P6329m9031j01339k63173
9459D913479l25049n7348K49694K01505l264P9832L05210J57776k96778m42288
9449D782769j26677J05755m1288j54998J06809L97597K52325j81954m07241k62173
9439D470924N778J41006Q1461p7816j51818m7473P0278R946q5960M4381K55529
9428D716236J65297j35192j37026J95849K62977j64443m60414j29458L48677K72201
$$ plain form
9418 4934704 4754889 4451191 4457561 4679075 4760301 4610586 4362923 4115013 3974618 4076301
9408 4076301 4310168 4323887 4030857 3801024 3890656 4044931 4008223 4052095 4505159 5032627
9398 5032627 4979386 4346361 3861318 4021575 4539148 4856981 4813471 4619764 4491077 4501360
9388 4501360 4604079 4649560 4520136 4309322 4213357 4241373 4245572 4234492 4372342 4620746 4704241
9377 4704241 4558561 4498825 4744260 5054733 5093138 4916980 4808373 4787038 4642807 4387624
9367 4387624 4328323 4631874 5069099 5283419 5154097 4833561 4566528 4527963 4711395 4910901
9357 4910901 4914928 4778452 4803309 5156011 5567326 5542720 4922123 4163913 3952805 4476071
9347 4476071 5192102 5440363 5190294 4963641 5051675 5154660 4936464 4591190 4542077 4800248
$$ packed form
9418D934704j79815l03698O370K21514Q1226j49715k47663k47910j40395J01683
9408D076301K33867J3719k93030k29833Q9632J54275l6708M3872M53064N27468
9398E032627n3241o33025m85043J60257N17573L17833m3510j93707j28687J0283
9388D501360J02719M5481j29424k10814r5965K8016M199j1080J37850K48404Q3495
9377D704241j45680n9736K45435L10473L8405j76158j08607k1335j44231k55183
9367D387624n9301L03551M37225K14320j29322l20536k67033l8565J83432J99506
9357D910901M027j36476K4857L52702M11315k4606o20597p58210k11108N23266
9347D476071P16031K48261k50069k26653Q8034J02985k18196l45274m9113K58171
$$ plain form
9337 4800248 5000971 4964406 4846706 4799121 4860109 5137345 5649614 5982681 5639916 4874889
9327 4874889 4600971 5166843 5771851 5573402 4901071 4723113 5224925 5691211 5701732 5622553
9317 5622553 5751002 5731207 5223932 4604986 4490938 4899721 5344601 5529285 5502717 5292135
9307 5292135 4871888 4480579 4528344 5065619 5639249 5812886 5627788 5431806 5426667 5540833
9297 5540833 5657191 5787898 5976294 6121795 6044132 5771465 5625289 5847160 6230319 6379893
9287 6379893 6304804 6398496 6763909 6985890 6803788 6582921 6724961 6972503 6834259 6457631
9277 6457631 6446821 6903078 7302681 7360638 7337584 7338335 7028600 6403579 6167554 6783989 7640659
9266 7640659 7813789 7334970 7013172 7200031 7467019 7476063 7433752 7520895 7521242 7319956 7253341
$$ packed form
9337D800248K00723l6565j17700m7585O0988K77236N12269L33067l42765p65027
9327D874889k73918N65872O05008j98449o72331j77958N01812M66286J0521p9179
9317E622553J28449j9795n07275o18946j14048M08783M44880J84684k6568k10582
9307E292135m20247l91309M7765N37275N73630J73637j85098j95982n139J14166
9297E540833J16358J30707J88396J45501p7663k72667j46176K21871L83159J49574
9287F379893p5089R3692L65413K21981j82102k20867J42040K47542j38244l76628
9277F457631j0810M56257L99603N7957k3054P51l09735o25021k36025O16435Q56670
9266G640659J73130m78819l21798J86859K66988R044m2311Q7143L47k01286o6615
$$ plain form
9255 7253341 7587362 8034283 8175999 8068307 8024800 8036924 7850857 7493333 7281805 7333756
9245 7333756 7457366 7556495 7755746 8013184 7984487 7515415 7003235 6952528 7299660 7502889
9235 7502889 7295608 7032706 7146477 7494523 7530435 7077079 6631124 6747523 7316728 7716898
9225 7716898 7623594 7356975 7348072 7582432 7807324 8019891 8357227 8636630 8500976 8081882
9215 8081882 8014698 8541355 9031389 8801525 8097530 7749089 8019972 8379454 8408569 8335870
9205 8335870 8495571 8783055 8958917 9072155 9213620 9202761 8948545 8832032 9216238 9746141
9195 9746141 9693874 8982289 8349948 8412241 8996202 9527509 9681543 9502719 9240242 9233052
9185 9233052 9634289 10107956 10147440 9829169 9808103 10331882 10761756 10496850 9936044 9916552
$$ packed form
9255G253341L34021M46921J41716j07692m3507J2124j86067l57524k11528N1951
9245G333756J23610R9129J99251K57438k8697m69072n12180n0707L47132K03229
9235G502889k07281k62902J13771L48046L5912m53356m45955J16399N69205M00170
9225G716898r3304k66619q903K34360K24892K12567L37336K79403j35654m19094
9215H081882o7184N26657M90034k29864p03995l48441K70883L59482K9115p2699
9205H335870J59701K87484J75862J13238J41465j0859k54216j16513L84206N29903
9195I746141n2267p11585o32341O2293N83961N31307J54034j78824k62477p190
9185I233052M01237M73667L9484l18271k1066N23779M29874k64906n60806j9492
$$ plain form
9175 9916552 10453979 10734978 10343693 9838564 9905161 10425428 10712384 10409008 9860348 9667461
9165 9667461 10030678 10551716 10708012 10522953 10560749 11106509 11645561 11532513 10955624 10699351
9155 10699351 11022266 11385767 11383482 11292895 11431150 11565935 11413824 11244845 11439912 11791380
9145 11791380 11856535 11788843 12137866 12854783 13179329 12703178 11987966 11811523 12211461 12643335
9135 12643335 12775389 12681013 12415929 11921545 11397969 11295654 11674710 11915789 11474045 10739050
9125 10739050 10623908 11266016 11719925 11256798 10444724 10336905 10909032 11109111 10447160
9116 10447160 9674598 9570156 9818991 9686480 9250679 9213221 9751746 10291620 10364091 10080662
9106 10080662 9739987 9505208 9526139 9877578 10265750 10223196 9704138 9128816 8809604 8727750
$$ packed form
9175I916552N37427K80999l91285n05129O6597N20267K86956l03376n48660j92887
9165I667461L63217N21038J56296j85059L7796N45760N39052j13048n76889k56273
9155A0699351L22915L63501k285r0587J38255J34785j52111j68979J95067L51468
9145A1791380O5155o7692L49023P16917L24546m76151p15212j76443L99938M31874
9135A2643335J32054r4376k65084m94384n23576j02315L79056K41079m41744p34995
9125A0739050j15142O42108M53909m63127q12074j07819N72127K00079o61951
9116A0447160p72562j04442K48835j32511m35801l7458N38525N39874P2471k83429
9106A0080662l40675k34779K0931L51439L88172m2554n19058n75322l19212q1854
$$ plain form
9096 8727750 8852253 9168300 9367518 9107720 8688562 8817599 9508188 9929095 9686186 9486182
9086 9486182 9978589 10660587 10696838 10248779 10073538 10200959 10024822 9514964 9284468 9441795
9076 9441795 9412581 9079730 9081145 9614933 9923445 9525445 9095259 9377614 9936000 9869229
9066 9869229 9282277 9072887 9491696 9866457 9747031 9469053 9429188 9525901 9564779 9623788
9056 9623788 9734723 9699196 9517819 9574083 10067740 10607445 10687788 10307192 9831979 9494823
9046 9494823 9314991 9304844 9451642 9617283 9691785 9746961 9876776 10024146 10105716 10136611
9036 10136611 10102747 9924616 9685355 9632464 9785828 9850632 9729088 9749571 10075545 10280865
9026 10280865 9972656 9514577 9576012 10177616 10754871 10994392 10988765 10706363 10041850 9385877
$$ packed form
9096H727750J24503L16047J99218k59798m19158J29037O90589M20907k42909k00004
9086I486182M92407O81998L6251m48059j75241J27421j76137n09858k30496J57327
9076I441795k9214l32851J415N33788L08512l98000m30186K82355N58386o6771
9066I869229n86952k09390M18809L74761j19426k77978l9865R6713L8878N9009
9056I623788J10935l5527j81377N6264M93657N39705Q0343l80596m75213l37156
9046I494823j79832j0147J46798J65641P4502N5176J29815J47370Q1570L0895
9036A0136611l3864j78131k39261n2891J53364O4804j21544K0483L25974K05320
9026A0280865l08209m58079O1435O01604N77255K39521n627k82402o64513o55973
$$ plain form
9016 9385877 9374800 9942188 10353849 10362801 10530412 11094071 11374826 10860089 10120317 9937602
9006 9937602 10137058 10097229 9936090 10262463 11018953 11492552 11385434 11054807 10740738 10367034
8996 10367034 10104632 10285629 10652579 10525444 9907844 9613746 10026376 10542592 10607001 10476549
8986 10476549 10473557 10299968 9777332 9556817 10233640 11248494 11564591 11113264 10686271 10623261
8976 10623261 10540557 10292134 10251356 10507359 10633763 10503171 10576043 11067432 11523047 11606855
8966 11606855 11659133 11995600 12249618 12016965 11673406 11831722 12290756 12298031 11748825 11358296
8956 11358296 11562137 11954785 12064900 12067460 12322824 12685296 12774968 12625670 12522428 12386083
8946 12386083 11921311 11341178 11288791 11840315 12184247 11700682 10902290 10756145 11366463 11964467
$$ packed form
9016I385877j1077N67388M11661Q952J67611N63659K80755n14737p39772j82715
9006I937602J99456l9829j61139L26373P56490M73599j07118l30627l14069l73704
8996A0367034k62402J80997L66950j27135o17600k94098M12630N16216O4409j30452
8986A0476549k992j73589n22636k20515O76823J014854L16097m51327m26993o3010
8976A0623261q2704k48423m0778K56003J26404j30592P2872M91389M55615Q3808
8966A1606855N2278L36467K54018k32653l43559J58316M59034P275n49206l90529
8956A1358296K03841L92648J10115K560K55364L62472Q9672j49298j03242j36345
8946A2386083m64772n80133n2387N51524L43932m83565p98392j46145O10318N98004
$$ plain form
8936 11964467 12071267 11964876 11925504 11743043 11291562 10987759 11196209 11602286 11695823 11572764
8926 11572764 11714299 12177628 12565169 12688969 12715522 12680848 12406971 11967824 11746933 11900966
8916 11900966 12169852 12326555 12422065 12486982 12412369 12263496 12289208 12457034 12422654 12173692
8906 12173692 12225747 12840116 13466246 13406455 12757805 12255205 12352963 12847878 13284384 13386651
8896 13386651 13179542 12966923 13102567 13571259 13955111 14007897 13994905 14187167 14353130 14192416
8886 14192416 13995684 14295511 14986692 15404274 15300253 15168138 15457188 15968467 16257013
8877 16257013 16234002 16112761 16050763 16079576 16174993 16223245 16106238 15929053 15946780 16186239
8867 16186239 16404445 16507544 16684898 16974958 17048976 16688706 16197606 16029482 16218390 16492408
$$ packed form
8936A1964467J06800j06391l9372j82461m51481l03803K08450M06077R3537j23059
8926A1572764J41535M63329L87541J23800K6553l4674k73877m39147k20891J54033
8916A1900966K68886J56703R5510O4917p4613j48873K5712J67826l4380k48962
8906A2173692N2055O14369O26130n9791o48650n02600R7758M94915M36506J02267
8896A3386651k07109k12619J35644M68692L83852N2786j2992J92262J65963j60714
8886A4192416j96732K99827O91181M17582j04021j32115K89050N11279K88546
8877A6257013k3011j21241o1998K8813R5417M8252j17007j77185J7727K39459
8867A6186239K18206J03099J77354K90060P4018l60270m91100j68124J88908K74018
$$ plain form
8857 16492408 16774204 17190504 17652412 17814656 17542918 17156656 17066663 17315107 17595163 17650335
8847 17650335 17546825 17555497 17833141 18265543 18605095 18696240 18563803 18396327 18489601 19027115
8837 19027115 19764736 20120200 19836450 19408509 19510877 20114835 20624390 20853137 21274836
8828 21274836 22114179 22779066 22637108 21957946 21566828 21783538 22204159 22425346 22502394 22669797
8818 22669797 22995501 23396915 23740574 23878506 23783642 23648915 23687577 23900707 24211498 24681667
8808 24681667 25333480 25903490 26121731 26159902 26439086 27027559 27606693 28029377 28490416 29060524
8798 29060524 29476471 29596205 29725720 30226848 31001825 31606708 31787601 31765821 32038125 32904649
8788 32904649 34097013 34943550 35089442 34964686 35287489 36219470 37349667 38366072 39235964
$$ packed form
8857A6492408K81796M16300M61908J62244k71738l86262q9993K48444K80056N5172
8847A7650335j03510Q672K77644M32402L39552R1145j32437j67476R3274N37514
8837A9027115P37621L55464k83750m27941J02368O03958N09555K28747M21699
8828B1274836Q39343O64887j41958o79162l91118K16710M20621K21187P7048J67403
8818B2669797L25704M01414L43659J37932r4864j34727L8662K13130L10791M70169
8808B4681667O51813N70010K18241L8171K79184N88473N79134M22684M61039N70108
8798B9060524M15947J19734J29515N01128P74977O04883J80893k1780K72304Q66524
8788C2904649J192364Q46537J45892j24756L22803R31981J130197J016405Q69892
$$ plain form
8779 39235964 39801879 39879329 39866183 40511946 41773221 42642806 42615749 42601680 43633717 45260700
8769 45260700 46199966 46261915 46529352 47626344 48887553 49569533 49977822 50831772 52138784
8760 52138784 53326761 54135190 54817652 55640541 56607892 57585298 58417318 59051752 59746405
8751 59746405 60931257 62622362 64206217 65107002 65501156 66107242 67440846 69518582 72052031
8742 72052031 74579363 76591569 77947238 79104591 80603379 82382955 83944322 85102116
8734 85102116 86176253 87440760 88786372 90038850 91317600 92961925 95272966 98307728
8726 98307728 101716439 104895074 107643908 110598903 114590290 119612094 124928669 130213402
8718 130213402 135941802 142458897 149335537 156068951 162805032 169723163 176129152 180926153
$$ packed form
8779C9235964N65915P7450j3146O45763J261275Q69585k7057j4069J032037J626983
8769D5260700R39266O1949K67437J096992J261209O81980M08289Q53950J307012
8760E2138784J187977Q08429O82462Q22889R67351R77406Q32020O34434O94653
8751E9746405J184852J691105J583855R00785L94154O06086J333604K077736K533449
8742G2052031K527332K012206J355669J157353J498788J779576J561367J157794
8734H5102116J074137J264507J345612J252478J278750J644325K311041L034762
8726I8307728L408711L178635K748834K954995L991387N021804N316575N284733
8718A30213402N728400O517095O876640O733414O736081O918131O405989M797001
$$ plain form
8710 180926153 183830616 185430128 186090374 185501574 183411619 180177137 176356629 172268164
8702 172268164 168204399 164590918 161538738 158574973 155226595 151674020 148482043 145859619
8694 145859619 143560224 141417444 139578688 138158308 136986111 135864283 134892153 134349581
8686 134349581 134303737 134478420 134571947 134638969 135046976 136040126 137483613 139137181 141032396
8677 141032396 143372116 146155630 149197612 152521144 156415616 161003672 166040139 171303945
8669 171303945 176916676 183004683 189196115 194720066 198966872 201787776 203308641 203627145
8661 203627145 202698611 200433497 196914964 192516657 187704975 182728603 177654352 172683029
8653 172683029 168161647 164215407 160645287 157305814 154306056 151706638 149343319 147153082
$$ packed form
8710A80926153K904463J599512O60246n88800k089955l234482l820508m088465
8702A72268164m063765l613481l052180k963765l348378l552575l191977k622424
8694A45859619k299395k142780j838756j420380j172197j121828r72130n42572
8686A34349581m5844J74683R3527O7022M08007R93150J443487J653568J895215
8677A41032396K339720K783514L041982L323532L894472M588056N036467N263806
8669A71303945N612731O088007O191432N523951M246806K820904J520865L18504
8661B03627145r28534k265114l518533m398307m811682m976372n074251m971323
8653A72683029m521382l946240l570120l339473k999758k599418k363319k190237
$$ plain form
8645 147153082 145355811 144067986 143053789 142136289 141519466 141367539 141402133 141308339 141209257
8636 141209257 141304816 141404870 141352048 141528871 142261259 143035890 143136834 142860713 143165752 144177205
8626 144177205 145088769 145696853 146915646 149297082 152017976 154029376 155470184 157197718
8618 157197718 159493662 161994357 164449850 166766186 168587036 169562938 169864396 169832004 169324838
8609 169324838 168001366 166026922 163882612 161665794 159238636 156918397 155282903 154285802
8601 154285802 153253558 151877361 150620115 149984988 149895668 149991526 150107246 150251189 150426708
8592 150426708 150654603 150979546 151403803 151977490 152868668 154124441 155515080 156875408 158373898
8583 158373898 160121722 161827945 163291322 164896248 167044921 169430234 171573361 173767831
$$ packed form
8645A47153082j797271j287825j014197r17500o16823j51927L4594r3794r9082
8636A41209257R5559J00054n2822J76823P32388P74631J00944k76121L05039J011453
8626A44177205R11564O08084J218793K381436K720894K011400J440808J727534
8618A57197718K295944K500695K455493K316336J820850R75902L01458l2392n07166
8609A69324838j323472j974444k144310k216818k427158k320239j635494r97101
8601A54285802j032244j376197j257246o35127q9320R5858J15720J43943J75519
8592A50426708K27895L24943M24257N73687Q91178J255773J390639J360328J498490
8583A58373898J747824J706223J463377J604926K148673K385313K143127K194470
$$ plain form
8575 173767831 176642086 180049987 183414026 187015650 191753955 197581920 203484276 209275264
8567 209275264 216044972 224291590 233012136 241492185 250641820 261308746 272346175 281873351
8559 281873351 289777065 297427510 305365453 312929627 320081384 327916650 337013092 346712323
8551 346712323 356647398 367735903 380726704 394531147 406903267 416346208 422602923
8544 422602923 425612953 424880919 420060865 411689845 401033411 389259174 376889813 364120794
8536 364120794 351515413 339977926 329871067 320629666 311712244 303557858 296945516 291678099
8528 291678099 286768441 281919262 277902175 275225578 273304177 271463023 270077166 270014964
8520 270014964 271316470 273097629 274679923 276333455 278867134 282769550 287824188 293479460
$$ packed form
8575A73767831K874255L407901L364039L601624M738305N827965N902356N790988
8567B09275264O769708Q246618Q720546Q480049R149635J0666926J1037429R527176
8559B81873351P903714P650445P937943P564174P151757P835266R096442R699231
8551C46712323R935075J1088505J2990801J3804443J2372120R442941O256715
8544D22602923L010030p32034m820054q371020j0656434j1774237j2369361j2769019
8536C64120794j2605381j1537487j0106859r241401q917422q154386o612342n267417
8528B91678099m909658m849179m017087k676597j921401j841154j385857o2202
8520B70014964J301506J781159J582294J653532K533679L902416N054638N655272
$$ plain form
8512 293479460 299553654 306440336 314472670 323320152 332402576 341717395 351689977 362277086
8504 362277086 372919653 383479050 394448821 405902322 416864548 426091578 432865572
8497 432865572 436641403 436641801 432504620 424891372 414824896 402804829 389173249 374896691
8489 374896691 361141436 348234675 335795360 323839715 313053143 303886128 295971361
8482 295971361 288628555 281581734 275061368 269448910 264858441 260934420 257196970 253699745
8474 253699745 250989723 249159777 247431696 245180811 242927816 241621081 241236350 240861147
8466 240861147 240013193 239102687 238648892 238801682 239641829 241181223 242975872 244489938 245997601
8457 245997601 248402663 251970012 255948029 259678477 263329860 267175822 270866777 273929067
$$ packed form
8512B93479460O074194O886682Q032334Q847482R082424R314819R972582J0587109
8504C62277086J0642567J0559397J0969771J1453501J0962226R227030O773994
8497D32865572L775831L98m137181p613248j0066476j2020067j3631580j4276558
8489C74896691j3755255j2906761j2439315j1955645j0786572r167015p914767
8482B95971361p342806p046821o520366n612458m590469l924021l737450l497225
8474B53699745k710022j829946j728081k250885k252995j306735l84731l75203
8466B40861147q47954r10506m53795J52790Q40147J539394J794649J514066J507663
8457B45997601K405062L567349L978017L730448L651383L845962L690955L062290
$$ plain form
8449 273929067 276436678 278658772 280449586 281467561 281684064 281285036 280368586 279072377
8441 279072377 277692863 276375932 274989360 273539274 272359755 271677852 271411627 271608760
8433 271608760 272563317 274211835 275990489 277680370 279821368 282837413 286360218 289994996
8425 289994996 294160244 299437028 305566714 311901839 318492285 325899499 334213483 343108577
8417 343108577 352675160 363291382 374709536 386100066 397027304 407624828 417794238
8410 417794238 427011868 434987077 441739439 446960277 450136357 451455260 451712309 451045206
8402 451045206 448612958 443903502 437536971 430305350 422227256 413177439 403725458 394554483
8394 394554483 385549468 376258304 366904455 358165539 350189289 342598546 335360248 328923577
$$ packed form
8449B73929067K507611K222094J790814J017975K16503l99028r16450j296209
8441B79072377j379514j316931j386572j450086j179519o81903k66225J97133
8433B71608760R54557J648518J778654J689881K140998L016045L522805L634778
8425B89994996M165248N276784O129686O335125O590446P407214Q313984Q895094
8417C43108577R566583J0616222J1418154J1390530J0927238J0597524J0169410
8410D17794238R217630P975209O752362N220838L176080J318903K57049o67103
8402D51045206k432248m709456o366531p231621q078094r049817r451981r170975
8394C94554483r005015r291164r353849q738916p976250p590743p238298o436671
$$ plain form
8386 328923577 323485756 318755616 314519139 310879090 307822210 305085755 302685201 301162669
8378 301162669 301005545 302031364 303586727 305249359 307170764 309775979 313264732 317486925
8370 317486925 322281053 327729588 333843873 340116565 345791974 350611638 354822224 358311853
8362 358311853 360320384 360352940 358808534 356168753 352085544 346009332 338339189 330059137
8354 330059137 321407941 311863129 301467385 291175101 281592553 272259019 262637267 253065398
8346 253065398 244152352 235842984 227739690 219899635 212639837 205869631 199273184 192938341
8338 192938341 187183084 181917705 176791060 171858843 167477584 163569846 159629309 155513096
8330 155513096 151621745 148171955 144889810 141620070 138634382 136014463 133288244 130133995
$$ packed form
8386C28923577n437821m730140m236477l640049l056880k736455k400554j522532
8378C01162669j57124J025819J555363J662632J921405K605215L488753M222193
8370C17486925M794128N448535O114285O272692N675409M819664M210586L489629
8362C58311853K008531L2556j544406k639781m083209o076212p670143q280052
8354C30059137q651196r544812j0395744j0292284r582548r333534r621752r571869
8346B53065398q913046q309368q103294p840055p259798o770206o596447o334843
8338A92938341n755257n265379n126645m932217m381259l907738l940537m116213
8330A55513096l891351l449790l282145l269740k985688k619919k726219l154249
$$ plain form
8322 130133995 127004914 124515826 122510671 120314321 117753121 115350586 113509422 111995722
8314 111995722 110342555 108394127 106322674 104370902 102657726 101028309 99111961 96796573
8306 96796573 94590990 93134806 92335154 91426114 89970346 88317167 86890917 85572312
8298 85572312 84141046 82819983 81849912 80913059 79608252 78230325 77369245 76870808 75972796
8289 75972796 74511272 73199720 72493535 71932378 70986278 69866026 68974213 68154690 67146749
8280 67146749 66299820 66037640 65910945 65065349 63576389 62434685 62072447 61761760 60841454
8271 60841454 59790448 59470966 59786563 59791510 58949167 57663170 56562060 55780265 55093260
8262 55093260 54372805 53650431 52926159 52165656 51442808 50898184 50512296 50047115 49327412
$$ packed form
8322A30133995l129081k489088k005155k196350k561200k402535j841164j513700
8314A11995722j653167j948428k071453j951772j713176j629417j916348k315388
8306I6796573k205583j456184p99652r09040j455768j653179j426250j318605
8298H5572312j431266j321063r70071r36853j304807j377927q61080m98437q98012
8289G5972796j461524j311552p06185n61157r46100j120252q91813q19523j007941
8280F7146749q46929k62180j26695q45596j488960j141704l62238l10687r20306
8271F0841454j051006l19482L15597M947q42343j285997j101110p81795o87005
8262E5093260p20455p22374p24272p60503p22848n44624l85888m65181p19703
$$ plain form
8253 49327412 48523642 47985836 47766802 47509253 46926347 46182963 45580838 45073490 44440856
8244 44440856 43796853 43454044 43310674 42915632 42260647 41920046 42094329 42072909 41171281 39810545
8234 39810545 39036099 39156352 39475161 39308271 38672339 37934434 37347999 37070525 37132953 37197686
8224 37197686 36795779 36013731 35497619 35519026 35513220 34938195 34160223 33918632 34166598 34103542
8214 34103542 33352809 32493553 32204510 32334588 32190629 31538975 30943458 31048521 31714840
8205 31714840 32041031 31318024 29892293 28874984 28909848 29472532 29628404 29246330 29006141
8196 29006141 29266543 29513587 29172799 28470572 28028772 27914692 27674058 27217224 27043658
8187 27043658 27405527 27779847 27562707 26945373 26607622 26697282 26673201 26233992 25855889 26071212
$$ packed form
8253D9327412q03770n37806k19034k57549n82906p43384o02125n07348o32634
8244D4440856o44003l42809j43370l95042o54985l40601J74283k1420r01628j360736
8234C9810545p74446J20253L18809j66890o35932p37905n86435k77474O2428O4733
8224C7197686m01907p82048n16112K1407n806n75025p77972k41591K47966o3056
8214C4103542p50733q59256k89043J30078j43959o51654n95517J05063O66319
8205C1714840L26191p23007j425731j017309L4864N62684J55872l82074k40189
8196B9006141K60402K47044l40788p02227m41800j14080k40634m56834j73566
8187B7043658L61869L74320k17140o17334l37751Q9660k4081m39209l78103K15323
$$ plain form
8177 26071212 26594251 26670697 26149430 25651093 25596219 25614168 25233697 24718290 24672045 25010158
8167 25010158 24951912 24133351 23184888 22916610 23315672 23705832 23623689 23140123 22509830 21963995
8157 21963995 21785352 22116796 22618068 22708150 22281922 21851296 21836128 22055678 22111386 21934654
8147 21934654 21692407 21451761 21259990 21300364 21594839 21753989 21440644 20946689 20862084 21239412
8137 21239412 21555015 21493490 21269548 21088141 20818729 20441855 20337919 20745512 21254321 21260498
8127 21260498 20760005 20317058 20324689 20613099 20774895 20633654 20359593 20246807 20373152 20466937
8117 20466937 20243808 19872477 19818553 20132889 20274833 19892211 19402493 19407826 19834958 20138386
8107 20138386 20142801 20138268 20250818 20296063 20261354 20376273 20618306 20669408 20497665 20479421 20759956
$$ packed form
8177B6071212N23039P6446n21267m98337n4874J7949l80471n15407m6245L38113
8167B5010158n8246q18561r48463k68278L99062L90160q2143m83566o30293n45835
8157B1963995j78643L31444N01272R0082m26228m30626j5168K19550N5708j76732
8147B1934654k42247k40646j91771M0374K94475J59150l13345m93955q4605L77328
8137B1239412L15603o1525k23942j81407k69412l76874j03936M07593N08809O177
8127B1260498n00493m42947P631K88410J61796j41241k74061j12786J26345R3785
8117B0466937k23129l71331n3924L14336J41944l82622m89718N333M27132L03428
8107B0138386M415m533J12550M5245l4709J14919K42033N1102j71743j8244K80535
$$ plain form
8096 20759956 20977664 20857336 20613777 20484792 20312665 19941853 19632708 19671523 19888534 19967720
8086 19967720 19950147 20024272 20102517 20059483 20126314 20524184 20902776 20723413 20113989 19768896
8076 19768896 19998580 20419210 20629499 20652341 20592809 20393611 20135890 20113623 20361989 20518005
8066 20518005 20389485 20251389 20306423 20296658 20036515 19910944 20300229 20792858 20619778 19800112
8056 19800112 19205746 19353231 19709382 19517521 18872615 18494117 18641444 18798967 18501226
8047 18501226 18000971 17823420 17951060 17890643 17492179 17231094 17491228 17940831 17968055 17519984
8037 17519984 17109287 17079439 17276553 17459721 17621290 17771695 17752162 17454993 17008025 16627122
8027 16627122 16500397 16821431 17559463 18135916 17847692 16854007 16215004 16557013 17204996
$$ packed form
8096B0759956K17708j20328k43559j28985j72127l70812l09145L8815K17011P9186
8086A9967720j7573P4125P8245m3034O6831L97870L78592j79363o09424l45093
8076A9768896K29684M20630K10289K2842n9532j99198k57721k2267K48366J56016
8066B0518005j28520j38096N5034r765k60143j25571L89285M92629j73080q19666
8056A9800112n94366J47485L56151j91861o44906l78498J47327J57523k97741
8047A8501226n00255j77551J27640o0417l98464k61085K60134M49603K7224m48071
8037A7519984m10697k9848J97114J83168J61569J50405j9533k97169m46968l80903
8027A6627122j26725L21034P38032N76453k88224r93685o39003L42009O47983
$$ plain form
8018 17204996 17181496 16596191 16297579 16470793 16508933 16223264 16210159 16769497 17302034 17203792
8008 17203792 16677400 16175377 15648882 14935724 14390336 14432031 14777372 14795625 14431984 14143248
7998 14143248 14070297 13944043 13751265 13801653 14066530 14099755 13767604 13459883 13383396 13243088
7988 13243088 12896840 12734619 13012211 13323752 13209416 12862539 12732725 12807348 12834128 12902369
7978 12902369 13160129 13241830 12732255 12040653 11979466 12476474 12592145 11996323 11508295 11748500
7968 11748500 12125968 11856752 11290156 11317557 11886661 12099024 11654354 11230502 11311268 11508526
7958 11508526 11359302 11062143 10977214 10974739 10803225 10671010 10891143 11238839 11248862 10991753
7948 10991753 10962959 11224204 11236054 10690628 10021991 9812491 10041576 10267544 10338750 10520732
$$ packed form
8018A7204996k3500n85305k98612J73214L8140k85669j3105N59338N32537r8242
8008A7203792n26392n02023n26495p13158n45388M1695L45341J8253l63641k88736
7998A4143248p2951j26254j92778N0388K64877L3225l32151l07721p6487j40308
7988A3243088l46248j62221K77592L11541j14336l46877j29814P4623K6780O8241
7978A2902369K57760Q1701n09575o91602o1187M97008J15671n95822m88028K40205
7968A1748500L77468k69216n66596K7401N69104K12363m44670m23852Q0766J97258
7958A1508526j49224k97159q4929k475j71514j32215K20133L47696J0023k57109
7948A0991753k8794K61245J1850n45426o68637k09500K29085K25968P1206J81982
$$ plain form
7938 10520732 10937138 11256301 11122040 10698127 10514352 10776905 11072395 10889634 10268616
7929 10268616 9710649 9524003 9536829 9480629 9352052 9247265 9104786 8860002 8681910 8780899
7919 8780899 9066881 9241921 9177231 8987541 8805728 8708090 8775320 8964702 9009118 8757439
7909 8757439 8531113 8729998 9104993 8948254 8152429 7526923 7714535 8274942 8360157 7951123
7899 7951123 7766572 8084130 8371769 8211799 7946568 8074279 8478193 8685554 8580031 8399099
7889 8399099 8221189 7952433 7755366 7961488 8443060 8549410 7944771 7154402 6914078 7219649
7879 7219649 7453789 7326713 7178631 7286793 7383409 7143549 6778129 6735634 7003737 7121880
7869 7121880 6837512 6376879 6032263 5820396 5664477 5636545 5837569 6194251 6517083 6668843
$$ packed form
7938A0520732M16406L19163j34261m23913j83775K62553K95490j82761o21018
7929A0268616n57967j86646J2826n6200j28577j04787j42479k44784j78092R8989
7919H780899K85982J75040o4690j89690j81813r7638O7230J89382M4416k51679
7909H757439k26326J98885L74995j56739p95825o25506J87612N60407Q5215m09034
7899G951123j84551L17558K87639j59970k65231J27711M03914K07361j05523j80932
7889H399099j77910k68756j97067K06122M81572J06350o04639p90369k40324L05571
7879G219649K34140j27076j48082J08162R6616k39860l65420m2495K68103J18143
7869G121880k84368m60633l44616k11867j55919k7932K01024L56682L22832J51760
$$ plain form
7859 6668843 6621249 6466738 6392326 6473664 6492437 6197024 5769373 5704969 6104494 6444785
7849 6444785 6298115 5939507 5878268 6062790 6026091 5681310 5454205 5604550 5877191 5938004
7839 5938004 5771399 5514819 5262468 5193569 5523173 6078659 6256099 5735020 5009946 4845347
7829 4845347 5326900 5804861 5722941 5165212 4576685 4278985 4363320 4771440 5280768 5573602
7819 5573602 5527695 5374157 5409608 5592943 5593359 5254694 4847678 4753872 4994195 5220709 5157202
7808 5157202 4892421 4694007 4677829 4754095 4780965 4663718 4423457 4286384 4531460 5048425
7798 5048425 5246330 4742910 4007177 3855044 4331162 4645481 4348871 3949942 4008165 4208718
7788 4208718 3956024 3477779 3556111 4292267 4907710 4842682 4363756 3912546 3518401 3157124
$$ packed form
7859F668843m7594j54511p4412Q1338J8773k95413m27651o4404L99525L40291
7849F444785j46670l58608o1239J84522l6699l44781k27105J50345K72641O0813
7839E938004j66605k56580k52351o8899L29604N55486J77440n21079p25074j64599
7829D845347M81553M77961q1920n57729n88527k97700Q4335M08120N09328K92834
7819E573602m5907j53538L5451J83335M16l38665m07016r3806K40323K26514o3507
7808E157202k64781j98414j6178P6266K6870j17247k40261j37073K45076N16965
7798E048425J97905n03420p35733j52133M76118L14319k96610l98929N8223K00553
7788D208718k52694m78245P8332P36156O15443o5028m78926m51210l94145l61277
$$ plain form
7778 3157124 3074183 3305384 3374410 2991090 2660645 3012052 3798101 4202514 3996487 3727162
7768 3727162 3762538 3821426 3631103 3460343 3659546 4081312 4320557 4255909 4030784 3724166
7758 3724166 3372194 3159614 3262984 3577217 3855988 4044174 4218927 4288884 4068084 3657209
7748 3657209 3449425 3649764 4002559 4129306 3991021 3866455 3940365 4060964 3950692 3604875
7738 3604875 3383033 3611596 4128829 4397696 4141995 3687539 3511933 3619599 3616834 3322347
7728 3322347 3002887 2972243 3209476 3456396 3503082 3306820 3000587 2845475 3011015 3358441
7718 3358441 3610571 3739246 3938099 4186946 4182684 3839504 3506477 3442702 3394652 3031900
7708 3031900 2540880 2365604 2526202 2658118 2655422 2784297 3119605 3359775 3365092 3438085
$$ packed form
7778C157124q2941K31201O9026l83320l30445L51407P86049M04413k06027k69325
7768C727162L5376N8888j90323j70760J99203M21766K39245o4648k25125l06618
7758C724166l51972k12580J03370L14233K78771J88186J74753O9957k20800m10875
7748C657209k07784K00339L52795J26747j38285j24566P3910J20599j10272l45817
7738C604875k21842K28563N17233K68867k55701m54456j75606J07666k765k94487
7728C322347l19460l0644K37233K46920M6686j96262l06233j55112J65540L47426
7718C358441K52130J28675J98853K48847m262l43180l33027o3775m8050l62752
7708C031900m91020j75276J60598J31916k696J28875L35308K40170N317P2993
$$ plain form
7698 3438085 3793561 4102197 3927389 3407494 3118961 3321518 3668598 3708609 3423006 3150119
7688 3150119 3114710 3184259 3099554 2855076 2732036 2913109 3195703 3249849 3084990 3025065
7678 3025065 3214960 3416279 3384294 3197275 3054393 2962414 2829488 2710049 2736394 2913215
7668 2913215 3165698 3464827 3694865 3542268 2827287 1905268 1420316 1598885 2043477 2310518
7658 2310518 2432971 2689748 3051940 3149916 2800844 2339165 2263021 2626648 2976284 2948645
7648 2948645 2747181 2816853 3143926 3204038 2697886 2047159 1922790 2437530 3056932 3248430
7638 3248430 2997453 2682366 2617573 2781578 2926080 2903588 2830357 2853861 2862413 2660425 2388797
7627 2388797 2414509 2729579 2877082 2666245 2505714 2694060 2840044 2494987 1982843 1961562
$$ packed form
7698C438085L55476L08636j74808n19895k88533K02557L47080M0011k85603k72887
7688C150119l5409O9549q4705k44478j23040J81073K82594N4146j64859n9925
7678C025065J89895K01319l1985j87019j42882r1979j32926j19439K6345J76821
7668B913215K52483K99129K30038j52597p14981r22019m84952J78569M44592K67041
7658B310518J22453K56777L62192R7976l49072m61679p6144L63627L49636k7639
7648B948645k01464O9672L27073O0112n06152o50727j24369N14740O19402J91498
7638C248430k50977l15087o4793J64005J44502k2492p3231K3504Q552k01988k71628
7627B388797K5712L15070J47503k10837j60531J88346J45984l45057n12144k1281
$$ plain form
7617 1961562 2404872 2719040 2733886 2826714 3080519 3106703 2833298 2712075 2907967 2995677
7607 2995677 2761844 2609836 2785417 2878643 2567517 2216655 2188424 2177172 1883676 1771098
7597 1771098 2337650 3079596 3093107 2454168 2075295 2294470 2525488 2356833 2115878 2141716
7587 2141716 2274719 2351832 2531622 2803479 2783933 2371886 2068119 2234410 2503555 2370897
7577 2370897 1974411 1795477 1882559 1897112 1768753 1788704 2051660 2229932 2037305 1662407
7567 1662407 1566905 1934277 2449007 2663945 2517253 2336273 2314427 2246152 1961960 1738041
7557 1738041 1908888 2282087 2404369 2276559 2262221 2351336 2155460 1700192 1538129 1862255
7547 1862255 2170254 2122809 2081356 2365594 2609264 2429717 2200940 2473208 3020131 3193625
$$ packed form
7617A961562M43310L14168J4846R2828K53805K6184k73405j21223J95892Q7710
7607B995677k33833j52008J75581R3226l11126l50862k8231j1252k93496j12578
7597A771098N66552P41946J3511o38939l78873K19175K31018j68655k40955K5838
7587B141716J33003P7113J79790K71857j9546m12047l03767J66291K69145j32658
7577B370897l96486j78934Q7082J4553j28359J9951K62956J78272j92627l74898
7567A662407r5502L67372N14730K14938j46692j80980k1846o8275k84192k23919
7557A738041J70847L73199J22282j27810j4338Q9115j95876m55268j62063L24126
7547A862255L07999m7445m1453K84238K43670j79547k28777K72268N46923J73494
$$ plain form
7537 3193625 2954067 2798960 2832310 2679378 2305206 2160593 2375440 2472507 2139228 1747247
7527 1747247 1779682 2130079 2308461 2100703 1724447 1459885 1372940 1393630 1516532 1817129
7517 1817129 2232181 2443846 2220899 1853963 1887972 2323536 2532930 2204638 1866562 2069164
7507 2069164 2547152 2742124 2689563 2697868 2583431 2098772 1785959 2337124 3232261 3193318
7497 3193318 2120326 1373311 1762476 2445464 2447850 2161841 2398828 2838402 2586525 1761778
7487 1761778 1338805 1601650 1829731 1552875 1174208 1143914 1291565 1296075 1239663 1350978
7477 1350978 1599975 1846527 2093695 2338035 2404482 2181764 1875328 1795124 1940727 1986906
7467 1986906 1734771 1453142 1598926 2182284 2648472 2578820 2265435 2227168 2364539 2164610
$$ packed form
7537C193625k39558j55107L3350j52932l74172j44613K14847R7067l33279l91981
7527A747247L2435L50397J78382k07758l76256k64562q6945K0690J22902L00597
7517A817129M15052K11665k22947l66936L4009M35564K09394l28292l38076K02602
7507B069164M77988J94972n2561Q305j14437m84659l12813N51165Q95137l8943
7497C193318j072992p47015L89165O82988K386k86009K36987M39574k51877q24747
7487A761778m22973K62845K28081k76856l78667l0294J47651M510n6412J11315
7477A350978K48997K46552K47168K44340O6447k22718l06436q0204J45603M6179
7467A986906k52135k81629J45784N83358M66188o9652l13385l8267J37371j99929
$$ plain form
7457 2164610 1679326 1576894 2051586 2419321 2162413 1698145 1615703 1768456 1726699 1592250
7447 1592250 1688380 1895695 1982889 2151732 2521919 2557164 1884099 1233852 1504146 2204305
7437 2204305 2060512 1057532 543352 1129873 1821536 1707007 1319836 1587846 2362969
7428 2362969 2825331 2698201 2292368 1819801 1340255 1029716 953328 895585 822731 1088199
7418 1088199 1765846 2263200 2081963 1520205 1139886 987221 845656 806899 1018879 1245694
7408 1245694 1235741 1196038 1398155 1665228 1732969 1729168 1806634 1740838 1418398 1242575 1467495
7397 1467495 1644128 1391228 1176480 1555174 2153896 2291987 2127513 2200777 2283955 1809658
7387 1809658 1113616 1031658 1451827 1523378 1205580 1274923 1765842 1825625 1345395 1293799
$$ packed form
7457B164610m85284j02432M74692L67735k56908m64268q2442J52753m1757j34449
7447A592250R6130K07315Q7194J68843L70187L5245o73065o50247K70294P00159
7437B204305j43793j002980n14180N86521O91663j14529l87171K68010P75123
7428B362969M62362j27130m05833m72567m79546l10539p6388n7743p2854K65468
7418A088199O77647M97354j81237n61758l80319j52665j41565l8757K11980K26815
7408A245694r953l9703K02117K67073O7741l801P7466o5796l22440j75823K24920
7397A467495J76633k52900k14748L78694N98722J38091j64474P3264Q3178m74297
7387A809658o96042q1958M20169P1551l17798O9343M90919N9783m80230n1596
$$ plain form
7377 1293799 1987772 2420005 1933639 1278700 1248272 1462072 1373730 1367674 1848687 2226151
7367 2226151 1902098 1435710 1601877 2033639 1967454 1670569 1878389 2365940 2392762 2138104
7357 2138104 2319351 2679737 2304333 1340856 946293 1418653 1793324 1554815 1361267 1616162
7347 1616162 1654396 1043598 537700 866665 1496569 1536653 1180398 1266349 1871593 2289401
7337 2289401 2172758 1884831 1795947 1880334 1990973 2044846 1960452 1771003 1704408 1849983
7327 1849983 1928907 1723747 1517864 1718858 2217501 2515604 2367869 1940837 1459791 1054102
7317 1054102 853284 901228 1048367 1190523 1461517 1897712 2126965 1805845 1226145 1026061
7307 1026061 1342868 1695164 1715982 1562836 1514175 1566828 1602634 1635795 1702145 1739007 1749651
$$ packed form
7377A293799O93973M32233m86366o54939l0428K13800q8342o056M81013L77464
7367B226151l24053m66388J66167M31762o6185k96885K07820M87551K6822k54658
7357B138104J81247L60386l75404r63477l94563M72360L74671k38509j93548K54895
7347A616162L8234o10798n05898L28965O29904M0084l56255Q5951O05244M17808
7337B289401j16643k87927q8884Q4387J10639N3873q4394j89449o6595J45575
7327A849983P8924k05160k05883K00994M98643K98103j47735m27032m81046m05689
7317A054102k00818M7944J47139J42156K70994M36195K29253l21120n79700k00084
7307A026061L16807L52296K0818j53146m8661N2653L5806L3161O6350L6862J0644
$$ plain form
7296 1749651 1886560 2183278 2351253 2060267 1401091 925596 1152246 2012449 2812355 2852235
7286 2852235 2150157 1441276 1359620 1761550 2024707 1855084 1505857 1268248 1112922 930140
7276 930140 813826 899799 1112056 1293379 1475934 1781135 2080075 2020495 1513514 1003252
7266 1003252 1020354 1522654 1930819 1852493 1496182 1250993 1186608 1238626 1549053 2145904
7256 2145904 2519580 2153035 1400837 1119977 1362655 1282323 625649 362951 1163745 2090044
7246 2090044 1838816 755485 393852 1231935 2069522 1894305 1208545 1002531 1328693
7237 1328693 1587128 1588015 1576062 1560851 1312761 879165 582194 575504 773119 1101301 1475177
7226 1475177 1639707 1387664 903450 624228 771298 1182962 1547631 1678434 1654917 1769226
$$ packed form
7296A749651J36909K96718J67975k90986o59176m75495K26650Q60203P99906L9880
7286B852235p02078p08881q1656M01930K63157j69623l49227k37609j55326j82782
7276I30140j16314Q5973K12257J81323J82555L05201K98940n9580n06981n10262
7266A003252J7102N02300M08165p8326l56311k45189o4385N2018L10427N96851
7256B145904L73676l66545p52198k80860K42678q0332o56674k62698Q00794R26299
7246B090044k51228j083331l61633Q38083Q37587j75217o85760k06014L26162
7237A328693K58435Q87j1953j5211k48090m33596k96971o690J97615L28182L73876
7226A475177J64530k52043m84214k79222J47070M11664L64669J30803k3517J14309
$$ plain form
7216 1769226 2177754 2577914 2501434 1987793 1599947 1642286 1802665 1794087 1841069 2133962
7206 2133962 2287904 1913355 1364966 1273629 1567089 1636836 1346540 1160811 1286910 1412804
7196 1412804 1407595 1571016 1945828 2054084 1702661 1468460 1857653 2410784 2267977 1415911
7186 1415911 751985 904014 1515766 1863116 1761498 1562313 1498368 1436419 1281033 1248634
7176 1248634 1504955 1759955 1593666 1129201 956216 1277377 1565846 1337150 864701 721898
7166 721898 929020 1068408 1040431 1121820 1349202 1443740 1396326 1563017 2039450 2435830
7156 2435830 2442980 2179928 1828095 1381521 945485 818596 1038611 1258291 1286861 1329554
7146 1329554 1491539 1541845 1430663 1507225 1880058 2097100 1879930 1644356 1796103 2031329
$$ packed form
7216A769226M08528M00160p6480n13641l87846M2339J60379q578M6982K92893
7206B133962J53942l74549n48389r1337K93460O9747k90296j85729J26099J25894
7196A412804n209J63421L74812J08256l51423k34201L89193N53131j42807q52066
7186A415911o63926J52029O11752L47350j01618j99185o3945o1949j55386l2399
7176A248634K56321K55000j66289m64465j72985L21161K88469k28696m72449j42803
7166G21898K07122J39388k7977Q1389K27382R4538m7414J66691M76433L96380
7156B435830P150k63052l51833m46574m36036j26889K20015K19680K8570M2693
7146A329554J61985N0306j11182P6562L72833K17042k17170k35574J51747K35226
$$ plain form
7136 2031329 1921543 1694862 1748962 1836759 1530759 1134068 1243043 1651130 1636787 1219566
7126 1219566 1136948 1553807 1803174 1574718 1369259 1471362 1434543 1039313 867441 1325023
7116 1325023 1857567 1811310 1435266 1317834 1385814 1235820 1011953 1128262 1417918 1372881
7106 1372881 1055342 999814 1292140 1466379 1302450 1065305 935959 830875 819778 1099969
7096 1099969 1479874 1495326 1148358 938632 1047867 1135695 1113375 1385194 1963963 2069256
7086 2069256 1205777 111367 -85092 647826 1303893 1256086 922774 955076 1357495 1660887
7076 1660887 1583953 1253236 970171 952532 1191456 1465341 1591122 1668402 1910608 2245337
7066 2245337 2346332 2143933 2012683 2245378 2581707 2571555 2262675 2131181 2321954 2386384
$$ packed form
7136B031329j09786k26681N4100Q7797l06000l96691J08975M08087j4343m17221
7126A219566q2618M16859K49367k28456k05459J02103l6819l95230j71872M57582
7116A325023N32544m6257l76044j17432O7980j49994k23867J16309K89656m5037
7106A372881l17539n5528K92326J74239j63929k37145j29346j05084j1097K80191
7096A099969L79905J5452l46968k09726J09235Q7828k2320K71819N78769J05293
7086B069256q63479j094410j96459P32918O56067m7807l33312L2302M02419L03392
7076A660887p6934l30717k83065j7639K38924K73885J25781P7280K42206L34729
7066B245337J00995k02399j31250K32695L36329j0152l08880j31494J90773O4430
$$ plain form
7056 2386384 1975414 1431028 1318805 1587826 1666035 1357549 1143483 1424049 1903455 2061110
7046 2061110 1923580 1939208 2236183 2457199 2344233 2097418 2026999 2128128 2165707 2013841
7036 2013841 1771384 1625882 1674512 1824806 1872040 1734718 1549361 1447268 1377352 1315566
7026 1315566 1463668 1937253 2388403 2338029 1865235 1560785 1735609 2059343 2090598 1810959
7016 1810959 1509230 1461335 1816030 2441749 2819535 2528504 1929437 1818951 2232937 2270116
7006 2270116 1482441 733952 1029710 2049863 2657823 2501131 2223403 2253606 2287192 2025315
6996 2025315 1643628 1360892 1184533 1226796 1654052 2169577 2175088 1654928 1295045 1481037
6986 1481037 1786533 1766299 1655403 1856292 2234414 2399313 2314736 2206517 2178150 2264054
$$ packed form
7056B386384m10970n44386j12223K69021P8209l08486k14066K80566M79406J57655
7046B061110j37530J5628K96975K21016j12966k46815p0419J01129L7579j51866
7036B013841k42457j45502M8630J50294M7234j37322j85357j02093o9916o1786
7026A315566J48102M73585M51150n0374m72794l04450J74824L23734L1255k79639
7016A810959l01729m7895L54695O25719L77786k91031n99067j10486M13986L7179
7006B270116p87675p48489K95758J020153O07960j56692k77728L0203L3586k61877
6996B025315l81687k82736j76359M2263M27256N15525N511n20160l59883J85992
6986A481037L05496k0234j10896K00889L78122J64899q4577j08219k8367Q5904
$$ plain form
6976 2264054 2522851 2762448 2583468 2053014 1871357 2415750 3081455 3128052 2752339 2656764
6966 2656764 2902465 2964782 2736574 2671982 2941129 3163911 3082185 2892194 2798427 2773920
6956 2773920 2865016 3221114 3701723 3917014 3760526 3476856 3173987 2765578 2434927 2585074
6946 2585074 3194155 3750256 3962684 4008350 3970705 3678305 3298336 3386471 3999107 4424570
6936 4424570 4238676 3976249 4192956 4483534 4184874 3595545 3613529 4353531 4974718 4916471
6926 4916471 4584904 4628659 5073494 5431034 5351386 4983165 4838953 5316267 6210425 6818113
6916 6818113 6721389 6285081 6117085 6281049 6429724 6499509 6759902 7245230 7634096 7731356
6906 7731356 7673960 7625723 7616926 7704694 7970849 8345672 8687594 8974853 9191216 9218572 9148759
$$ packed form
6976B264054K58797K39597j78980n30454j81657N44393O65705M6597l75713r5575
6966B656764K45701O2317k28208o4592K69147K22782q1726j89991r3767k4507
6956B773920R1096L56098M80609K15291j56488k83670l02869m08409l30651J50147
6946B585074O09081N56101K12428M5666l7645k92400l79969Q8135O12636M25463
6936D424570j85894k62427K16707K90578k98660n89329J7984P40002O21187n8247
6926D916471l31567M3755M44835L57540p9648l68221j44212M77314Q94158O07688
6916F818113r6724m36308j67996J63964J48675O9785K60393M85328L88866R7260
6906G731356n7396m8237q797Q7768K66155L74823L41922K87259K16363K7356o9813
$$ plain form
6895 9148759 9411258 10149380 10793328 10845287 10769811 11334464 12320125 12850794 12906238 13375944
6885 13375944 14454697 15187589 15069287 14954951 15659500 16648010 17041078 17107410 17675752
6876 17675752 18649198 19287981 19662107 20638650 22446855 24311025 25685691 26987137 28820982
6867 28820982 31158050 33577231 35848210 38065811 40574577 43806077 47758310 51619590
6859 51619590 54382910 55853748 56560480 56687832 55730274 53346257 49971572 46338134 42840164
6850 42840164 39587760 36651650 34009486 31580280 29472651 27887664 26715267 25613623
6842 25613623 24525205 23655601 22906584 21895232 20656166 19721418 19288810 18899071 18205861
6833 18205861 17481611 17032218 16680312 16219911 15856006 15764983 15690012 15383538 14992867 14637230
$$ packed form
6895I148759K62499P38122O43948N1959p5476N64653R85661N30669N5444M69706
6885A3375944J078753P32892j18302j14336P04549R88510L93068O6332N68342
6876A7675752R73446O38783L74126R76543J808205J864170J374666J301446J833845
6867B8820982K337068K419181K270979K217601K508766L231500L952233L861280
6859E1619590K763320J470838P06732J27352r57558k384017l374685l633438l497970
6850D2840164l252404k936110k642164k429206k107629j584987j172397j101644
6842B5613623j088418q69604p49017j011352j239066r34748m32608l89739o93210
6833A8205861p24250m49393l51906m60401l63905r1023p4971l06474l90671l55637
$$ plain form
6823 14637230 14137662 13567457 13434110 13783526 13798290 12981252 12087757 12017477 12360270 12094843
6813 12094843 11310947 11028116 11459636 11695479 11233098 10697175 10727332 11101785 11349314 11436173
6803 11436173 11468098 11403845 11396519 11763495 12335442 12517344 12257241 12193031 12528915 12624865
6793 12624865 12158237 11806769 12129167 12581248 12451060 12083269 12253830 12860384 13217552
6784 13217552 13285352 13605890 14233022 14693162 14915200 15278056 15750597 15883084 15723334 15875810
6774 15875810 16505028 17109634 17480560 18036761 18900077 19472604 19417576 19363183 20072676 21473534
6764 21473534 23064231 24767253 26749603 28821550 30720485 32735426 35376499 38591034
6756 38591034 41952924 45475994 49459253 53459668 56206374 56889595 55980047 54382070
$$ packed form
6823A4637230m99568n70205j33347L49416J4764q17038q93495p0280L42793k65427
6813A2094843p83896k82831M31520K35843m62381n35923L0157L74453K47529Q6859
6803A1436173L1925o4253p326L66976N71947J81902k60103o4210L35884R5950
6793A2624865m66628l51468L22398M52081j30188l67791J70561O06554L57168
6784A3217552O7800L20538O27132M60140K22038L62856M72541J32487j59750J52476
6774A5875810O29218O04606L70926N56201Q63316N72527n5028n4393P09493J400858
6764B1473534J590697J703022J982350K071947J898935K014941K641073L214535
6756C8591034L361890L523070L983259M000415K746706O83221r09548j597977
$$ plain form
6748 54382070 52270676 49309215 45668757 42105410 39021828 36096470 33075116 30391642
6740 30391642 28559543 27295662 25833016 24008303 22446121 21567322 20995242 20238354 19443890
6731 19443890 18988365 18696786 18092001 17237850 16663846 16447129 16026444 15101321 14125945
6722 14125945 13604496 13374095 12956833 12250725 11489924 10832701 10388094 10377137 10815209 11216292
6712 11216292 11065305 10478327 9977480 9714549 9386446 8889837 8547656 8565776 8699884 8660202
6702 8660202 8500639 8379416 8225179 7922413 7635330 7643557 7915147 8080298 7848550 7313145
6692 7313145 6818101 6606385 6625432 6646744 6545114 6411194 6362597 6334468 6172573 5878842
6682 5878842 5614849 5482424 5453495 5494498 5570089 5527762 5222561 4819614 4710691 4984950
$$ packed form
6748E4382070k111394k961461l640458l563347l083582k925358l021354k683474
6740C0391642j832099j263881j462646j824713j562182q78799n72080p56888p94464
6731A9443890m55525k91579o04785q54151n74004k16717m20685r25123r75376
6722A4125945n21449k30401m17262p06108p60801o57223m44607j0957M38072M01083
6712A1216292j50987n86978n00847k62931l28103m96609l42181J8120J34108l9682
6702H660202j59563j21223j54237l02766k87083Q227K71590J65151k31748n35405
6692G313145m95044k11716J9047K1312j01630j33920m8597k8129j61895k93731
6682E878842k63993j32425k8929M1003P5591m2327l05201m02947j08923K74259
$$ plain form
6672 4984950 5226482 5058188 4682038 4584081 4837928 5056273 4995773 4818651 4677329 4448262
6662 4448262 4106026 3990538 4308428 4622402 4361252 3757572 3670592 4327631 4842986 4383287
6652 4383287 3338513 2773150 3017190 3459488 3603307 3595279 3628999 3540514 3277737 3171096
6642 3171096 3363611 3476906 3247780 3009518 3062193 3048682 2585370 2117125 2368874 3153976
6632 3153976 3543635 3194149 2723236 2671697 2847005 2922918 2991442 3162884 3188034 2888645
6622 2888645 2535009 2427303 2467267 2464733 2506930 2711906 2963127 3170092 3413418 3562593
6612 3562593 3220742 2416050 1858082 2026797 2452485 2449627 2145138 2128041 2429448 2595759
6602 2595759 2549871 2605422 2738780 2620343 2347584 2382252 2696797 2728618 2317040 1965434
$$ packed form
6672D984950K41532j68294l76150r7957K53847K18345o0500j77122j41322k29067
6662D448262l42236j15488L17890L13974k61150o03680q6980O57039N15355m59699
6652D383287j044774n65363K44040M42298J43819q028L3720q8485k62777j06641
6642C171096J92515J13295k29126k38262N2675j3511m63312m68245K51749P85102
6632C153976L89659l49486m70913n1539J75308P5913O8524J71442K5150k99389
6622B888645l53636j07706L9964k534M2197K04976K51221K06965K43326J49175
6612C562593l41851q04692n57968J68715M25688k858l04489j7097L01407J66311
6602B595759m5888N5551J33358j18437k72759L4668L14545L1821m11578l51606
$$ plain form
6592 1965434 1981758 2065175 1992544 2007717 2201786 2198850 1876345 1747831 2134242 2557784 2524375
6581 2524375 2339516 2484318 2697589 2476759 2104013 2263358 2821358 2926981 2353969 1859419
6571 1859419 1996914 2355397 2331074 2011882 1846615 1916773 2014756 2109118 2265857 2325536
6561 2325536 2096817 1761437 1705076 1967295 2155718 1934070 1402103 975446 1003083 1458638
6551 1458638 1907909 1873320 1355072 883393 913658 1311189 1635413 1773416 1957139 2208662
6541 2208662 2191475 1761126 1310739 1281953 1551644 1638438 1404318 1185136 1226685 1365687
6531 1365687 1390630 1379439 1453516 1472207 1278272 1057350 1102537 1327248 1379631 1202384 1098373
6520 1098373 1215768 1357012 1384101 1414876 1463016 1290298 869197 623918 875621 1338998
$$ packed form
6592A965434J6324Q3417p2631J5173J94069k936l22505j28514L86411M23542l3409
6581B524375j84859J44802K13271k20830l72746J59345N58000J05623n73012m94550
6571A859419J37495L58483k4323l19192j65267P0158R7983R4362J56739N9679
6561B325536k28719l35380n6361K62219J88423k21648n31967m26657K7637M55555
6551A458638M49271l4589n18248m71679L0265L97531L24224J38003J83723K51523
6541B208662j7187m30349m50387k8786K69691Q6794k34120k19182M1549J39002
6531A365687K4943j1191P4077J8691j93935k20922M5187K24711N2383j77247j04011
6520A098373J17395J41244K7089L0775M8140j72718m21101k45279K51703M63377
$$ plain form
6510 1338998 1531295 1432337 1344476 1316831 1174840 996972 1071475 1390023 1624516 1643594
6500 1643594 1642048 1683915 1521877 1036189 542657 465768 877065 1460073 1798136 1695199
6490 1695199 1382403 1354887 1793216 2249032 2178457 1646293 1142485 877118 761023 929617
6480 929617 1583535 2293586 2263547 1513529 1019778 1300722 1648813 1334924 830103 1010944
6470 1010944 1698305 1958261 1573930 1225921 1262341 1247308 900954 641817 844118 1204501
6460 1204501 1255729 1034138 847579 757800 681431 721915 1007869 1352446 1405897 1106858
6450 1106858 773183 758751 1126618 1630113 1963564 2046599 2018580 1923313 1585984 979802
6440 979802 500747 546884 951815 1205670 1149829 1048424 1045548 1031482 1039626 1252199 1538227
$$ packed form
6510A338998J92297r8958q7861k7645j41991j77868P4503L18548K34493J9078
6500A643594j546M1867j62038m85688m93532p6889M11297N83008L38063j02937
6490A695199l12796k7516M38329M55816p0575n32164n03808k65367j16095J68594
6480I29617O53918P10051l0039p50018m93751K80944L48091l13889n04821J80841
6470A010944O87361K59956l84331l48009L6420j5033l46354k59137K02301L60383
6460A204501N1228k21591j86559q9779p6369M0484K85954L44577N3451k99039
6450A106858l33675j4432L67867N03495L33451Q3035k8019r5267l37329o06182
6440I79802m79055M6137M04931K53855n5841j01405k876j4066Q144K12573K86028
$$ plain form
6429 1538227 1513546 1187048 1015355 1155767 1237233 1092836 1085561 1357671 1405123 913823
6419 913823 438218 591564 1024309 968922 489654 360857 814210 1216526 1074320 666217
6409 666217 485210 600956 797721 921619 893003 705245 539447 581153 681452 558575
6399 558575 356827 547794 1162068 1595679 1411855 930498 733748 912130 1115382 1107996
6389 1107996 953177 784122 659188 585653 535353 498065 559935 776005 956320 842980
6379 842980 563162 577514 1021498 1432740 1381388 1072094 993119 1200645 1340778 1251964
6369 1251964 1132356 1115231 1061110 882838 774074 911289 1107986 1014787 635390 412988
6359 412988 685558 1204482 1419810 1205016 995358 1107354 1275679 1157238 972196 1146904
$$ packed form
6429A538227k4681l26498j71693J40412Q1466j44397p275K72110M7452m91300
6419I13823m75605J53346M32745n5387m79268j28797M53353M02316j42206m08103
6409F66217j81007J15746J96765J23898k8616j87758j65798M1706J00299j22877
6399E58575k01748J90967O14274M33611j83824m81357j96750J78382K03252p386
6389A107996j54819j69055j24934p3535n0300l7288O1870K16070J80315j13340
6379H42980k79818J4352M43984M11242n1352l09294p8975K07526J40133q8814
6369A251964j19608j7125n4121j78272j08764J37215J96697r3199l79397k22402
6359D12988K72570N18924K15328k14794k09658J11996J68325j18441j85042J74708
$$ plain form
6349 1146904 1492152 1363315 685220 190888 410412 976699 1277376 1300217 1370117 1446091
6339 1446091 1256035 916008 839447 1079518 1249410 1122652 902206 827218 861513 869191
6329 869191 814962 684522 443054 194008 192072 542192 966205 1008669 523143 -82224
6319 -82224 -200963 277206 761511 669482 216015 122898 594053 1094528 1240525 1300744
6309 1300744 1526176 1603881 1275620 969399 1171290 1563867 1502401 1068384 891644 1092847
6299 1092847 1190615 1019698 965793 1199071 1368735 1213404 887103 557499 238579 104846
6289 104846 381607 823876 897377 577992 374160 486629 607077 622143 767613 958586
6279 958586 782699 352611 303454 697190 861704 626346 663950 1151968 1254102 622748
$$ packed form
6349A146904L45248j28837o78095m94332K19524N66287L00677K2841O9900P5974
6339A446091j90056l40027p6561K40071J69892j26758k20446p4988L4295P678
6329H69191n4229j30440k41468k49046j936L50120M24013M2464m85526o05367
6319h2224j18739M78169M84305r2029m53467r3117M71155N00475J45997O0219
6309A300744K25432P7705l28261l06221K01891L92577o1466m34017j76740K01203
6299A092847R7768j70917n3905K33278J69664j55331l26301l29604l18920j33733
6289A04846K76761M42269P3501l19385k03832J12469J20448J5066J45470J90973
6279I58586j75887m30088m9157L93736J64514k35358L7604M88018J02134o31354
$$ plain form
6269 622748 240804 821881 1475664 1144989 403636 450101 1100726 1297488 1008387 997900
6259 997900 1124474 603339 -215012 -117759 848577 1288005 748735 361568 730641 936000
6249 936000 362621 -135205 143354 464160 128261 -134959 461605 1178202 959667 258370
6239 258370 153080 452134 245456 -283043 -243226 189269 75353 -439452 -295399 471853
6229 471853 629116 -85684 -382589 441194 1322215 1183743 540780 393345 612548 513186
6219 513186 204448 241623 490619 408881 99171 111528 431186 559953 459161 556637
6209 556637 855816 850485 417996 81435 195037 470158 548459 523858 583728 554460 207085
6198 207085 -227987 -268083 148467 532123 468571 136344 19592 248810 510996 615303
$$ packed form
6269F22748l81944N81077O53783l30675p41353M6465O50625J96762k89101j0487
6259I97900J26574n21135q18351R7253R66336M39428n39270l87167L69073K05359
6249I36000n73379m97826K78559L20806l35899k63220N96564P16597k18535p01297
6239B58370j05290K99054k06678n28499L9817M32495j13916n14805J44053P67252
6229D71853J57263p14800k96905Q23783Q81021j38472o42963j47435K19203r9362
6219E13186l08738L7175K48996q1738l09710J2357L19658J28767j00792R7476
6209E56637K99179n331m32489l36561J13602K75121P8301k4601N9870k9268l47375
6198B07085m35072m0096M16550L83656o3552l32227j16752K29218K62186J04307
$$ plain form
6188 615303 784591 1165146 1376907 988215 277000 106 400012 943454 1130344 1047331
6178 1047331 960292 901583 931630 1274648 1810569 1921404 1321079 622166 546653 937487
6168 937487 1137144 1013493 920607 883397 610983 245587 293532 725610 902462 587762
6158 587762 318877 473866 650548 406640 38344 82134 469036 743421 817999 932036
6148 932036 1051233 891175 482083 199562 219010 374868 570439 867703 1104983 924185
6138 924185 384702 100064 431966 902185 829809 307991 34826 267308 518624 407971
6128 407971 250394 464495 835844 874455 638930 609002 824824 800571 406357 191106
6118 191106 504255 859080 673044 218991 202170 622327 762089 308106 -174331 -79665
$$ packed form
6188F15303J69288L80555K11761l88692p11215k76894L99906N43442J86890q3013
6178A047331q7039n8709L0047L43018N35921J10835o00325o98913p5513L90834
6168I37487J99657j23651r2886l7210k72414l65396M7945M32078J76852l14700
6158E87762k68885J54989J76682k43908l68296M3790L86902K74385P4578J14037
6148I32036J19197j60058m09092k82521J9448J55858J95571K97264K37280j80798
6138I24185n39483k84638L31902M70219p2376n21818k73165K32482K51316j10653
6128D07971j57577K14101L71349L8611k35525k9928K15822k4253l94214k15251
6118A91106L13149L54825j86036m54053j6821M20157J39762m53983m82437R4666
$$ plain form
6108 -79665 442963 823725 837957 722826 743570 918608 1091769 1119786 1013961 892712
6098 892712 726647 296561 -353543 -643218 -114247 744533 960588 428065 84545 486174
6088 486174 962395 705964 32977 -196012 60960 131511 -141086 -211839 106691 294182
6078 294182 72650 -56738 378756 1062103 1375065 1218369 927046 726351 682776 874633
6068 874633 1168050 1095159 445820 -215035 -150878 523224 967613 768673 390676 336790
6058 336790 427133 257593 -56699 -73239 276046 649877 862617 1031306 1175766 1131266
6048 1131266 946119 918444 1052782 919785 363054 -63134 181510 765806 921563 560210
6038 560210 303697 426699 496601 257407 145029 491385 827172 593713 124538 202861
$$ packed form
6108g9665N22628L80762J4232j15131K0744J75038J73161K8017j05825j21249
6098H92712j66065m30086o50104k89675N28971Q58780K16055n32523l43520M01629
6088D86174M76221k56431o72987k28989K56972P0551k72597p0753L18530J87491
6078B94182k21532j29388M35494O83347L12962j56696k91323k00695m3575J91857
6068H74633K93417p2891o49339o60855O4157O74102M44389j98940l77997n3886
6058C36790R0343j69540l14292j6540L49285L73831K12740J68689J44460m4500
6048A131266j85147k7675J34338j32997n56731m26188K44644N84296J55757l61353
6038E60210k56513J23002O9902k39194j12378L46356L35787k33459m69175P8323
$$ plain form
6028 202861 855546 1308185 1108483 633723 394586 431192 577103 789081 949831 778139
6018 778139 245167 -238603 -328397 -166759 -55094 17870 227815 519126 677289 670389
6008 670389 647653 677695 703965 693344 654941 575400 469316 416235 441899 459655 417879
5997 417879 390535 446991 559121 683534 781409 750692 560932 443052 624253 862449
5987 862449 676464 130672 -135871 123403 361543 185541 80699 572799 1202226 1164556
5977 1164556 636601 506720 881190 864183 11855 -905573 -1005040 -448045 -8048 -7402
5967 -7402 -183520 -237600 -62355 311636 646746 630635 348533 306351 709225 1091480 998177
5956 998177 641705 473532 493016 479979 558851 924300 1255885 1070889 539353 294489
$$ packed form
6028B02861O52685M52639j99702m74760k39137L6606J45911K11978J60750j71692
6018G78139n32972m83770q9794J61638J11665P2964K09945K91311J58163o900
6008F70389k2736L0042K6270j0621l8403p9541j06084n3081K5664J7756m1776
5997D17879k7344N6456J12130J24413R7875l0717j89760j17880J81201K38196
5987H62449j85985n45792k66543K59274K38140j76002j04842M92100O29427l7670
5977A164556n27955j29881L74470j7007q52328r17428r9467N56995M39997O46
5967g402j76118n4080J75245L73991L35110j6111k82102m2182M02874L82255r3303
5956I98177l56472j68173J9484j3037P8872L65449L31585j84996n31536k44864
$$ plain form
5946 294489 468463 561237 303645 6016 -73081 -81471 -107645 30029 265251 159328 -334636
5935 -334636 -557364 -95822 444721 260358 -404477 -564826 87133 818679 981998 805494
5925 805494 770850 753906 275561 -637160 -1314130 -1197986 -474838 151778 221363 -46735
5915 -46735 -112141 163226 358454 155008 -123563 34658 517390 727286 530388 484356
5905 484356 901382 1254620 972625 383051 240000 554467 601494 74706 -449145 -368761
5895 -368761 198016 783361 1163755 1253715 888705 179953 -265603 -3159 581489 756099
5885 756099 441781 216859 400836 671203 642413 356320 82899 14633 250362 718505
5875 718505 1040067 851500 355202 155933 455696 837522 946549 874423 707101 302128
$$ packed form
5946B94489J73974R2774k57592k97629p9097q390k6174J37674K35222j05923m93964
5935c34636k22728M61542N40543j84363o64835j60349O51959P31546J63319j76504
5925H05494l4644j6944m78345r12721o76970J16144P23148O26616O9585k68098
5915d6735o5406K75367J95228k03446k78571J58221M82732K09896j96898m6032
5905D84356M17026L53238k81995n89574j43051L14467M7027n26788n23851Q0384
5895c68761N66777N85345L80394Q9960l65010p08752m45556K62444N84648J74610
5885G56099l14318k24922J83977K70367k8790k86093k73421o8266K35729M68143
5875G18505L21562j88567m96298j99269K99763L81826J09027p2126j67322m04973
$$ plain form
5865 302128 -166802 -81901 691619 1309341 1020766 272994 -354 208478 190606 -104863
5855 -104863 11046 614339 836485 278055 -204830 232503 1097452 1282546 650076 77576
5845 77576 131958 468242 562325 396884 234198 151900 50463 -106655 -237627 -231681 -45993
5834 -45993 207615 305452 146706 -107470 -231753 -190722 -88674 16470 108647 139319 115796
5823 115796 165695 371136 638522 840929 942419 885669 589852 208646 91978 253798
5813 253798 216270 -255937 -609917 -225355 558270 800180 292717 -155735 92615 679834
5803 679834 909725 699090 464069 417879 408058 267452 3815 -248434 -284182 -10402
5793 -10402 302052 228619 -184265 -363143 -36139 281877 47416 -422262 -398425 117845
$$ packed form
5865C02128m68930Q4901P73520O17722k88575p47772k73348K08832j7872k95469
5855a04863J15909O03293K22146n58430m82885M37333Q64949J85094o32470n72500
5845G7576N4382L36284R4083j65441j62686q2298j01437j57118j30972N946J85688
5834d5993K53608R7837j58746k54176j24283M1031J02048J05144R2177L0672k3523
5823A15796M9899K05441K67386K02407J01490n6750k95817l81206j16668J61820
5813B53798l7528m72207l53980L84562P83625K41910n07463m48452K48350N87219
5803F79834K29891k10635k35021m6190r821j40606k63637k52249l5748K73780
5793a0402L12454p3433m12884j78878L27004L18016k34461m69678K3837N16270
$$ plain form
5783 117845 380494 50893 -297831 -83501 412801 501918 96722 -208677 20952 550559
5773 550559 866401 782739 511903 318080 295058 408854 555781 558475 290905 -97431
5763 -97431 -238662 24661 404513 559198 582631 798492 1144898 1181611 786729 416837
5753 416837 451581 649433 569717 241022 35920 82822 182350 181399 91136 -49795 -116798
5742 -116798 136505 705474 1113068 988681 683949 781424 1134689 1062047 482578 111203
5732 111203 349450 723802 765556 747094 1031804 1287196 1005114 406220 146379 363746
5722 363746 643359 744444 743649 597402 218568 -67336 181298 724084 808924 291220
5712 291220 -74852 256272 824912 891915 482274 196707 292337 479435 501023 449314
$$ packed form
5783A17845K62649l29601l48724K14330M96302Q9117m05196l05399K29629N29607
5773E50559L15842q3662k70836j93823k3022J13796J46927K694k67570l88336
5763i7431j41231K63323L79852J54685K3433K15861L46406L6713l94882l69892
5753D16837L4744J97852p9716l28695k05102M6902R9528r51r0263j40931o7003
5742a16798K53303N68969M07594j24387l04732R7475L53265p2642n79469l71375
5732A11203K38247L74352M1754j8462K84710K55392k82082n98894k59841K17367
5722C63746K79613J01085p95j46247l78834k85904K48634N42786Q4840n17704
5712B91220l66072L31124N68640O7003m09641k85567R5630J87098K1588n1709
$$ plain form
5702 449314 496611 635651 733411 656345 360257 1739 -109290 176457 644176 939843
5692 939843 899445 578193 158325 -33157 301197 956152 1183318 531479 -434428 -729069
5682 -729069 -198131 355199 349150 134521 252971 526129 403319 -90287 -356549 -116688
5672 -116688 252125 384567 447073 718267 1012408 925148 492654 187891 250243 386317
5662 386317 268189 21153 -30688 97134 88946 -148099 -326264 -225518 -33468 -52206
5652 -52206 -228011 -206431 178042 666223 878877 728689 446866 277325 262600 332044
5642 332044 460303 605860 560444 99467 -613675 -985786 -593493 272804 908403 971189
5632 971189 687967 356076 36356 -200658 -163410 110001 256567 106590 -44804 20742
$$ packed form
5702D49314M7297J39040R7760p7066k96088l58518j11029K85747M67719K95667
5692I39843m0398l21252m19868j91482L34354O54955K27166o51839r65907k94641
5682g29069N30938N53330o049k14629J18450K73158j22810m93606k66262K39861
5672a16688L68813J32442O2506K71194K94141q7260m32494l04763O2352J36074
5662C86317j18128k47036n1841J27822q188k37045j78165J00746J92050j8738
5652e2206j75805K1580L84473M88181K12654j50188k81823j69541j4725O9444
5642C32044J28259J45557m5416m60977p13142l72111L92293Q66297O35599O2786
5632I71189k83222l31891l19720k37014L7248K73411J46566j49977j51394O5546
$$ plain form
5622 20742 16878 -310108 -579979 -294912 289715 476466 177053 -71108 -104813 -323631
5612 -323631 -731117 -677676 27689 565588 291757 -209253 -48869 513958 503052 -177018
5602 -177018 -614045 -364182 -42785 -163925 -290429 126361 725788 735596 131308 -346965
5592 -346965 -213781 240513 452186 238408 -103523 -124702 361440 1044950 1351605 1044771
5582 1044771 494525 199342 195367 168693 9838 -73820 25695 120776 47956 -61135 20438
$$ packed form
5622B0742l864l26986k69871K85067N84627J86751k99413k48161l3705k18818
5612c23631m07486N3441P05365N37899k73831n01010J60384N62827j0906o80070
5602a77018m37027K49863L21397j21140j26504M16790N99427R808o04288m78273
5592c46965J33184M54294K11673k13778l41931k1179M86142O83510L06655l06834
5582A044771n50246k95183l975k6674j58855q3658R9515R5081p2820j09091Q1573
$$ [...]
##END NTUPLES=NMR SPECTRUM
##END=
