##TITLE=1H ikalashn
52 H
22.10.2024
##JCAMPDX= 6.0         $$ Bruker NMR JCAMP-DX V2.0
##DATA TYPE= NMR FID
##DATA CLASS= NTUPLES
##ORIGIN= UXNMR, Bruker Analytische Messtechnik GmbH
##OWNER= root
$$ TOPSPIN		Version 1.3
$$ 2024-10-22 13:47:08.562 +0400  Irina@DPX200
$$ Compression mode = diff/dup
##.OBSERVE FREQUENCY= 200.131300845
##.OBSERVE NUCLEUS= ^1H
##.DELAY= (6, 6)
##.ACQUISITION MODE= SIMULTANEOUS
##.ACQUISITION SCHEME= undefined
##.AVERAGES= 32
##.DIGITISER RES= 18
##SPECTROMETER/DATA SYSTEM= spect
##.PULSE SEQUENCE= zg
##.SOLVENT NAME= D2O
##.SHIFT REFERENCE= INTERNAL, D2O, 1, 17.49637
##AUDIT TRAIL= $$ (NUMBER, WHEN, WHO, WHERE, WHAT)
$$ ##TITLE= Audit trail, TOPSPIN		Version 1.3
$$ ##JCAMPDX= 5.01
$$ ##ORIGIN= Bruker BioSpin GmbH
$$ ##OWNER= Irina
$$ $$ F:/spectra/data/iren/nmr/1H/4/audita.txt
$$ ##AUDIT TRAIL=  $$ (NUMBER, WHEN, WHO, WHERE, VERSION, WHAT)
(   1,<2024-10-22 13:46:59.921 +0400>,<Irina>,<DPX200>,<TOPSPIN 1.3>,
      <created by zg
	started at 2024-10-22 13:44:47.437 +0400,
	POWCHK disabled, PULCHK disabled
       configuration hash MD5:
       BE 6D 3F 07 2A EA 11 49 91 17 2B D3 AF B3 58 0D
       data hash MD5: 16K
       6E 7E 27 E1 2C 84 EE 47 96 A0 19 6C B3 23 F6 DE>)
$$ ##END=
$$ 
$$ $$ hash MD5
$$ $$ DD 3F C0 C9 86 F2 98 92 66 C8 CB A0 9B CC A4 F1
##$RELAX= 
##$RELAX= 
##$RELAX= 
##$RELAX= 
##$RELAX= 
##$RELAX= 
##$RELAX= 
##$RELAX= 
##$RELAX= 
$$ Bruker specific parameters
$$ --------------------------
##$DU= <F:/spectra>
##$EXPNO= 4
##$NAME= <1H>
##$PROCNO= 1
##$TYPE= <nmr>
##$USER= <iren>
##$AMP= (0..31)
100 100 100 100 100 100 100 100 100 100 100 100 100 100 100 100 100 100 
100 100 100 100 100 100 100 100 100 100 100 100 100 100 
##$ANAVPT= -1
##$AQSEQ= 0
##$AQ_mod= 1
##$AUNM= <au_zg>
##$AUTOPOS= <>
##$BF1= 200.13
##$BF2= 200.13
##$BF3= 200.13
##$BF4= 200.13
##$BF5= 200.13
##$BF6= 200.13
##$BF7= 200.13
##$BF8= 200.13
##$BYTORDA= 1
##$CFDGTYP= 0
##$CFRGTYP= 5
##$CHEMSTR= <none>
##$CNST= (0..63)
1 1 145 1 1 1 1 1 1 1 1 1 1 1 1 1 1 1 1 1 1 1 1 1 1 1 1 1 1 1 1 1 1 1 
1 1 1 1 1 1 1 1 1 1 1 1 1 1 1 1 1 1 1 1 1 1 1 1 1 1 1 1 1 1 
##$CPDPRG= <>
##$CPDPRG1= <>
##$CPDPRG2= <>
##$CPDPRG3= <>
##$CPDPRG4= <mlev>
##$CPDPRG5= <mlev>
##$CPDPRG6= <mlev>
##$CPDPRG7= <mlev>
##$CPDPRG8= <mlev>
##$CPDPRGB= <>
##$CPDPRGT= <>
##$D= (0..63)
0 2 0 0 0 0 0 0 0 0.06 0 0.03 0 0 0 0 0.0002 0 0 0 0 0 0 0 0 0 0 0 0 0 
0 0 0 0 0 0 0 0 0 0 0 0 0 0 0 0 0 0 0 0 0 0 0 0 0 0 0 0 0 0 0 0 0 0 
##$DATE= 1729590414
##$DBL= (0..7)
120 120 120 120 120 120 120 120 
##$DBP= (0..7)
150 150 150 150 150 150 150 150 
##$DBP07= 0
##$DBPNAM0= <>
##$DBPNAM1= <>
##$DBPNAM2= <>
##$DBPNAM3= <>
##$DBPNAM4= <>
##$DBPNAM5= <>
##$DBPNAM6= <>
##$DBPNAM7= <>
##$DBPOAL= (0..7)
0.5 0.5 0.5 0.5 0.5 0.5 0.5 0.5 
##$DBPOFFS= (0..7)
0 0 0 0 0 0 0 0 
##$DE= 6
##$DECBNUC= <off>
##$DECIM= 32
##$DECNUC= <off>
##$DECSTAT= 4
##$DIGMOD= 1
##$DIGTYP= 9
##$DL= (0..7)
0 120 120 120 120 120 120 120 
##$DP= (0..7)
150 150 150 150 150 150 150 150 
##$DP07= 0
##$DPNAME0= <>
$$ [...]
##$SW= 21.9926040160658
##$SWIBOX= (0..15)
0 0 2 0 0 0 0 0 0 0 0 0 0 0 0 0 
##$SW_h= 4401.40845070422
##$TD= 16384
##$TD0= 1
##$TE= 300
##$TE2= 300
##$TE3= 300
##$TEG= 300
##$TL= (0..7)
0 120 120 120 120 120 120 120 
##$TP= (0..7)
150 150 150 150 150 150 150 150 
##$TP07= 0
##$TPNAME0= <>
##$TPNAME1= <>
##$TPNAME2= <>
##$TPNAME3= <>
##$TPNAME4= <>
##$TPNAME5= <>
##$TPNAME6= <>
##$TPNAME7= <>
##$TPOAL= (0..7)
0.5 0.5 0.5 0.5 0.5 0.5 0.5 0.5 
##$TPOFFS= (0..7)
0 0 0 0 0 0 0 0 
##$TUNHIN= 0
##$TUNHOUT= 0
##$TUNXOUT= 0
##$USERA1= <user>
##$USERA2= <user>
##$USERA3= <user>
##$USERA4= <user>
##$USERA5= <user>
##$V9= 5
##$VALIST= <valist>
##$VCLIST= <CCCCCCCCCCCCCCC>
##$VD= 0
##$VDLIST= <DDDDDDDDDDDDDDD>
##$VPLIST= <PPPPPPPPPPPPPPP>
##$VTLIST= <TTTTTTTTTTTTTTT>
##$WBST= 1024
##$WBSW= 25
##$XGAIN= (0..3)
0 0 0 0 
##$XL= 0
##$YL= 0
##$YMAX_a= 500700
##$YMIN_a= -823073
##$ZGOPTNS= <>
##$ZL1= 120
##$ZL2= 120
##$ZL3= 120
##$ZL4= 120
##$ABSF1= 10
##$ABSF2= 0
##$ABSG= 5
##$ABSL= 3
##$ALPHA= 0
##$AQORDER= 0
##$ASSFAC= 0
##$ASSFACI= 0
##$ASSFACX= 0
##$ASSWID= 0
##$AUNMP= <proc_1d>
##$AXLEFT= 0
##$AXRIGHT= 0
##$AXTYPE= 0
##$AXUNIT= <>
##$AZFE= 0.1
##$AZFW= 0.1
##$BCFW= 1
##$BC_mod= 2
##$BYTORDP= 1
##$COROFFS= 0
##$CY= 7568.61572265625
##$DATMOD= 1
##$DC= 2
##$DFILT= <>
##$DTYPP= 0
##$F1P= 17.9538593292236
##$F2P= -4.03888763876832
##$FCOR= 0.5
##$FTSIZE= 32768
##$FT_mod= 4
##$GAMMA= 1
##$GB= 1
##$INTBC= 1
##$INTSCL= 1
##$ISEN= 128
##$LB= 0.01
##$LEV0= 0
##$LPBIN= 0
##$MAXI= 945.577
##$MC2= 0
##$MEAN= 0
##$ME_mod= 0
##$MI= -402.1523
##$NCOEF= 0
##$NC_proc= 0
##$NLEV= 6
##$NOISF1= 8.587773
##$NOISF2= 6.764455
##$NSP= 1
##$NTH_PI= 0
##$NZP= 0
##$OFFSET= 17.49637
##$PC= 1
##$PHC0= -40.02401
##$PHC1= 3.795192
##$PH_mod= 0
##$PKNL= yes
##$PPARMOD= 0
##$PPDIAG= 0
##$PPIPTYP= 0
##$PPMPNUM= 100
##$PPRESOL= 1
##$PSCAL= 0
##$PSIGN= 0
##$REVERSE= no
##$SF= 200.13
##$SI= 32768
##$SIGF1= 18.5376
##$SIGF2= -6.396296
##$SINO= 400
##$SIOLD= 32768
##$SREGLST= <1H.CDCl3>
##$SSB= 3
##$STSI= 0
##$STSR= 0
##$SW_p= 4401.40845070422
##$SYMM= 0
##$S_DEV= 0
##$TDeff= 0
##$TDoff= 0
##$TI= <>
##$TILT= no
##$TM1= 0
##$TM2= 0
##$TOPLEV= 0
##$USERP1= <user>
##$USERP2= <user>
##$USERP3= <user>
##$USERP4= <user>
##$USERP5= <user>
##$WDW= 1
##$XDIM= 8192
##$YMAX_p= 0
##$YMIN_p= 0
$$ End of Bruker specific parameters
$$ ---------------------------------
##NTUPLES= NMR FID
##VAR_NAME=  TIME,          FID/REAL,        FID/IMAG
##SYMBOL=    X,             R,               I
##VAR_TYPE=  INDEPENDENT,   DEPENDENT,       DEPENDENT
##VAR_FORM=  AFFN,          ASDF,            ASDF
##VAR_DIM=   8192,          8192,            8192
##UNITS=     SECONDS,       ARBITRARY UNITS, ARBITRARY UNITS
##FACTOR=    0.0002272,     1,               1
##FIRST=     0,             0,               0
##LAST=      1.8609952,     -49,             107
##MIN=       0,             -823073,         -823073
##MAX=       1.8609952,     500700,          500700
$$ Real data points
##PAGE= N=1
##DATA TABLE= (X++(R..R)), XYDATA
0 0 0 0 0 0 0 0 0 0 0 0 0 0 -1 32 -32 32 -32 33 -64 64 -95 96 -128 129 -160 192 -224 256 -289 336 -385 448
32 448 -502 572 -641 714 -803 900 -1015 1125 -1256 1397 -1551 1717 -1896 2098 -2317 2552
48 2552 -2815 3099 -3416 3761 -4145 4577 -5055 5596 -6210 6923 -7737 8705 -9864 11285
62 11285 -13068 15392 -18561 23164 -30470 43971 -77332 340378 321718 -189633 234508
73 234508 500700 354148 98151 245304 240541 -83217 -295325 15248 224678 -85298
83 -85298 -488056 -340992 -16672 -71551 -336981 -254492 -23435 -90690 -294879 -135056 169591
94 169591 99527 -221129 -178944 209051 360909 101831 -85657 30752 140967 52314 37497
105 37497 198714 218078 -32372 -167502 30941 222854 102347 -93231 -71168 35052
115 35052 -2393 -69401 5501 78401 -45359 -205773 -141781 42554 44802 -123968 -187761
126 -187761 -87208 -21247 -51742 -47609 6113 -8038 -65075 -23823 94977 132506 66763 36446
138 36446 91106 130925 105867 86290 105075 92389 30359 3835 33475 26842 -45459 -92177
150 -92177 -72574 -56241 -76583 -85954 -82102 -109142 -137090 -93455 -6804 18981 -25038 -41880
162 -41880 7504 52116 49006 49590 83067 88945 46803 30996 70924 86934 42344 9840 25795
175 25795 23057 -25868 -47413 -9896 11528 -26182 -55389 -23405 8273 -26538 -72327 -48069
187 -48069 12206 20971 -11920 -19084 -4095 -12665 -24890 -1135 24101 3381 -27376 -15025 17712
200 17712 17591 -806 9335 35623 27840 -3430 -454 36746 50564 26701 13260 24034 22237
213 22237 1866 -7425 -6843 -16709 -25106 -12913 -8405 -38063 -65694 -46717 -10510 -12865 -40161
226 -40161 -34277 2643 12115 -9123 -2212 37967 48546 20544 13217 38411 42655 20110 21563
239 21563 42731 26193 -20952 -25245 16314 21261 -32146 -59516 -16529 15953 -23567 -61468
251 -61468 -26067 18555 -4504 -40449 -12146 32882 16980 -20102 -1866 37780 25408 -11493
263 -11493 2291 40278 22892 -27696 -18169 38335 34819 -30683 -44998 13517 36769 -13517
275 -13517 -39600 2334 27705 -10831 -35770 3666 37134 4531 -34617 -11335 27953 12932
287 12932 -20369 -5434 23474 746 -33899 -7021 39386 20374 -34297 -31209 19917 31984
299 31984 -6021 -22286 4647 17643 -6423 -16366 10396 22263 -8163 -27871 -2280 19453
311 19453 769 -16941 -1402 11222 -7471 -18790 6045 27128 6943 -22339 -12691 20328
323 20328 24754 -649 -11520 2524 7856 -3725 -3505 9258 4442 -14712 -15924 277 4402
336 4402 -6344 -9153 -2222 -2756 -11002 -7406 11007 18018 -409 -16977 -4761 18645 20025 4247
350 4247 -3742 -341 2338 4940 8644 5059 -6220 -10555 -4536 727 -1245 -5467 -5276 -3082 -6278
365 -6278 -11028 -4591 9622 9464 -6057 -13075 261 14305 13678 3606 -4656 -4088 5178 12252 8771
380 8771 -152 -5211 -4208 -41 2892 490 -3951 -3918 -2280 -5597 -7065 -749 4775 190 -7959 -9035
396 -9035 -760 8653 8828 -2199 -9017 -1442 9623 9019 784 -3492 -375 4885 6381 1709 -3401
411 -3401 -1738 3019 2387 -1769 -3993 -2207 986 2409 -1811 -7429 -5626 2304 4043 -1863 -5808
426 -5808 -2873 2075 3241 189 -2796 652 4767 2426 -3012 -1591 5214 6305 1090 -3644 -2822
441 -2822 2108 5481 3296 -2133 -3640 -1746 974 3819 3627 -2988 -7882 -2019 6643 3366 -5555
456 -5555 -5778 1045 2350 -3367 -4834 1592 5239 -2310 -10001 -2890 8728 6287 -4598 -4521 3381
471 3381 4062 1615 5252 8232 490 -7129 597 13607 10091 -7006 -11414 3662 10827 -2773
485 -2773 -13015 -2515 6059 -4301 -14353 -5206 5454 -1987 -12698 -7417 4193 3298 -4231 -1525
499 -1525 7395 3982 -5491 1842 17307 13443 -4716 -4859 14158 18693 524 -9336 2846 11951
513 11951 935 -10734 -4774 5073 -834 -13569 -12588 -3733 -5005 -11694 -7618 -313 -4602 -11528
527 -11528 -3121 8714 3934 -7652 -2732 13912 17841 5644 -1117 8911 17601 9998 -287
540 -287 3263 10902 6989 -1743 -2299 133 -2667 -7082 -7584 -8497 -11171 -10889 -6410 -3734 -7538 -12058
556 -12058 -8929 -588 516 -4970 -4689 4659 10040 6258 1726 3261 8534 10725 8066 3346 3594
571 3594 9029 11037 5894 -414 -1451 472 1778 64 -3318 -4810 -4206 -3460 -5495 -7221 -8323 -7858
587 -7858 -5534 -4156 -6694 -7878 -1932 3261 -1065 -7786 -4273 5346 9016 4960 2036 4734 8902
602 8902 9957 7401 5315 3566 3009 5773 9764 6468 -2751 -5881 -537 -452 -7299 -7731 -2200 -2677
618 -2677 -10017 -10855 -2972 803 -5432 -11091 -6556 1618 2591 1255 4973 5975 -1315 -3597 7611
633 7611 13554 1885 -7561 3818 16541 8475 -6626 -5346 5937 4065 -6363 -4098 7856
646 7856 6158 -7999 -8584 6433 6930 -9837 -13273 2618 6456 -8218 -10825 5523 8312 -12126
660 -12126 -20652 -818 14406 -719 -17273 -3492 17533 9202 -10499 -3927 15674 11152 -5362
673 -5362 2351 21486 13898 -8035 -4297 16288 12767 -12465 -16028 5854 10611 -12445 -21616 36
687 36 9193 -15281 -30279 -6269 15519 123 -18887 -4493 15444 6121 -10010 997 19499
700 19499 11645 -5266 2850 22228 13414 -10727 -7264 17186 15214 -13117 -18801 5253 12845
713 12845 -8090 -17817 -977 6830 -9960 -19345 -1476 13453 1683 -12359 -2996 10129 2051
726 2051 -9368 407 13463 3726 -10165 -458 15238 6287 -12490 -8051 10937 10958 -6319 -10544
740 -10544 4192 10819 681 -5046 2275 4158 -5592 -7083 5989 10261 -1588 -8402 -856 2768
754 2768 -4964 -7171 2263 6207 -4590 -12151 -2424 9823 5030 -6887 -6655 3062 5022 1118 2420
769 2420 6409 1930 -3074 1123 6569 1478 -5904 -2626 5293 3935 -3794 -5351 -63 378 -4955
784 -4955 -4135 3149 4733 -2892 -6357 -330 5313 3607 0 -1162 -1766 -2222 1539 5887 4499 -3120
800 -3120 -7033 -2860 2542 1371 -2107 -1996 1269 349 -1985 -1203 2126 2875 1242 -233 87 2451
816 2451 4247 2276 -1230 -1699 708 1565 -404 -3095 -3101 -1625 -162 -320 -1454 -3452 -5209 -2857 3247
833 3247 5190 -583 -3868 1217 5987 2583 -2020 1974 7224 2716 -4356 -2376 5526 5388 -3571
848 -3571 -6341 -166 2097 -3842 -5429 1189 1667 -5797 -6632 2818 5517 -4051 -7270 3956 10686
863 10686 1247 -7929 -568 10137 5143 -5810 -3041 7767 4912 -6979 -5568 5729 5356 -6186
877 -6186 -7231 2866 3370 -5935 -5907 5038 6593 -5645 -10032 3162 10883 -673 -9551 421 11075
892 11075 2523 -8747 -2263 9207 3822 -7307 -3495 6956 4278 -6362 -5479 4482 4046 -5393
906 -5393 -4909 4747 4357 -7070 -7573 5907 9923 -3502 -10298 286 8695 1603 -5367 380 6608
921 6608 1173 -5920 -1087 6560 3258 -5092 -3634 3889 2452 -4280 -2116 3903 475 -7680 -4359
936 -4359 5718 5164 -5461 -8290 596 6496 2393 -3009 -1292 2307 516 -579 4130 6037 345
951 345 -4123 410 5091 2264 -1475 -503 527 -2127 -3340 595 3802 -436 -6953 -6109 1519 4370
967 4370 -799 -4524 -2513 6 1182 2418 3300 193 -3011 -575 4030 4636 971 -1062 397 1298
983 1298 138 -629 1448 2113 -1835 -4990 -1329 2601 1012 -2830 -3636 -1747 -243 1038 1112 -681
999 -681 -2670 -1567 1749 3228 1496 -1806 -1600 1767 2760 264 -763 1350 1815 -354 -1099 415
1015 415 1614 823 -774 -1624 -855 787 504 -468 -1268 -1115 -396 577 1063 -894 -1772 -429 1695 943
1033 943 -1171 -1395 214 1909 718 -1678 -1781 1076 1876 -82 -2231 -1089 553 1067 488 -227 -343
1050 -343 -160 703 879 537 450 525 589 1035 442 -335 285 1369 337 -1739 -1595 1058 1376 -1071 -3214
1069 -3214 -2048 451 1109 -954 -2579 -1375 310 588 51 266 -222 -181 1054 2078 1137 473 915
1086 915 1991 1023 -185 -438 1090 1713 334 -2262 -1715 720 658 -1637 -3130 -2034 -202 255 -888
1103 -888 -1756 -1088 -6 658 278 120 203 639 1501 1572 792 352 970 1634 981 142 -400 337 1220 452
1123 452 -1492 -1824 33 112 -1358 -2387 -656 1044 55 -1078 -905 -146 677 328 236 403 564 612 1158
1142 1158 1536 359 -1544 -398 1736 1217 -1366 -1426 450 1038 -908 -2220 -709 806 400 -1702
1158 -1702 -1502 900 1881 603 -412 3 -139 103 2116 2697 648 -1373 -176 1713 1430 -733 -2134
1175 -2134 -910 879 -291 -1757 -618 711 -1362 -3286 -1914 1162 1512 -532 -1366 -794 159 1138
1191 1138 1788 1065 -274 -960 676 3803 3674 -162 -1990 248 2245 812 -1041 -357 423 -300 -2054
1208 -2054 -1671 -254 5 -2008 -3378 -1494 758 941 169 -479 -1172 -1340 527 2988 2477 -288 -949
1225 -949 1326 3399 2432 -599 -1103 934 1374 -536 -775 1088 1071 -1913 -3201 -1285 511 -624 -1658
1242 -1658 -979 -384 -843 42 703 715 -1237 -2314 512 3460 1815 -1094 -719 2170 1504 -1732 -1232
1259 -1232 1614 2352 -599 -1901 352 1843 627 -1487 -859 382 -380 -838 1656 2357 -895 -3289
1275 -3289 -379 2504 105 -2606 -1206 1590 1202 -1505 -2079 831 1026 -2008 -2818 858 3085 432
1291 432 -1526 253 1415 -433 -331 1602 2306 -639 -1796 1526 3568 802 -2681 -1805 1223 821
1307 821 -2086 -1184 1810 779 -2770 -2465 64 710 -1486 -1587 484 921 -616 -660 1102 403 -1879
1324 -1879 -2011 2017 3215 122 -1851 567 2859 829 -1185 -22 1702 864 -579 594 1965
1339 1965 248 -1412 -1243 -14 -498 -1838 -537 984 -720 -3382 -2077 978 370 -2707 -2470 338
1355 338 1892 404 74 1389 1878 333 351 1801 2395 1576 512 1962 1766 -448 -1390 449 817
1372 817 -2186 -3600 -751 1132 -1103 -3799 -3037 -129 181 -1121 -982 747 1040 -304 822 2495
1388 2495 2008 -151 299 2888 2243 -73 -419 1722 1630 -1518 -2705 -178 1360 -754 -3301 -1399
1404 -1399 1158 377 -1985 -1619 505 403 -403 -41 1454 782 -383 -59 1083 543 -1114 -1323 448
1421 448 1186 -811 -2071 -615 1303 -345 -2106 -944 1985 1839 -493 -1137 726 1961 1291 -113
1437 -113 -8 876 267 0 659 672 -940 -2205 -928 719 -436 -2108 -1917 382 712 -1419 -1955 189
1455 189 2195 82 -1168 600 2866 1502 -1273 -1001 1539 1700 -119 -675 408 77 -1177 -446
1471 -446 1506 927 -2238 -3247 417 2651 194 -1766 332 2214 -34 -2503 -188 2640 1030
1486 1030 -2537 -1969 1554 2049 -1362 -2765 -282 897 -1206 -878 1641 1645 -1364 -1827 2358 3934 577
1503 577 -2654 -321 2894 1548 -1291 -463 1971 368 -3009 -2355 1373 1026 -2663 -3083 338 913
1519 913 -925 -1074 915 963 -1178 -810 2320 3340 -121 -1933 824 3541 961 -2247 -1073 1491
1535 1491 231 -2643 -1537 699 227 -1818 -1734 50 404 -802 -546 1451 1439 -341 180 2504 2171
1552 2171 -440 -548 1318 1941 -101 -1830 -175 827 -546 -2105 -1770 -528 -617 -1429 -1402 -336 -698
1569 -698 -721 588 1270 147 -924 473 2369 2003 137 408 1456 1038 109 -8 790 820 -767 -1456
1587 -1456 -52 448 -441 -1197 -612 -559 -969 -306 699 122 -1510 -1048 1083 1635 122 -1280 -758 955
1605 955 762 -177 -225 688 211 -272 380 1242 446 -388 -259 838 774 -84 280 997 275 -694 -817 683
1625 683 701 -1071 -2389 -657 925 40 -1193 -960 -385 -150 -230 -29 498 117 -95 363 1310 763 273
1644 273 139 936 844 176 67 756 731 -590 -1113 -286 777 134 -1145 -1519 -260 697 263 -805 -659
1663 -659 120 57 75 377 304 -294 -85 423 500 -242 -774 -142 282 -35 -954 -658 663 760 -404 -604 937
1684 937 1483 669 -398 264 757 1275 482 61 222 487 -79 -364 -89 -623 -1067 -718 -274 -441 -1524
1703 -1524 -1448 330 278 -749 -1147 243 1221 874 -538 -10 1581 1610 439 277 833 1170 518 464 499
1722 499 -190 -741 -458 285 -101 -1326 -1164 -417 19 -957 -1754 -559 433 -74 -775 -347 638 714 301 160
1742 160 545 1014 767 658 627 461 108 372 607 90 -812 -581 168 442 -567 -1088 -398 165 -482 -1192
1762 -1192 -554 -84 262 -312 -699 -116 551 290 30 256 380 331 640 646 538 -70 -107 584 389 19 -578
1783 -578 -163 523 181 -805 -568 147 334 -371 -381 -233 102 210 17 -453 -421 -89 55 74 111 139 -21 190
1805 190 435 170 -247 -370 629 710 -205 -302 463 649 351 -533 -836 378 778 -34 -467 25 378 -224
1825 -224 -357 -154 68 -104 -382 133 7 -283 -419 37 112 -259 -867 -97 910 1022 -479 -687 512
1844 512 1178 93 -436 372 649 542 363 29 324 -152 -983 -399 250 83 -422 -175 -86 -710 -1129 -539
1864 -539 440 -44 -897 -1075 401 1188 402 -738 -359 788 603 228 317 1265 819 192 70 752 547
1883 547 -376 -199 159 321 -346 -582 -120 -33 -1588 -2258 -633 649 -38 -1532 -885 663 570 -261 -717
1902 -717 294 894 275 397 1109 1351 521 132 869 1278 189 -306 714 1031 -230 -1273 -359 310
1920 310 -548 -1863 -1481 -304 164 -935 -1733 -629 236 -537 -732 9 1119 410 296 934 988 679 293
1939 293 953 1344 493 227 502 1507 662 -836 -1307 82 -34 -929 -1346 -638 -91 -1052 -1179 -992 -723
1958 -723 -749 -771 -388 187 335 243 477 616 632 371 959 1650 1021 217 195 1041 990 290 -470 -237 44 -87
1980 -87 -392 -318 -635 -669 -659 -906 -1010 -621 -473 -128 -169 -145 -60 136 308 -217 -228 272 1128 777 588 -46 106
2003 106 528 699 353 -164 -236 204 805 586 -372 -292 61 -275 -483 -550 -51 232 -158 -895 -956 -446 -582
2024 -582 -751 -723 -577 -85 -175 148 237 -81 -376 262 1052 986 505 552 895 1126 699 243 331 880 313 -273
2046 -273 -391 17 -172 -872 -1241 -864 -732 -882 -1200 -876 -740 -530 -232 292 56 -266 -234 484 1566 737
2066 737 299 257 680 843 315 -29 575 782 -17 -488 -240 505 -29 -816 -620 -271 -240 -447 -497 -210 -453
2087 -453 -828 -47 388 -257 -979 -904 655 1006 143 -573 -243 530 642 59 500 943 749 -353 40 469
2107 469 463 148 26 205 139 -674 -654 -51 -89 -869 -921 -75 143 -766 -1487 -848 779 164 -609 -569 563 627
2129 627 292 451 921 1051 364 -172 322 514 -279 -291 33 -7 -1078 -1058 -45 399 -706 -1310 -487 470
2149 470 50 -799 -492 482 550 -196 254 638 495 266 101 187 314 -248 -239 129 -147 -867 -664 341 236
2170 236 -685 -1360 -384 217 -10 -113 231 749 148 -63 431 691 472 234 5 294 167 -170 -62 407
2190 407 -399 -760 -373 342 -167 -1101 -806 173 393 -38 -446 -130 176 59 -8 673 593 -185 -70 -20 346
2211 346 112 161 506 208 -430 -349 162 670 1 -580 -235 196 444 -227 -625 -90 213 64 22 -19 -274
2232 -274 -490 -317 390 212 -382 -325 12 317 167 -362 288 840 -7 -456 -28 582 630 87 -287 64 271
2253 271 255 -297 119 -88 -402 -215 -181 -183 -332 -575 -96 97 -82 -552 252 280 77 -427 -19 604 669 -112
2275 -112 -187 10 232 234 84 -172 161 -219 -317 -183 -188 -265 -343 60 -23 -177 -451 36 212 456 6 31 163
2298 163 248 -56 -345 97 327 53 -458 -567 -118 103 -181 -132 -97 76 87 55 276 389 89 232 522 479
2320 479 -124 -389 455 616 -194 -411 -62 -174 73 -476 -498 -142 48 -18 -68 -381 -195 30 137 287 104
2341 104 212 381 782 379 172 138 372 563 211 -172 84 365 31 -413 -185 1 -397 -404 -170 -267 -61
2362 -61 -170 -43 226 -185 -178 191 294 -49 -11 38 434 679 63 -28 105 498 236 251 95 148 104 -268 -213
2385 -213 -171 -221 -104 -53 -327 -327 -321 172 200 -481 -783 -31 559 264 -245 -77 312 313 43 145 -59 201 -56
2408 -56 224 439 94 61 -159 143 109 -238 -343 160 -211 -645 -491 -64 -139 103 -219 -471 -152 340 413 -240
2430 -240 -51 0 64 87 387 254 -226 234 264 27 -24 -216 -229 250 -38 -424 -47 242 152 -461 -290 -205 261
2453 261 120 -252 161 379 167 198 -123 -271 176 143 -48 39 -4 -72 -181 243 -266 -218 -357 109 376 51
2475 51 -187 -120 52 111 32 -255 309 83 272 122 146 296 -100 31 -146 -26 387 103 -222 124 -149 -204
2497 -204 56 47 -40 -543 -174 186 101 85 -421 -175 148 209 -97 14 222 321 241 96 253 -59 101 21 22 56
2521 56 96 -15 102 11 -395 -177 -150 311 50 -516 181 16 211 -323 -414 165 165 88 18 68 124 128 -50 -182
2545 -182 113 101 -51 51 198 -120 -179 -99 16 -139 -434 -28 335 -65 -335 -232 134 342 -199 -247 -48
2566 -48 216 198 154 -44 -54 69 -177 -255 162 -83 -325 43 -194 152 -195 -257 254 48 -113 -94 93 590
2588 590 -29 -360 -158 133 272 -132 -161 60 19 79 -5 -289 -246 -247 -82 220 143 -46 -146 13 198 -156 -488
2611 -488 -49 248 -47 -38 214 292 197 -87 -66 -41 383 110 216 370 -157 170 -40 101 -117 -217 -211 88 68
2634 68 -127 164 -103 -34 -110 -233 -126 -3 233 -42 -293 354 179 -138 100 326 32 293 255 -27 144
2655 144 186 -35 -217 76 -45 -251 -7 -38 95 -153 -12 263 -8 -123 -22 76 -63 210 -196 25 -18
2676 -18 -65 73 -187 105 -36 58 81 156 -20 -340 -79 232 -73 11 -285 93 83 -35 -157 -142 -177 13 97
2699 97 -70 70 -21 -109 132 151 85 21 160 374 -63 -126 405 -18 -11 -1 -96 50 249 4 -172 46 156 -75
2723 -75 2 -111 55 -171 -38 102 56 -19 62 244 282 183 -39 27 267 59 -348 220 307 343 -90 -148 -32 156
2747 156 72 -45 70 147 63 142 60 145 -217 44 114 180 -207 0 19 307 -61 -37 151 20 103 -193 -302 -13
2771 -13 45 107 82 -43 109 -207 43 182 -196 -53 412 369 101 114 48 -121 156 -104 -432 -84 235 114
2793 114 170 69 259 -9 43 -61 -89 -136 -21 71 -80 -40 -116 -74 28 69 -303 -70 239 127 16 -185 327
2816 327 174 104 -6 -184 307 -136 -141 -148 57 -143 -254 135 130 -73 5 28 -19 -136 -241 -228 95 -32 -9 -248
2840 -248 324 150 187 -230 -150 262 81 -81 -31 31 -243 -12 -52 166 -114 -92 15 177 -92 -82 -15 54 66
2863 66 -231 -268 -29 185 -41 -257 -144 81 203 -195 -47 -103 300 -138 265 93 -88 -222 16 7 54 -324
2885 -324 -284 -8 193 -226 -251 54 210 166 84 298 135 174 -105 -136 -54 9 192 -134 -62 52 -162 -219 -22
2908 -22 58 -226 -28 -33 -62 -228 -91 0 -36 -241 -166 -122 71 149 137 -97 -271 53 376 266 -52 -179 41 -141
2932 -141 -96 -17 83 56 164 -53 -31 -230 215 135 -28 -91 222 101 90 -124 -14 54 -46 366 3 -112 303
2955 303 -33 178 -172 -63 -40 15 203 72 -34 39 72 275 195 3 -189 -150 124 121 -67 -26 212 -69 -10
2978 -10 35 -114 133 85 -201 12 38 -33 -258 51 -71 154 6 112 44 -189 -157 -77 -12 -3 -35 26 -166 54
3002 54 45 -194 -107 363 -4 24 97 107 148 -32 -38 -343 -276 -43 220 -93 34 -128 -160 -60 223 -13 1 -236
3026 -236 42 46 -224 64 95 236 -62 -104 105 -238 7 58 124 30 79 144 -55 -191 57 -55 89 -226 -87
3049 -87 28 -168 -84 -90 -201 -45 72 -60 -189 -128 -269 -20 271 74 -51 -35 -207 115 74 -117 70 341
3071 341 142 -56 6 -83 -83 -168 -269 -190 -61 -31 275 -41 -62 -141 37 -5 -53 -233 48 354 10 -75 83 -144
3095 -144 267 391 -213 57 193 224 -75 -239 -185 -148 -137 -36 192 57 -114 1 57 161 84 -14 -138 13
3117 13 -10 -112 75 -11 -24 -125 -237 51 1 178 21 -98 126 -119 -83 -149 -238 -136 47 -14 137 175 74
3140 74 150 33 -16 -244 -434 249 183 -106 21 -135 3 76 25 -105 -89 148 18 75 45 -33 -16 44 -43 49 178
3165 178 335 161 -150 -151 106 188 152 17 86 -30 106 82 126 -54 -97 -29 166 83 -169 -119 128 -66 17 -88
3189 -88 -20 -276 111 319 99 88 -3 -65 -58 -141 85 162 2 -292 11 68 -157 -175 -351 -204 -147 146 100 27 45
3214 45 65 -20 -32 -70 135 -105 107 245 104 -95 172 29 3 118 34 77 -271 69 -175 271 168 -16 14
3237 14 -179 12 -112 106 87 0 78 -36 -221 -121 -202 -163 -58 106 67 -110 -116 -16 -57 140 -56 149 160 -141
3261 -141 -99 109 -107 -18 8 -108 -241 59 200 -122 54 -11 -122 -124 -59 -36 30 -46 -22 49 299 58 -52 233
3285 233 -101 -65 -84 88 -135 -67 -131 -88 6 93 115 88 112 -23 44 150 -123 326 -128 -41 -114 47 -91 96
3309 96 -54 53 -185 -282 -96 162 -61 -136 47 65 -132 -91 177 -178 96 -166 -22 171 -103 -121 -17 -192
3331 -192 -57 51 -175 61 -182 321 211 80 -14 -5 -1 -209 -118 -144 104 -3 -2 -160 -36 -71 -161 257 -81 -25
3355 -25 245 -31 -9 -116 -54 -169 50 24 114 -11 108 58 57 112 -1 49 -53 113 30 -148 -95 91 205 156
3379 156 -52 171 108 7 16 103 129 -33 265 194 403 145 -148 2 146 20 219 133 -3 -163 -34 -31 84
3402 84 1 -234 -209 -129 126 -58 149 279 223 101 -38 -382 -89 31 85 -42 271 12 120 84 33 40 25 -49
3426 -49 215 -96 342 -47 54 213 134 -127 -25 47 -326 54 84 -16 -99 -235 213 -56 28 -29 -134 109
3448 109 -141 -130 404 -82 -119 -33 75 37 -87 65 -222 -180 -154 136 -166 -179 38 -25 -254 90 315 5 61
3471 61 55 191 97 -150 -117 133 -105 -30 -33 -83 186 -75 130 -15 12 175 -57 -147 42 -7 -206 -172 21 -5 0
3496 0 -85 52 -158 8 97 -15 339 36 21 -14 -231 -3 -147 277 223 70 128 40 48 -105 -193 35 -2 -274
3520 -274 193 167 32 6 31 76 2 398 -166 51 -102 -330 61 67 -47 -78 64 27 -23 -78 178 -4 206 8
3544 8 119 175 -16 -49 69 199 -51 -16 12 173 57 -171 -62 194 -234 -58 -259 188 -223 -28 -63 -348
3566 -348 22 33 -50 -112 -17 84 66 104 -34 0 -76 -56 24 -230 38 -131 -26 -15 18 -323 -11 44 -28 -15 218
3591 218 42 77 -29 -21 -86 -35 -17 -235 134 -53 52 117 -30 -315 -193 -230 45 -219 -150 16 43 -292 -58
3614 -58 -48 -305 84 149 -35 9 -129 -97 -71 10 40 21 52 161 -29 185 247 -11 22 83 337 64 -313 -83
3638 -83 78 201 284 152 -84 -76 -211 50 25 22 -303 62 -80 29 142 80 135 -168 127 275 32 37 165 -237
3662 -237 -107 -35 -202 -55 -116 35 136 -74 86 118 -89 4 -148 -163 263 168 9 -121 54 -101 -14 -17 17
3685 17 42 87 16 -97 122 244 -20 -42 29 -228 -139 -30 183 -141 -60 90 282 -13 51 256 13 86 109 63
3709 63 30 -89 111 -65 -47 151 215 -134 -33 -105 120 -295 -172 -127 -27 140 85 -12 57 -102 12 -60 6 81
3733 81 -66 66 -248 -41 -129 231 -34 -103 -48 -70 -163 41 -14 -17 101 -103 -413 79 33 -123 -127 121 -280 81
3757 81 -7 -44 67 -168 -38 -209 -149 -87 52 -50 34 15 -89 38 142 49 18 39 196 -131 -109 215 -37 -47
3781 -47 -264 -44 -2 82 72 -64 -105 0 -42 -44 187 88 28 -239 18 -131 -6 -118 -169 11 4 -26 161 85 -35
3806 -35 -23 77 -93 -209 18 240 41 -201 -115 343 265 -48 -31 182 61 -93 238 -178 79 -344 34 -12
3828 -12 -66 -55 95 109 -143 68 180 78 -158 -177 -48 -37 -52 65 -198 -127 -108 -173 231 -22 122 9 7 -54
3852 -54 -237 81 141 116 286 -11 -14 -20 -72 -42 -48 120 -85 128 28 75 -14 39 19 -117 32 105 124 -117 -47 -139
3878 -139 -171 98 -253 -128 -125 -33 57 -75 67 131 21 125 166 176 104 -133 234 152 -5 -43 -16 35 -179 -95 40
3903 40 -125 -9 -134 -63 28 37 -88 57 -172 -81 -84 108 85 348 -17 33 -144 -16 -54 34 -77 -49 212 64
3927 64 -58 80 -91 -59 143 180 -91 -272 -35 -154 -6 -119 86 73 225 59 19 184 15 -16 -218 -154
3949 -154 115 -36 -148 171 -103 -84 122 -68 116 -144 133 -284 -204 19 18 -3 -79 -117 -114 -245 -204 -271 57 -19
3973 -19 28 -97 69 -30 -20 102 -271 109 96 68 83 36 100 213 -110 83 -175 140 -68 -125 108 -148 -48
3996 -48 60 -92 -288 -29 -88 233 83 -65 119 -2 102 26 -95 123 107 -238 -86 -90 -225 -95 177 315
4018 315 66 162 -114 -139 327 194 -162 -224 -42 179 12 -47 -86 60 74 -21 -42 89 18 -169 214 -122 -20
4041 -20 -77 -151 -225 124 52 -124 -4 2 154 141 143 12 218 300 165 -222 -2 46 -383 1 -17 13 174 -51 103
4066 103 71 -26 -86 -517 -14 153 -155 75 47 151 32 -67 16 -71 244 144 -7 -181 -285 -82 50 -249
4088 -249 -179 91 -49 -50 -99 68 -310 144 195 139 -242 66 -42 -104 -102 253 -112 -351 -221 -111 -42 234 -165
4111 -165 -158 -94 15 137 -38 -225 -58 -198 -35 89 103 -3 -139 -56 55 -138 -180 -1 60 -29 52 40 -350
4134 -350 -66 -199 128 -34 -125 -72 91 -53 -108 -66 -170 118 292 -21 -44 40 142 95 -232 -140 170 -265 18
4157 18 -33 33 273 173 44 -109 -13 90 116 55 143 84 46 259 -31 110 -150 222 -194 -34 23 8 67 -44
4181 -44 202 -13 -63 136 -55 56 53 -281 -47 -86 33 139 -175 -36 -9 -205 63 71 74 -81 -212 -21 59 103
4205 103 -206 -99 82 -210 212 -394 373 -179 -53 136 40 -120 62 -172 -139 -135 94 -330 -87 28 21 -78
4227 -78 102 41 -20 -72 -57 -248 -222 -83 -121 -116 -84 -26 -286 -75 71 211 -4 -48 -156 -150 -243 -55 -94 265 -105
4252 -105 -147 -219 2 149 -118 30 30 110 189 -3 76 -109 191 -287 -227 -7 -34 100 -85 197 -16 -219 -169
4275 -169 171 -40 -182 -168 -182 8 31 91 -129 327 53 -186 83 92 -111 152 -242 -138 151 -313 -69 -132
4297 -132 -135 3 52 -139 172 174 -66 -112 -4 132 -261 108 -132 -5 -173 158 61 64 -149 97 230 -53 -18
4320 -18 100 42 23 -135 -15 -89 -13 -129 -275 32 158 -46 -66 152 0 193 123 -123 121 73 -134 -125 -271
4343 -271 168 -111 -103 -192 -186 -82 -57 -76 -87 165 81 11 -132 62 -174 191 30 74 17 -70 369 -81 -44 145 -100
4368 -100 22 -241 47 250 -106 73 68 -138 -73 25 -110 -140 -102 -52 -61 43 72 -3 -75 9 -200 -12 -258 140
4392 140 -247 -340 76 -204 -115 38 19 89 -170 55 -266 -175 -248 204 -57 71 -374 13 -232 12 132 12
4414 12 56 91 170 29 444 207 -214 50 -22 184 219 36 90 14 36 -9 -133 21 133 14 58 -57 -211 -253
4438 -253 -39 -155 60 228 -64 96 77 -2 140 -35 102 136 217 351 209 171 -51 -31 86 147 59 24 68
4461 68 140 -110 27 66 -11 -103 31 -84 20 -55 -177 -158 -142 -81 173 -117 -117 69 105 230 -2 55 25 -58 152
4486 152 89 -198 126 -191 -209 -45 -46 -125 -157 141 3 30 119 90 42 -55 104 185 54 -262 -47 -128 17 -273
4510 -273 -208 12 139 -48 245 156 -136 -168 -36 -83 -20 110 126 -67 150 86 182 -23 100 2 42 -209 -13
4533 -13 17 -32 144 6 -20 -184 70 151 40 113 -286 -26 -58 -59 112 5 116 -180 133 -328 -12 -170 20
4556 20 -180 65 -196 87 -14 -106 -46 -17 176 -87 101 72 292 -78 -179 -53 -92 106 71 -33 -286 111
4578 111 -48 58 -6 -333 -64 148 68 224 -2 265 -85 -28 -38 -24 -140 -371 -46 -244 -61 -200 -74 -168
4600 -168 -53 -210 12 -43 33 -257 3 -144 -27 -44 179 -54 42 81 267 -65 -119 244 -94 84 -133 -20
4622 -20 -184 3 -20 -129 -85 50 -46 -78 -134 79 18 17 -71 30 -131 128 -121 176 -207 -43 256 28 311
4645 311 220 16 173 232 -28 -22 -68 -117 147 121 7 -193 110 -115 -273 119 -34 -111 -101 155 -89 -47 24 -110
4669 -110 239 -225 102 -119 -63 -243 174 -15 70 -245 77 28 -307 -107 198 -72 -82 250 35 -97 147
4690 147 -229 -90 -76 121 -102 -120 -14 -164 177 1 59 257 -28 133 -152 -105 81 -112 -304 -120 -380
4711 -380 -190 64 -215 173 211 117 16 -34 74 -86 -222 -86 -12 -99 -196 -61 34 11 194 99 -73 -132 -150 -151
4735 -151 192 229 -102 -130 21 88 -26 -1 -50 -213 109 193 4 112 236 -3 179 3 -167 65 -301 -143
4757 -143 -83 105 -159 -273 -245 -64 86 51 44 94 190 122 106 -114 -402 122 158 11 60 123 95 11 55 73 28 10
4783 10 -137 167 -82 150 -5 -25 -242 122 -96 -2 -43 8 -234 -96 -62 76 147 10 24 -116 -21 244 113
4806 113 -213 114 23 176 -262 -58 77 93 58 161 -195 -90 144 -124 -7 59 -80 81 -180 -98 137 14
4828 14 4 -50 -3 173 -57 -12 -174 120 127 -84 -158 -40 218 211 -39 -94 38 105 -65 32 1 298 173 -143 87
4853 87 27 112 -161 -161 70 -23 277 280 -17 61 91 -186 -6 -71 56 -169 -125 -51 127 35 -161 77 -358 -133 -147
4878 -147 75 175 -189 187 17 -75 145 -67 243 -173 -94 184 65 38 -156 78 85 31 -131 -164 -146 -102 -171
4901 -171 -81 55 80 -71 -257 -168 144 78 -44 -39 72 45 49 36 45 122 183 116 -11 -27 -230 261 -180 -90 100 200
4927 200 3 -264 -126 -101 -114 -171 -27 16 28 -248 -159 -244 97 -32 -124 130 221 -76 -30 60 145 174 277 87
4951 87 -27 -11 139 -201 -191 -41 33 168 120 67 -25 81 309 -112 -89 173 -57 235 -149 -162 -46 -27 -99 -144
4975 -144 -294 -92 163 40 44 145 1 -79 -43 45 -162 63 -14 42 -12 -71 -62 -228 56 -140 218 -127 100 -3
4999 -3 86 -252 -89 0 -9 84 22 -74 -215 96 -226 52 26 -22 222 -55 -93 59 -334 -160 -28 54 -97 100
5023 100 -138 68 -22 -247 -71 3 -227 -125 -78 172 118 -230 174 93 6 73 133 -23 -20 -134 -43 -95 -72 7 -375
5048 -375 34 55 95 52 7 86 110 -237 181 128 -140 -109 -216 1 217 -83 -101 65 71 -57 -35 100 62 -43
5072 -43 316 33 7 172 -26 -28 86 298 -6 67 36 206 -126 -154 -83 149 -132 -191 -110 -77 -126 106 -183 98
5096 98 135 93 327 177 5 -165 -168 151 86 2 194 115 175 -45 -120 -50 190 -49 -253 -62 -95 67 -186 -173
5120 -173 68 201 -104 50 113 -83 -225 -125 -41 -25 -76 33 47 69 -39 -193 -80 -1 105 31 91 220 -14
5143 -14 76 -123 -28 11 284 -232 -134 -30 112 170 31 101 -92 242 -42 154 73 59 -206 -55 188 -210 103
5166 103 -257 -18 207 66 -21 -60 85 293 92 -48 -261 -155 174 -221 -182 80 249 101 43 78 -137 139
5188 139 5 -12 234 -65 -55 -132 -13 89 -198 195 26 -75 -130 -38 70 89 98 -79 -93 -72 173 112 93 296
5212 296 -30 -239 73 88 -213 158 -157 169 91 173 76 11 32 65 -150 -22 40 36 76 -165 233 27 -231 17
5236 17 -13 -151 19 -163 -65 -66 218 -146 -8 72 -138 90 147 58 87 15 74 76 -209 74 54 -147 106 -76 -91
5261 -91 -153 -90 57 17 45 56 285 227 -131 -310 -39 215 134 -46 -62 245 -12 299 35 -216 -65 -342 -128
5284 -128 -387 5 -82 -133 -253 83 126 15 -10 87 211 34 112 41 51 55 220 8 126 -159 183 -168 -45
5307 -45 -22 -13 -166 -184 -180 -91 22 -33 10 -38 -90 -57 22 55 298 -31 6 -74 177 -117 -143 96 -275 38 279 -33
5333 -33 17 69 -189 59 -155 147 -225 -73 167 186 27 -93 -113 10 249 -63 -94 -159 194 34 160 75 21
5356 21 11 181 -201 63 -124 -30 195 -92 -63 132 135 306 4 -47 59 -60 -71 -121 -79 -235 -15 -97 7 83
5380 83 5 47 -177 -8 131 32 -24 -120 94 -304 -40 -9 -272 120 -6 16 -133 -50 83 155 -69 20 -36 232
5404 232 125 -59 82 57 48 -54 68 115 38 -114 74 -286 203 -90 114 -100 21 188 -104 155 -176 -28
5426 -28 240 -101 73 -65 73 -139 -122 -21 -119 -154 -71 91 -67 117 62 91 -53 -226 -237 -226 210 292 -170
5449 -170 47 -145 -110 83 135 -256 63 -164 16 20 -68 54 23 -1 -22 86 153 -62 -131 5 -144 76 -70
5472 -70 -76 -14 -132 -23 10 35 41 67 80 -135 -41 -34 102 78 24 17 42 56 -136 141 -134 -138 115 -1 -3 21 90 -214
5500 -214 -26 74 -189 276 22 -173 1 -16 -236 164 -126 -268 91 83 -14 -95 100 206 100 23 113 82 36
5523 36 -33 -252 -266 -57 3 1 66 -165 -26 291 -72 33 114 169 238 -39 79 -222 87 -29 170 77 98 -14
5547 -14 -160 -83 -156 276 7 288 -33 -189 73 39 -45 12 16 77 44 226 210 -49 -22 115 88 -49 113 257
5571 257 155 78 320 -28 -96 60 -89 -110 -113 -154 127 4 54 -333 -150 -8 -8 -51 -109 74 -269 -9 -42 166
5595 166 -24 260 -206 -157 232 -41 41 -141 32 0 -166 147 20 -81 -24 -63 33 8 -83 -34 16 102 131 28
5619 28 -115 -35 -27 -64 -64 132 65 129 -78 60 -65 -72 -18 -59 -3 20 -120 -159 -141 -43 49 53 -79 -97 -31 -101 120 82
5647 82 -184 183 -109 112 -55 75 24 145 -17 174 -28 24 -118 -2 34 -47 43 164 -151 -33 90 -20
5669 -20 -71 16 -99 -46 506 46 123 75 -5 196 168 60 -62 223 21 367 14 -70 -16 -80 197 93 97 191 -19
5694 -19 217 -56 33 -74 -261 86 267 -72 -150 7 200 -106 150 86 -81 141 37 -107 -38 117 -155 78
5716 78 132 156 -338 -31 -20 -59 190 -107 -175 -8 -237 -241 -11 -165 -114 -61 65 114 -5 -173 65 -58 84 -17
5740 -17 -59 -94 278 -49 38 58 -243 -79 108 -22 166 -134 -184 -144 118 68 81 -184 29 204 19 87 -197
5763 -197 -32 -54 -45 244 274 -157 252 150 15 59 -262 18 14 46 154 214 40 -60 -77 17 -259 -66 145 100
5787 100 36 -52 121 195 31 -137 -61 -32 59 183 118 -159 2 -130 -181 205 -29 -57 -67 -225 62 -134 187
5810 187 65 29 128 -237 -40 -162 74 212 -133 -62 -111 -36 -13 -207 159 114 19 -216 -151 217 31 -18 -16 -122
5834 -122 147 -15 -112 205 -62 31 -79 -105 -153 13 -11 -92 73 142 22 46 -9 220 107 -64 -104 -52 244 128
5858 128 80 68 -247 17 87 -50 -35 159 44 -176 233 80 32 15 -319 -86 64 44 -110 18 -176 -74
5880 -74 40 -88 58 242 -22 -11 -107 8 72 -49 -39 190 -101 77 -33 -139 32 -157 -161 -2 180 34
5902 34 105 45 9 7 123 -62 -42 88 84 -88 -293 181 274 14 -69 -276 149 -90 -101 116 350 21 -195 -12
5926 -12 255 -34 56 39 -128 -147 -74 102 47 -3 -122 -60 65 161 -3 58 237 -175 -22 -51 -97 -85 -140 5 -102
5951 -102 -207 21 19 134 71 -99 221 161 -107 -190 180 -46 -141 -110 -148 35 -96 154 -26 103 110 -95 -74 -48
5975 -48 109 117 -47 -4 175 41 -1 176 -29 92 25 137 -3 -8 280 -6 104 -84 171 38 -292 -230 -73
5998 -73 135 13 -150 10 -186 -162 -43 59 224 58 212 -181 10 -11 26 127 -41 154 186 107 -135 36
6020 36 -144 134 64 155 -3 -287 237 134 114 -118 -41 -108 -181 158 -7 113 -22 124 -2 -92 81 118 15
6043 15 11 103 89 256 64 -271 -176 167 341 -61 10 37 -169 54 185 5 40 160 -99 93 29 -86 -99 59
6067 59 -281 94 -181 -59 4 6 -99 -170 9 28 92 177 -184 -190 196 27 76 3 234 -136 35 58 77 -44 -73
6092 -73 -283 256 -319 148 66 129 -113 -12 -32 73 -69 -26 25 40 -38 -82 70 12 162 128 -322 16 178 -150
6116 -150 -128 -330 147 144 129 -271 -38 127 -225 -15 -4 -128 164 55 137 101 288 78 86 -66 -90 119 22 143
6140 143 318 -3 -11 34 -15 127 0 202 4 84 41 111 166 -244 57 175 74 -24 -108 -2 -262 116 15
6163 15 99 27 2 118 -221 47 -171 34 -18 29 -21 93 71 -226 41 -12 216 115 -74 121 87 -45 42 -23
6187 -23 -21 23 61 -60 -43 124 -40 297 118 -33 -121 -172 -19 -50 55 -47 -127 169 -217 -87 243 205 330 298
6211 298 -189 125 152 -56 21 -213 54 -22 -141 -50 -179 72 -131 188 -44 -57 120 86 11 241 51 25 -15
6234 -15 -480 191 121 17 58 -128 316 -235 -119 0 -66 35 141 -109 45 105 95 -84 -199 54 96 -120
6256 -120 41 95 -7 9 105 143 -136 26 -341 54 97 -100 91 -49 98 -49 47 -208 -275 -19 -26 33 46 33
6280 33 -202 89 196 65 31 86 -54 46 15 -1 -191 30 -119 -374 -228 -111 -60 -216 103 -86 -67 76
6302 76 126 -131 20 -107 -238 -41 188 195 112 -21 -99 171 -105 -43 200 116 -52 -117 2 -1 -28 178 81 105 146
6327 146 -232 100 -160 -100 127 119 -17 -25 -115 -152 117 147 106 -46 214 43 -93 -23 183 -69 -23 -52 70 -65
6351 -65 -62 -229 -110 -70 115 61 -45 125 120 -180 -134 -126 252 169 15 137 -6 -73 195 -22 -354 -114 151 -20
6375 -20 99 -47 248 -157 4 -34 -74 -108 -112 -42 63 136 31 -32 30 77 151 -62 -26 -1 -16 -66 45 186 23
6400 23 -107 -59 206 -214 243 -54 -75 -164 52 -63 -70 -2 138 37 94 -252 12 74 22 242 -209 261 -61
6423 -61 -210 284 -58 -46 -17 7 27 44 138 26 177 246 -87 -124 -11 -119 -86 120 224 -187 -155 322 62 -65
6447 -65 104 -65 37 -26 -30 -73 69 19 -149 254 141 -46 -70 -95 145 -103 -194 -69 65 -70 63 75 156 113
6471 113 -44 21 269 151 54 56 4 -98 199 96 73 105 -156 -22 198 -42 -82 30 -11 -81 -334 74 -57
6494 -57 107 -73 96 91 -43 90 106 61 -128 -174 280 295 -70 109 -84 -74 81 -102 84 -207 5 -98 -92
6517 -92 27 -42 54 -35 -105 -158 94 293 -380 112 246 126 -228 72 223 8 192 -4 16 91 -127 363 72
6540 72 122 -29 172 101 77 138 -86 13 38 141 -51 -207 138 -130 12 58 40 -89 -118 30 100 -212 -39 81
6564 81 10 178 50 191 -91 129 98 120 42 274 0 61 166 33 -14 32 89 -48 24 193 -15 -114 144 175
6588 175 -45 25 -29 18 160 -33 112 132 -149 -100 -55 -182 224 -110 -162 -191 -13 -62 275 -38 141 1 -51
6611 -51 38 77 55 182 138 47 117 -62 -105 -189 -91 137 -126 55 64 87 -97 -31 -16 3 -25 -266 -42 76 195 36
6637 36 -145 60 -134 -419 9 -152 56 -54 49 32 95 -308 -34 -135 -190 -208 -284 65 126 178 -190 12 105
6660 105 6 95 80 -156 -186 -99 221 -56 -106 -118 -72 217 66 125 219 28 -52 -244 131 -78 -31 116 16 38
6684 38 -343 -32 35 -194 -8 -183 31 76 159 -6 -65 97 134 55 301 162 53 200 230 -50 -51 246 -45
6707 -45 -263 -86 96 127 -35 31 9 3 -151 18 -123 -149 413 -84 -111 90 -21 -66 34 82 -72 -177 49
6730 49 144 26 -47 -123 -214 70 -141 21 -21 12 72 -39 87 95 64 -25 -27 233 -78 222 -61 -101 -118 79 5 245
6756 245 -75 -195 -75 127 214 -135 -26 -159 -53 63 320 -397 -295 -134 16 -65 70 -169 -216 68 127
6777 127 258 85 -126 -89 167 69 45 -112 -175 -85 -17 157 193 192 80 127 179 16 -123 193 -32 18 128 100
6801 100 318 -17 129 72 191 -69 -95 -157 -63 -34 115 -119 88 145 62 123 -32 27 1 -189 -40 55 -80 -123
6825 -123 -2 -64 64 23 40 145 -175 59 341 -17 -239 76 -4 -57 154 171 -213 121 312 -49 14 55 -54
6848 -54 -201 73 -2 -115 44 -7 0 289 110 61 -261 190 156 75 95 -155 100 -57 -192 -116 -213 -307 84 -163
6872 -163 -198 -195 -3 -83 55 18 59 -68 -61 47 -41 212 56 -71 214 -43 -241 12 214 49 -38 -128 27 50
6896 50 -204 135 119 113 53 151 -190 -148 -206 71 46 34 275 -161 2 -125 146 197 117 152 136 182 -122 -104 43
6921 43 174 -257 -174 -113 96 35 -139 -172 8 -4 -95 -125 63 73 -129 211 52 266 75 -43 25 83 54 60 -87
6946 -87 18 -214 48 -79 234 32 126 -90 -34 272 -123 -1 35 34 144 148 200 161 -27 34 241 93 7 56
6970 56 -12 164 -134 244 65 141 -66 347 98 29 -59 42 -30 38 -17 -319 77 -296 14 -161 -39 -140 -152
6993 -152 198 -222 252 139 102 -96 -100 -24 61 77 -22 58 98 -15 371 -69 -100 -184 74 80 -68 -17 -50 26 -61 246
7019 246 178 164 -198 19 4 -141 -56 -137 -236 99 23 -271 -140 -34 65 -139 66 246 2 -12 -92 299 -112
7042 -112 -33 -7 10 10 17 -49 187 214 52 -68 -61 -207 119 164 -3 -76 25 -124 26 -118 -46 71 165 -101 252
7067 252 -79 52 230 88 0 136 219 -78 180 -41 121 -77 87 9 118 -3 363 274 53 142 -211 -82
7089 -82 -52 -236 129 -187 -17 -77 102 61 68 36 95 52 -247 -41 56 -167 -144 -85 93 -40 -119 -158 -209 85 -54
7114 -54 110 -253 -150 1 97 -243 -40 -24 102 -7 150 136 -91 -85 87 69 -147 31 -79 413 232 165 -42
7137 -42 176 -116 285 81 -33 -21 -184 -136 230 58 -35 -149 -210 74 -24 54 105 -21 -135 -118 -25 -132 119
7160 119 -115 56 22 -60 -66 90 76 -73 -148 46 107 89 -347 -23 -105 -123 56 -129 -9 70 69 -316 -25 -209
7184 -209 88 211 -151 131 -161 129 -73 150 -102 -26 -23 213 -55 -81 273 159 232 -45 102 12 291 107
7206 107 -52 160 28 169 109 35 23 53 -21 7 1 109 -20 106 -55 31 137 -46 271 114 -3 -160 -133
7229 -133 213 -67 167 57 -84 122 204 187 169 111 215 107 -124 291 118 -115 163 17 76 70 59 51 -177
7252 -177 -267 -19 230 111 -237 -179 -73 126 47 98 -26 135 65 29 -102 -80 186 -117 86 59 -37 122 90
7275 90 28 -67 -32 105 -52 17 -65 131 27 -158 -71 23 238 -150 41 -289 66 60 -216 -117 135 -164 107 -242
7299 -242 151 62 57 -107 -102 120 -72 47 -136 239 1 -32 -50 -22 -150 -75 105 -153 -158 -185 -246 -9 25 -3 147
7324 147 161 187 48 -17 124 215 -136 -255 -22 -38 -2 -39 -243 -112 -10 0 53 32 -33 -79 -21 -195 193 -111
7348 -111 278 -239 214 413 79 -13 71 25 -38 18 108 -160 99 241 -63 -63 30 -113 -149 -137 14 231 189 -66
7372 -66 -67 -244 7 -126 51 21 103 71 -56 -122 -262 168 314 156 39 51 9 -40 50 -225 113 -53 -34 -130
7396 -130 -274 -62 -224 -3 47 -77 -77 113 13 255 -7 201 47 146 108 239 96 -43 -117 346 165 68
7418 68 -108 40 73 -34 16 18 -6 59 -52 -86 176 -312 -124 -242 -76 23 233 243 135 -165 -198 -292 -25 -48
7442 -48 264 -25 -25 40 -59 30 -132 23 -130 70 4 147 1 -88 -66 132 -27 301 39 -23 38 106 189 -44
7466 -44 220 -41 -243 -1 25 -57 22 105 -143 89 -21 61 177 -5 57 195 -70 183 128 -255 44 132 236
7489 236 -116 -189 21 -22 -173 -110 27 166 -109 -75 135 44 -157 -16 -78 56 -27 -118 -58 -130 -17 81 146 59
7513 59 243 -122 11 96 -23 126 12 129 169 109 -95 -416 3 27 81 -27 307 235 68 -86 95 73 195
7536 195 -91 -156 -166 -162 83 -14 -43 -28 -153 -11 30 -21 175 -31 -103 168 -25 -168 62 -210 -7 -22 77 -65
7560 -65 -111 -98 -13 99 -172 18 -220 -161 137 -7 -102 -185 18 46 -37 29 85 230 290 3 12 314 -216 265 0
7585 0 -1 -72 97 115 -130 -42 -159 259 -124 203 -156 149 188 57 -36 59 46 6 66 31 -23 -63 -199 -151 -44 -365
7611 -365 123 -132 108 -118 -52 -124 -52 -222 71 -96 -78 53 140 10 190 140 -15 61 114 -97 -17 201 23
7634 23 -126 -28 181 -166 -145 192 -125 -86 39 -51 -83 -99 33 -11 152 172 27 63 127 -12 22 -227 5 24
7658 24 7 63 -41 -21 129 35 128 12 283 28 -186 -102 -64 -65 66 156 249 73 39 151 -255 -194 124 84 91 68
7684 68 -39 -48 -62 148 -18 -85 -75 163 96 -58 183 116 -101 28 -64 222 39 -21 -77 329 254 192 -45 4 111
7709 111 247 -200 -81 -77 88 -264 -54 -122 214 27 -142 -29 144 175 121 -111 -11 -143 43 25 -105 9
7731 9 -25 -5 -21 -11 -182 -191 -60 165 -86 45 -53 91 82 125 -27 157 226 -49 31 187 -247 -147 -46 -7 -108
7756 -108 -306 25 106 -81 -38 -74 8 -45 113 -127 231 64 -331 240 -190 -85 -35 -54 -37 -119 169 -141 -191
7779 -191 -145 21 -17 326 204 15 13 -183 24 -21 20 133 67 -154 -138 -186 65 154 -6 85 -74 83 -85 -56
7803 -56 94 19 -162 77 84 43 -117 137 -283 -256 10 -8 -6 -233 -129 143 -21 -7 -185 36 136 -308 -75
7826 -75 -16 24 73 -65 -192 -122 68 97 55 -205 52 265 132 67 -173 -288 23 -81 21 -68 105 269 -14
7849 -14 355 -96 -95 -43 -105 -19 58 -72 -125 93 30 -125 223 -107 -162 109 -266 291 -218 11 105 -17 128 -213
7873 -213 100 -165 21 43 -247 12 -420 79 53 -119 -87 -65 -178 -84 58 -158 -33 -109 -169 373 -118 -65 -196
7896 -196 15 -32 11 -21 5 31 -160 256 165 43 -104 26 318 151 -49 -307 -41 42 154 70 33 120 274
7919 274 37 -141 -63 -81 33 223 148 -78 202 100 26 243 54 -92 351 -78 248 120 14 -66 -132 248
7941 248 93 -13 71 4 198 78 296 256 215 100 143 39 5 182 -20 150 -105 62 -138 -87 -54 -7 -17
7964 -17 37 -96 -177 -20 4 51 75 -18 -114 259 7 42 76 71 188 174 92 -178 214 82 88 -136 -124 194 -151 221
7990 221 -93 -118 202 -116 -143 -217 29 155 274 152 174 56 -327 -109 -96 71 283 -76 -71 3 62 94 126 -165
8014 -165 -28 -121 -41 99 123 202 5 148 -217 262 -94 -54 -81 54 -77 -21 -19 -213 -54 -114 257 -305 203
8037 203 29 20 64 74 212 27 260 55 176 -219 146 233 -48 82 -68 70 -4 50 117 140 -289 174 -17
8060 -17 214 -6 189 -242 -186 206 -157 -223 -7 157 71 25 78 -8 -92 -84 61 41 42 -102 117 275 -81 -154 -41
8085 -41 13 71 -223 106 -49 123 -195 -4 -20 128 21 -57 21 -184 -21 -75 -49 101 67 -97 220 -276 119
8108 119 -18 -70 -132 -79 47 -220 2 -29 30 309 -33 -76 -132 -73 8 96 60 -209 -2 98 -60 62 48 -91
8132 -91 9 -8 164 44 -60 -79 -185 115 -26 29 64 7 -89 2 -168 38 -93 -272 188 -10 34 -53 -40 8
8156 8 -146 78 -66 -199 60 20 53 162 91 102 38 -172 -76 -56 84 -2 -77 -178 416 -128 -43 155 -97 60
8180 60 145 -88 193 46 199 -68 104 194 51 -18 -49
8191d9
$$ Imaginary data points
##PAGE= N=2
##DATA TABLE= (X++(I..I)), XYDATA
0 0 0 0 0 0 0 0 0 0 0 0 0 0 0 0 32 -32 32 -32 32 -64 64 -64 96 -96 128 -128 160 -192 220 -240 286 -320 353
33 353 -410 449 -513 577 -641 712 -800 893 -990 1093 -1213 1341 -1479 1633 -1797 1982
49 1982 -2185 2405 -2650 2922 -3226 3566 -3951 4389 -4899 5486 -6187 7032 -8077 9408
63 9408 -11164 13600 -17220 23176 -34691 65288 -315752 -823073 -167603 238565 100914
74 100914 -139828 68473 196920 18037 -62341 295339 490387 164351 -187346 18884
84 18884 347215 220035 -129191 -109098 84273 -21227 -264996 -164216 70066 -52651
94 -52651 -365032 -285076 94888 171963 -147165 -310913 -106731 79708 17033 -17429 113512
105 113512 127101 -81066 -147369 93958 269825 108249 -94379 -30436 124628 105095 25701
116 25701 78971 136951 26050 -94328 146 170639 127014 -72184 -128011 -8795 45645
127 45645 -32817 -83782 -64988 -91592 -153681 -123256 -28851 -24382 -108795 -129077 -47525 15195
139 15195 4751 2137 47404 72294 52777 63672 122264 138366 85253 58533 94473 111076
151 111076 69010 28410 9327 -27029 -63628 -44685 -2906 -28349 -109474 -140103 -93106 -53314
163 -53314 -66130 -73809 -40568 -22019 -40856 -31092 29711 62314 31462 14417 48243 65084
175 65084 33385 23232 63409 77739 30712 -5416 18214 38415 -3101 -46864 -18430 35019
187 35019 26815 -23545 -35695 -13220 -12511 -22946 -5096 13030 -11482 -41993 -26489 4857 -1662
200 -1662 -28538 -25009 -4351 -13221 -38440 -27065 15021 28007 3578 -4603 18364 30264 20316
213 20316 20997 35264 36921 31969 39636 38191 7649 -17116 -719 22526 2580 -39202 -43448
226 -43448 -17239 -18826 -49218 -49286 -15718 -9481 -37503 -38748 -2334 14456 793 7933 35911
239 35911 30862 541 9334 54722 57344 5293 -16126 26350 49522 1194 -41292 -10759 25160
252 25160 -8020 -51177 -26941 13813 -7594 -46228 -26046 16130 5502 -28460 -11487 28984
264 28984 16123 -24909 -8540 45720 38328 -24932 -31123 30601 48299 -8838 -35546 7982
276 7982 32068 -8737 -33797 4823 33199 -3302 -39614 -10593 29979 12254 -23943 -10189
288 -10189 20333 1556 -28911 -3454 37189 12577 -39541 -27995 26413 32097 -12687 -27756
300 -27756 4672 20376 -2988 -13256 11851 22204 -6964 -22919 5172 25943 3531 -18245
312 -18245 -2372 11835 -5716 -17626 4417 19113 -4535 -29663 -13425 20345 19161 -9635
324 -9635 -17694 2594 12984 2379 458 12347 8950 -8153 -6387 11282 12786 -2577 -8906
337 -8906 -1744 -2217 -9903 -7371 5395 5761 -13249 -24308 -7109 15580 11815 -7616 -11618 -174
351 -174 7543 9465 10843 7064 -1470 -1690 6999 11234 6305 -483 -1375 -463 -3314 -7711 -3501 5209
367 5209 545 -15417 -18259 -2221 9662 3321 -9271 -12209 -5206 5982 11003 5537 -2987 -3488
381 -3488 2221 7543 9273 5078 185 315 2627 600 -1430 2630 5363 -1428 -9227 -7407 1486
396 1486 6981 2203 -8391 -12077 -1970 8070 4454 -5593 -7090 -1024 4792 4869 -182 -3362 -2
411 -2 5348 4378 -272 -1332 1432 3534 3135 -849 -5202 -2122 4840 4387 -3386 -6806 -2488 2387 1271
428 1271 -2343 -4317 -1408 2675 116 -4312 -1924 4500 4254 -1997 -4686 -874 4505 6039 2138
443 2138 -2823 -2929 947 3762 4273 1910 -3391 -5563 1173 8089 3415 -5634 -5042 2907 3840 -2253
459 -2253 -4151 1489 3580 -4097 -9994 -2039 7611 2472 -9199 -8393 1294 2579 -1531 -125 2333
474 2333 -2847 -6838 2672 13608 8301 -6998 -6864 9804 16174 1987 -7470 3637 12824 1946
488 1946 -8774 222 9053 -79 -12314 -7244 3432 -223 -10683 -9288 -1303 -4509 -12481 -6007
502 -6007 7205 2632 -13135 -9559 10935 14870 -2351 -8581 7737 18203 7522 -2730 5751
515 5751 16329 9708 -2991 -1099 8547 5698 -3665 -3467 2002 -4335 -13064 -8033 346 -6791 -18586
530 -18586 -13178 1950 2967 -10828 -14816 -1426 8847 2402 -5230 2543 13323 11289 4339 6296
544 6296 11907 10695 6588 5920 6504 3982 2723 4220 3093 -3372 -9273 -7353 -2033 -3966 -11719 -12216
560 -12216 -4908 -1682 -7639 -12325 -8127 -1486 746 -1635 -3661 -135 6592 8714 3938 282 3281
575 3281 8381 9668 8176 5235 4635 5805 6251 3608 1352 437 398 648 289 -3686 -6367 -3294 -1327
592 -1327 -7441 -13580 -9395 -913 -613 -7163 -9989 -5649 -662 19 -1683 -1892 578 3286 7532 10680
608 10680 8270 1393 1990 9498 10962 4711 3052 7671 6383 -1912 -3626 2160 2762 -5836 -11845
623 -11845 -6761 171 -1604 -6981 -5794 -4633 -9377 -9749 1122 6796 -3891 -10110 2712 14287
637 14287 4938 -9132 -4354 9135 8305 -2250 258 10645 8319 -5220 -5043 9370 9938 -6079
651 -6079 -7747 8741 12603 -3204 -7007 7588 8580 -10802 -16567 3318 14445 -4116 -21154
664 -21154 -7381 10515 -555 -21336 -13652 7316 3092 -13440 -5333 13931 7552 -11347 -3710
677 -3710 19419 16860 -5310 -4937 19268 23123 -469 -9329 11165 17803 -8086 -21694 1194
690 1194 18255 -3298 -24986 -12045 6596 -4950 -21862 -10893 7902 385 -14915 -5141 14709
703 14709 7565 -12577 -4528 20825 18415 -7990 -9511 16235 22433 -1392 -12119 4971 12156
716 12156 -5574 -14696 2255 13590 -1836 -17208 -7151 6635 -1138 -12590 -3036 10254 1013
729 1013 -12089 -1839 12970 3704 -13465 -6720 12379 10421 -7791 -10221 5750 11286 -1123
742 -1123 -7855 394 4210 -3365 -3793 8073 11004 -1791 -8352 891 6918 -762 -3704 4003 7052
757 7052 -4569 -10816 -214 9175 1157 -11916 -9286 1901 3732 -2481 -2265 1550 -893 -4134
771 -4134 734 6287 1993 -3667 1376 8666 5921 -2558 -3585 2287 2927 -1972 -2460 3288 3379 -4735
787 -4735 -7510 -219 4584 800 -3823 -3438 -1688 -387 2943 5899 2343 -4196 -5566 520 5629
802 5629 2959 -2216 -2200 879 -314 -3164 -2199 683 764 -1242 -2398 -1007 1513 3133 1101 -988
818 -988 -34 2858 4377 1602 -400 808 2537 2706 827 -1491 -3004 -3941 -1908 1691 1264 -4605
834 -4605 -7585 -1964 2719 -707 -4920 -385 4708 1625 -3876 25 7645 6614 -1634 -3585 3763
849 3763 6535 151 -2466 2722 3003 -4138 -5740 2317 3629 -5890 -8217 1640 6834 -3169 -10732
864 -10732 -1889 8783 3506 -7249 -3200 8321 5883 -5453 -3435 8170 7135 -4899 -5181 5058
878 5058 5235 -4554 -4808 4746 4834 -7149 -9733 3282 9132 -2873 -11252 -297 10228 824 -10301
893 -10301 -2306 9804 3717 -7346 -2502 8279 4800 -5866 -4014 5816 5525 -4363 -4412 4715 4262
908 4262 -6319 -6329 6326 7903 -6123 -11696 912 8835 307 -7302 -1317 5370 220 -6250 -464
923 -464 6918 3009 -5186 -2801 5724 4085 -2592 -1284 4923 1515 -5511 -1960 6930 4039 -6499
938 -6499 -7536 1918 6376 -135 -6524 -3799 987 -232 -1951 1579 3093 -2223 -5005 1045 5824
953 5824 2645 -1618 -16 2517 842 -307 3164 4606 144 -5598 -2953 4211 4913 -2003 -6500
968 -6500 -3047 673 217 -287 -415 -2473 -4689 -1519 3137 2380 -1544 -2312 247 2055 1374 766 2486
985 2486 3073 -315 -2035 1610 5016 2451 -2556 -2395 110 1574 902 -637 -2164 -3088 -1601 1162
1001 1162 1489 -1021 -3806 -2353 1328 1796 -894 -1705 428 1495 -369 -1104 829 2099 914 -596
1017 -596 -879 598 1892 1218 -410 -722 -397 164 627 539 -723 -1655 185 1819 534 -1762 -1294 528
1035 528 1755 360 -1622 -1297 1399 1888 -479 -2313 -779 1063 867 -445 -1500 -899 -520 112 222
1052 222 -299 -417 -242 124 444 515 -40 629 1925 852 -679 396 2444 2456 -119 -1659 -310 1984
1070 1984 1617 -1034 -2558 -994 713 -40 -1402 -1732 -1528 -1234 -581 -181 -455 -1043 -177 821 118 -244
1088 -244 326 1776 2463 1110 -583 685 2928 2194 -546 -1493 312 1357 589 -1304 -1768 -1428 -545
1105 -545 -405 -1186 -1697 -1435 -888 -413 -109 -570 -698 69 1316 841 44 464 1568 2154 815 -218 -113
1124 -113 1459 1531 -671 -1158 14 1043 -40 -1827 -1599 -337 42 -689 -1081 -739 -191 21 433 612
1142 612 -415 -1270 363 2182 1679 -792 -655 1390 1628 -559 -1403 -22 1262 207 -1813 -1686 533
1159 533 710 -828 -2105 -1067 -426 -31 794 1176 -491 -1888 67 2311 1974 -553 -704 873 2557
1176 2557 1118 -277 507 1080 -365 -2379 -623 1604 881 -1724 -2690 -1580 -459 353 -670 -1148
1192 -1148 -2093 -1787 395 2478 1809 -1609 -2512 727 3296 1608 2 1126 2175 1082 -11 286
1208 286 1462 1262 -990 -2281 -405 1601 329 -1782 -2504 -2830 -2210 -380 1275 58 -2912 -2589
1224 -2589 872 2277 527 -1729 -1089 1865 2344 563 259 2190 2110 -777 -1467 1058 2369 774
1240 774 -665 -497 -21 -427 -665 -499 -947 -2025 -2238 332 2151 415 -2741 -1834 1632 707 -1929
1257 -1929 -1050 2146 2263 -818 -1720 591 2171 552 -1442 -427 1028 610 -61 1434 1405 -1156 -2584
1274 -2584 221 3027 486 -2099 -302 2614 1565 -1570 -1772 870 1060 -2019 -2498 1079 2535 -633
1290 -633 -3088 -1046 484 -844 -1011 1204 1435 -1096 -1604 1760 3288 220 -2647 -772 2908 2404
1306 2404 -730 -299 2614 1578 -1941 -1836 1289 1649 -1181 -1771 648 863 -897 -1183 26 -317 -2350
1323 -2350 -1852 1335 2346 -1025 -3181 -308 2196 396 -2178 -273 1714 936 -498 661 2096
1338 2096 777 -971 -136 1576 1189 288 927 2028 268 -1942 -1117 1674 824 -2942 -2694 120 809
1355 809 -1782 -2625 -1152 -537 -1608 -1686 352 1352 41 32 1450 2230 360 286 2568 3038 601 -328
1373 -328 2119 3297 409 -3000 -1700 856 389 -2063 -2412 -919 -869 -2398 -1777 -72 -436 -2101 -1173
1390 -1173 1680 1760 -214 164 2320 2456 -198 -810 1909 3138 289 -1805 -120 1885 484 -2187
1406 -2187 -1793 582 48 -1169 -798 516 139 -1239 -544 1080 883 -411 -452 1327 1784 -505 -1419
1423 -1419 272 1684 -399 -2230 -822 1348 182 -2139 -2045 -29 1262 156 -1008 -290 1129 943
1439 943 443 1200 1743 258 -625 860 1854 871 -1177 -680 964 508 -1925 -2394 -217 987 -921
1456 -921 -2479 -337 1719 -31 -2584 -1023 1569 1909 -234 -807 741 1034 -31 40 1647 982 -1977
1473 -1977 -2619 1253 2772 -287 -2467 -480 1780 -141 -2406 -24 2716 975 -2120 -1319 2563
1488 2563 2390 -1375 -2601 460 1311 -929 -1254 396 438 -2508 -2397 1395 2465 -1496 -3272 -101
1504 -101 3147 1915 -1478 -28 2650 1621 -1378 -358 3051 2106 -1517 -2259 1022 1675 -1132 -2051
1520 -2051 -422 -334 -2038 -1761 893 1561 -1394 -2731 512 3285 768 -2171 -122 2654 1526 -1240
1536 -1240 -228 2128 724 -1663 -1781 -27 41 -1333 -1853 -73 -132 -1631 -1220 961 990 -1147 -1064 1817
1554 1817 2611 138 -531 1268 2944 1129 -748 32 1300 574 -973 -1033 -562 -886 -1430 -879 -229 -1766
1572 -1766 -2799 -775 849 -11 -1141 -811 1087 856 34 379 1314 1300 61 -220 1214 1896 537
1589 537 -329 -324 -212 -273 -88 474 -278 -1697 -914 934 783 -731 -2010 -508 772 812 -539 -604 78
1608 78 125 -425 115 734 111 -1077 -264 807 638 103 340 707 638 -216 350 1711 1374 -278 -1186 448
1628 448 1797 715 -1173 -1238 -37 -179 -715 -740 -740 -1057 -1105 -854 -179 -50 -1083 -524 434 751 -220 51
1648 51 1040 1137 65 -470 800 1327 463 -717 -414 587 807 -32 -1127 -629 -137 -79 -138 28 2 -541
1668 -541 -149 509 351 -217 -277 213 648 96 -783 -452 511 332 -956 -1213 216 894 -252 -1191 -519
1687 -519 523 717 109 135 551 1006 571 559 935 722 203 579 1087 326 -851 -644 340 46 -1318 -1399
1707 -1399 -857 174 -939 -1728 -1047 117 367 -546 -495 512 874 504 706 955 580 402 1162 1550 751
1726 751 -282 -210 715 731 -682 -1115 -207 174 -680 -1401 -829 -135 -462 -1132 -1105 -367 86 -200 -70 232
1746 232 110 295 556 611 418 -3 238 1142 1472 -48 -458 344 603 -5 -604 -338 343 89 -612 -1121
1766 -1121 -658 -206 -312 -469 -538 -183 -305 -13 96 -267 -610 140 507 409 93 35 710 1038 346 -290 -324
1787 -324 394 991 78 -364 -115 170 59 -138 -445 -207 -468 -51 -299 -58 -51 -161 -368 -38 -179 -558 -75
1808 -75 581 214 -104 -394 98 266 60 -591 -262 589 960 266 -281 128 312 -91 -6 384 450 -16 -39
1829 -39 232 -126 -425 -442 -214 189 -645 -840 -99 586 104 -1268 -906 385 746 -225 -699 119 736 436
1849 436 -5 28 667 171 -289 35 877 677 17 193 528 -168 -660 -58 509 -129 -1130 -809 68 585
1869 585 -390 -1710 -1090 223 206 -683 -452 529 537 -444 -48 320 648 54 330 1003 843 563 289 656
1889 656 642 -355 -783 632 1175 -264 -1852 -998 388 83 -1412 -1652 -444 -63 -589 -830 -394 123
1907 123 -796 -766 332 1078 285 156 1241 1581 322 105 658 1682 740 -385 176 1255 1144 -481
1925 -481 -1412 -308 -23 -973 -1424 -722 -271 -653 -1062 -850 -115 -583 -977 -206 564 131 -249 772 1532
1944 1532 902 104 188 1601 1726 372 74 782 1133 108 -647 -444 -163 -377 -909 -551 -642 -804 -1331
1963 -1331 -950 -897 -989 -746 -109 375 25 -328 254 1194 1142 433 303 546 1206 1394 713 248 516 307 91
1984 91 -176 -178 -162 -9 -287 -578 -925 -604 -358 -574 -1008 -822 57 95 -228 -318 -923 -17 319 385 286 -87 -24
2007 -24 234 655 472 -87 16 517 763 325 535 603 837 334 -401 0 191 153 -455 -368 -171 -224 -468 -711
2029 -711 -355 -908 -956 -501 -30 -595 -660 -676 137 415 -65 55 500 1288 833 525 880 1541 1019 325 -21
2050 -21 124 507 -73 -212 -724 -281 -659 -633 -493 -763 -1412 -1312 -326 193 -406 -1001 -645 291 548 14 48
2071 48 645 777 581 163 400 1184 795 4 58 516 413 0 75 -129 -54 -405 -201 39 -455 -878 -600
2092 -600 266 567 -624 -1213 -410 237 275 -639 -256 370 -12 -578 98 621 610 20 218 693 692 302 360
2113 360 710 436 -50 -239 779 838 -509 -1182 -297 761 -76 -1168 -1133 -356 68 -431 -534 270 113
2132 113 -278 -442 696 1079 392 384 878 570 6 -298 764 716 -461 -986 -103 565 -240 -1173 -758 321
2152 321 40 -914 -560 198 408 -75 -143 646 536 174 326 567 183 -122 31 633 608 -712 -1093 84
2172 84 569 -534 -911 -835 36 -117 -499 -295 450 145 -78 228 424 546 195 646 606 507 189 428 964
2193 964 130 -969 -658 548 372 -517 -492 -473 -27 -198 -583 -78 9 -555 -244 26 298 181 -100 429
2213 429 280 -103 -191 437 698 23 -676 86 633 406 -376 -500 278 442 180 15 206 169 -211 -172 218
2234 218 314 -239 -399 6 160 -440 -436 -114 228 -559 -557 -222 673 378 -146 -75 242 434 262 197 442 228
2256 228 231 74 182 -23 -155 -85 222 270 -505 -569 -449 188 -435 -685 -205 326 107 -355 -292 365 553 285
2278 285 -27 380 274 109 178 114 82 -97 -32 170 -12 -264 -258 -186 -85 -35 -393 -389 7 275 25 -305 279
2301 279 395 324 -106 -325 262 -13 -56 -243 -153 16 -287 -284 -180 -174 -418 -181 242 -109 -126 48 359 669 122
2324 122 172 257 587 397 90 -164 291 196 -201 -496 -509 -162 -198 -179 -370 -78 -440 -88 294 -40 -174 -58
2346 -58 109 644 380 -211 469 527 416 100 -159 326 373 -25 -80 87 26 11 -122 -328 -631 -313 -192 -426
2368 -426 -326 -378 7 316 -20 -209 -130 -66 78 206 -102 159 181 349 116 275 -18 17 270 91 125 -280
2390 -280 -234 189 207 -368 -634 29 -75 44 -517 -538 -184 -197 -111 -117 2 2 -115 177 -19 410 251 3 387
2413 387 218 49 -108 351 295 -127 -659 -56 33 210 -405 -531 -176 110 -261 -328 -457 -11 -202 -429 217
2434 217 -371 -61 -85 217 204 72 -98 211 114 31 -204 4 182 378 -137 -343 -155 426 -354 -285 -130 111
2456 111 282 -18 -78 35 -81 135 157 178 -7 -102 146 236 4 46 108 451 168 -68 -169 -134 -178 -7 -52
2479 -52 -109 184 294 -127 -234 166 -8 -71 -133 -100 328 319 106 -90 -21 71 -24 100 385 -142 -214 -26 372 96
2503 96 -217 -453 -167 242 68 -142 -134 -128 -118 -125 -241 -4 2 -99 -64 400 476 306 50 -73 -15 -234 63 370
2527 370 120 -119 -158 -133 -11 57 -427 -397 -16 242 -68 -165 -227 -21 -99 -143 112 -17 458 138 261 400 54
2550 54 123 -2 -34 41 42 -223 265 301 -193 -416 -119 127 -183 -461 -318 375 201 -11 -161 -113 411 51 -47
2573 -47 28 179 37 206 155 178 37 -212 82 -55 -90 5 75 361 -277 -500 -274 94 136 -193 -6 152 204
2596 204 -42 -57 -264 268 82 130 219 554 19 -178 123 15 -159 -305 -146 65 60 -236 -372 106 -311 -504
2618 -504 -299 -152 298 202 -54 -25 -139 195 5 119 121 79 231 393 -78 -124 -391 105 8 -98 -233 174
2640 174 72 135 -91 -498 -1 34 137 -332 -320 121 408 399 70 94 -33 205 -2 321 -83 -68 197 345
2662 345 -163 -173 -119 -153 159 -229 -285 -133 -16 -112 -363 -284 -14 -148 -57 -76 -41 -90 332 52 216 0 192
2685 192 299 174 126 126 184 94 138 125 -16 -101 -15 -139 -241 74 -211 -42 -316 -281 -219 -48 -82 84 80 -44 3
2710 3 94 149 2 -173 172 32 216 32 -142 71 -67 120 13 176 -80 6 -7 95 170 22 -10 -220 44
2733 44 83 -225 177 226 -113 60 89 153 -197 -26 -207 179 -9 99 -192 -71 194 -3 102 -98 -36 35
2755 35 -21 244 220 -6 -84 207 -11 -115 -102 -31 73 174 -214 -62 95 146 121 39 23 -130 186 178 -34 -220
2779 -220 -214 -74 -198 -243 -207 -274 -100 358 -117 -181 -84 251 -127 -70 -186 27 79 63 -134 162 260 -13 59 5
2803 5 -96 -70 -118 83 -2 -95 -126 50 117 -14 -96 233 218 -95 -65 -117 -74 2 -42 21 23 -136 -54 10 118 -205 -217
2830 -217 100 255 -357 -256 67 25 170 -76 -303 -61 218 31 83 90 24 41 163 -38 146 -90 -157 163
2852 163 260 65 -97 65 -87 -5 -196 -147 365 -8 52 -12 6 -136 -40 -232 255 413 244 257 -25 101 4
2875 4 -117 98 158 205 -98 1 117 -153 -125 -40 170 129 -264 -260 -72 -120 -156 -104 141 28 75 -163 -38 -48 76
2900 76 195 -98 -39 -26 -53 179 222 25 24 -37 -34 49 -82 -213 28 242 174 -89 -272 7 279 -218 114 -282
2924 -282 218 158 107 63 -259 -160 74 -28 -33 -290 -247 322 9 116 -112 295 199 2 -157 -284 187 53 58
2947 58 -113 -118 147 -193 -23 -111 73 177 -17 97 104 11 41 90 -71 101 345 15 -133 52 -212 -110 -16
2970 -16 133 121 -92 -10 -178 -110 -31 121 -229 -284 143 -152 148 -284 -16 101 2 218 -141 -23 36 -66 -144
2993 -144 117 68 28 -214 -253 25 -192 -315 -262 -201 -123 204 -49 -47 166 74 -33 329 -85 45 390 34 226
3016 226 59 43 -57 61 51 -20 192 -340 122 -48 -49 -190 -309 -171 3 101 183 -43 -251 190 204 -138 -84
3039 -84 40 -6 151 27 210 136 64 -231 -29 -45 -156 -258 39 -98 26 -51 -76 -43 -239 -3 192 208 58
3062 58 -174 145 44 169 -133 7 14 -11 102 -20 76 49 255 121 121 22 -103 76 -185 85 5 -227 -203 106
3086 106 -120 -168 -65 -24 79 -4 -175 -19 244 113 -162 -265 12 30 124 -129 106 16 115 213 17 42 -49
3109 -49 -40 -28 7 -265 134 -48 -148 -132 -56 11 119 -72 -229 -257 240 26 213 54 -94 -98 -10 -8 45 17 -107
3134 -107 -85 190 -104 -122 -405 -109 92 155 -151 -88 255 173 -352 12 -116 138 81 -35 55 -24 215 26 -199
3157 -199 -295 -15 -143 104 -230 26 91 -20 81 53 -41 319 99 12 43 87 141 247 -15 -88 101 -102 -28
3180 -28 77 57 -85 -46 -78 -65 -92 -261 -18 -48 -35 -5 -268 48 155 109 11 -41 47 158 3 80 279 217 101
3205 101 186 -259 -35 -227 -28 -218 -202 -18 -63 -318 -145 -40 -280 -7 76 -199 288 -248 -93 161 -78
3226 -78 96 -110 -38 -86 -298 -71 -165 -96 -110 -111 42 -76 -142 -66 21 -247 -188 -5 -88 -38 21 29 6 49 4 -37 -145
3253 -145 151 17 101 125 -97 236 211 -10 -107 192 25 118 57 -76 152 -220 -128 170 231 -273 -54 61 102
3276 102 24 18 -92 -113 49 226 -312 35 -98 112 30 39 -57 61 -54 93 275 -71 -243 40 -81 49 -41
3299 -41 112 64 -24 -121 -41 -89 -153 -66 -40 61 158 -98 148 215 -97 1 -39 -27 173 -147 -27 -102 -133 -208 -240 -42
3325 -42 0 -238 -31 31 -116 -63 113 71 -153 349 -92 107 -142 -112 -278 119 154 -94 -149 58 11 -149 -167
3348 -167 54 -185 25 41 16 -137 -101 -79 0 -33 19 -54 7 110 151 278 180 75 15 34 30 -28 -108 -29 -59 14 299
3375 299 -14 -72 15 -6 69 47 -143 -44 61 -8 111 36 245 -238 -121 -55 -278 -87 89 7 -225 -42 57 -62
3399 -62 -233 61 38 -103 -237 -33 -14 -263 -225 -23 -246 -192 -231 199 39 -2 -43 6 -26 -210 -79 -121 350 -3
3423 -3 -215 150 186 -65 59 -82 118 -134 31 -201 -52 30 33 69 -81 142 234 -111 -245 -20 184 22 275
3446 275 11 -61 67 16 -104 -102 270 9 258 -174 -122 -383 -167 -108 138 90 -72 -111 -27 -53 54 -55 -53 -103
3470 -103 -19 106 17 -65 -238 127 -50 -66 -113 -56 10 38 -53 180 137 95 -218 -45 -198 76 -104 -188 -151 -48
3494 -48 -222 250 186 -118 -213 83 -87 -107 207 198 86 272 30 -40 -5 -69 -43 -68 220 -24 -56 98 95 165 102
3519 102 9 100 -67 -265 51 90 124 -30 79 46 66 -231 -55 -19 -263 -217 -228 -50 -79 -17 206 -221 -61 101
3543 101 -164 -145 -10 34 30 -2 -161 76 83 0 -246 20 -23 46 -91 -85 -84 -115 -163 -100 286 -120 19 -104 112 -72
3569 -72 37 47 50 -259 156 -321 -370 81 -280 -15 -102 116 173 152 -122 264 -84 216 -68 -27 88 201 54
3592 54 42 -301 185 -193 -38 -92 -4 -115 57 -36 -32 -76 91 43 152 -113 -91 -25 -146 -89 6 141 -118 117
3616 117 35 -62 -186 -33 183 195 -109 46 -2 -10 12 -141 20 30 -331 -2 -226 17 83 113 -237 211 -50
3639 -50 55 -56 49 68 259 -57 51 23 -74 101 -345 -2 213 74 152 -111 -100 97 42 -181 -82 -180 -334
3662 -334 55 151 163 -22 -260 117 5 12 -127 -110 46 352 -196 227 -130 193 208 -36 -13 70 -35 127 160
3685 160 -5 10 -220 -59 84 21 71 -116 114 -55 -89 331 54 80 -81 -112 46 -206 27 216 -15 267
3707 267 -53 -8 -165 -104 -61 -75 143 177 -48 10 94 82 -230 184 82 -16 -19 99 85 -50 -56 -5 -5 -17 212 152
3733 152 -134 -89 -167 54 27 109 142 -114 -60 172 -139 81 16 -229 -63 113 124 -104 -48 -156 26 -242 -278
3756 -278 -67 -97 -3 14 153 21 -149 45 39 -241 -46 137 134 13 144 -48 -282 -116 -88 -158 53 114 11
3779 11 211 -47 -28 -100 -19 -118 118 -9 262 -220 83 -18 27 -18 -56 103 31 103 86 222 43 -23 -139 -302
3803 -302 -109 25 -22 285 -267 -118 -118 -84 -16 -285 -164 68 -159 -176 -53 -28 -184 -4 -96 -54 -273 -165 212
3826 212 105 217 254 112 -39 62 3 48 283 -81 -254 139 93 221 6 -163 -232 -76 10 37 51 17 -66
3849 -66 123 -158 -9 -319 -58 -2 -234 -12 86 301 46 41 115 15 97 -96 -107 150 -24 -159 -57 -142 157
3872 157 -34 -59 185 -22 8 83 93 215 18 -232 -112 -191 96 -64 -24 -46 132 301 142 -58 78 34 335
3895 335 43 140 221 97 96 6 -326 22 -32 -30 11 -100 -90 58 110 233 -52 -145 72 -87 -239 -132 -27 -24 -45
3920 -45 -21 51 4 -21 -170 43 18 -60 -191 30 109 -46 -129 36 32 -131 102 -301 -135 -62 126 83 -380 -222
3944 -222 93 81 -203 64 -72 134 69 -100 -110 -161 141 -77 81 -18 25 113 -41 -25 -162 -114 -6 30 -38 -105
3968 -105 -30 -12 7 -52 30 -150 -130 -1 -182 -403 -105 -56 -123 -161 -66 -16 93 211 203 122 47 69 104 157 156 85 294
3995 294 52 -94 -233 -147 -38 -146 -211 64 -102 -6 -14 61 -126 137 188 -40 12 172 -114 66 -49 -106 -114 -509
4019 -509 125 -107 83 -43 83 -85 165 220 40 192 1 -209 -192 -47 228 -2 -153 167 27 172 59
4040 59 38 120 -259 -95 104 158 -11 -78 69 181 41 -28 -43 -51 53 90 -88 -122 -85 44 211 -84 63 137
4064 137 -332 25 -73 87 19 86 -230 162 178 -78 -29 -5 -12 -310 94 -118 44 -10 -64 131 -33 22 -21 31
4088 31 -139 110 14 -179 359 24 73 19 -108 186 81 181 167 -210 -88 -218 88 -69 119 58 -117 -237
4110 -237 74 58 -161 121 11 -80 -67 -196 -79 -20 -202 -53 -7 -114 149 156 2 -173 29 -99 -27 122 141
4133 141 -7 -21 -159 -83 44 -130 -45 -105 212 97 -123 -254 -76 114 -58 31 -126 104 -97 -78 232 232 39
4156 39 42 -178 -68 -174 -94 47 -186 108 100 148 -230 264 -186 57 197 -80 -108 -20 64 173 164 -239 93 149
4180 149 95 101 204 -146 112 -46 85 -110 133 16 212 -42 -42 -159 100 177 159 33 55 -30 12 41 291 159
4204 159 -97 275 -158 -68 232 27 -115 7 21 -5 -43 -13 -35 -96 36 116 -73 -140 -122 5 -15 210 -171 62
4228 62 286 -155 168 70 139 197 -100 26 -38 134 -52 -124 -139 109 -78 74 -414 -66 0 121 156 -213 -133
4251 -133 -242 129 -214 -114 103 -55 -22 153 -38 -67 -2 119 144 126 50 -67 117 -447 -58 -137 -296 56
4273 56 46 0 -21 -42 -190 -135 -267 139 -200 -32 41 63 -46 -30 77 -146 9 166 25 106 101 -30 -21 134 -268
4298 -268 38 -47 -73 71 38 62 50 -69 -53 -46 -90 261 90 -37 30 189 4 112 44 -41 -37 -98 -102 70 -110 -80
4324 -80 -28 -145 45 -35 -99 -143 -31 100 -143 -73 149 -287 -294 -136 316 33 88 67 28 -232 82 191 124 -5
4348 -5 -76 14 182 -232 13 11 103 -91 -189 245 -195 -148 -111 -162 -155 180 -168 231 -95 10 -57 99 58 -91 38
4373 38 -94 -133 -2 -10 -84 148 -32 -159 90 -82 -42 78 -97 93 -66 102 -33 153 -31 -15 306 -62
4395 -62 160 164 348 -27 161 25 5 -23 -92 -42 178 38 -8 -13 -143 110 28 -80 -150 110 -129 -211 13 -23 114
4420 114 -172 195 -165 -104 81 24 -28 -70 -126 -40 -90 -46 192 -233 39 77 -154 -46 113 -52 -61 -141 352 0
4444 0 177 -94 -163 42 92 118 158 11 115 40 135 -97 -136 -12 200 96 11 -49 60 31 262 -231 -241 -50
4468 -50 -114 -175 -183 14 80 25 218 -156 -132 89 95 177 -136 43 38 -52 131 2 120 -133 27 -81 -153 144 166
4493 166 88 177 -83 -124 -79 92 266 -84 -127 28 -66 -16 191 95 -49 -160 95 66 109 -68 163 -92 155
4516 155 18 -56 155 -42 -45 -62 116 -18 -107 29 220 -98 22 146 40 -16 16 236 78 -171 110 -150
4538 -150 105 -16 -155 -207 133 -236 -5 228 38 -33 -68 116 -100 -63 -6 32 155 10 16 117 180 -31 92
4561 92 100 29 -41 -48 102 185 19 190 144 167 132 103 60 -215 155 -173 -141 107 -256 -202 -158 -172 86 81 62 64 72 30
4589 30 211 56 -50 -71 -60 -163 -29 -180 266 -22 8 -115 255 44 -74 -16 -194 67 1 -314 -73 -78 171
4612 171 -26 -145 -72 -122 -239 160 103 33 186 -234 -128 156 -109 -83 -50 -37 49 -159 -142 14 -63 111 -328
4635 -328 -37 -166 75 76 -352 -29 -195 130 99 -140 -400 31 -233 -222 27 141 56 -103 -32 -23 -17 -199 -289 -136
4659 -136 -198 112 -65 -36 97 -147 -126 15 -5 -110 268 202 160 81 105 61 224 72 210 110 59 -92 3 26
4683 26 127 -21 2 -59 116 31 86 -3 -325 -150 -128 -256 -28 196 163 -7 187 47 18 211 128 -45 154
4706 154 -217 -310 -11 -156 135 -54 -300 138 96 71 219 -59 -143 -53 -182 -117 73 -141 251 115 -147 -6
4728 -6 -217 264 -38 -22 -32 76 94 112 -318 -143 89 129 -73 117 149 59 -332 -79 62 -27 -212 -88 321
4751 321 -84 201 -167 -264 39 -98 50 170 79 24 49 48 -57 -80 30 -207 -227 308 -16 -130 103 -201 -79
4774 -79 -81 130 -139 121 -98 84 168 59 72 -109 219 -102 -112 110 46 4 -102 -268 -76 20 -253 -104 -2
4797 -2 111 -107 48 -292 -302 -7 105 66 31 49 -45 -76 110 54 121 -74 -42 98 -78 -60 -149 84 -261 -134
4821 -134 -38 238 -309 -140 121 -141 57 32 20 123 -22 -33 91 -105 -31 25 169 68 78 -137 -158 231 -75
4844 -75 -61 -145 156 -73 31 -299 16 17 44 -241 -65 191 -232 152 68 -113 23 -138 154 136 -179 -167 404
4867 404 -128 92 -29 -32 -67 -78 -107 -133 130 -17 24 125 174 -365 -181 154 117 75 112 10 30 -86 -78 -218 -88
4892 -88 -111 -50 -128 -29 147 -179 62 0 -33 -312 210 132 -118 -80 -194 -41 -19 -89 -97 -96 -77 -245 -236 140 66 38 -224
4919 -224 122 180 -43 245 -1 255 -38 -97 -145 64 46 -118 109 -96 92 -4 80 26 120 -22 -231 -167 -73
4942 -73 77 116 -128 65 -44 -172 88 108 8 154 248 363 149 67 3 -32 -18 21 -69 15 -77 125 60 -12 -133
4967 -133 111 113 -156 -257 224 -2 -97 -7 -71 239 -62 -109 113 -2 60 -49 120 78 134 201 -33 -8 -167 -32
4991 -32 478 -175 150 -24 -171 -233 157 -6 -218 310 155 -105 -149 -115 -390 -42 -14 5 -69 62 -285 -24
5013 -24 -62 101 167 221 6 89 64 -189 -112 -36 -42 14 -3 211 142 -96 65 -209 -238 169 -18 24 -233 274 -133
5038 -133 -23 121 -78 193 -11 29 -25 -183 175 17 -127 -4 -3 -147 -46 113 -1 -117 -149 42 18 -290
5060 -290 69 3 -201 -74 -68 27 -262 -112 -147 167 -318 -283 -32 -162 -36 -120 -84 -83 115 16 70 -17 200 -5
5084 -5 -28 99 32 -157 -168 -159 83 122 -245 -46 -187 245 21 -138 51 18 -129 -96 127 -135 -99 -94 72 -72
5108 -72 -53 -110 -118 -90 8 -127 103 273 -42 359 -95 -48 -129 16 160 9 -57 3 -76 -341 -115 31 157 143
5132 143 48 -71 -2 -32 345 78 -128 103 -132 326 157 -272 -157 2 -104 30 -79 -101 55 -40 162 -67
5154 -67 151 -46 -215 153 43 -26 -97 104 151 90 -25 -136 -62 90 37 -133 133 -44 312 -12 -80 46 7
5177 7 195 62 -12 60 -83 -31 -114 -227 -87 63 -220 9 19 150 258 77 -137 345 185 60 122 -231 130
5200 130 -136 204 -99 80 70 19 -62 113 -240 88 239 71 -48 81 23 128 36 -209 29 28 -200 -28
5222 -28 91 -24 -134 -173 87 -245 -17 103 83 -95 -265 136 123 127 -66 -205 24 35 -51 55 68 -280 -113
5245 -113 163 108 184 -47 44 211 30 17 63 -16 -47 -17 -38 -116 -168 66 91 -40 -215 -191 -6 -188 -27 -130
5269 -130 131 -135 -11 262 124 -18 224 7 26 62 -50 137 99 -28 -63 -16 167 -163 -44 -57 -86 56
5291 56 11 -210 97 -191 -186 -61 -109 223 -255 -5 8 -58 -41 24 -42 -4 -169 -68 -112 -7 139 -67 196 -76
5315 -76 -211 -21 -21 177 -303 -80 -63 298 -195 -11 99 -74 286 224 23 83 35 162 -59 297 -66 115
5337 115 233 188 -261 94 87 89 169 84 -53 73 -28 -3 12 -86 -136 57 1 23 242 -180 3 -96 -15 121 -100
5362 -100 -150 205 25 172 -117 29 65 25 23 5 88 58 -319 54 56 -22 -105 17 78 -66 50 -124 -39 225 196
5387 196 210 269 -18 351 132 -139 -85 84 128 -120 293 -130 318 307 72 213 -98 23 71 46 210 1
5409 1 260 -126 68 98 228 76 286 111 41 116 -241 -21 215 -50 -2 -21 -63 120 172 -127 -166 100 -25
5432 -25 -36 15 -102 104 354 125 -278 -2 -54 -171 289 8 21 -22 -124 -147 -31 66 135 55 -35 48 -116 -49
5456 -49 80 356 227 -135 -14 22 -218 86 -33 75 324 -72 128 -247 -26 121 -116 -110 -40 4 232 227 -45
5479 -45 27 -3 -273 17 116 112 -120 -80 84 52 107 170 272 -153 92 300 387 221 180 -233 127 178 -9 -30 199
5504 199 186 121 -188 -90 -27 -156 14 26 -80 104 141 -99 70 -155 66 -110 32 -171 -1 -52 105 248
5526 248 -28 -128 -37 -97 -199 37 -39 -193 146 1 -62 -106 -109 -188 -394 189 32 31 33 -43 -96 -115 -124 24 283 304
5552 304 108 -263 -10 184 32 -131 235 86 -174 -108 144 -170 -23 -1 99 32 -92 192 75 -158 119
5573 119 -195 131 -194 4 1 29 94 -80 78 14 -19 -113 129 -40 19 -17 29 99 27 24 -150 170 113 -115 191
5598 191 88 -45 -74 27 -148 -18 83 90 6 -109 157 163 147 165 26 67 -146 182 -74 -274 -132 -164 153
5621 153 4 -79 176 88 -105 -32 -57 7 240 -47 -167 -147 -22 -159 -117 271 -18 21 -100 -296 183 299 -300
5644 -300 118 101 -282 205 -117 -41 -163 -43 211 205 -80 31 251 -1 -42 -98 -57 -88 -33 -311 156 18 -226
5667 -226 101 -256 -50 63 -76 402 -307 -117 -76 25 -61 52 -85 -262 24 244 57 -63 -11 -205 -150
5688 -150 -104 50 93 302 15 16 6 18 31 -247 -84 -59 3 71 -129 24 -74 22 31 64 -25 28 -46 45 -250 -65
5714 -65 -190 144 87 -99 88 -75 317 71 -45 60 126 -158 -71 -24 -191 175 -175 51 73 97 7 34 -31
5737 -31 106 212 -6 31 -67 -88 -106 283 111 161 -154 120 -97 114 -34 -193 19 91 149 7 -11 271 128
5760 128 -200 -42 217 150 54 -238 -259 63 -107 -130 -205 312 -54 59 -122 -25 -54 -172 -150 85 -77 -18 -247
5783 -247 -59 -163 50 -385 84 42 -3 -18 -291 73 33 -94 -2 -56 -47 63 60 99 -20 148 -131 61 -75 237
5807 237 77 231 226 -17 23 178 327 -21 -286 -168 -39 -84 -76 178 -87 -39 -121 58 -231 175 51 -28 -23 111
5831 111 7 -84 -132 -33 -111 16 16 69 250 54 295 217 -30 124 -12 295 143 -257 77 -140 -16 -61 -28
5854 -28 38 158 7 57 -20 130 22 48 -61 -288 -112 111 18 152 164 11 107 -252 246 6 19 -110 48
5877 48 -151 -100 -156 -40 -120 -170 -51 207 -41 -134 204 -42 -15 354 -430 -184 25 -147 -64 73 -31 9 73
5900 73 91 -64 -71 31 -109 134 -64 226 -240 52 -35 169 185 201 10 162 -220 147 -67 -33 276 -97 -73
5923 -73 -42 246 -56 -1 188 -262 -192 -74 -72 64 123 12 16 -87 -62 -91 -54 -254 102 6 3 214 63 -26 80
5948 80 225 379 -17 -48 -34 231 -253 -164 118 236 87 191 -228 -102 72 -88 115 -41 -33 -41 -135 -43 81
5971 81 -23 114 -219 -60 -214 201 -150 55 280 -136 -107 -54 -46 45 20 175 -97 86 189 -22 -171 19
5993 19 47 -225 -97 -122 142 100 17 110 -61 12 -222 26 32 -14 172 -45 11 -35 -58 -31 74 67 -125 -184 78 105
6019 105 -115 -110 143 -99 -83 251 210 -9 -33 -19 -184 197 102 19 -159 -77 -151 -141 -35 -44 -125 -179 16 3 -171
6044 -171 172 30 -160 -17 -40 -187 -137 40 -123 -67 177 109 122 162 -39 73 69 -10 93 -89 -57 -38 -210 -202
6068 -202 163 -63 -128 109 179 61 38 234 -141 -33 69 30 -28 131 -477 186 -7 -221 23 -76 91 -14
6090 -14 -55 -51 -50 -8 102 238 313 -84 -34 57 201 151 139 186 -77 153 -66 -108 -107 95 -41 53 -156 272 261 -35
6116 -35 -23 19 -118 -196 228 15 -41 -130 -49 147 201 113 -64 97 47 -326 130 -24 -66 -165 -8 -56 -118 -99 304
6141 304 -117 -70 176 10 -15 -58 -280 -70 58 -85 101 -26 116 85 -4 11 260 220 -39 102 -62 70
6163 70 138 200 62 -66 -127 -79 -120 72 -24 129 28 -38 -194 50 -164 -60 146 -59 37 -114 -209 5 182
6186 182 -43 20 -110 -114 -41 -111 85 -98 -148 -66 -185 -146 -28 3 -4 -208 213 -64 192 193 -43 -210 -97 13
6210 13 99 220 49 -21 138 -93 -11 98 172 -88 33 -72 -36 107 31 164 -110 69 -237 -346 -70 128
6232 128 101 -107 268 219 222 -14 -227 55 16 124 261 -291 87 169 123 -62 -24 56 65 82 180 -146 153 -84
6256 -84 120 -140 -245 56 7 4 105 187 40 -23 264 208 61 182 40 -39 96 0 205 -29 -221 -157 -64 -65
6280 -65 -62 222 321 44 -89 32 -78 224 -255 115 -18 -68 -44 126 3 267 -46 170 224 -55 -1 -262 39
6303 39 -206 -3 51 -177 116 77 -89 42 -194 206 11 102 238 -43 -44 71 80 79 244 -16 29 211 11 -34
6327 -34 20 204 212 36 -13 -130 -146 -126 89 393 239 121 119 142 126 109 -52 -18 90 -207 -4 -103 180 -171 -164
6352 -164 6 -41 -213 -191 137 -257 -57 -111 168 -76 11 80 193 -58 -6 391 150 125 24 -14 111 172 104
6375 104 -33 -282 -30 363 22 -90 14 38 74 -42 -103 202 -290 13 21 -170 253 50 -121 -104 -113 50 256
6398 256 213 -272 -35 137 -47 137 -94 116 -14 -116 113 -53 -7 6 -109 -95 -14 -113 71 222 333 -166
6420 -166 13 -96 -76 33 49 -68 36 70 -215 200 84 -234 145 71 -108 -89 -93 48 -81 43 -165 -146 -43
6443 -43 -199 44 -54 60 -116 -29 17 -227 210 -62 22 -115 -288 204 107 -29 20 300 -164 -6 -78 74 -113
6466 -113 5 -54 27 -137 -177 74 -19 -131 281 173 72 -109 49 120 -88 88 -178 -34 -1 -45 237 63
6488 63 -4 21 -35 13 -521 -154 57 178 143 -130 -34 -153 -119 202 -241 -81 9 200 28 129 19 -169 -58
6511 -58 -45 54 -176 -32 316 129 158 -194 -121 -36 41 -145 -113 -21 61 -9 -124 -23 -101 186 87 163 -92 87 33
6536 33 -98 -29 -105 155 -98 -152 -89 -175 55 49 -74 245 -9 -66 -171 18 80 -36 52 -84 -40 -38 -57 111 -9
6561 -9 105 0 69 -140 143 119 140 156 -91 -52 -149 71 50 -29 -15 -51 21 45 138 23 57 -29 2 110 6 46
6587 46 -269 -79 156 -79 98 45 -94 16 -2 36 4 36 161 47 -31 -84 -199 114 7 177 -142 -158 -113
6610 -113 175 132 -150 -165 148 -188 152 47 -50 -165 -210 -224 -50 134 25 85 130 -38 68 84 -79 166 116
6633 116 -8 110 -112 255 33 25 217 -78 -4 -241 -239 17 71 -105 62 54 46 334 57 -56 -79 -223 48 -29
6657 -29 -251 -183 -111 -12 128 -60 -44 -118 -79 13 -156 -61 -1 241 -133 -15 92 -229 -12 25 -97 32 -81 -194
6681 -194 110 133 53 103 -99 -63 184 63 -21 -16 -142 248 -172 -51 -78 -183 156 72 -148 109 93 -176 -63
6704 -63 180 -37 245 96 152 42 -324 -140 -150 114 196 214 -257 44 -16 150 82 32 -116 35 7 173 -54
6727 -54 -353 -172 -42 -79 -45 -245 -238 -98 -135 60 -100 179 65 -52 -75 -4 156 -2 212 -232 -105 -322 -240
6750 -240 94 -355 98 -77 -34 -256 20 -82 -221 -88 -245 -69 -189 231 -143 -176 -47 1 212 99 -122
6771 -122 14 -103 242 39 107 58 48 -61 -103 -61 4 -149 -96 126 -80 93 3 -349 -190 57 71 -22 220
6794 220 -204 37 161 -90 -106 -138 -68 -107 -11 106 1 34 -105 121 20 17 14 -105 -169 75 81 -42 66 130 285
6819 285 255 14 23 -115 55 -10 131 128 18 -146 -158 55 -49 75 -119 -93 -349 -180 51 -227 -30 -70 -56
6842 -56 310 -21 44 115 132 96 -7 -153 171 72 168 148 34 -241 143 104 -74 211 -103 -39 -102 217 26 -6
6866 -6 -149 -70 -223 177 -37 -135 -63 -179 107 28 -156 -36 37 -108 179 17 73 -57 -204 10 114 55 54 58
6890 58 203 -181 -81 123 211 -10 135 163 -47 -138 -227 44 -139 -175 -157 -17 -43 -31 -180 -162 -62 -59 -5 -21 58
6915 58 262 180 -28 -197 70 22 -124 -177 214 26 245 -104 50 20 132 -155 -34 53 47 -92 54 94 9
6938 9 -130 83 -23 45 210 98 102 101 47 116 -38 24 94 -117 44 49 133 -130 92 -50 -30 -35 103 127 -171 -64
6964 -64 -9 -22 7 -223 -214 -311 -63 -135 -18 291 257 -62 -103 2 -95 196 4 58 137 58 -264 -32 -285 28 -17
6989 -17 -122 133 67 88 42 -105 198 -29 -90 -87 -205 110 -142 51 -79 -28 55 361 120 -117 17 -154 132
7012 132 -41 235 -47 88 -151 77 -165 151 -100 -12 -93 17 19 -149 -259 -204 138 -50 235 -82 -79 -270
7034 -270 3 134 133 -134 -63 53 124 71 14 120 -154 205 -131 -33 -80 101 -149 341 103 -137 -169 -151 153
7057 153 -68 -52 -44 134 -65 -140 56 -246 127 17 -2 -49 31 -113 161 -116 27 18 92 -270 -109 -67 -117 83
7081 83 289 5 86 -112 110 -45 -180 67 -101 126 15 -186 -41 -130 -51 87 -65 10 -222 52 121 -121
7103 -121 79 187 17 -154 74 -204 107 27 -149 -179 -161 -85 -143 -244 18 -189 46 210 135 -158 -129 -44 93
7126 93 97 -68 -40 -149 -4 22 53 136 48 123 -74 27 -19 -69 15 -98 -160 48 -92 92 90 166 153 -127 -113 -150
7152 -150 -68 -124 28 -100 -76 110 40 -142 89 104 295 -47 170 -51 25 -19 44 -23 -161 3 74 190 12
7175 12 38 41 -16 -232 -166 103 200 132 -229 -326 80 -233 31 94 212 -99 52 -7 15 -78 -91 -114 -213 101 -102
7200 -102 22 -159 -50 267 -309 87 -266 1 -104 -306 45 -129 -46 187 -91 30 131 56 -28 34 49 -11
7222 -11 -20 193 80 69 -38 56 84 162 168 162 -129 56 25 -154 136 -179 -38 48 -103 -231 -167 -208 102 -106 57
7247 57 -32 -41 11 -40 82 79 83 -85 107 192 -29 156 0 -21 217 55 129 -131 -120 171 -28 77 -138 -27 45
7272 45 51 224 355 169 254 -18 200 -35 -137 107 76 30 -66 226 38 -153 204 -196 -57 131 201 -50 -111
7295 -111 -58 47 -228 131 52 54 61 117 210 84 -60 86 -62 114 228 130 318 13 -63 0 209 -96 176 43
7319 43 38 -148 -20 -165 19 -103 30 -34 48 130 -54 -53 -136 -68 65 172 -22 -161 -7 -276 42 69 -60 21
7343 21 126 -75 309 259 -304 68 93 58 -43 159 18 -59 153 149 55 186 105 8 -56 201 89 243 -56 158
7367 158 -74 190 52 -116 171 67 50 -70 226 -161 7 -133 143 -20 -45 -159 259 -94 -93 -133 115 75
7389 75 -118 -162 154 150 104 -30 109 -77 -36 40 10 69 -240 57 10 -56 2 22 -7 -191 109 147 -49 185 -26
7414 -26 141 -23 135 82 -319 79 -12 -183 -74 5 -246 -138 -22 95 -76 -145 48 175 -214 -97 -39 -173
7436 -173 -122 56 82 -80 -292 -40 7 -138 1 35 -5 -118 -36 31 134 12 41 -85 -188 -242 -42 -22 42 260
7460 260 38 85 170 26 -67 -43 -52 61 -257 -169 -180 -107 -192 56 -59 -14 -137 -49 88 -87 -157 -139 38 -101 -154
7485 -154 -91 -65 -13 21 -92 -138 255 -191 197 -174 -72 22 -82 123 -137 -118 -78 -62 204 29 43 -113 -95 10
7509 10 127 324 126 76 27 38 -75 -132 -63 52 28 186 -261 93 -114 84 -341 -144 -16 84 33 71 5
7532 5 156 235 -163 -27 7 147 29 -139 204 -150 -47 -69 -139 -85 25 -206 -38 43 -178 16 64 152 78 -147
7556 -147 -64 91 1 -30 40 -112 44 -237 230 -71 68 -12 -349 -104 184 -31 139 213 206 118 120 104 -94 204
7580 204 116 -159 174 -30 -53 -106 -91 158 183 -108 74 -29 61 -85 -364 -176 -159 -162 -96 -7 177 -73 -28 -41
7604 -41 -48 82 -244 -57 65 -11 6 122 71 -125 200 -174 35 43 -289 -259 48 -29 117 129 -157 39 96 27
7628 27 76 113 -138 -81 -327 120 117 -126 -82 -9 -25 -42 19 -92 2 100 -29 9 -84 53 -305 48 -102 -66 209
7653 209 -65 35 65 368 76 -45 58 11 -1 -4 64 25 -272 -303 -80 -96 116 161 -413 72 28 -251 -128 -100
7677 -100 -124 -87 41 -81 -182 16 101 126 -85 -105 125 5 124 -145 33 -37 44 -49 -48 -45 165 15 -28 4 114
7702 114 -132 -127 -35 -115 -41 86 -94 4 21 -226 202 -25 101 -44 185 -97 -2 -42 -51 152 143 139 -93 -49 -123 14
7728 14 -113 -55 -33 41 -102 -13 83 126 -106 -61 -57 102 84 -175 116 -124 61 -36 -131 17 113 -110 -25 33 -233
7753 -233 33 20 -35 -277 144 90 -225 50 -159 -83 119 -71 -87 44 -54 -90 107 -159 -120 -26 -223 -141 114
7776 114 -261 84 -171 91 82 -65 14 30 185 -90 102 80 -37 -27 -5 141 -230 23 231 -26 -48 64 -142
7799 -142 32 101 -57 57 43 225 183 -379 -152 143 262 -99 133 -44 74 -168 -55 -85 134 231 103 -143
7821 -143 -61 197 -48 -185 3 71 74 405 27 80 -76 214 226 -164 109 -47 -52 144 170 -46 -152 -57 -311
7844 -311 154 -20 -94 -7 -7 -2 -213 -221 266 96 37 73 76 -75 -161 137 -19 -38 -25 5 87 210 92 -36 -216 -53
7870 -53 -119 -279 -65 -21 -46 -55 -151 -25 -140 272 35 -141 -54 -5 -160 47 111 -79 -177 -84 -1 48 -97 36 34
7895 34 329 30 116 183 -107 122 57 139 85 122 -165 61 -23 180 50 -78 -121 -104 113 148 -60 122 80 -167
7919 -167 -2 7 170 109 115 81 26 -130 -95 -32 95 111 -138 50 183 -42 -4 380 120 214 96 67 8 -13 -161
7944 -161 -6 -1 -128 -161 -16 -52 -89 -215 -131 -35 175 171 -36 59 -232 173 -95 7 110 88 110 64 -165 -24
7968 -24 -1 -162 63 -85 -277 -31 178 170 205 -265 -29 -20 -100 55 9 77 16 -169 164 107 -33 -27 37 -33 42 -260
7994 -260 19 38 148 -26 -70 -77 42 254 18 118 -116 -85 -33 -8 -203 -135 -68 -8 134 48 24 120 29 277 341
8019 341 -86 -260 -88 -65 -285 22 92 -50 -336 -82 -80 175 97 -101 1 147 297 -67 197 31 200 168
8041 168 -66 181 -66 -91 70 -47 -87 294 -141 61 -273 114 -84 182 -258 56 147 102 -12 -12 -9 182 -46
8064 -46 74 151 -120 78 -174 10 22 22 132 65 -25 -123 34 202 -111 128 208 58 -36 -215 206 118 -17 20
8088 20 -303 283 17 -44 -53 165 -146 -234 48 -95 -111 -1 -142 161 -224 78 246 -36 49 -205 274 51
8110 51 4 -19 50 33 254 -175 -192 -85 134 -107 130 -47 107 104 134 223 -12 190 -148 -185 166 89 193 198 -119
8135 -119 140 83 115 -186 -38 -130 238 -28 -6 21 68 155 -18 -188 -11 -199 37 -47 132 -67 127 143 25
8158 25 41 -421 -8 -178 126 307 54 -62 156 116 -133 277 85 -91 -286 -242 6 -35 33 239 136 -105
8180 -105 -169 -23 -125 46 -120 -24 -147 248 -128 -343 107
8191A07
##END NTUPLES=NMR FID
##END=
