##TITLE=1H ikalashn
5152
16.10.2024
##JCAMPDX= 6.0         $$ Bruker NMR JCAMP-DX V2.0
##DATA TYPE= NMR FID
##DATA CLASS= NTUPLES
##ORIGIN= UXNMR, Bruker Analytische Messtechnik GmbH
##OWNER= root
$$ TOPSPIN		Version 1.3
$$ 2024-10-16 16:18:36.890 +0400  Irina@DPX200
$$ Compression mode = diff/dup
##.OBSERVE FREQUENCY= 200.131392401
##.OBSERVE NUCLEUS= ^1H
##.DELAY= (6, 6)
##.ACQUISITION MODE= SIMULTANEOUS
##.ACQUISITION SCHEME= undefined
##.AVERAGES= 16
##.DIGITISER RES= 18
##SPECTROMETER/DATA SYSTEM= spect
##.PULSE SEQUENCE= zg
##.SOLVENT NAME= CDCl3
##.SHIFT REFERENCE= INTERNAL, CDCl3, 1, 17.95386
##AUDIT TRAIL= $$ (NUMBER, WHEN, WHO, WHERE, WHAT)
$$ ##TITLE= Audit trail, TOPSPIN		Version 1.3
$$ ##JCAMPDX= 5.01
$$ ##ORIGIN= Bruker BioSpin GmbH
$$ ##OWNER= Irina
$$ $$ F:/spectra/data/iren/nmr/1H/4/audita.txt
$$ ##AUDIT TRAIL=  $$ (NUMBER, WHEN, WHO, WHERE, VERSION, WHAT)
(   1,<2024-10-16 16:17:51.234 +0400>,<Irina>,<DPX200>,<TOPSPIN 1.3>,
      <created by zg
	started at 2024-10-16 16:16:43.062 +0400,
	POWCHK disabled, PULCHK disabled
       configuration hash MD5:
       BE 6D 3F 07 2A EA 11 49 91 17 2B D3 AF B3 58 0D
       data hash MD5: 16K
       01 00 B1 0C 2C 62 E9 CE DE 2E 33 09 1B B7 19 EC>)
$$ ##END=
$$ 
$$ $$ hash MD5
$$ $$ 62 04 94 34 F8 0D 5B 60 E3 11 13 40 FD 23 F5 CA
##$RELAX= 
##$RELAX= 
##$RELAX= 
##$RELAX= 
##$RELAX= 
##$RELAX= 
##$RELAX= 
##$RELAX= 
##$RELAX= 
$$ Bruker specific parameters
$$ --------------------------
##$DU= <F:/spectra>
##$EXPNO= 4
##$NAME= <1H>
##$PROCNO= 1
##$TYPE= <nmr>
##$USER= <iren>
##$AMP= (0..31)
100 100 100 100 100 100 100 100 100 100 100 100 100 100 100 100 100 100 
100 100 100 100 100 100 100 100 100 100 100 100 100 100 
##$ANAVPT= -1
##$AQSEQ= 0
##$AQ_mod= 1
##$AUNM= <au_zg>
##$AUTOPOS= <>
##$BF1= 200.13
##$BF2= 200.13
##$BF3= 200.13
##$BF4= 200.13
##$BF5= 200.13
##$BF6= 200.13
##$BF7= 200.13
##$BF8= 200.13
##$BYTORDA= 1
##$CFDGTYP= 0
##$CFRGTYP= 5
##$CHEMSTR= <none>
##$CNST= (0..63)
1 1 145 1 1 1 1 1 1 1 1 1 1 1 1 1 1 1 1 1 1 1 1 1 1 1 1 1 1 1 1 1 1 1 
1 1 1 1 1 1 1 1 1 1 1 1 1 1 1 1 1 1 1 1 1 1 1 1 1 1 1 1 1 1 
##$CPDPRG= <>
##$CPDPRG1= <>
##$CPDPRG2= <>
##$CPDPRG3= <>
##$CPDPRG4= <mlev>
##$CPDPRG5= <mlev>
##$CPDPRG6= <mlev>
##$CPDPRG7= <mlev>
##$CPDPRG8= <mlev>
##$CPDPRGB= <>
##$CPDPRGT= <>
##$D= (0..63)
0 2 0 0 0 0 0 0 0 0.06 0 0.03 0 0 0 0 0.0002 0 0 0 0 0 0 0 0 0 0 0 0 0 
0 0 0 0 0 0 0 0 0 0 0 0 0 0 0 0 0 0 0 0 0 0 0 0 0 0 0 0 0 0 0 0 0 0 
##$DATE= 1729081067
##$DBL= (0..7)
120 120 120 120 120 120 120 120 
##$DBP= (0..7)
150 150 150 150 150 150 150 150 
##$DBP07= 0
##$DBPNAM0= <>
##$DBPNAM1= <>
##$DBPNAM2= <>
##$DBPNAM3= <>
##$DBPNAM4= <>
##$DBPNAM5= <>
##$DBPNAM6= <>
##$DBPNAM7= <>
##$DBPOAL= (0..7)
0.5 0.5 0.5 0.5 0.5 0.5 0.5 0.5 
##$DBPOFFS= (0..7)
0 0 0 0 0 0 0 0 
##$DE= 6
##$DECBNUC= <off>
##$DECIM= 32
##$DECNUC= <off>
##$DECSTAT= 4
##$DIGMOD= 1
##$DIGTYP= 9
##$DL= (0..7)
0 120 120 120 120 120 120 120 
##$DP= (0..7)
150 150 150 150 150 150 150 150 
##$DP07= 0
##$DPNAME0= <>
$$ [...]
##$SW= 21.9925939549014
##$SWIBOX= (0..15)
0 0 2 0 0 0 0 0 0 0 0 0 0 0 0 0 
##$SW_h= 4401.40845070422
##$TD= 16384
##$TD0= 1
##$TE= 300
##$TE2= 300
##$TE3= 300
##$TEG= 300
##$TL= (0..7)
0 120 120 120 120 120 120 120 
##$TP= (0..7)
150 150 150 150 150 150 150 150 
##$TP07= 0
##$TPNAME0= <>
##$TPNAME1= <>
##$TPNAME2= <>
##$TPNAME3= <>
##$TPNAME4= <>
##$TPNAME5= <>
##$TPNAME6= <>
##$TPNAME7= <>
##$TPOAL= (0..7)
0.5 0.5 0.5 0.5 0.5 0.5 0.5 0.5 
##$TPOFFS= (0..7)
0 0 0 0 0 0 0 0 
##$TUNHIN= 0
##$TUNHOUT= 0
##$TUNXOUT= 0
##$USERA1= <user>
##$USERA2= <user>
##$USERA3= <user>
##$USERA4= <user>
##$USERA5= <user>
##$V9= 5
##$VALIST= <valist>
##$VCLIST= <CCCCCCCCCCCCCCC>
##$VD= 0
##$VDLIST= <DDDDDDDDDDDDDDD>
##$VPLIST= <PPPPPPPPPPPPPPP>
##$VTLIST= <TTTTTTTTTTTTTTT>
##$WBST= 1024
##$WBSW= 25
##$XGAIN= (0..3)
0 0 0 0 
##$XL= 0
##$YL= 0
##$YMAX_a= 759876
##$YMIN_a= -1374873
##$ZGOPTNS= <>
##$ZL1= 120
##$ZL2= 120
##$ZL3= 120
##$ZL4= 120
##$ABSF1= 10
##$ABSF2= 0
##$ABSG= 5
##$ABSL= 3
##$ALPHA= 0
##$AQORDER= 0
##$ASSFAC= 0
##$ASSFACI= 0
##$ASSFACX= 0
##$ASSWID= 0
##$AUNMP= <proc_1d>
##$AXLEFT= 0
##$AXRIGHT= 0
##$AXTYPE= 0
##$AXUNIT= <>
##$AZFE= 0.1
##$AZFW= 0.1
##$BCFW= 1
##$BC_mod= 2
##$BYTORDP= 1
##$COROFFS= 0
##$CY= 7568.61572265625
##$DATMOD= 1
##$DC= 2
##$DFILT= <>
##$DTYPP= 0
##$F1P= 17.9538593292236
##$F2P= -4.03888763876832
##$FCOR= 0.5
##$FTSIZE= 32768
##$FT_mod= 4
##$GAMMA= 1
##$GB= 1
##$INTBC= 1
##$INTSCL= 1
##$ISEN= 128
##$LB= 0.02
##$LEV0= 0
##$LPBIN= 0
##$MAXI= 945.577
##$MC2= 0
##$MEAN= 0
##$ME_mod= 0
##$MI= -402.1523
##$NCOEF= 0
##$NC_proc= 0
##$NLEV= 6
##$NOISF1= 8.587773
##$NOISF2= 6.764455
##$NSP= 1
##$NTH_PI= 0
##$NZP= 0
##$OFFSET= 17.95386
##$PC= 1
##$PHC0= 318.22
##$PHC1= 6.50494
##$PH_mod= 0
##$PKNL= yes
##$PPARMOD= 0
##$PPDIAG= 0
##$PPIPTYP= 0
##$PPMPNUM= 100
##$PPRESOL= 1
##$PSCAL= 0
##$PSIGN= 0
##$REVERSE= no
##$SF= 200.13
##$SI= 32768
##$SIGF1= 18.5376
##$SIGF2= -6.396296
##$SINO= 400
##$SIOLD= 32768
##$SREGLST= <1H.CDCl3>
##$SSB= 3
##$STSI= 0
##$STSR= 0
##$SW_p= 4401.40845070423
##$SYMM= 0
##$S_DEV= 0
##$TDeff= 0
##$TDoff= 0
##$TI= <>
##$TILT= no
##$TM1= 0
##$TM2= 0
##$TOPLEV= 0
##$USERP1= <user>
##$USERP2= <user>
##$USERP3= <user>
##$USERP4= <user>
##$USERP5= <user>
##$WDW= 1
##$XDIM= 8192
##$YMAX_p= 0
##$YMIN_p= 0
$$ End of Bruker specific parameters
$$ ---------------------------------
##NTUPLES= NMR FID
##VAR_NAME=  TIME,          FID/REAL,        FID/IMAG
##SYMBOL=    X,             R,               I
##VAR_TYPE=  INDEPENDENT,   DEPENDENT,       DEPENDENT
##VAR_FORM=  AFFN,          ASDF,            ASDF
##VAR_DIM=   8192,          8192,            8192
##UNITS=     SECONDS,       ARBITRARY UNITS, ARBITRARY UNITS
##FACTOR=    0.0002272,     1,               1
##FIRST=     0,             0,               0
##LAST=      1.8609952,     6,               -2
##MIN=       0,             -1374873,        -1374873
##MAX=       1.8609952,     759876,          759876
$$ Real data points
##PAGE= N=1
##DATA TABLE= (X++(R..R)), XYDATA
0 0 0 0 0 0 0 0 0 0 0 0 -16 16 -16 32 -32 48 -58 64 -80 97 -128 144 -176 208 -241 288 -336 385 -434 513
30 513 -577 658 -753 850 -962 1085 -1219 1363 -1524 1703 -1895 2110 -2342 2591 -2866 3171
46 3171 -3498 3859 -4251 4685 -5161 5684 -6266 6913 -7636 8450 -9371 10432 -11660
59 -11660 13100 -14828 16932 -19563 22973 -27583 34182 -44490 62915 -105970 417491 -239412
71 -239412 -1107370 -6647 564694 386685 -100612 -250931 -10477 377600 178724 14715
81 14715 69582 -145527 -291952 277033 480871 -59202 -339441 -81555 161877 364298
91 364298 122107 -491346 -386470 379722 441561 -63989 -252886 -200894 -54009 209057
101 209057 105033 -172120 -81911 -27229 -148718 119226 272397 -204858 -373825 84472
111 84472 207913 -51259 -116261 -73394 8056 121802 -13051 -118040 60172 -21388 -221893
122 -221893 130574 374244 -102943 -355686 16136 221497 125427 10378 -157229 -90580
132 -90580 216214 147639 -109651 -1506 68756 -89160 15932 181818 48586 -33675 -27190
143 -27190 -89548 91782 255549 -105633 -319869 97574 319364 23897 -182133 -149002
153 -149002 8050 202778 62146 -228293 -67163 155931 -37297 -92194 101136 -22452
163 -22452 -194224 -14063 98592 7874 -24140 -85835 -90518 102772 75678 -176154 -102782
174 -102782 94908 15847 -17944 44972 -67192 -66917 103263 15257 -116231 26415 62279
185 62279 -44553 45558 84305 -58044 -23752 64401 -21392 -5112 72841 -15912 2313 117134
197 117134 -17492 -104358 80712 82660 -77268 -976 78259 -6669 14899 36352 -55567
208 -55567 979 64878 -67022 -45497 105937 -1793 -99097 44869 43417 -79371 -19514
219 -19514 9296 -49898 32258 39444 -104959 -42629 81001 -27149 -72074 20637 -20827 -38955
231 -38955 46544 -23527 -76898 56512 33490 -98359 -2503 66518 -47206 -18669 62258
242 62258 -24779 -31054 48410 -13166 -20184 70447 -6436 -61306 69244 56102 -60930 12468
254 12468 60222 -23088 15076 48555 -45991 -584 91406 -13258 -50194 51537 8816 -36938
266 -36938 56159 23426 -62345 18197 32823 -50135 13407 42921 -64237 -18075 70716 -32738
278 -32738 -61379 37267 -6044 -48343 28201 -9476 -63671 29531 23197 -64842 4468 30320
290 30320 -67852 -15471 59174 -35392 -39246 46647 -15436 -40674 47176 -1779 -57994 39326
302 39326 34340 -49336 17496 46602 -33999 5571 44822 -36445 -4908 68497 -15659 -28543
314 -28543 68111 12131 -48236 39749 30382 -42486 20886 38970 -28428 17473 39760 -42322
326 -42322 -3219 56239 -35554 -41126 53418 2849 -43283 30646 4015 -51516 22017 19147
338 19147 -58782 -1106 34117 -40656 -11481 34711 -40381 -32166 36110 -25446 -41804 40754
350 40754 -2900 -53317 31461 22515 -57671 1564 34652 -34356 -3816 35369 -27321 -5056
362 -5056 49216 -21851 -29296 48681 -23 -37700 46038 27789 -40295 23265 38772 -32891
374 -32891 7106 43167 -23351 -2901 46814 -15633 -16529 46670 -6180 -32943 39595 10120
386 10120 -41280 26846 26353 -42949 5367 32238 -39090 -13947 36669 -22797 -25171 28843 -16426
399 -16426 -31906 27163 -9028 -43518 24663 9626 -51811 8094 30090 -42266 -15036 30591
411 30591 -24117 -17560 31250 -16357 -25336 32383 -4646 -33767 29348 12820 -35106 22627
423 22627 29755 -33214 6695 38625 -25597 -8427 44703 -7650 -17803 39934 6619 -21484
435 -21484 28719 7732 -26864 28882 23133 -31898 15479 35402 -30982 -6581 39236 -18792
447 -18792 -23392 32603 -3400 -24795 26409 1234 -35877 12600 6918 -35272 10424 19339 -37489
460 -37489 -3606 30488 -31318 -26682 26054 -15301 -30410 25063 968 -32578 14639 8271
472 8271 -31292 7606 12207 -32085 6829 32431 -23264 -8852 32329 -17540 -22083 37282 5900
485 5900 -27835 23856 20075 -18234 16082 16914 -24175 10900 29526 -18021 3891 36281 -15540
498 -15540 -13311 37425 -3755 -28692 27084 13901 -24564 17340 18038 -28110 2003 18904 -23094
511 -23094 -2400 21141 -24589 -10977 31912 -16471 -33047 21431 -1753 -35121 15513 14453
523 14453 -32014 -869 13760 -27379 -6071 16305 -23822 -8391 27111 -15042 -18976 25986
535 25986 -9013 -32601 24621 16264 -28352 10176 23432 -19473 1961 21837 -18278 -3201
547 -3201 30373 -5249 -5361 29396 -6732 -18943 31536 9787 -27385 18968 23660 -21161 8117
560 8117 27897 -18037 -8328 21025 -10149 -5309 24224 -12061 -16573 29706 -166 -33166 12233
573 12233 9224 -29835 6685 20447 -25007 -6503 19958 -21123 -18269 14730 -14404 -16039 23295
586 23295 -4332 -24488 15226 -2713 -35006 12117 19671 -26693 649 27241 -16354 -12525
598 -12525 17574 -12249 -11148 25174 -1192 -13085 26550 5483 -24638 15333 14733 -21314 12890
611 12890 28533 -16302 -1497 28111 -9314 -11715 22007 -1989 -9823 24738 2300 -18689
623 -18689 19973 9594 -26699 7591 18090 -21678 -472 24126 -14216 -11545 16810 -14672
635 -14672 -20156 17896 -1966 -20712 13531 3091 -23747 7218 4701 -31302 553 21276
647 21276 -19525 -9182 21966 -11748 -19676 12356 -6825 -15579 20273 4619 -19061 15525
659 15525 10859 -25795 2011 18699 -13841 2914 25642 -9331 -7025 23448 -5263 -15390
671 -15390 21025 6000 -13770 20021 14317 -16604 8779 13695 -19476 3358 24821 -11301
683 -11301 -7568 21521 -4224 -11929 15206 -5997 -19282 17005 7781 -20984 6033 9916 -20298
696 -20298 -151 12520 -21806 -10223 18346 -8917 -13472 13844 -7671 -19838 12018 144
708 144 -22222 7658 8738 -18548 5752 16138 -20191 -9507 16989 -6885 -7293 16879 -4041
721 -4041 -9260 20212 1042 -20015 12163 11809 -13226 12077 18917 -14517 285 20461 -9820
734 -9820 -7449 19918 -947 -7161 20275 3204 -14776 10601 3555 -15474 13265 14068 -19351
747 -19351 594 18981 -13829 -11257 13520 -7686 -11185 14662 -3087 -16600 9417 -581 -19741
760 -19741 6697 5894 -20858 1875 14333 -17311 -7773 14916 -12253 -15102 14485 -500 -13748
773 -13748 9207 1258 -12003 11702 4622 -19260 6266 15566 -13283 1593 20359 -10045 -8756
786 -8756 19683 -508 -12167 15081 7113 -7917 13504 6876 -14326 7772 11728 -12408 6585
799 6585 18685 -13436 -5406 21484 -5225 -15548 12520 2137 -11322 11939 3500 -17230 4425
812 4425 6175 -16203 2517 10570 -17723 -4334 16551 -13341 -15884 13800 -3645 -17438 10168
825 10168 3544 -17249 2833 4992 -13305 3773 6819 -17090 1192 17528 -12520 -9074 17892
838 17892 -3733 -13026 15605 4578 -14089 9924 10073 -10531 6960 11616 -10709 3677 15455
851 15455 -8803 -425 19433 -6186 -9337 19076 2072 -14915 11826 9169 -11909 6534 9180
864 9180 -12922 1775 10833 -12360 -2198 13842 -11219 -9445 15603 -5514 -17730 10123 1829
877 1829 -17608 5645 7228 -16584 -1657 7600 -13501 -3128 9499 -12885 -6188 14755 -8275
890 -8275 -14133 13370 226 -16212 9380 7591 -14024 5194 11885 -11461 270 13270 -8434
903 -8434 -2315 16189 -3836 -5664 16608 -30 -10855 15040 7387 -13235 8879 13472 -10064
916 -10064 2529 13285 -8121 -1619 13122 -6731 -5077 15509 -2969 -11892 11917 1690 -15428
929 -15428 6684 6667 -15015 1624 10125 -13394 -5380 9572 -10235 -8781 9613 -6800 -11184
942 -11184 10029 -2548 -15213 7115 2444 -16891 3578 9994 -13178 -2228 11230 -9274
954 -9274 -5446 12160 -5336 -8047 13375 1007 -9465 11189 4715 -11505 8373 10155 -10933
967 -10933 4130 15477 -6717 -1445 14907 -3677 -5642 13492 398 -7536 12464 4028 -10556
980 -10556 8725 7577 -12394 2725 10575 -10327 -1821 12395 -7933 -8147 10295 -4432 -11981
993 -11981 7795 151 -12120 5345 2250 -13968 1993 5700 -14617 -3062 9988 -9854 -7298
1006 -7298 10169 -5495 -10499 8432 -1582 -11792 7629 4398 -11001 4884 7629 -10478 1420
1019 1420 10832 -7896 -1658 13801 -3895 -5606 13930 1314 -9034 10031 5641 -7969 8370
1032 8370 8748 -8507 4693 11274 -8446 -922 12826 -5066 -4858 12615 -1500 -8842 9931
1045 9931 1462 -11697 5922 5203 -11628 1960 7366 -10759 -2514 7673 -10071 -6529 9767
1058 9767 -5915 -10677 8184 -1461 -12733 4924 2242 -12751 2219 5962 -11343 -595 9237
1071 9237 -8920 -4958 9980 -4872 -6755 10524 -451 -8429 9875 4004 -10105 6478 8499
1084 8499 -8656 3154 11113 -6345 -28 12617 -4079 -4194 12513 -176 -6821 11026 3673
1097 3673 -8540 7643 5722 -10113 4173 9442 -9297 -931 10732 -6837 -5629 9496 -4156
1110 -4156 -8704 8108 -1248 -11094 6080 2159 -12544 2223 5145 -11813 -996 7684 -10521
1123 -10521 -5614 9662 -5995 -9304 8164 -1194 -9720 6183 1535 -9837 5492 5169 -10093
1136 -10093 2806 9241 -8910 -1471 12062 -4172 -4895 11313 -218 -6623 10100 3580 -7822
1149 -7822 7067 6548 -6874 5080 8206 -7727 2010 11265 -6632 -3761 12217 -2226 -8015
1162 -8015 9262 1995 -8739 5499 3292 -9068 3181 4349 -10246 737 7699 -9488 -4274
1175 -4274 8617 -7370 -9020 8800 -1792 -11152 5412 2505 -10384 1507 3045 -9354 1059
1188 1059 5427 -8789 8 9386 -7934 -6179 10333 -2367 -8759 9105 4079 -7904 5511
1201 5511 5739 -7544 2583 7018 -5344 2644 9577 -4977 -600 11189 -3944 -6280 11358
1214 11358 2321 -8455 7719 7162 -7391 1566 5327 -6295 1087 6538 -6003 -463 8464 -6425
1228 -6425 -6171 8635 -3038 -10395 6677 2994 -10434 1854 4872 -8876 -2249 4181 -7022
1241 -7022 -2552 5052 -6247 -3078 7892 -5568 -8921 7668 163 -10827 5036 6725 -7984
1254 -7984 733 7040 -5732 -2141 5714 -3725 -160 9257 -2183 -3402 9476 -963 -8209 8220
1268 8220 5970 -7550 4728 9983 -5154 -1264 6732 -3498 -1540 7415 -1834 -1842 8449 -2085
1282 -2085 -7079 7085 1215 -10044 4224 6910 -8108 -1044 6755 -6106 -4729 4920 -4082 -5173
1296 -5173 4433 -2877 -5056 6105 -1800 -9881 3980 2527 -10777 666 7946 -6354 -3298 6863
1310 6863 -3856 -5706 4231 -1970 -3385 7628 864 -5375 6425 2195 -9158 3207 7442 -5645
1324 -5645 1729 10630 -2854 -3774 6682 -1432 -4037 7272 2190 -2723 7206 1933 -7170 4391
1338 4391 4418 -8161 1779 9308 -4787 -3135 7499 -2982 -6411 4560 -950 -5539 4896 756
1352 756 -6763 3256 1477 -9435 538 4855 -8076 -2435 7513 -4599 -6038 5592 -2069 -7428
1366 -7428 3355 361 -5802 4446 2700 -6758 2421 4091 -7946 -461 7901 -3755 -2127 8717
1380 8717 -917 -5334 5937 928 -5347 5398 4310 -3855 4689 4970 -5953 1555 6459 -5320
1394 -5320 -794 9460 -1588 -4198 7198 168 -6505 4062 1893 -5564 3737 3628 -6280 1276
1408 1276 4472 -7216 -2146 5810 -4949 -4300 6621 -2036 -7013 4228 -127 -8005 2014 2328
1422 2328 -6453 1557 3988 -6402 -784 4896 -6119 -3566 6878 -1966 -4839 6500 1010 -6004
1436 -6004 3841 2372 -5776 3038 5232 -4331 1831 6470 -4074 -1193 6722 -2536 -2825 7857 884
1451 884 -4423 6112 2855 -5969 2537 4067 -4627 1906 5564 -4125 -535 5631 -4434 -3785 5793
1466 5793 -1657 -5247 5243 751 -6512 2625 1642 -7330 315 3808 -5680 -1043 4694 -4729 -3471
1481 -3471 4376 -3649 -5338 5012 -191 -5943 3726 2051 -6235 1488 3414 -5361 400 5504 -3682
1496 -3682 -1139 6350 -2015 -3318 5710 53 -4036 5567 2719 -4447 3932 4482 -4823 1153 5654
1511 5654 -3226 -424 6073 -2018 -2004 5831 -952 -4471 4785 1159 -5114 3151 3017 -5144 846 3378
1527 3378 -5451 -1118 4523 -4056 -3301 4741 -2146 -5155 3400 -652 -5904 2492 1224 -5929 1364
1542 1364 3285 -5439 -996 4078 -4213 -2451 4782 -2127 -3397 5068 -174 -4830 3839 2098 -4664
1557 -4664 2591 3958 -3820 1488 5136 -3345 -787 5814 -1621 -2375 5933 583 -3386 4743 1902
1572 1902 -4415 3044 3388 -4195 1390 4488 -3557 -663 4684 -3068 -2632 4577 -1699 -4438 4229
1587 4229 563 -5529 1955 1786 -5527 238 2833 -4754 -1137 3783 -4040 -2985 3973 -2406 -4455
1602 -4455 3582 -196 -4834 3109 1611 -5218 1441 3258 -4582 -139 4568 -2758 -1190 5036 -1674
1617 -1674 -2384 5102 -91 -3776 4731 2514 -3948 3040 3894 -3733 1162 4741 -2962 -294 5500
1632 5500 -1587 -2055 4956 -632 -3513 4028 660 -4361 3076 2552 -4945 852 3633 -4618 -1561
1647 -1561 3745 -3208 -2594 3780 -2008 -4073 3241 -756 -5368 2130 1212 -5154 1041 2676 -4886
1662 -4886 -503 3677 -3829 -2339 4403 -1660 -3114 4006 86 -3536 3234 1137 -4072 2932 3487
1677 3487 -3808 1226 4801 -2830 -750 4855 -1493 -1962 4959 223 -2534 4339 1463 -3600 2875
1692 2875 2429 -3787 1766 3788 -3657 -61 4507 -2940 -2770 4062 -1113 -3641 3216 4 -4067
1707 -4067 2235 775 -4994 855 1871 -4744 -443 3412 -3626 -2135 3463 -2769 -3744 3256 -592
1722 -592 -4234 2604 1299 -3858 1448 1793 -4087 695 3452 -3312 -273 4867 -1661 -2282 4323 -141
1738 -141 -2869 3665 1697 -2554 3091 2657 -3134 1439 3461 -2568 318 4353 -1690 -920 4596 -970
1754 -970 -3072 3578 598 -3750 2420 1957 -3317 985 2037 -3736 -415 2535 -3514 -1738 3483
1769 3483 -2011 -3158 2749 -999 -4406 1648 407 -4233 1261 2189 -3638 -331 2117 -3492 -1313
1784 -1313 3043 -2089 -1842 4085 -598 -3427 2823 883 -3512 1910 2612 -2171 1671 3285 -2517
1799 -2517 -24 3771 -1579 -1045 4308 148 -1595 3673 829 -2990 2576 2111 -2890 1374 3247
1814 3247 -2250 58 2908 -2197 -1329 2906 -1672 -2491 3175 -22 -3542 1717 834 -3932 99 1128
1830 1128 -3572 -173 2588 -2842 -1557 2447 -2551 -3276 2159 -701 -2814 2628 824 -3537 1007
1845 1007 1377 -3583 123 2990 -1603 68 3379 -1587 -1531 3187 -686 -2252 3597 1891 -2089 2532
1861 2532 2267 -2592 862 2631 -2072 591 3875 -1159 -786 3428 -784 -2254 2815 199 -2708
1876 -2708 2496 1847 -2970 694 1935 -3100 -915 1866 -2282 -875 2794 -1793 -2540 2285 -1326
1891 -1326 -4225 1427 890 -3311 910 1741 -3171 -641 1541 -3032 -1291 2656 -1279 -1303 3036 -755
1907 -755 -2787 2184 265 -3065 2281 2746 -2168 886 2910 -1757 -418 2724 -1048 -159 3843 -248
1923 -248 -1409 3506 480 -3005 2206 2054 -2343 1462 2977 -1909 -147 2430 -1995 -1281 2495 -958
1939 -958 -1521 2693 -667 -2920 1987 172 -3876 718 1994 -3051 -563 2133 -2381 -1683 1519 -1979
1955 -1979 -2011 2065 -1059 -2520 2257 188 -3420 1243 1216 -3246 398 2793 -1945 -533 2823 -1004
1971 -1004 -1432 2225 -434 -1084 3012 624 -1726 2813 1535 -2933 1209 2882 -1775 294 3435
1986 3435 -712 -649 2405 -836 -1433 2521 200 -1675 2472 835 -2794 1211 1363 -3229 -22 2548
2002 2548 -2149 -1384 2158 -1264 -2297 1257 -996 -2243 1591 -374 -2816 1390 773 -3532 -54
2017 -54 1802 -2747 -926 2346 -1380 -1506 2124 -670 -2023 1769 66 -1851 1899 1092 -2058 1553
2033 1553 2043 -2327 171 2941 -1107 -638 3210 230 -1148 2276 383 -1508 2058 1184 -1610 1858
2049 1858 1826 -2070 415 2224 -1884 -579 2756 -948 -1625 2063 -218 -2416 1101 203 -2268 881
2065 881 666 -2544 362 1320 -2774 -1029 1909 -1739 -1952 1684 -840 -2205 1366 1 -2328 987
2081 987 640 -2406 477 1474 -1923 11 2033 -1555 -801 2539 -622 -1580 2419 781 -1668 1686
2097 1686 1297 -1402 1269 1744 -1443 818 2583 -1215 -286 2616 -509 -1126 2356 219 -1575 1802
2113 1802 841 -1920 894 1260 -2002 108 1489 -1791 -584 1749 -1508 -1515 1746 -839 -2394 1281
2129 1281 86 -2524 611 784 -2317 -52 1083 -2336 -741 1648 -1560 -1240 1905 -833 -1706 1859
2145 1859 13 -2114 1433 1117 -1923 783 1812 -1361 251 1936 -1096 -259 2418 -530 -878 2349
2161 2349 414 -1434 1834 1139 -1537 1268 1662 -1505 570 2115 -1373 -487 2118 -831 -1075 1845
2177 1845 -320 -1549 1589 152 -2284 925 784 -2377 -128 1379 -1842 -693 1331 -1669 -1434
2192 -1434 1453 -930 -1974 1497 -26 -2209 868 472 -2233 293 1258 -1924 -115 1984 -1256
2207 -1256 -813 1979 -490 -1120 1870 215 -1306 1773 983 -1487 1246 1678 -1432 509 2211 -972
2223 -972 -3 2301 -552 -753 2125 16 -1335 1718 619 -1585 1175 942 -1833 355 1426 -1724
2239 -1724 -472 1736 -1244 -1201 1533 -816 -1666 1230 -215 -2066 886 551 -2079 183 824 -1901
2255 -1901 -433 1253 -1489 -886 1567 -823 -1385 1519 -31 -1701 1038 604 -1494 924 1183 -1440
2271 -1440 289 1685 -1254 -313 1949 -443 -571 1968 87 -1065 1675 643 -1409 1213 1299 -1258
2287 -1258 554 1509 -1092 -107 1628 -895 -668 1679 -409 -1279 1304 119 -1549 760 532 -1755
2303 -1755 298 921 -1668 -328 1161 -1460 -1057 1057 -856 -1273 1058 -343 -1635 833 152 -1898
2319 -1898 506 909 -1450 35 1291 -1147 -426 1430 -684 -848 1527 -44 -997 1359 546 -1199
2335 -1199 1031 1007 -1242 583 1603 -880 -65 1754 -466 -565 1549 -76 -792 1399 346 -1155
2351 -1155 1131 740 -1415 404 951 -1365 10 1343 -1007 -710 1222 -613 -1364 848 -62 -1422
2367 -1422 685 176 -1603 340 486 -1642 -41 1087 -1301 -674 1157 -694 -1172 1116 -86 -1356
2383 -1356 960 474 -1128 665 825 -1127 338 1179 -1024 79 1533 -559 -567 1740 41 -1026
2399 -1026 1224 642 -910 890 885 -862 627 1077 -1047 122 1505 -799 -516 1535 -372 -1124 1152
2416 1152 93 -1483 697 618 -1264 160 715 -1185 -206 768 -1287 -619 1197 -848 -1152 1125 -167
2433 -167 -1726 625 390 -1425 347 639 -1152 28 874 -1127 -256 1188 -678 -584 1545 -184 -1140
2450 -1140 1273 516 -1428 686 1194 -838 382 1195 -649 85 1218 -734 -131 1593 -186 -818
2466 -818 1486 309 -1362 854 748 -1214 349 1107 -1006 -202 955 -909 -491 914 -818 -855 1178
2483 1178 -356 -1532 862 366 -1697 191 749 -1297 -333 832 -953 -536 881 -913 -777 1123
2499 1123 -370 -1087 1163 225 -1376 682 773 -1296 198 1400 -628 -166 1327 -441 -396 1138 -318
2516 -318 -553 1540 214 -1052 1204 724 -1361 446 1295 -791 39 1291 -549 -366 1056 -415
2532 -415 -719 1101 -161 -910 978 133 -1415 563 667 -1480 -234 947 -902 -667 821 -654
2548 -654 -804 797 -533 -1017 708 4 -1262 633 612 -1320 30 888 -1093 -303 1084 -384 -431
2565 -431 1056 -126 -692 807 48 -801 965 707 -861 815 1043 -1003 -47 1326 -292 -279 1254
2582 1254 -41 -547 809 -120 -722 1020 459 -893 715 738 -1095 -12 811 -917 -401 1036 -466
2599 -466 -786 711 -285 -1041 436 -116 -1018 480 276 -1347 73 634 -1105 -473 901 -644 -663 840
2617 840 -198 -659 685 -9 -899 624 361 -849 514 925 -740 215 1155 -568 -322 1261 75
2634 75 -472 1040 306 -569 724 306 -734 630 728 -729 260 1015 -480 -384 961 -254 -569 931
2652 931 48 -771 518 115 -1030 185 360 -973 39 655 -1069 -440 755 -761 -909 615 -294
2669 -294 -875 573 -75 -927 322 118 -959 112 677 -818 -89 937 -553 -380 918 -362 -611
2686 -611 820 247 -554 700 472 -700 351 692 -466 181 996 -481 -3 1098 -229 -531 921
2703 921 141 -653 682 336 -669 449 520 -817 -37 626 -696 -280 776 -492 -579 581 -354 -911
2721 -911 517 100 -931 305 188 -947 -72 246 -869 -187 685 -655 -418 696 -211 -804 570
2738 570 -30 -767 622 327 -667 389 584 -707 134 807 -425 -120 930 -61 -361 990 78 -547
2756 -547 778 452 -587 506 648 -618 235 732 -534 -75 822 -444 -398 778 -62 -639 498 53
2774 53 -828 359 188 -788 121 508 -795 -271 491 -621 -599 574 -377 -731 525 -144 -885 304 135
2793 135 -893 175 399 -739 68 625 -670 -212 799 -292 -405 742 54 -530 628 227 -564
2810 -564 445 566 -518 296 779 -380 -22 831 -352 -193 789 -71 -455 821 262 -625 401 387
2828 387 -618 172 439 -647 27 638 -488 -337 525 -324 -628 389 -92 -672 333 98 -784 8
2846 8 280 -817 -54 477 -535 -288 495 -507 -507 506 -141 -581 442 171 -621 390 388 -615 202 534
2866 534 -361 -68 744 -256 -182 689 52 -256 734 250 -340 670 511 -492 221 632 -416 76 606
2885 606 -315 -193 597 -201 -433 504 16 -531 336 176 -640 82 252 -607 -73 407 -619 -354 411 -417
2905 -417 -503 384 -239 -648 268 -94 -733 147 226 -685 -1 373 -547 -117 436 -341 -370 540 -31 -391 560
2926 560 199 -426 395 427 -448 310 552 -394 86 689 -240 -173 731 18 -185 536 176 -371 535 283 -484
2947 -484 290 479 -470 47 408 -432 -213 415 -284 -367 448 -132 -598 241 197 -674 96 78 -752 -55 290
2968 290 -608 -245 460 -451 -462 398 -232 -516 381 -40 -584 296 306 -577 225 429 -475 -65 482 -186 -115
2989 -115 726 -37 -262 610 151 -369 501 428 -394 417 468 -445 144 674 -292 -215 659 -78 -280 615 -80
3010 -80 -465 426 138 -580 371 261 -595 -58 333 -524 -265 385 -559 -368 403 -258 -510 322 -188 -795
3030 -795 105 41 -650 48 367 -555 -184 425 -472 -292 436 -136 -313 517 80 -389 388 92 -467 340
3050 340 509 -344 119 562 -336 -83 565 -82 -218 676 54 -260 501 109 -365 337 196 -446 213 434
3070 434 -377 -127 472 -420 -338 450 -140 -444 399 -46 -531 254 27 -644 10 155 -548 -67 331 -451
3090 -451 -324 355 -385 -423 348 -87 -385 299 86 -498 108 120 -506 101 478 -290 11 563 -247 -217 395
3111 395 -86 -262 557 184 -309 362 195 -353 247 378 -264 147 527 -273 -176 560 -39 -303 413 -2
3131 -2 -335 296 154 -404 117 188 -501 -31 304 -367 -143 343 -339 -382 264 -134 -405 157 89 -398 113 102
3153 102 -461 -60 180 -419 -137 429 -257 -225 383 -24 -394 214 24 -312 318 267 -195 181 325 -348 38
3174 38 424 -88 -3 559 -65 -153 403 61 -381 355 318 -284 195 332 -268 -76 305 -341 -178 382 -99
3195 -99 -268 457 -59 -463 113 62 -457 124 100 -397 -20 203 -393 -304 291 -203 -249 289 -165 -414 286 -32
3217 -32 -437 35 127 -433 57 371 -247 -19 290 -265 -175 367 -117 -147 429 114 -356 304 258 -387 215 456
3239 456 -252 78 391 -122 -86 304 -162 -205 396 -23 -188 371 105 -348 143 227 -312 55 343 -238 -112
3260 -112 224 -223 -373 221 1 -285 242 -30 -414 102 49 -419 42 224 -353 -95 262 -229 -241 253 -147
3281 -147 -278 327 10 -350 251 204 -332 91 279 -215 28 305 -168 2 408 -76 -151 393 17 -252 237
3302 237 127 -271 318 282 -269 -5 287 -223 -25 329 -37 -149 259 -106 -316 198 -31 -395 82 177 -408
3323 -408 64 135 -466 -105 167 -248 -191 188 -133 -351 234 -67 -293 64 93 -325 77 192 -266 -55 295
3344 295 -200 -44 284 -137 -110 315 -9 -213 277 194 -202 116 240 -287 87 280 -182 -65 384 -131 -133
3365 -133 282 -41 -152 241 -35 -234 108 64 -208 13 170 -347 -121 244 -278 -120 224 -129 -175 226 36
3386 36 -328 136 26 -237 -4 155 -334 -30 225 -267 -160 276 -148 -172 261 -12 -181 174 77 -191 140
3407 140 138 -186 143 271 -65 68 227 -125 -18 299 82 -83 245 101 -155 139 176 -122 60 178 -150
3428 -150 -96 192 -168 -27 225 -89 -221 209 5 -251 50 -5 -244 57 88 -261 -61 205 -132 -148 211
3449 211 -64 -192 251 -132 -235 192 77 -273 56 72 -192 71 114 -141 -6 133 -192 -40 251 59 -59
3470 -59 306 115 -144 108 219 -66 74 182 -90 24 255 -54 -6 154 -23 -144 160 -53 -196 149 108
3491 108 -198 23 119 -191 -48 197 -105 -110 127 -90 -252 79 9 -201 34 62 -132 -37 131 -158 -27 177
3513 177 -171 -37 171 -88 -117 107 54 -137 156 68 -169 67 102 -153 -44 220 -53 -25 183 13 -40 119
3535 119 -58 -118 178 -20 -110 108 135 -139 152 161 -144 33 127 -107 10 257 -184 -82 149 -47 -182 110
3557 110 17 -170 92 137 -219 14 59 -166 -74 82 -20 -209 122 -81 -58 115 -18 -234 77 34 -118 -12
3579 -12 83 -161 -25 139 -115 -71 105 -53 -128 129 37 -191 176 124 -202 -12 158 -37 51 311 -151 -79 251
3602 251 -72 -83 211 91 -197 225 58 -194 86 121 -182 16 142 -140 -60 81 -181 -134 97 -63 -224
3623 -224 91 52 -231 -7 40 -225 12 32 -230 -64 110 -69 -174 140 -5 -165 159 47 -117 143 6
3644 6 -111 63 160 -111 7 191 -133 54 127 72 5 107 -30 -110 180 135 -126 114 137 -159 127 148 -133
3667 -133 -49 183 -67 -10 118 -62 -191 66 -8 -110 22 135 -72 -61 152 -206 -50 152 -117 -145 7 -48
3689 -48 -194 25 -14 -137 69 53 -207 94 53 -100 24 48 -49 -157 151 -43 -112 132 9 -124 141 88 -58
3712 -58 39 161 -72 16 189 -85 -69 82 40 -109 193 91 -168 -2 8 -187 26 155 -69 10 28 -218 -124
3735 -124 122 -150 -69 136 -4 -113 30 17 -136 -27 77 -115 7 66 -95 -48 72 -139 -2 114 -55
3756 -55 -84 60 95 -70 34 78 -123 -36 101 50 -98 125 -23 -8 109 45 -89 144 31 -100 94 80 -144
3779 -144 58 150 -152 -7 84 5 -130 54 -147 -88 143 24 -215 107 5 -131 -31 98 -152 -67 -46 -93
3801 -93 6 -24 -128 -98 82 0 -150 41 75 -111 31 115 -44 -41 43 -6 -65 20 -42 -46 258 32 -164 126 38 -113
3827 -113 98 13 -86 -4 11 -129 -56 111 55 -15 95 18 -99 99 -109 -108 15 -17 -84 70 63 -129 -17 61 -54
3852 -54 -6 93 -97 -33 68 23 -181 -5 -14 -33 28 14 -102 17 57 -111 15 66 -88 -34 154 -63 14 65 24
3877 24 -135 28 39 -86 112 27 62 27 59 13 10 102 -13 -16 199 -14 -3 99 47 -46 26 -16 -39 27 111 -138 -35
3904 -35 98 -2 -4 24 -32 -18 75 38 -161 10 39 -164 64 79 -36 -4 122 -116 -103 6 -73 -83 53 22 -102
3929 -102 52 30 -57 -21 52 -96 12 132 -51 16 74 61 -21 136 32 -26 40 128 -39 19 23 -18 -2 146 -73
3954 -73 -43 83 -37 4 37 71 -149 -47 38 13 0 92 -55 36 52 -22 -70 24 -19 -37 49 -9 -71 89 -93 -92 -44
3981 -44 57 -90 1 32 -36 -28 90 -93 -98 162 -76 -84 51 -34 -92 37 50 -22 -1 137 -67 8 150 -35 115
4006 115 111 -18 -54 70 40 -71 17 -36 21 -100 160 -118 70 79 -69 -108 123 13 -81 12 18 -73 -20 6 -160 17
4032 17 64 -77 -66 -11 -132 -10 39 -39 -127 88 -66 -85 -8 68 -38 -26 98 11 -110 4 -109 17 62 -80
4056 -80 -100 46 -36 -51 -17 101 -112 4 21 -81 78 15 -4 34 46 -57 -67 107 -8 -39 48 80 -92 -12 42
4081 42 -48 -57 62 -69 30 72 -47 -4 29 -52 -128 30 -26 -87 -11 0 -88 -53 18 -47 -39 -5 -33 -120 -5 88 -80 -5
4109 -5 54 -49 -37 16 -33 51 -14 -89 21 75 45 -73 62 -83 -28 25 -7 -64 106 69 -50 -7 40 57 -13 60 -15
4136 -15 61 40 -47 -116 -11 -50 -64 -3 50 -91 -66 -85 -138 -83 19 -133 -50 69 -71 -14 7 -12 -64 -64 -63 -70 -44 48 -96
4165 -96 -103 67 -93 103 5 -11 -75 44 9 -93 128 15 -79 166 33 63 28 74 -21 -2 84 9 -44 65 30 -9
4191 -9 12 41 -54 48 34 -100 -116 -14 -83 3 -34 -104 -63 58 -115 -70 52 -65 -56 -60 71 -3 106 96 -54 -47 77
4218 77 38 -63 71 20 -19 28 37 38 65 58 -142 63 -27 -47 64 -13 -83 -34 -1 18 -11 120 39 -95 79 108 -2
4245 -2 40 55 -134 -70 -21 -79 -7 72 -101 -65 44 -74 -70 54 52 -32 -5 84 -80 35 -42 -57 -28 -34 -105 -131 13 -41
4273 -41 -46 -11 67 20 37 25 -12 73 56 -68 -68 42 -18 -24 -9 -18 -26 82 56 -30 57 89 -50 35 34 -42 -44 70 -34 -49 119
4304 119 1 -51 109 -20 -48 -24 50 -57 23 73 -35 -42 18 -56 -27 48 -64 31 6 -38 -132 49 -2 -54 -50 95 -130
4331 -130 -3 6 -90 -93 47 -35 -64 59 -46 -15 74 0 -54 -56 44 -4 -17 29 -28 6 22 65 -46 148 -10 -41 31
4358 31 -34 -125 23 -52 -52 -98 71 51 -59 79 -112 12 12 -28 12 76 -10 -77 23 -38 -44 -48 46 -107 -65 45 -37 -186
4386 -186 -8 -43 -32 103 -23 7 -19 -12 -74 110 73 -56 70 92 -52 -5 50 -22 -43 64 14 -103 31 49 -53
4411 -53 131 15 -47 8 118 -55 -100 127 -9 -65 99 21 -38 40 36 -8 101 122 4 104 69 -61 -10 113 -61
4436 -61 -57 -10 -82 -43 97 96 -70 38 -42 -108 11 -16 -21 -38 49 -130 -37 29 -137 -69 -53 -145 -73 -18 -35 -29 57 -33 5
4465 5 9 56 -64 46 61 10 -9 42 31 -18 35 69 -96 69 24 -58 60 65 50 48 102 -119 -48 -6 -25 -70 6 -47 -62
4494 -62 93 -15 -85 7 -4 -68 9 28 -138 25 71 0 -82 88 -57 -92 45 -49 -115 -25 55 -207 -57 97 -51
4519 -51 57 85 -29 16 88 -24 -2 112 12 -74 42 -8 -13 57 123 -3 100 138 -25 -49 -12 -47 45 95 40 24
4545 24 29 -14 -148 -13 54 -82 -106 14 19 24 49 -19 -106 6 13 -96 16 -88 -177 -23 -18 -126 -76 -14 -149 -44 -77
4572 -77 -30 -58 48 -103 -88 135 14 -11 73 23 -109 -24 5 -70 119 105 13 124 126 -26 -41 131 2 -3 146 19
4598 19 -20 20 53 -57 36 65 -39 -6 107 26 -67 72 -14 -52 81 37 -25 5 -15 -158 3 -2 -123 -44 101 -130
4624 -130 -44 95 -61 -162 43 5 -137 38 -24 -69 -15 105 -113 -16 88 -7 60 42 -81 -129 29 -40 -41 115
4648 115 60 -24 44 47 -28 33 46 -84 -10 159 -66 -27 124 14 -55 28 39 -60 119 27 -121 76 24 -60 -68 -13 -157
4675 -157 -4 41 5 27 114 -202 -98 28 127 -159 63 -110 -152 48 33 -54 -78 45 -88 -44 -49 -75 -48 72 7
4700 7 -92 2 -30 -64 82 21 21 -26 201 -11 -22 114 -22 -44 141 37 29 -15 -41 -38 68 64 -5 13 50 -38 12 87 -41
4729 -41 -107 155 -63 -55 55 68 -20 33 62 -62 6 15 2 15 172 -52 -63 31 -116 -61 13 -93 -79 -8 -20 -58 -47
4756 -47 54 -65 17 166 4 26 34 -108 -2 79 -64 77 38 63 -70 54 49 -51 64 91 15 7 58 -38 27 47
4782 47 -17 38 77 10 -96 30 -5 -73 37 129 -41 26 55 -128 -110 34 -51 3 -58 -99 -111 84 -17 -132 -11
4807 -11 21 -137 -18 10 -93 -39 96 -13 -97 6 -31 10 -3 32 -12 20 34 -31 41 53 -20 41 24 4 -2 93 -22
4834 -22 -29 134 53 -55 36 -25 -90 -15 92 -84 38 172 -26 -44 65 -24 -81 38 69 -88 -29 -59 -83 -21 42 -168
4860 -168 -65 84 -87 -30 19 -34 -150 34 -44 -185 43 -17 -82 54 56 -132 9 41 -18 -97 52 -57 -53 45 39
4885 39 -97 94 98 -112 102 134 27 105 179 1 -67 90 2 -56 34 20 -24 -78 66 -41 70 116 -101 11 15
4910 15 -101 9 91 39 -100 123 -69 -79 -44 -48 -67 -82 92 -106 -25 74 19 -141 76 -66 -24 37 0 -77 49
4935 49 16 -70 68 -20 -92 95 42 -50 15 78 -89 -33 -26 -1 6 74 89 -94 30 -51 -48 117 113 -78 -32 35 -55 33 73
4964 73 -46 28 19 -22 18 34 -71 -160 78 -73 -192 -57 -10 -153 -58 24 -126 -52 21 -153 -95 23 21 16 -31 10 -95
4991 -95 65 73 19 2 77 -75 -13 69 -25 6 151 -16 -48 60 18 -53 48 87 -82 -41 50 -12 -20 35 34 59 46 17
5019 17 -93 37 33 -30 72 39 -90 -12 28 -5 -85 92 -113 -37 -35 -68 -102 89 -4 -55 -35 -37 -101 -28 51 -76 -51 12
5047 12 -30 12 1 -71 33 29 -25 -64 74 -100 3 0 -25 15 -22 64 -27 -12 -2 -43 -29 73 42 -41 48 48 -4 26 6
5076 6 -56 53 115 -75 -33 56 -38 -126 83 9 -72 65 26 -57 69 13 -55 49 36 -16 -127 106 17 -11 39 -48 -124
5103 -124 68 15 -32 -30 -15 -86 17 14 -147 -44 1 -61 -7 -9 -78 -10 58 58 -118 78 -46 -81 11 37 -15 8 127 24
5131 24 -65 161 -65 30 67 26 -89 29 -41 15 67 49 12 10 49 -77 -75 19 -47 -55 28 -96 -103 92 20 -48 39 -21 -103
5160 -103 -101 36 -70 60 -54 -52 -69 40 -34 -134 55 -66 -116 48 -2 -3 -29 -78 54 20 47 41 4 116 120 -28
5186 -28 131 -27 36 70 41 -64 62 20 -41 51 1 32 -22 78 -40 14 -1 54 -6 15 -7 -71 7 55 -57 -41 -22
5213 -22 15 -49 7 -127 -58 -18 -68 -103 -23 32 -48 -14 40 -33 -58 -37 -99 -110 31 -37 -48 -53 -60 -28 90 -31 -107 28 -38
5242 -38 -2 -46 125 -8 72 42 26 8 -15 -11 34 1 57 70 48 55 -49 24 25 -56 2 31 19 -2 71 10 -41 83 -39
5271 -39 2 31 -14 -39 -1 20 -24 25 42 -122 29 38 12 -95 32 -69 -19 -34 57 49 91 30 27 32 25 -61 -61 36 65 -45
5301 -45 -50 1 -23 -30 18 -72 38 92 -18 -11 20 -17 -66 23 65 -18 54 -16 21 29 -36 -34 86 43 -6 17 10 -36 -7 72 -17 -29
5333 -29 24 -17 -26 23 96 -20 -41 -73 15 -53 3 -83 -6 -64 -86 6 75 -11 84 129 25 4 3 7 24 35 28 16 6 32 9
5364 9 86 77 23 56 16 59 -4 -10 -87 16 20 10 -26 -14 -43 0 29 -26 74 -10 5 -9 -68 35 -30 -10 21 -69 19 -7 -75
5395 -75 25 13 -89 -71 36 -13 -13 -1 0 57 -79 44 74 -54 87 36 -89 77 -16 -77 23 31 19 47 0 20 30
5422 30 94 109 -26 -65 -54 -63 109 19 -13 -39 -6 -63 -70 -39 52 52 38 -9 -53 57 97 -148 8 5 -10 -100 1 -3 -7 25
5452 25 -48 -39 -59 41 6 31 -77 39 56 -16 -46 -70 49 -11 -12 17 -11 0 11 56 -35 -10 -8 -20 63 14 -48 87 27
5481 27 59 91 18 19 -69 43 -30 -92 18 -39 -52 24 -20 -32 -39 -8 64 -29 -10 -108 -9 -23 -23 -92 -6 0 -37 -72 45 1 17
5512 17 12 -145 60 36 49 40 19 28 22 -6 -26 9 92 -10 -98 -29 69 -46 -25 80 2 -14 -44 54 55 110 1 18 18 -9
5542 -9 -48 0 86 -21 -45 -54 -33 -49 17 22 13 -2 -26 68 80 -52 55 19 18 -16 9 55 -10 -46 -24 -66 2 99 -82 -93 31
5573 31 -17 11 -23 14 -147 11 -36 -84 -38 -19 1 18 71 -25 -40 -9 -30 1 37 -38 18 -32 -48 -71 14 89 -36 97
5601 97 43 -88 0 81 -41 -11 8 51 -85 64 114 24 22 -6 107 18 45 -80 -23 36 -18 -40 66 33 -88 110
5627 110 42 -28 63 47 -88 -27 15 -33 -51 -6 -99 -14 39 66 3 -5 61 9 92 11 13 48 57 -44 -86 32 11 38 10 2
5657 2 50 -19 2 -100 -69 58 -25 24 52 93 49 63 1 -82 3 -75 24 27 -4 25 -1 115 -43 -49 28 -23 -44 27 -3 20
5687 20 -24 41 -121 -11 34 1 20 -34 -66 -51 36 -27 -66 5 -40 7 10 -58 -82 -11 -39 -103 56 73 36 51 61 127 22
5716 22 -21 19 -48 126 -1 -29 15 41 -9 85 51 -57 28 -21 37 -19 11 24 -51 -64 -80 -24 -14 -85 -87 -47 20 -54 -87
5745 -87 42 -66 33 -32 5 -26 86 -51 -62 29 -6 -29 -39 128 -54 87 25 -125 104 -17 -59 -55 63 40 -12
5770 -12 76 -36 -109 55 70 -10 72 13 33 29 -4 -12 7 85 -34 -43 -31 -3 -38 35 -46 -76 65 -12 46 34 36 -133 -23
5799 -23 -34 -92 69 -66 -70 -68 -16 -73 -97 -53 34 13 -48 9 -98 71 16 -78 52 98 -30 -59 51 -20 0 30 57 -71
5827 -71 10 44 -17 20 36 -16 34 101 -46 60 83 29 -18 104 51 -75 34 48 -72 -33 21 59 87 88 4 -40 -48 -53 -42
5856 -42 -8 -104 12 39 114 -1 44 36 -79 35 -33 58 29 54 64 -100 105 40 -72 24 -81 -27 -24 109 -101 -54
5882 -54 29 -6 -55 45 -18 48 92 -21 -35 42 61 37 31 16 -2 -84 74 -9 -55 83 3 29 35 -24 0 22 -11 -85 -20
5911 -20 56 -44 16 16 -72 5 -15 40 -74 -3 -13 6 86 -15 3 21 6 -60 16 60 -57 8 19 -51 90 -49 -36 -9
5939 -9 84 -8 -18 -15 -12 -29 17 82 31 -26 -77 3 -42 19 -86 -71 59 -12 -44 80 -42 51 -65 -56 55 121 42 -64 5
5968 5 -33 -94 12 73 16 0 99 40 -31 -12 86 -43 -18 21 -90 -59 15 40 -61 70 -55 -15 47 -55 -68 45 30
5995 30 -83 -10 -54 -49 -7 37 28 -82 39 29 -86 105 33 -126 20 95 -33 64 111 57 0 28 -31 8 51 20 17 31
6023 31 -41 -4 118 -52 -53 85 51 35 68 109 6 89 111 18 19 -1 5 8 -5 28 33 51 -65 -22 71 34 28 -24 2 -4 0 47
6055 47 -58 40 -30 9 -13 16 -18 41 33 38 -51 79 -30 -10 60 -16 -36 16 108 39 -50 40 27 5 102 50 77 61 39 -48
6085 -48 26 36 32 -28 109 -20 39 125 40 -33 26 -68 24 -38 2 -77 11 30 -47 -143 -2 -66 -41 18 -85 4 -54 12 -25
6114 -25 -16 20 17 19 11 -139 23 58 -17 -11 14 -70 56 -4 -26 -9 123 -35 -59 -24 67 -50 65 91 9 53 8 29 51
6143 51 52 39 67 -17 -11 -4 -30 -2 -58 -23 35 -16 64 -43 4 63 -70 -71 -4 -46 44 -46 14 30 -12 -4 -21 8 -76 48 -16
6174 -16 -64 73 5 -24 29 -61 -87 -62 -106 -70 10 129 -2 -38 31 45 81 65 -10 29 30 33 -5 19 -108 -135 -64 113 -5
6203 -5 11 -1 -36 -39 -46 -72 -116 16 4 -50 -33 -57 -28 -45 15 -36 -31 20 -15 -29 125 -89 26 -31 -91 -12 7 -10 -27 -38
6233 -38 93 -4 -34 -2 -40 32 65 -75 -102 18 -62 52 10 83 54 55 25 -2 7 46 1 8 65 -102 -19 74 63 -24 13
6262 13 -90 -63 69 83 -4 34 -54 15 63 35 -16 -54 -38 -62 1 9 -69 4 50 28 -21 -25 -16 11 73 -38 -59 7 125 26
6292 26 35 -7 -31 -30 104 -59 -22 1 -49 62 -49 10 -28 -50 78 -16 -19 12 -52 46 38 -1 23 47 46 18 85 36 -34 -14
6322 -14 -26 -21 -39 -52 -52 -90 15 75 -5 -30 -11 -18 5 -28 -58 26 18 -105 51 -37 -55 -74 96 -38 -65 92 8 -99 28
6351 28 24 -45 -3 40 -94 -28 -6 36 -46 45 -79 32 38 4 -35 -4 93 -48 -8 31 9 -23 32 -25 -64 -25 47 64 -26
6380 -26 0 -17 22 1 -53 133 -16 20 -18 65 -9 -23 87 -32 -92 49 -45 -59 76 45 22 -70 37 -11 57 -74
6406 -74 16 3 71 -46 -45 52 -44 -50 61 -69 28 8 22 -37 -16 -7 -42 5 44 15 -66 82 30 24 14 34 109 42 -2 4 88
6437 88 70 -56 79 -3 24 79 68 112 -34 58 -26 19 -4 33 12 -17 32 -54 -49 38 -26 -2 -90 -30 -31 16 -33 -49 62
6466 62 -96 -58 21 23 -20 67 -48 -52 6 -17 19 -25 38 -27 -34 40 -51 -83 19 -1 -58 183 34 17 27 81 33 83 -21
6495 -21 0 -23 -18 -36 -68 69 -39 -56 9 12 -104 -65 50 -36 -58 -6 -42 -76 8 -23 -38 -80 -24 -54 72 26 -63 -52 21
6524 21 -97 -39 92 74 -135 83 64 82 51 21 -29 51 30 -55 -21 -60 17 7 92 23 51 4 4 103 9 35 -28 7 -4
6553 -4 -4 11 -40 -8 -71 38 0 1 76 -16 29 -19 29 0 -45 -3 12 25 -35 -42 0 17 -35 -11 34 17 -31 -64 -2 -6 -1 30 -6
6586 -6 29 -44 -9 75 98 89 -2 -25 42 17 109 1 32 140 44 -8 125 -32 -22 -37 -44 40 -44 122 17 -23 76 -43
6614 -43 7 33 -20 30 0 -13 -92 41 -25 -49 -38 8 -15 -57 22 86 57 -24 19 -110 -27 30 40 95 50 -93 18 30
6642 30 -21 -3 -3 -60 -20 -1 13 22 48 28 43 95 36 -7 -14 24 -11 -2 81 -47 -8 27 2 -33 23 10 56 -8 60 56 15 -26
6674 -26 -99 -5 26 -37 -94 63 8 43 61 -17 7 -24 -41 -40 23 13 -28 -155 -9 -20 19 -11 -12 -34 33 -3 7 48 63 -49
6704 -49 -90 9 -22 -49 82 -61 -26 -84 17 -10 70 52 -33 -48 13 -86 61 68 -79 28 26 22 -6 14 14 54 -3 -25 -42
6733 -42 111 -61 -70 -10 -23 29 -20 50 -98 -48 69 -86 -50 1 -57 -27 76 76 -102 40 64 -59 -31 -48 -73 -16 -13
6760 -13 -35 0 66 -44 -34 25 2 -56 0 4 -27 -45 11 -13 -28 44 -35 -91 25 -55 27 -4 55 -64 52 15 9 -36 -43 15
6790 15 -37 48 -50 8 -20 8 5 75 -29 25 50 16 -42 -27 12 -10 85 76 -29 -16 18 -24 104 27 -8 -22 38 50 -91
6819 -91 -65 83 15 -9 24 -15 -48 -31 -42 29 -38 77 1 4 12 33 71 -20 -27 -13 -28 -24 63 37 13 -17 77 -34 -32 43 57
6850 57 42 68 39 28 11 59 33 95 60 -47 124 18 12 95 91 -63 -136 43 -46 -10 50 2 -107 -46 3 -125 -54 -7
6878 -7 -60 -7 48 -22 -26 2 48 93 -75 -17 16 -103 -33 -38 87 61 12 67 64 46 3 72 -1 -29 57 43 41 63 60 46 16 106
6910 106 -95 -21 83 97 -84 37 -12 99 56 40 1 -111 -47 -1 73 -5 -23 -42 -113 -83 -12 -4 -91 -54 19 -64 62
6937 62 -4 -23 -104 30 -42 -51 17 11 10 54 37 -2 69 58 -58 51 17 70 44 15 25 -35 34 68 -25 65 68 -72 34 65
6967 65 58 70 46 36 25 29 29 30 28 4 -61 -12 71 -80 -116 61 -53 -70 -46 -87 -43 -72 23 -49 24 -12 -58 11 21 -109 9
6998 9 13 36 -30 -63 -63 43 38 -62 -15 32 126 0 33 6 26 69 67 120 -27 15 16 149 51 65 12 47 64 19 31 62 -20
7029 -20 -28 83 -6 37 105 -21 -19 -7 -47 -22 30 20 42 31 27 0 -55 -93 9 -16 -107 65 -72 22 44 -62 -49 -40 32
7058 32 -64 21 27 -30 -23 -85 -121 36 -32 -11 36 -18 12 43 3 -77 107 146 -7 31 77 -46 -6 33 15 86 -33 -39 -72
7087 -72 36 -40 -8 -59 87 -88 21 21 -49 -22 6 -65 -5 -19 18 2 18 -31 -23 -12 -56 -117 -6 -8 -48 -12 64 -28 5
7116 5 -37 -42 -32 47 -3 -55 -43 -30 -8 -32 17 -108 42 -3 -79 -101 -35 17 21 49 58 -3 45 35 -90 120 51 -1 9 65
7146 65 -63 -21 146 27 -26 66 4 32 -31 -39 -10 26 86 -26 3 -76 71 -63 57 -53 -1 48 -32 -4 -31 19 -102
7173 -102 -30 -64 -2 -42 85 -65 61 -10 -118 -19 48 -62 66 84 -67 18 -17 -8 -94 -3 -25 -55 12 -26 -72 29
7199 29 62 -44 28 89 -4 18 -63 30 43 50 1 18 31 8 -28 82 6 -6 18 -17 24 38 86 -91 -8 -46 -35 -12 -52
7228 -52 36 37 30 34 34 -88 -5 -31 52 -3 -91 -115 49 35 -70 29 -91 -27 51 54 -30 47 174 28 -49 -65 -49 35 62 10
7258 10 95 70 9 -116 40 73 4 41 76 72 8 39 -19 31 145 29 -3 41 -6 -34 -45 -3 -140 -16 5 12 11 -32 -47
7287 -47 -70 -81 1 -28 -100 34 -23 63 43 -17 -34 33 -32 -19 2 -35 18 74 -52 -2 51 77 12 21 112 -31 107 29 -37
7316 -37 -3 49 48 27 31 6 -82 20 -2 109 69 14 -10 -1 37 -10 -26 -10 -24 1 -44 -50 -12 -44 -77 -63 44 -69 29 -41
7346 -41 -108 -6 52 -71 -77 -117 -80 -38 -3 -2 -115 43 32 6 -27 23 55 -17 55 55 -68 -38 116 27 69 35 14 30 87
7375 87 28 -42 50 56 -12 35 68 -71 35 -21 -30 24 18 -39 -16 83 66 -63 71 54 -60 0 79 -62 -15 18 -42 60
7403 60 52 46 53 -38 17 -85 -22 3 6 3 -10 -44 -5 -64 -88 -47 26 16 -45 73 -10 10 55 9 79 75 63 -27 -21 -51 -49 -92 46
7436 46 -50 -19 8 -151 -76 16 -109 -43 82 83 -108 44 59 -17 -64 118 109 46 32 34 16 -60 -54 -19 54 -40 -87 -53 56
7465 56 -57 -74 21 -175 38 -108 -19 -8 14 -17 -20 -1 -36 -33 -31 -28 -44 42 -73 -39 67 -39 26 41 -50 -13 129 69
7493 69 -67 31 23 110 -8 40 23 10 92 -84 9 12 20 2 64 55 23 -31 62 -47 24 7 -47 -34 -7 69 76 85 33 -1 41
7524 41 -25 -74 53 68 -50 -7 19 -17 -32 39 29 -15 -56 -18 -41 -17 -1 -53 -6 60 -65 46 51 0 39 -24 42 -37 -42
7553 -42 24 5 11 57 10 23 -68 4 -5 65 -26 34 -9 104 23 29 -41 -55 99 91 -20 22 -15 19 -46 13 124 -28 11 46
7583 46 -33 -119 -20 14 1 -24 56 -39 25 -75 4 68 -80 -2 12 11 -39 52 -44 8 53 -12 -18 35 -67 -32 -49 -75 -57 35
7613 35 1 -36 -105 -17 72 -61 73 28 64 -43 75 19 52 56 83 0 54 14 -69 -8 -4 18 -107 59 11 40 11 -73
7641 -73 -49 -78 -74 17 28 -11 -88 9 -85 -42 43 19 9 -43 22 -28 -15 25 37 -23 22 40 25 113 -48 76 2 89 -28
7670 -28 93 -13 -14 -59 8 36 -93 -22 60 25 -19 31 61 -16 -40 -73 -22 -27 -10 -63 11 -8 38 -55 -47 -51 2 70 -16 -43 -4
7701 -4 -21 -53 22 -11 91 -26 30 31 -3 -29 -60 -14 -8 -22 32 -56 -51 33 79 11 99 24 -90 74 102 6 67 11 53 13
7731 13 -87 12 74 33 -26 -13 -6 8 14 19 33 -48 -56 30 -4 -5 -11 -15 25 -8 -54 -7 -117 16 -8 -3 8 -20 35 -46 2 -36 21
7764 21 37 -69 37 72 -2 10 -60 -4 -5 88 0 -35 4 156 -21 -88 44 22 -7 83 0 31 81 34 33 59 51 1 -71
7793 -71 0 -7 13 67 -74 68 8 -21 -20 -76 7 -67 -51 9 28 -44 -29 -59 -87 20 -50 -36 -37 -134 54 79 3 -29 -17 -1
7823 -1 13 -1 -18 49 -37 30 -31 15 13 78 -9 13 50 -26 -43 11 -4 64 -24 4 76 138 58 30 75 -31 -73 -76 -23 -80 28
7854 28 -36 -46 -6 10 -65 -12 135 -22 0 49 -19 -26 -33 -4 59 0 -29 5 60 138 76 46 -36 23 -62 20 19 -1 -56 -16 10
7885 10 34 28 40 25 -44 9 21 -50 -38 71 -6 -27 -66 1 32 -57 -76 -50 -48 33 -31 -40 -53 14 -23 11 25 -48 -10 -36 -56
7916 -56 9 -25 23 15 -70 9 -10 21 4 -43 60 -48 -45 -60 -4 -37 32 37 -64 63 -52 -12 19 93 -18 -5 -23 -37 37
7945 37 -49 -46 -43 16 -30 18 -54 30 40 -47 -59 0 8 7 -11 26 42 -24 -27 100 59 48 20 35 -71 16 29 17 -18 -45 3 63
7977 63 76 26 -58 -41 83 50 -67 15 34 7 11 -97 -126 -45 43 -58 15 -62 -26 -59 -40 72 -70 46 -57 8 16
8004 16 2 -34 -107 23 -25 -44 45 28 -1 -48 35 26 19 -10 -70 17 47 -40 0 -24 43 49 -93 4 9 35 -34 -50 3 65 -85
8035 -85 -16 -63 3 -16 48 20 38 29 -85 59 -7 -53 59 -27 130 37 -97 -46 2 -80 29 -61 50 -33 39 -63 -59
8062 -59 54 15 16 -8 -7 -56 78 -7 -51 -22 -14 -31 -15 4 -49 51 -82 -47 4 58 77 -7 87 12 -36 64 29 21 -24 -40
8092 -40 -36 42 32 12 -13 -35 -41 -25 64 -3 -29 -13 -82 -7 23 -69 -30 -51 6 28 -96 41 50 3 22 30 51 -54 -41 -31 35
8123 35 45 33 74 60 -23 -32 23 22 88 -3 -3 87 -20 -1 -9 17 8 32 6 44 121 -10 92 -39 -19 105 12 34 15 22 -78
8154 -78 -3 -59 75 -9 41 2 -40 27 22 -53 19 62 -42 60 52 -47 28 -14 -39 -26 50 -2 -50 7 -47 9 37 5 39 4
8184 4 73 112 -8 -3 36 11 6
8191F
$$ Imaginary data points
##PAGE= N=2
##DATA TABLE= (X++(I..I)), XYDATA
0 0 0 0 0 0 0 0 0 0 0 -16 16 -16 16 -32 32 -32 48 -64 65 -80 96 -113 144 -161 193 -225 257 -305 353 -401
30 -401 452 -516 592 -665 753 -845 947 -1059 1182 -1321 1467 -1629 1803 -1998 2209 -2438
46 -2438 2689 -2963 3264 -3596 3963 -4367 4814 -5315 5878 -6517 7241 -8084 9062 -10230
60 -10230 11644 -13393 15629 -18596 22729 -28902 39119 -58999 111967 -544443 -1374873 101930
72 101930 759876 239872 -340275 -309712 11606 354620 112115 -180342 -81271 -72821 -170622
83 -170622 272276 438923 -146382 -407127 30431 286147 257369 1823 -417750 -236558
93 -236558 506672 478143 -200271 -349852 -67620 106768 246399 119615 -188020 -102446
103 -102446 84152 -25120 79651 211370 -189463 -361174 133834 283011 -89681 -181908
113 -181908 -36552 24294 72232 -36981 -171381 -12124 19691 -168810 52510 274563
123 274563 -167262 -421500 33284 271965 29740 -128081 -171811 -85954 175333 116474
133 116474 -185765 -97524 79316 -51280 -18162 156488 18074 -115271 -28852 -15729 70769
144 70769 193770 -83518 -276918 134259 356341 -23432 -241489 -70101 111457 204657
154 204657 60976 -203165 -57293 215637 34499 -114485 80481 36513 -151449 18330
164 18330 163237 10834 -63235 -49790 -47913 83126 76179 -160134 -108484 131151 49119
175 49119 -74939 -1708 -50649 -88848 65083 21335 -138496 -12559 78455 -54244 -23858
186 -23858 51529 -77271 -76966 51756 -10741 -44673 50262 -6196 -42898 66867 -11600 -118320
198 -118320 54331 105180 -73778 -28825 97424 7221 -20671 38860 -26415 -8610 81773
209 81773 -15178 -39544 111242 42219 -91903 39887 86790 -56797 -19785 61625 -6736
220 -6736 20627 56878 -67934 -41974 100113 7063 -83133 24348 22148 -39719 30718 2354
232 2354 -77036 29611 46408 -95882 -32637 74247 -38320 -58504 45097 -20177 -66105
243 -66105 26995 -3168 -50914 33642 -1623 -80071 31627 55576 -75546 -26716 62092 -22523
255 -22523 -24738 41539 -29468 -22720 79506 -50 -68653 43669 41563 -36726 37945 44068
267 44068 -53693 8450 64087 -24528 1978 63600 -29035 -21767 82521 1158 -62354 45718
279 45718 35572 -41290 24271 25429 -47805 22139 47337 -53118 -14433 46494 -44358 -30453
291 -30453 62317 -18138 -61331 35161 2161 -58471 23012 10235 -67660 11783 39868 -57634
303 -57634 -18209 42325 -38301 -31307 35567 -29033 -32326 53432 -7499 -54036 43455 20540
315 20540 -62541 16515 44694 -40405 1971 51913 -19774 -4165 45643 -24316 -16091 61668
327 61668 -7462 -41916 58745 33920 -42206 24690 33546 -37634 16770 45163 -37430 -4842
339 -4842 55725 -17532 -22138 42079 -16132 -37911 39935 2031 -44563 32645 17186 -56098
351 -56098 11662 32771 -56539 -19274 41539 -28307 -28577 30598 -21296 -31231 32853 -17438 -51244
364 -51244 30353 9792 -51600 20487 31160 -50365 -5456 39882 -32453 -17342 42238 -15217
376 -15217 -22368 41964 -2839 -30069 38955 11516 -36871 31661 30998 -35749 17103 44442 -30009
389 -30009 -3684 47959 -16820 -17236 48357 1504 -27523 33684 8986 -29870 26696 15230
401 15230 -36997 18612 28878 -41805 -2563 41324 -30566 -27940 35117 -10261 -31417 24430
413 24430 -6034 -38210 19147 4049 -43353 11116 18479 -41527 -1466 28473 -36665 -18596
425 -18596 33101 -22361 -29103 35166 -2044 -35218 25008 12161 -34018 12681 17654 -28010
437 -28010 14776 31696 -28005 483 41348 -19699 -16994 43818 -208 -26578 35389 17713
449 17713 -24292 22807 19751 -28892 11481 28795 -20728 6698 34169 -22256 -10410 37709
461 37709 -14617 -31094 30406 5199 -31390 20573 14353 -34825 3330 17029 -30901 -6074
473 -6074 18271 -26795 -8467 29268 -22371 -29403 22892 -11326 -35226 24254 10266 -39150
485 -39150 6231 21764 -26974 -5206 16614 -24066 -4321 29749 -14485 -12782 31104 -8426
497 -8426 -24731 31097 8696 -30987 21993 28552 -22077 7922 28382 -19629 -3108 31411
509 31411 -8057 -5823 30215 -6104 -12872 34674 806 -32018 22969 19517 -27673 11663 27600
522 27600 -26003 -8885 23258 -16883 -13062 21841 -12243 -16662 24158 -7754 -30515 16186
534 16186 -269 -36877 12950 21347 -33279 -8050 22392 -22048 -16873 17788 -15393 -17029 24205
547 24205 -3351 -21841 16704 -2179 -27523 19970 16225 -30293 6980 29941 -18847 -5257
559 -5257 29315 -11522 -15993 25838 3696 -9275 24610 2241 -17279 26812 13295 -29645
571 -29645 10843 27348 -17954 3615 31322 -14132 -12225 25667 -7584 -20012 20489 3026
583 3026 -16253 20398 5246 -28781 6959 8340 -30320 4791 26552 -23757 -13755 24196
595 24196 -15117 -27191 13106 -4921 -19872 17187 2265 -24647 10745 5826 -31909 1771
607 1771 19092 -21080 -1763 26477 -16210 -16654 23585 -4306 -20465 19084 7779 -14308 18199
620 18199 10309 -20459 12563 18754 -21288 3074 28936 -10635 -4855 29461 -3581 -15878 19962
633 19962 1356 -16673 21377 13451 -18009 10774 14233 -20206 1832 15037 -21077 -2580
645 -2580 27971 -11636 -17987 19514 -5402 -26393 9719 3586 -18366 11870 7912 -25525 815
658 815 11030 -27123 -8896 20712 -11299 -10767 19091 -9634 -20861 14851 -1353 -22527 13775
671 13775 11836 -18294 8485 15995 -19378 -2391 17867 -13054 -2555 27567 -4081 -13758 21442
684 21442 4902 -14988 14105 7144 -14634 16701 18910 -16607 2411 19622 -11990 -3370 19846
697 19846 -9788 -10254 23484 1879 -16593 12106 2077 -19698 9126 9207 -20194 2378 14805
710 14805 -16589 -4754 15014 -17996 -17766 16419 -2025 -16211 10109 -1549 -18152 9224
722 9224 2009 -25074 3296 15427 -15092 -982 16155 -15836 -11465 17904 -5886 -14382 17672
735 17672 5307 -12673 13579 7373 -17378 6212 13017 -10849 8908 19948 -13847 -3983 23673
748 23673 -4892 -13222 18257 5127 -10304 15371 6939 -15246 8338 9998 -14783 4657 14874
761 14874 -14313 -2177 18561 -11437 -13573 15459 -4658 -18187 12422 5277 -17972 2692
773 2692 5118 -15152 2065 5719 -20235 -2450 15942 -13003 -10173 15208 -9053 -18203 13808
786 13808 2633 -18251 8083 10040 -12956 3356 8022 -15095 1067 15814 -8832 -686 19147
799 19147 -8154 -10673 21100 2654 -16932 13081 12888 -9514 8871 11166 -13342 3045 15499
812 15499 -8561 462 16942 -8839 -6692 19445 -4006 -16860 14863 6557 -16955 7116 10112
825 10112 -16417 -1851 10167 -11243 -3231 8669 -13733 -6095 15710 -10266 -17624 13022 -313
838 -313 -19698 7564 6550 -18774 627 10906 -13279 -3376 10865 -10885 -5318 13942 -6700
851 -6700 -8582 15605 -2317 -14389 14839 7609 -16167 7644 15456 -10247 1509 14266 -7935
864 -7935 -1284 16095 -4533 -4093 17381 -1819 -10047 16982 4402 -15896 10357 12201 -13461
877 -13461 3366 14240 -11838 -4660 12936 -7189 -6709 11725 -6560 -10341 12931 -3253 -18167
890 -18167 8913 4894 -18837 2155 9977 -15760 -4223 10995 -12279 -9366 10650 -7361 -10750
903 -10750 11356 -2439 -13462 9665 2037 -15671 7607 9850 -14893 1512 15254 -9219
915 -9219 -4421 14292 -4104 -5892 14095 9 -6986 14986 4085 -12041 10830 10198 -11819
928 -11819 5705 14807 -8979 -107 15821 -6331 -6749 13914 -1553 -8926 11699 1604 -11235
941 -11235 8816 3991 -14818 3771 8037 -14570 -1244 12422 -11455 -9230 10427 -6880 -12131
954 -12131 8674 -2771 -13809 7470 2302 -15176 2860 5214 -14559 -71 10073 -11672
966 -11672 -4235 13590 -6529 -9525 11478 -1136 -10557 10303 4547 -9900 8331 8234 -10399
979 -10399 4720 12205 -8936 137 15331 -4085 -3652 15126 -742 -8622 12340 4259 -9798
992 -9798 8977 8474 -9152 4214 8975 -9855 149 10850 -9000 -4920 12884 -4387 -10292
1005 -10292 9474 -848 -13258 5437 2611 -13269 2735 6309 -12781 -2502 7349 -11236
1017 -11236 -6143 9029 -7453 -8953 9690 -3024 -12273 7912 2363 -13665 4039 7492 -9907
1030 -9907 1751 9513 -8714 -1541 11583 -5982 -5137 13405 -226 -7384 11957 4113 -9270
1043 -9270 8619 8040 -9243 4904 11692 -7108 605 12566 -5002 -3790 11622 -2646 -6585
1056 -6585 11824 1262 -10449 7811 4966 -11754 2915 7344 -10673 -1182 8856 -8977 -5414
1069 -5414 9099 -6691 -9966 7889 -2364 -11489 5983 1144 -12610 3333 4544 -12955 -471
1082 -471 8369 -9705 -4171 9591 -6010 -6839 9780 -2396 -9196 9276 2795 -9677 7038
1095 7038 7001 -9219 3562 9459 -7698 1205 12782 -5102 -3305 13071 -1013 -6705 11060
1108 11060 2865 -7953 8669 5849 -8853 5432 8448 -9158 789 10264 -7164 -3170 10520
1121 10520 -5331 -7571 10208 -1296 -11406 6339 2808 -11459 2305 4369 -10721 149
1133 149 6191 -10567 -3512 8333 -8384 -7835 9430 -3299 -10824 6855 1178 -10923 4726
1146 4726 4730 -10330 1565 7737 -7565 -524 8816 -6107 -2652 11375 -3309 -6711 11678 2439
1160 2439 -9001 8212 7363 -7739 3932 8456 -5916 1821 9286 -5513 -335 11307 -4102
1173 -4102 -5398 10719 -888 -8749 9235 4237 -10522 3890 6889 -9307 -1259 6318 -7160
1186 -7160 -2278 6962 -6794 -4710 8099 -6077 -10522 7788 159 -12057 4634 5193 -11056
1199 -11056 -838 5584 -8790 -3005 6884 -5112 -3118 7682 -4581 -6048 8434 -1699 -9047
1212 -9047 8892 5613 -9494 4185 9396 -7087 -1624 8311 -2746 -446 9113 -1817 -2063 9626
1226 9626 -1593 -6404 9523 3280 -8617 6726 8488 -8088 403 8897 -5618 -3564 7460
1239 7460 -2669 -3816 6467 -2342 -5286 6567 -2375 -10519 5655 3544 -11170 1409 7782
1252 7782 -8794 -4862 6080 -5677 -6810 4830 -2252 -4514 5990 -2153 -8333 4918 360
1265 360 -10330 4428 7540 -8272 -377 9543 -5155 -5736 6839 -537 -3348 7547 1398 -3748
1279 -3748 6928 1343 -7057 6343 6094 -7399 3487 10687 -4977 -2773 9304 -1783 -5093
1292 -5093 7052 1203 -4554 5545 1936 -4993 4781 1742 -9168 2380 6181 -8360 -1525 9111
1306 9111 -4804 -7175 5560 -2168 -8475 3039 654 -5516 3907 998 -8780 1093 2451 -9766
1320 -9766 -505 8121 -5257 -3541 8093 -3343 -8503 4622 945 -5634 5418 4216 -4852 3204
1334 3204 3191 -7241 2042 7450 -5220 164 11010 -2017 -5264 7861 1012 -6381 5526 4489
1348 4489 -4072 4672 4665 -5533 2030 5088 -6474 -137 8187 -4164 -3642 8441 -1576 -7880 4708
1363 4708 1139 -8059 2123 3483 -5835 1220 3390 -7501 -1722 4243 -7079 -3744 7524 -2771
1377 -2771 -6476 5592 -610 -8812 2546 2460 -6752 2142 5105 -5283 47 4692 -5959 -1857
1391 -1857 7139 -3096 -3064 9073 598 -6475 5607 3231 -6469 3311 6024 -3792 2556 6430 -4228
1406 -4228 -252 6810 -3661 -2727 8096 -462 -4601 6941 1599 -7214 3507 3739 -6754 1089
1420 1089 5514 -4830 -861 4968 -5138 -3607 4998 -3979 -5590 6155 -20 -7308 3468 1797
1434 1797 -8111 329 3316 -6257 -437 5217 -4774 -2563 5046 -3858 -4821 5368 -890 -5096 5848
1449 5848 2330 -6384 3048 4318 -6168 596 6302 -2940 21 6809 -2242 -2431 6217 -1102 -4089
1464 -4089 6680 2419 -4738 4919 4097 -5549 1680 5067 -4815 -190 6448 -2922 -2378 5747 -2179
1479 -2179 -4742 4576 -437 -5664 4229 2183 -6662 1258 3361 -6409 -1405 4185 -4738 -2637 4877
1494 4877 -3199 -4628 4464 -1481 -6237 3300 1091 -5840 2575 3237 -5678 547 4630 -4879 -1652
1509 -1652 5859 -2077 -2787 5747 -111 -3767 4932 1326 -4757 4077 4054 -4249 2245 5548 -3520 -265
1525 -265 5551 -2520 -1498 6317 -679 -3504 5355 1065 -4999 3222 2494 -4952 1683 3765 -4700
1540 -4700 -283 4524 -4319 -3045 4404 -2546 -4426 4082 -688 -5361 2778 769 -6307 1091 2791
1555 2791 -5545 -596 3968 -4219 -2013 4297 -3127 -3730 4629 -740 -4505 4231 1729 -4896 2558
1570 2558 3152 -4508 1249 4841 -3270 -260 5733 -1701 -1951 5316 -276 -3027 5125 1614 -3792
1585 -3792 4047 3517 -4504 1397 4482 -3509 -316 4971 -2430 -1905 4755 -1681 -3803 4048 106
1600 106 -4880 2907 1665 -5169 1135 2634 -5414 -976 3652 -4179 -2747 4114 -2361 -3967 3384
1615 3384 -1196 -4880 2841 628 -5325 2187 2988 -4965 46 4021 -3814 -1413 4695 -1933 -2243
1630 -2243 5074 -82 -3458 4180 1377 -3807 3403 3237 -3594 2233 4691 -3420 -34 5438 -2145
1645 -2145 -2001 5344 -137 -2770 4406 721 -3891 3078 1899 -4649 1583 3458 -4221 -265 3853
1660 3853 -3786 -2431 3941 -2565 -3968 3648 -419 -4809 2329 783 -5155 811 1595 -4801 195
1675 195 3473 -4241 -1729 4107 -2754 -3512 3887 -659 -3765 3688 1298 -3941 2544 2511 -3976 1265
1691 1265 3872 -2879 305 4877 -2020 -1267 5252 -771 -3113 4688 1635 -3291 3316 2793 -3280
1706 -3280 1858 3200 -3411 396 4162 -2649 -1118 4569 -1839 -3121 3555 -707 -4295 2814 1251
1721 1251 -4596 1135 2276 -4342 -787 2195 -3849 -1325 3174 -2907 -2741 3620 -1545 -4717 2596
1736 2596 490 -4411 1760 2163 -3746 580 2705 -3527 -750 3704 -2084 -1364 4320 -631 -2305
1751 -2305 3925 497 -3499 3229 2681 -2998 1816 3925 -2124 289 3698 -1829 -715 4073 -1011
1766 -1011 -1648 4375 208 -3314 2730 1205 -3807 1483 2574 -3312 265 3224 -3056 -1870 2338
1781 2338 -2362 -2617 2921 -1023 -3197 2460 -221 -4906 894 1421 -4117 -47 2778 -2729 -1096
1796 -1096 2314 -2897 -2337 3012 -957 -2619 3144 795 -2997 1969 1559 -3408 1350 3180 -2317
1811 -2317 346 4036 -1326 -1157 3563 -516 -1585 3565 607 -2036 3479 2077 -2975 1485 2816
1826 2816 -2558 96 3220 -1667 -430 3555 -1425 -2296 2639 -826 -3344 2245 1080 -3122 1366
1841 1366 1469 -4141 -815 1819 -3205 -1311 2983 -1475 -2141 2065 -1664 -3452 1879 -163 -3352
1856 -3352 2020 1959 -3244 80 2072 -2990 -865 2963 -1341 -746 3570 -509 -2160 2802 447 -2634
1872 -2634 2624 2172 -2207 2007 3168 -2271 54 3177 -1449 -855 3484 66 -822 3346 15 -2603
1888 -2603 2312 703 -3251 1626 2783 -2499 0 2467 -2647 -1837 2049 -1844 -1951 2587 -489
1903 -489 -2697 1574 -500 -3994 839 967 -3429 595 2662 -2939 -1547 2031 -2124 -2298 2192 -466
1919 -466 -1667 2667 59 -2924 1928 1140 -3262 1288 3142 -1909 262 3535 -1349 -1197 2870 -452
1935 -452 -1280 3243 965 -1443 2705 1160 -2533 1946 2188 -2549 772 3607 -1600 -1062 3075 -899
1951 -899 -2139 2096 -289 -2045 2042 382 -2744 1380 854 -3750 4 1841 -2994 -1120 2624
1966 2624 -1886 -2413 1859 -1118 -3016 1239 -60 -2463 1607 607 -3022 816 1430 -3333 -334
1981 -334 3135 -1453 -1120 3031 -354 -2064 2063 335 -1699 2404 1528 -1545 1872 1961 -2218 778
1997 778 2801 -1755 -64 3734 -494 -1518 2874 334 -2102 1787 1035 -1677 1609 1166 -2355 855
2013 855 1786 -2888 -693 2484 -1861 -1774 2365 -711 -2733 1335 -177 -2940 651 494 -2593 437
2029 437 1105 -2710 -376 1632 -2627 -1465 2501 -983 -2169 2048 223 -2437 1019 823 -1968 1142
2045 1142 1755 -1600 732 2297 -1719 -359 2768 -715 -921 3137 547 -1680 2339 1368 -1842 1274
2061 1274 1835 -1360 834 2048 -1476 98 2315 -1476 -1110 2595 -478 -2181 1853 408 -2372
2076 -2372 916 820 -2420 88 1244 -2316 -617 1558 -1869 -1413 1594 -1447 -2189 1700 -334 -2667
2092 -2667 1175 781 -2591 150 1305 -1993 -191 1643 -1479 -449 2223 -1009 -1365 2418 139
2107 139 -1773 2019 1171 -1624 1445 1878 -1497 555 2347 -1117 -55 2371 -489 -639 2395 49
2123 49 -1338 2119 716 -2002 1314 1439 -1836 309 1727 -1688 -513 1791 -1497 -1278 1779 -916
2139 -916 -1893 1454 -241 -2457 852 405 -2628 291 1190 -2273 -668 1536 -1589 -1302 1549 -1060
2155 -1060 -1587 1597 -303 -2087 1400 697 -2160 839 1415 -1669 354 2018 -1224 -292 2229 -629
2171 -629 -930 2340 325 -1248 1991 973 -1375 1549 1439 -1632 832 2110 -1434 -192 2332 -794
2187 -794 -991 1788 -419 -1591 1646 174 -1892 1108 747 -2212 175 1179 -1957 -474 1364 -1592
2203 -1592 -1252 1557 -1104 -2012 1203 -203 -2053 889 325 -2009 611 924 -2129 -131 1536 -1530
2219 -1530 -794 1891 -749 -1053 1928 -177 -1630 1643 734 -1537 1241 1407 -1387 700 1773 -1233
2235 -1233 48 2236 -711 -597 2307 6 -1170 1732 446 -1551 1330 991 -1575 719 1444 -1557
2251 -1557 -123 1513 -1256 -817 1524 -798 -1315 1500 -303 -1956 866 339 -2075 362 861 -1864
2267 -1864 -247 1141 -1656 -716 1398 -1181 -1413 1442 -282 -1581 1076 247 -1720 858 943 -1571
2283 -1571 424 1638 -1149 -141 1756 -720 -538 1802 -202 -800 1804 615 -1195 1287 1053 -1246
2299 -1246 756 1521 -1018 208 1789 -872 -504 1705 -414 -1084 1430 190 -1345 1082 435 -1736
2315 -1736 457 783 -1663 -38 1217 -1395 -793 1138 -1064 -1223 1130 -526 -1632 961 105 -1693
2331 -1693 358 527 -1617 59 984 -1359 -327 1427 -781 -996 1434 -195 -1042 1132 406 -1073
2347 -1073 1153 1024 -1045 642 1311 -959 181 1611 -598 -265 1861 -197 -889 1565 343 -1094
2363 -1094 1175 973 -954 560 937 -1158 89 1082 -1163 -398 1372 -706 -1115 1146 -253 -1629
2379 -1629 630 250 -1607 283 573 -1470 -161 770 -1364 -632 954 -974 -932 1174 -491 -1416 1061
2396 1061 209 -1533 535 829 -1182 242 970 -801 -36 1221 -817 -333 1694 -271 -763 1600
2412 1600 414 -1204 1150 873 -1067 594 1429 -732 -41 1366 -523 -321 1253 -537 -610 1454
2428 1454 -112 -1356 1117 447 -1555 269 933 -1203 -197 921 -1095 -621 897 -946 -938 963
2444 963 -485 -1315 950 -76 -1757 443 643 -1609 -13 1226 -947 -521 1002 -647 -663 1033
2460 1033 -279 -731 1399 175 -1249 1138 730 -1377 521 1439 -841 140 1620 -431 -403 1296
2476 1296 -141 -572 1199 130 -819 1276 465 -1328 793 1058 -1370 -55 1497 -850 -604 1078
2492 1078 -446 -812 806 -372 -1171 886 7 -1368 653 514 -1614 -98 896 -1366 -510 1241
2508 1241 -728 -981 887 -333 -1091 744 -35 -905 874 442 -1366 431 1018 -1310 -48 1577
2524 1577 -504 -515 1338 -52 -727 1022 191 -617 1144 651 -847 794 864 -1119 413 1364 -890
2541 -890 -391 1453 -334 -805 1083 95 -914 650 42 -1111 649 418 -1217 195 897 -1289 -480
2558 -480 952 -804 -874 856 -238 -1047 610 -102 -1223 388 293 -1050 430 635 -1175 -121 915
2575 915 -974 -604 1271 -91 -748 942 132 -761 613 371 -651 811 870 -717 268 1008 -681
2592 -681 -323 1215 -257 -343 1320 185 -810 808 455 -833 531 617 -795 389 734 -961 -234
2609 -234 1034 -717 -736 890 -190 -1007 602 142 -992 270 268 -1163 88 465 -945 -62 720 -842
2627 -842 -639 859 -509 -884 821 136 -965 483 321 -944 279 558 -766 238 883 -626 -194
2644 -194 1074 -242 -575 989 230 -645 840 506 -692 512 651 -604 298 873 -519 -65 929
2661 929 -393 -486 870 -175 -793 751 303 -900 292 414 -831 20 457 -837 -168 683 -710
2678 -710 -576 585 -510 -924 564 -147 -983 416 290 -965 103 468 -912 -239 666 -585 -250
2695 -250 823 -390 -468 853 77 -773 701 475 -690 450 721 -459 155 855 -427 6 1019
2712 1019 -191 -258 1057 83 -587 816 267 -689 554 568 -694 179 697 -700 -185 740 -563 -312
2730 -312 857 -378 -716 707 -93 -959 301 203 -982 99 444 -899 -209 530 -838 -512 619
2747 619 -454 -595 615 -226 -689 519 144 -915 332 472 -659 73 787 -487 -127 871 -301
2764 -301 -257 1003 28 -482 815 348 -578 570 581 -552 357 750 -532 60 809 -419 -297 796
2782 796 -216 -529 664 89 -722 447 243 -903 247 486 -733 -169 521 -602 -439 521 -590
2799 -590 -676 643 -219 -789 396 48 -825 196 232 -786 32 552 -635 -214 700 -366 -450 573 -90
2818 -90 -376 657 133 -546 644 412 -603 366 674 -417 162 786 -273 -87 746 -101 -344 764
2836 764 207 -524 553 357 -586 277 490 -613 -130 598 -419 -223 636 -279 -407 514 -208 -781 399
2855 399 55 -805 119 196 -791 -100 352 -677 -299 478 -556 -486 589 -189 -545 436 -3 -623 369 236
2875 236 -585 169 464 -512 -2 681 -347 -164 751 -80 -191 699 92 -408 602 384 -465 407 609
2894 609 -367 132 654 -401 -22 628 -230 -319 515 -5 -537 406 115 -544 297 243 -616 87 404 -677
2914 -677 -341 486 -471 -432 291 -226 -524 341 -29 -635 184 105 -717 -34 347 -469 -112 502 -374 -351 555
2935 555 -214 -487 554 156 -483 299 297 -379 312 528 -479 62 653 -166 -142 681 -21 -213 678 51
2955 51 -254 599 313 -486 313 417 -420 77 465 -454 -85 553 -334 -374 499 -120 -580 364 31 -643 134
2976 134 152 -593 74 334 -471 -311 338 -398 -451 385 -247 -438 444 -132 -640 304 116 -554 101 470 -452
2997 -452 -62 480 -243 -144 642 -83 -357 575 117 -414 502 294 -357 428 422 -385 208 602 -393 -20 630
3018 630 -135 -213 523 -76 -327 570 147 -443 382 225 -582 199 423 -460 -12 427 -458 -381 409 -319 -551
3039 -551 266 20 -471 224 48 -684 -17 231 -567 -35 407 -465 -312 352 -309 -422 466 -35 -398 443
3059 443 196 -387 243 275 -456 141 490 -339 90 575 -114 -178 644 43 -348 546 135 -234 479 324 -433
3080 -433 218 401 -421 57 500 -207 -106 555 -206 -464 370 -145 -526 231 54 -519 102 170 -496 -164
3100 -164 138 -544 -122 392 -405 -355 349 -142 -578 140 -3 -485 286 223 -364 43 266 -371 -67 496 -225
3121 -225 -124 508 -39 -269 566 154 -392 478 385 -228 220 436 -271 133 385 -233 -77 551 -70 -184
3141 -184 475 40 -367 265 164 -427 176 284 -381 -8 293 -428 -222 205 -367 -219 310 -74 -466 168
3161 168 -117 -604 60 60 -403 74 203 -431 -85 205 -436 -248 386 -52 -257 321 -47 -268 286 110 -347
3182 -347 140 449 -249 23 436 -76 -56 332 -115 -89 496 67 -156 396 122 -301 242 268 -257 92 419
3203 419 -164 -60 340 -185 -274 269 -17 -302 241 40 -341 160 92 -653 -9 250 -373 -197 226 -218 -285
3224 -285 167 -228 -282 200 -1 -340 216 73 -341 47 206 -357 51 426 -265 -70 356 -145 -254 349
3244 349 36 -214 326 282 -168 254 289 -228 43 407 -148 18 519 -54 -95 334 27 -302 318 97 -189
3265 -189 142 234 -280 58 229 -318 -62 309 -266 -212 313 -61 -298 167 -58 -416 151 61 -356 51 91
3286 91 -395 -152 240 -214 -184 299 -138 -251 331 -48 -301 152 121 -292 96 233 -220 89 271 -252 -53
3307 -53 345 -39 -129 316 12 -275 316 117 -215 321 184 -274 162 300 -278 12 332 -111 -135 385 -124
3328 -124 -212 372 99 -294 114 53 -304 83 153 -307 -121 267 -194 -185 198 -169 -360 207 -30 -234 164 101
3350 101 -356 98 191 -273 -10 197 -212 42 294 -161 -22 263 -83 -176 288 55 -175 137 196 -207 165
3371 165 241 -135 32 340 -145 -51 394 -23 -188 299 32 -278 274 203 -258 89 233 -276 22 232 -144
3392 -144 -69 198 -195 -187 136 13 -235 165 121 -302 -25 66 -231 -68 80 -219 -77 242 -122 -103 86 -89
3414 -89 -252 162 112 -192 102 212 -224 83 230 -84 -81 162 -90 4 248 57 -120 261 148 -154 173 246
3436 246 -159 40 158 -136 37 228 -104 -102 170 -79 -69 98 -65 -113 47 91 -177 7 119 -188 -42 149
3458 149 -268 -31 219 -167 -110 118 -66 -264 71 -57 -317 46 99 -225 -38 113 -143 -39 187 -73 -38
3479 -38 176 -23 -77 122 87 -131 141 92 -76 97 141 -67 -12 258 -30 2 285 40 -214 170 68 -188
3501 -188 215 47 -201 79 92 -162 25 8 -103 -108 110 -163 -67 68 -104 -131 155 11 -317 -63 52 -192
3523 -192 -155 161 -219 -87 110 -147 -160 205 -93 -200 217 35 -66 111 217 -129 30 142 -112 45 211
3544 211 -56 -3 266 73 -12 280 128 -3 163 200 -180 87 109 -156 76 146 -158 -187 147 -72 -130 121
3566 121 -38 -137 135 -4 -123 41 0 -201 8 117 -211 -32 123 -45 -167 118 -89 -97 256 -54 -159
3587 -159 21 62 -198 0 132 -63 -36 161 -139 27 150 -29 -131 218 46 -103 168 29 -86 70 138
3608 138 -36 -20 143 -49 -60 213 -50 -85 187 98 -74 116 28 -80 21 10 -278 7 123 -133 -141 110 -24
3631 -24 -191 122 10 -113 68 29 -263 113 21 -253 12 36 -200 -76 88 -161 -110 209 -145 -23 208 -47
3653 -47 -24 110 -3 -137 77 142 -138 26 143 -81 10 234 -34 32 199 -45 -174 171 78 -113 48 188
3675 188 -72 21 64 -81 13 21 -90 -12 143 -108 -133 128 19 -200 -1 61 -75 -10 43 -121 -36 67 -126 8
3699 8 39 -84 -139 70 9 -78 13 -29 -88 19 110 -38 -39 167 6 -40 79 -4 -29 146 71 -109 122 72 -158 102
3725 102 155 -55 140 81 4 -40 139 -42 -92 112 36 -70 69 131 20 120 11 -172 -20 82 -18 20 -22
3748 -22 -23 24 29 -49 -124 127 62 -69 102 34 -218 -58 31 -90 -74 48 -42 -55 155 -25 -93 87 -54 -146 73
3773 73 79 -122 42 147 -20 18 165 -81 -91 141 -36 -87 109 89 -12 95 10 -88 7 65 -139 15 132 -95
3797 -95 45 33 -15 -113 133 30 -115 10 119 -94 55 34 -146 -17 115 -39 9 80 -19 -111 112 20 -31 95
3821 95 -125 -176 23 -4 -72 -37 50 -61 -144 85 -57 -43 50 -16 -32 28 7 -81 81 188 -73 107 67 -26 0 92
3847 92 -31 11 153 -10 -43 36 -8 -21 112 36 -92 76 68 -184 -53 65 -64 -97 96 -100 -120 84 -69 -40
3871 -40 80 8 -89 -23 -9 -124 45 44 -92 -63 53 3 -50 49 -66 -71 46 -15 -111 8 66 -133 54 53 -98 49
3897 49 128 3 -10 175 -13 -47 58 56 25 21 105 -181 49 113 -36 44 103 1 22 102 -81 -62 61 -18 -89 68
3923 68 -16 -88 22 66 -37 -3 45 -108 -35 3 -81 -62 40 -99 -230 -16 9 0 -49 -38 -125 22 87 -8 -27 101
3949 101 57 -92 99 -65 -22 76 73 -65 128 58 -14 -58 97 -90 25 88 -10 -20 109 -26 76 124 14 -99
3973 -99 85 70 -122 -106 58 -73 -15 -92 -120 -60 54 -15 -52 2 -127 -66 12 39 -30 98 -36 -68 -11 1 -113 -57
3999 -57 -4 -20 -68 50 -21 -63 29 79 -126 55 71 -135 108 89 19 -27 104 48 -40 33 75 -69 98 69 -37 85
4025 85 -76 -61 -29 22 -38 41 98 -24 -77 136 -45 -137 6 46 -61 27 -22 -48 20 3 -51 -100 29 14 -133 34
4051 34 -49 -71 -17 -11 58 -9 92 -46 19 26 -56 -12 5 -76 -50 62 -74 -32 53 104 -62 99 88 -82 7 8 -15 -49
4079 -49 112 42 67 99 -61 -53 141 45 -52 63 -26 -29 32 166 -88 -32 113 -133 -51 87 -33 -61 137 -72 -124
4104 -124 82 -42 -70 -17 63 -133 -73 10 -52 -82 100 -68 26 47 -2 -28 20 56 -68 53 61 -101 -7 19 -4 -45
4130 -45 121 31 50 29 43 -28 95 -9 -64 -50 52 -22 11 41 -109 -27 81 -49 -99 187 87 -118 23 5 -76
4155 -76 -63 -7 -22 2 69 -5 -47 18 -19 -53 -36 -76 -73 -54 86 -58 48 -110 -9 -1 -23 -106 -24 55 -71 -57 88 -34
4183 -34 2 94 -70 -44 14 -2 -5 79 -31 -64 48 60 57 -32 68 -20 -62 108 31 -58 31 69 -59 96 -26 -33 -15 -30
4211 -30 -61 38 27 -60 -43 143 69 -45 20 -11 -16 -8 -65 -37 -44 78 -93 -20 -5 38 -72 87 20 -107 31 -35 -75 4
4239 4 50 -71 -44 59 17 28 121 9 -8 78 -77 -157 65 -54 17 75 76 -78 32 60 -3 31 -3 -93 11 78 18
4266 18 -46 21 30 11 6 10 -79 -54 -20 -50 40 54 -122 -4 70 -21 -39 34 68 -16 1 -117 -64 40 -15 -105 2 29 -39
4295 -39 35 148 -51 22 87 -38 -18 146 46 -74 67 -2 -11 21 55 13 93 84 -103 -56 81 66 -23 83 -54 -2
4321 -2 13 33 -84 97 48 25 -30 7 15 -37 38 -99 -68 27 2 -109 -17 -84 -138 -44 21 -51 9 26 -30 -20 58 -38 18
4350 18 60 -58 59 23 86 -73 59 113 -79 -19 125 -58 40 11 17 -35 46 -32 -2 -6 31 -9 91 30 -46 67 93
4377 93 -4 30 48 3 -20 5 -40 22 116 -41 -56 -63 -4 -105 9 23 -42 23 -121 -130 -101 22 -111 -32 78 -25 -30 76
4405 76 11 -171 57 22 -3 -37 84 -125 -51 120 -36 73 22 -31 -41 16 -47 5 114 42 -33 26 173 -21 53
4430 53 113 6 34 14 -32 -20 16 40 14 44 30 -35 4 127 -61 -34 63 -129 -40 51 -33 29 68 -86 -63 -26 -21 -72
4458 -72 -45 -46 -150 12 35 -82 -122 44 -81 -104 44 -64 -53 77 28 -62 105 42 -81 117 74 -53 63 102
4482 102 -85 33 108 14 -89 -7 -7 -2 -8 102 -128 194 80 -38 -26 54 -117 -26 80 -13 -63 -24 -40 62 100 44
4508 44 -20 9 -28 -49 -2 -27 -24 -86 14 -85 -16 52 18 -66 5 -64 -68 63 -37 -62 -12 -23 -60 0 44 28 -15 5 -37 -51
4538 -51 143 32 -83 46 52 -28 6 170 13 -35 4 -17 -26 79 68 -81 69 12 -169 123 28 -8 108 54 5
4563 5 31 104 -81 64 52 -45 31 32 22 -64 98 8 -93 15 61 -64 -1 42 -99 -54 -33 -50 -90 8 -116 2 -41
4590 -41 10 -107 46 -8 -61 146 -10 -120 -58 100 -107 -18 84 -73 27 49 25 -80 139 112 -58 48 40 -122
4614 -122 75 36 -32 -14 82 9 -33 119 -42 -23 100 101 -59 8 61 -107 130 53 -135 -14 107 -87 -26 137
4638 137 -79 -119 74 -112 -30 58 -76 -94 -37 6 -148 -83 43 -231 -60 49 -63 -46 112 0 -31 25 47 -81
4662 -81 17 12 -32 21 99 6 -41 64 -70 37 130 -32 13 93 -11 -28 4 -2 16 50 82 -39 -41 71 -47 5 111
4689 111 -73 31 31 -77 -40 72 0 -79 10 -17 -57 54 89 -195 -109 166 -35 -138 20 -34 -84 15 -17 -29 106
4714 106 67 -124 -24 39 -51 60 42 -74 31 38 3 -79 75 22 -3 37 -76 -40 92 75 80 86 124 24 68 194
4740 194 -26 4 27 3 -79 72 33 -87 35 92 -70 31 11 -83 -100 26 -74 -65 -20 -154 -46 40 6 -105 70
4765 70 -47 -69 7 62 -101 -42 120 -140 -11 75 19 -2 63 31 -68 63 -5 -96 48 -3 6 79 52 -49 8 107 -16
4792 -16 79 144 85 -61 85 42 -42 35 18 -5 21 108 -134 -20 32 -125 -34 20 15 -64 116 -33 -65 -2 -19 -77 -34
4819 -34 20 -73 -46 71 -48 45 50 -63 -68 -24 -1 -18 80 -11 -65 33 11 -83 23 142 -47 37 75 11 73 72 11 -24 133
4848 133 131 -18 45 62 -70 44 8 14 -31 123 -63 41 64 7 -126 -47 58 -66 14 83 -77 -100 89 -107 -41
4873 -41 -25 -74 -51 15 18 -77 -13 66 -42 64 -35 -188 16 104 -50 -84 51 16 2 75 1 17 113 -94 -91 117 -24
4900 -24 -73 112 38 -32 40 90 -22 -36 103 -70 16 119 2 58 121 -20 -26 62 49 -72 5 147 -45 -76 62
4925 62 -100 -44 12 -46 -56 16 14 -3 21 46 -61 -98 24 -14 -12 10 -94 -78 -9 -25 -47 66 -64 -89 49 32 -158
4952 -158 1 -30 -57 -27 123 -1 19 137 3 -104 -39 -42 15 85 57 -32 98 -33 -123 46 42 -35 53 82 -30 20
4978 20 61 -54 -82 64 67 -38 139 -62 -67 63 -12 -134 -50 -3 -116 -100 -3 -39 -107 31 62 -10 -33 -7 -94 27
5004 27 -44 -234 -24 20 -103 -75 66 -136 20 54 26 -8 23 -11 -44 80 -52 -31 -15 5 -22 -49 78 -7 -104 172
5030 172 -48 5 126 76 24 21 142 -11 5 83 -63 76 -27 -53 21 33 -88 -63 51 -38 -87 -29 -7 -62 -88 -27
5056 -27 -148 -5 -25 -61 -102 10 -28 -55 -57 -119 -136 -9 1 13 -18 -11 -115 -74 56 26 -2 -20 4 -21 85 68 1 110
5084 110 45 4 39 82 32 93 97 -30 57 60 60 17 10 -125 -114 -13 51 -55 71 62 -62 20 -64 -100 -69 -83 -78 -18 46 21
5114 21 -150 0 -59 -70 37 -73 -49 -94 13 -22 -77 76 -57 -42 29 -55 -26 103 35 -18 73 5 -84 48 7 -8
5140 -8 26 122 67 45 39 -21 41 4 7 -60 70 39 -40 -42 140 16 -91 100 -43 -23 31 28 -57 12 -119 -50 14 38 -39
5169 -39 -5 5 -30 -4 15 -10 -31 -69 -92 -9 82 -20 -36 -4 -124 14 18 58 -95 52 49 -76 43 10 -53 63 137
5196 137 14 36 4 92 -97 45 33 -48 -20 -14 -45 -39 88 -59 -49 21 1 93 -54 -17 45 83 5 -71 -9 -27 -31 65
5224 65 -22 -138 8 72 -144 -13 4 -37 30 28 77 -43 -16 -7 -79 7 51 -41 -88 35 31 -145 55 -13 67 10 -23 16
5252 16 -32 -4 -66 65 66 -3 -5 -31 42 -4 43 102 -66 -14 91 -16 44 -40 -46 -40 33 -62 -5 -67 -88 26 53 -18 13 -57
5282 -57 -10 -25 1 -30 -124 28 -71 40 47 25 -43 31 9 -39 -25 104 -37 -51 -12 -54 -92 9 32 64 145 28 -13 -7
5310 -7 -49 29 -41 27 6 -72 48 -85 -123 -116 46 7 4 44 15 72 -30 -115 11 -5 25 33 -21 -87 -27 32 -106 -41 -8
5339 -8 14 -53 24 10 -45 -11 33 35 -54 73 -9 -32 -115 -34 -17 54 15 51 -84 37 -3 15 88 -52 5 19 52 -83 70
5368 70 -34 -15 -32 -66 -78 -9 -37 -41 -37 -60 -53 -19 -55 13 -38 -10 2 -1 47 78 27 56 38 -5 44 -21 -29 -21 87 -45 -6 -5
5400 -5 -123 -84 5 30 32 77 21 11 33 -87 -43 20 -12 -85 -104 -15 63 -80 35 8 -41 -58 18 -95 16 -86 -86 50
5428 50 -54 -15 18 24 18 -29 45 45 -45 98 47 -14 -44 -2 4 55 108 43 -93 -12 60 11 5 -20 -56 51 55 -74 28 54
5458 54 -61 -93 -43 -56 -5 -25 8 65 19 -24 -108 -51 -13 15 80 32 -72 42 -71 -65 -26 10 1 -112 -93 -88 4 -9 -12 -29
5488 -29 20 61 -17 102 62 -26 20 69 -44 74 48 -42 33 44 -74 15 26 -96 -61 90 101 47 14 89 -91 61
5514 61 7 15 -83 101 9 -47 -37 48 49 -14 -88 -54 29 -68 -74 27 41 -9 -27 -47 -55 -70 1 -62 54 56 -2 -63 78 0 0
5545 0 10 114 21 8 25 13 1 38 2 18 -88 34 -46 58 70 -15 73 127 48 15 13 34 -55 59 -66 54 7 82
5573 82 3 66 24 -48 23 8 -20 -49 43 -41 -8 10 -119 16 40 9 46 -39 78 -78 142 60 -30 -36 47 31 -37 26
5601 26 116 -111 69 20 1 89 46 -28 -22 101 106 38 70 26 16 34 -19 -39 23 30 -15 22 -23 97 -8 93 -9 -41
5629 -41 88 -25 -58 -31 -60 -26 6 -42 -5 31 -46 113 38 48 -24 56 -50 -72 -12 127 55 -24 124 -94 -36 2 6
5656 6 26 83 -69 9 17 -17 -53 4 -39 -11 -7 56 12 -48 -18 77 3 -2 42 -75 -25 17 -36 -49 126 22 3 -65 -24 -51
5686 -51 -12 -18 -99 59 95 -23 4 123 -58 -11 7 -75 14 -25 4 20 -25 40 -12 -36 -108 -32 72 -71 -19 17 31 -18
5714 -18 38 95 -62 -136 -36 -3 -12 5 57 -24 -10 -12 -52 32 129 27 58 94 25 -59 -57 -109 25 68 -7 -71 47 27 -10
5743 -10 18 23 -74 -14 22 33 -4 63 1 -65 14 19 -60 -13 81 -66 -12 -46 -48 -30 23 -4 -101 -34 -8 20 56 17 -64 49 -6
5774 -6 -44 69 30 -78 22 -9 -111 -84 34 12 -55 23 -77 -33 26 32 -3 22 -14 -68 -9 102 100 22 65 -73 35
5801 35 -49 -39 -65 48 -43 -11 -5 117 -3 2 -6 -121 -22 54 -39 -159 50 -22 16 67 3 25 63 -55 -136 -40 -32 -78 77
5830 77 42 -41 -73 9 -11 -21 -42 -87 -114 -9 0 36 62 141 14 8 76 31 6 -24 -18 26 44 32 9 7 -30 33 53 64 -52
5861 -52 59 -37 -45 59 0 -107 -31 11 79 -54 -62 -61 -57 -31 -46 -37 -1 26 -76 -29 18 4 -75 32 -104 -130 -54 -62 -74 -30
5891 -30 42 -32 7 57 -53 50 -6 5 8 45 -31 -64 73 3 -40 102 74 -21 50 86 -10 -56 101 19 21 14 68 -6 68
5920 68 81 -9 -25 30 -27 -36 42 32 16 -83 -56 -31 34 9 -28 -8 -30 -100 15 -55 -138 81 -86 -82 -60 -124 -105 -49 -1 -22
5950 -22 -149 79 41 -10 45 24 -116 -48 -44 -49 7 65 17 -28 55 -55 14 -47 -47 -6 50 40 -41 47 -145 -66 14 25 -70
5979 -70 -32 -50 -65 6 11 -20 -8 -37 -15 -54 -49 -14 14 21 28 25 -21 19 -105 -71 -52 -24 -27 5 -31 -80 96 -37 -76 -14 -4 -45
6011 -45 -62 -40 48 -41 38 -6 -62 60 -59 -19 -16 83 -81 -3 4 -27 11 30 40 53 38 -17 -22 86 -41 -84 57 -43
6039 -43 -28 -56 67 56 29 -40 11 -4 51 -72 -27 -49 -91 -31 56 -46 -43 26 -52 -54 -8 18 -109 71 81 5 54 -49
6067 -49 43 -37 -62 -140 -13 72 -49 13 56 91 -18 66 -67 22 -59 38 -50 -25 16 24 -18 -74 21 -71 85 1 -40 25
6095 25 -3 -60 16 0 -37 -25 49 -11 -12 92 -10 72 17 55 119 -62 -16 -31 -4 -4 10 119 -11 4 -1 58 -63 -61 0
6124 0 -35 -36 69 0 -137 13 28 -96 -29 69 -43 -26 10 39 -9 -26 -38 -5 18 3 30 78 -14 7 38 -53 -17 8 45
6153 45 62 53 20 -33 19 -17 13 28 8 89 15 92 -25 -16 21 56 12 -30 -12 -6 -17 -26 89 -87 -44 -29 0 -39 -92 18
6183 18 26 52 -56 9 2 4 3 29 -119 -133 -21 -72 -47 -2 40 141 80 46 -84 42 44 -19 47 54 -1 -58 58 -39 28 14
6213 14 20 38 39 -8 -32 -46 0 63 -28 26 8 20 52 65 -52 -36 89 -12 19 -29 -115 54 -3 6 54 98 -97 -52 -25
6242 -25 4 -52 44 -21 -75 79 -56 -1 85 -51 -1 -45 65 -46 22 16 16 -90 45 45 3 2 70 -59 22 31 -78 52
6270 52 -48 15 -13 51 90 -113 -5 46 54 33 -149 15 -7 87 -67 -44 -9 48 7 19 69 -98 23 36 -122 31
6296 31 -25 -36 -63 44 -43 -74 39 20 -25 -60 -17 -15 62 4 -61 8 -62 -12 116 -13 -89 37 29 -78 24 36 -59 -31
6324 -31 112 14 41 95 -69 -29 44 -108 2 -52 31 -49 -3 61 9 -47 -75 -34 -66 79 -66 -81 -17 -1 -17 29 -18
6351 -18 -55 -9 -25 -99 -11 53 -73 -71 47 -6 18 -21 -43 -5 16 -2 -33 74 -8 -68 -91 -78 -5 -17 52 -17 -58 -3 10
6380 10 -61 2 -1 -2 -31 -63 -12 -51 -43 -38 -25 -8 39 31 -31 -1 -58 26 -47 -118 34 -33 -63 15 29 -88 21 -20 -35 -22 36
6411 36 -92 -5 44 56 34 18 -75 -85 30 -61 69 -23 50 -49 -94 52 -22 -13 -4 130 -64 48 103 39 -9 50 33 15
6439 15 8 -44 -46 -29 101 -64 51 -27 -44 -20 -100 -34 18 -49 -13 -86 21 -23 -43 69 -79 -47 -34 36 -8 -87 95 -14
6467 -14 8 -25 -4 -88 32 32 18 -74 -3 -21 21 41 -57 -24 1 106 10 9 -40 -40 22 -58 -49 48 -19 2 11 15 -10 25 59 -43
6499 -43 -80 22 -2 -27 -16 -87 -11 -2 -15 -40 53 10 0 18 -2 7 -21 8 -3 8 -31 24 -1 92 -98 -89 78 41 -59 -15
6529 -15 81 -5 -11 70 -44 16 -6 -35 -31 -7 1 26 89 -40 44 -6 -30 -12 19 26 -24 -3 70 -79 33 36 -40 -23 69 81 -63
6560 -63 -13 15 105 -48 -27 -69 53 1 -14 49 4 0 -89 0 -4 -1 85 -90 -42 -29 -35 9 -37 75 -16 105 9 -13 -57 -1
6590 -1 -23 23 -13 -31 -13 18 -46 -35 -14 65 -86 -32 -26 -108 32 108 -53 7 40 -48 2 5 -37 15 -35 8 -42 18 140 37
6620 37 47 71 60 -129 96 -10 -19 -9 68 -62 9 -36 -3 76 67 12 39 66 3 -15 24 -68 17 -44 0 -60 -18 -49 -33
6649 -33 42 -58 -52 -37 -15 -92 -60 -22 -15 -13 78 7 -33 -40 4 -46 13 40 7 62 -29 -14 -99 95 14 -6 42 -32 16 37 -4
6680 -4 -4 23 111 80 47 11 -51 94 115 -58 27 86 41 21 47 9 50 35 -34 -38 -64 74 -2 -71 1 -31 -28 52 -82 -17
6710 -17 84 -6 -110 -5 38 -47 15 -12 -11 -61 46 -3 -93 20 -39 62 1 22 27 37 122 11 19 65 -16 18 -3 -23
6738 -23 -29 28 -13 40 -71 -9 -41 -14 124 -21 37 -28 -53 50 20 6 26 62 -7 -88 -25 -39 5 54 -54 -36 -79 1
6766 1 -103 11 -67 -50 -23 -5 46 -20 20 -14 34 6 -23 -61 3 4 -15 -35 -56 -64 95 74 -7 -102 66 -7 -19 177 97
6795 97 62 135 0 45 39 76 16 -38 57 28 -38 64 31 -5 2 -86 14 3 -60 -133 -10 0 -81 -69 72 -111 -38 36
6823 36 -1 -73 38 -19 3 -33 -36 -99 -2 -90 26 -25 -90 -12 -31 36 14 -9 -42 -5 38 23 -36 -10 89 23 -2 0 76 -28
6853 -28 -11 -27 31 4 118 68 114 46 -49 -16 -5 66 -22 44 -26 -61 -20 -34 -14 -39 49 -59 -64 -11 37 41 22 -22 -47 29
6883 29 31 -48 23 -86 -114 83 4 5 42 80 -1 -42 -51 -16 -80 -76 -4 -47 7 -11 -52 30 37 -2 53 135 -70 -50 -64 73 98
6914 98 27 -56 -104 75 -46 22 -21 2 -25 22 -8 -52 -8 3 -20 18 -85 -82 -111 32 -3 -106 0 48 6 31 6 15
6942 15 7 -3 14 -15 13 -77 -56 -25 -44 -127 -39 26 -60 -3 -48 -12 -5 -63 28 61 37 -77 -9 26 -35 -33 -50 37 -54 -50 87
6973 87 -13 -11 39 -65 -12 42 -111 48 -27 -46 42 -16 -61 -52 46 26 -40 -3 5 -28 -40 55 6 -51 -41 -56 61 8 96
7002 96 -7 -26 38 11 36 -45 -76 -131 -59 26 52 38 13 7 3 6 -8 34 -92 -25 -28 -93 -9 -9 36 82 17 44 -65 -72 67
7033 67 -18 57 10 74 -4 -7 -107 -3 26 54 56 -86 26 75 49 -21 64 -4 84 60 9 -103 35 57 -48 18 -62 -30
7061 -30 43 -38 -111 -68 -94 -7 -23 54 -55 -82 -14 45 14 15 32 -66 -11 -80 -42 -53 -80 -14 -68 64 -91 27 -85 -16
7089 -16 20 4 31 40 81 -41 -68 37 38 -89 56 51 38 39 -19 1 62 45 46 20 86 -93 14 32 -18 -28 8 -13 -37 -5
7119 -5 -37 -87 37 12 -95 -9 111 29 2 16 -114 -41 53 -13 -99 -55 -32 7 -54 90 -57 37 63 -40 59 -47 -10
7146 -10 84 18 19 21 54 -9 -1 -34 20 56 -34 39 28 -40 89 -18 15 73 -43 -78 -50 -18 -37 12 -51 -46 -7 2 -48 54 28
7177 28 -68 -16 -38 17 25 34 -27 -129 -21 -6 -62 63 -8 25 113 -38 -52 -28 60 -61 -104 99 30 -25 22 50 57 -2 19
7206 19 -9 9 21 20 6 -31 -119 15 80 19 28 68 30 7 -33 -99 26 -12 -8 -41 -33 52 69 -18 42 -51 -35 34 96 -42 12
7237 12 -68 -46 -3 90 -46 -26 68 -22 34 -88 80 -5 34 -10 7 20 -3 -112 81 -21 5 12 18 -17 -22 38 -37 42 13
7266 13 -18 -10 -36 -59 64 1 -95 44 46 32 -17 4 -1 -70 -33 -34 -49 13 34 12 -14 20 -1 48 6 14 -64 129 -92 -41 -44
7297 -44 35 30 24 -18 -32 -15 -14 74 -14 -2 -47 6 15 22 -7 0 36 -65 -97 97 46 12 51 52 -65 1 -10 11 -81 11 -45 -14
7329 -14 16 29 -55 82 -17 -36 -31 25 23 -13 -16 -50 -55 17 -87 -30 -32 -57 58 75 56 -32 127 -47 -18 74 93 -73 18 33
7359 33 -59 7 -66 -73 -54 -23 -40 -36 75 -43 -28 43 20 -8 -35 76 -7 -7 -57 -30 -35 5 -33 50 -15 -62 5 29 77 -105
7389 -105 -25 57 -41 2 36 -29 79 -37 35 33 15 38 18 77 23 -8 45 -12 46 2 -130 19 28 -17 8 -25 49 -45 -73
7418 -73 11 -17 -37 31 -83 -77 17 -9 -97 18 11 -66 40 -83 29 -103 46 -81 -34 26 -2 8 -19 12 -39 23 62
7445 62 28 45 -5 6 48 21 98 87 29 14 6 77 -10 14 123 65 8 27 -25 -21 41 -43 -59 -5 30 -106 -60 22 7 -81
7475 -81 -22 16 -72 -67 -70 60 -49 20 -40 -18 11 -93 -142 16 30 -65 -61 -8 19 -73 -73 -32 7 58 69 -103 34 -40 -71
7504 -71 85 -84 -8 43 18 -11 4 127 -50 63 67 39 14 82 48 -5 0 -7 -14 105 -29 -7 20 72 -43 33 -95 38
7532 38 -13 37 -52 -36 30 15 11 5 -2 -8 -4 62 8 -10 -23 32 75 6 -34 -36 73 -30 2 -87 21 -26 56 129 -5 42 40 46
7564 46 27 -65 23 25 43 34 28 63 -83 0 31 43 34 -43 -76 -15 -105 -26 -1 8 -50 78 -49 -28 2 -47 1 -57 6 -9 -37
7595 -37 -10 -84 5 -43 -39 11 -65 -62 -27 -2 -125 6 12 -97 -87 23 3 -26 67 -19 -34 -14 -23 -1 103 5 30 -106 -1
7624 -1 -4 23 2 11 4 49 18 -44 12 -15 39 -40 6 -1 -5 -86 -10 -3 -66 83 70 -99 14 -64 28 2 -40 59 -31 64 40 -39
7656 -39 -49 20 -9 -15 68 19 20 26 -27 -61 -40 62 66 19 -21 -41 -34 29 15 45 -13 92 -42 55 3 -109 6 -3 54 30 -46
7687 -46 -74 6 2 -75 -3 51 -86 77 70 -32 -14 17 7 77 4 32 -37 -58 -62 -28 31 -47 -34 -16 33 -125 16 7 70 -22
7717 -22 -10 -3 -8 -30 115 -4 -1 140 -43 -40 -19 -76 -89 19 -59 -28 48 -11 -86 61 13 -20 -23 53 27 12 5 75 -85 67
7747 67 28 -78 -81 -36 44 88 -4 26 -9 -9 -5 0 -12 73 6 1 28 35 108 36 -41 -38 -68 48 27 46 105 -14 -84 -34 42 19
7779 19 -31 -105 15 -39 -112 -83 46 -8 -64 6 9 33 -45 -72 -23 25 74 -6 80 40 -62 -21 36 100 46 99 47 -2 23
7808 23 18 64 5 55 96 66 -3 -22 8 -19 31 29 24 -5 -39 -8 -33 81 -47 -14 -28 -4 -90 19 -50 -50 -64 -2 -95 -53 -111
7839 -111 12 34 -28 7 -78 42 77 88 -15 -26 -55 28 -21 51 29 42 -13 -5 101 58 41 -51 -2 52 19 -47 37 24
7867 24 67 50 13 124 -40 -95 -12 -17 -34 -48 -80 79 7 -53 -20 56 45 -75 1 35 -67 30 4 -45 -25 -27 -30 -22 48 -11
7897 -11 -76 -16 53 11 7 -2 28 -43 20 -5 40 21 -40 45 -38 -42 -5 -1 48 30 -20 115 40 4 30 74 42 -31 -5 7 36 16
7929 16 -29 -63 -22 5 54 43 31 39 33 -7 -93 -46 -12 -25 -17 -34 -19 112 29 -99 -88 18 -76 -7 2 14 12 21 23 48 59 -69
7961 -69 -65 -13 -11 -19 -71 19 3 1 -98 -57 50 -51 -7 7 -1 -25 6 49 -9 45 -44 -83 -19 30 -32 -19 -27 42 -8 -81 16 19 -38
7994 -38 28 32 -42 -21 -20 25 -5 84 4 -42 67 17 60 -60 140 71 -66 103 28 10 -46 20 103 32 -4 72 33 -78
8022 -78 -80 -14 -33 75 53 19 -8 20 -6 -16 9 51 -29 -13 -44 30 9 3 -59 -76 4 25 -87 -56 -28 -75 18 4 -69 -21
8052 -21 -8 -8 -18 22 109 -10 -45 -17 1 -65 -36 -62 19 39 114 -10 4 18 -17 42 31 9 -2 2 85 -11 3 -62 -65 -54 24
8083 24 31 16 69 12 15 69 -10 20 -22 -36 -70 -51 44 -54 -32 -51 -32 75 -37 2 -54 -40 -51 15 58 34 22 -23 -8 56
8113 56 85 -48 23 -14 78 33 14 55 -83 7 -2 -12 83 -52 -26 28 -61 -79 -8 18 -12 55 -10 -89 66 83 -40 15
8141 15 11 143 20 -34 -40 17 -4 -5 18 -9 -27 46 5 -2 -44 8 29 31 -9 3 31 41 85 -24 10 44 48 70 -15 119 20
8172 20 -46 -98 9 -29 -30 44 45 65 -71 -40 -37 11 84 -21 -126 -2 -19 -37 -2
8191b
##END NTUPLES=NMR FID
##END=
