##TITLE=1H ikalashn
3754
14.10.2024
##JCAMPDX= 6.0         $$ Bruker NMR JCAMP-DX V2.0
##DATA TYPE= NMR FID
##DATA CLASS= NTUPLES
##ORIGIN= UXNMR, Bruker Analytische Messtechnik GmbH
##OWNER= root
$$ TOPSPIN		Version 1.3
$$ 2024-10-14 14:17:37.890 +0400  Irina@DPX200
$$ Compression mode = diff/dup
##.OBSERVE FREQUENCY= 200.131392401
##.OBSERVE NUCLEUS= ^1H
##.DELAY= (6, 6)
##.ACQUISITION MODE= SIMULTANEOUS
##.ACQUISITION SCHEME= undefined
##.AVERAGES= 64
##.DIGITISER RES= 18
##SPECTROMETER/DATA SYSTEM= spect
##.PULSE SEQUENCE= zg
##.SOLVENT NAME= CDCl3
##.SHIFT REFERENCE= INTERNAL, CDCl3, 1, 17.95386
##AUDIT TRAIL= $$ (NUMBER, WHEN, WHO, WHERE, WHAT)
$$ ##TITLE= Audit trail, TOPSPIN		Version 1.3
$$ ##JCAMPDX= 5.01
$$ ##ORIGIN= Bruker BioSpin GmbH
$$ ##OWNER= Irina
$$ $$ F:/spectra/data/iren/nmr/1H/4/audita.txt
$$ ##AUDIT TRAIL=  $$ (NUMBER, WHEN, WHO, WHERE, VERSION, WHAT)
(   1,<2024-10-14 14:17:18.453 +0400>,<Irina>,<DPX200>,<TOPSPIN 1.3>,
      <created by zg
	started at 2024-10-14 14:13:05.343 +0400,
	POWCHK disabled, PULCHK disabled
       configuration hash MD5:
       BE 6D 3F 07 2A EA 11 49 91 17 2B D3 AF B3 58 0D
       data hash MD5: 16K
       F0 B6 85 CE 84 FB CD 75 9F 6E EA 0D B3 CB 46 31>)
$$ ##END=
$$ 
$$ $$ hash MD5
$$ $$ A5 83 C1 19 D4 F9 1F 60 97 EF 92 A4 C3 22 5D 84
##$RELAX= 
##$RELAX= 
##$RELAX= 
##$RELAX= 
##$RELAX= 
##$RELAX= 
##$RELAX= 
##$RELAX= 
##$RELAX= 
$$ Bruker specific parameters
$$ --------------------------
##$DU= <F:/spectra>
##$EXPNO= 4
##$NAME= <1H>
##$PROCNO= 1
##$TYPE= <nmr>
##$USER= <iren>
##$AMP= (0..31)
100 100 100 100 100 100 100 100 100 100 100 100 100 100 100 100 100 100 
100 100 100 100 100 100 100 100 100 100 100 100 100 100 
##$ANAVPT= -1
##$AQSEQ= 0
##$AQ_mod= 1
##$AUNM= <au_zg>
##$AUTOPOS= <>
##$BF1= 200.13
##$BF2= 200.13
##$BF3= 200.13
##$BF4= 200.13
##$BF5= 200.13
##$BF6= 200.13
##$BF7= 200.13
##$BF8= 200.13
##$BYTORDA= 1
##$CFDGTYP= 0
##$CFRGTYP= 5
##$CHEMSTR= <none>
##$CNST= (0..63)
1 1 145 1 1 1 1 1 1 1 1 1 1 1 1 1 1 1 1 1 1 1 1 1 1 1 1 1 1 1 1 1 1 1 
1 1 1 1 1 1 1 1 1 1 1 1 1 1 1 1 1 1 1 1 1 1 1 1 1 1 1 1 1 1 
##$CPDPRG= <>
##$CPDPRG1= <>
##$CPDPRG2= <>
##$CPDPRG3= <>
##$CPDPRG4= <mlev>
##$CPDPRG5= <mlev>
##$CPDPRG6= <mlev>
##$CPDPRG7= <mlev>
##$CPDPRG8= <mlev>
##$CPDPRGB= <>
##$CPDPRGT= <>
##$D= (0..63)
0 2 0 0 0 0 0 0 0 0.06 0 0.03 0 0 0 0 0.0002 0 0 0 0 0 0 0 0 0 0 0 0 0 
0 0 0 0 0 0 0 0 0 0 0 0 0 0 0 0 0 0 0 0 0 0 0 0 0 0 0 0 0 0 0 0 0 0 
##$DATE= 1728901037
##$DBL= (0..7)
120 120 120 120 120 120 120 120 
##$DBP= (0..7)
150 150 150 150 150 150 150 150 
##$DBP07= 0
##$DBPNAM0= <>
##$DBPNAM1= <>
##$DBPNAM2= <>
##$DBPNAM3= <>
##$DBPNAM4= <>
##$DBPNAM5= <>
##$DBPNAM6= <>
##$DBPNAM7= <>
##$DBPOAL= (0..7)
0.5 0.5 0.5 0.5 0.5 0.5 0.5 0.5 
##$DBPOFFS= (0..7)
0 0 0 0 0 0 0 0 
##$DE= 6
##$DECBNUC= <off>
##$DECIM= 32
##$DECNUC= <off>
##$DECSTAT= 4
##$DIGMOD= 1
##$DIGTYP= 9
##$DL= (0..7)
0 120 120 120 120 120 120 120 
##$DP= (0..7)
150 150 150 150 150 150 150 150 
##$DP07= 0
##$DPNAME0= <>
$$ [...]
##$SW= 21.9925939549014
##$SWIBOX= (0..15)
0 0 2 0 0 0 0 0 0 0 0 0 0 0 0 0 
##$SW_h= 4401.40845070422
##$TD= 16384
##$TD0= 1
##$TE= 300
##$TE2= 300
##$TE3= 300
##$TEG= 300
##$TL= (0..7)
0 120 120 120 120 120 120 120 
##$TP= (0..7)
150 150 150 150 150 150 150 150 
##$TP07= 0
##$TPNAME0= <>
##$TPNAME1= <>
##$TPNAME2= <>
##$TPNAME3= <>
##$TPNAME4= <>
##$TPNAME5= <>
##$TPNAME6= <>
##$TPNAME7= <>
##$TPOAL= (0..7)
0.5 0.5 0.5 0.5 0.5 0.5 0.5 0.5 
##$TPOFFS= (0..7)
0 0 0 0 0 0 0 0 
##$TUNHIN= 0
##$TUNHOUT= 0
##$TUNXOUT= 0
##$USERA1= <user>
##$USERA2= <user>
##$USERA3= <user>
##$USERA4= <user>
##$USERA5= <user>
##$V9= 5
##$VALIST= <valist>
##$VCLIST= <CCCCCCCCCCCCCCC>
##$VD= 0
##$VDLIST= <DDDDDDDDDDDDDDD>
##$VPLIST= <PPPPPPPPPPPPPPP>
##$VTLIST= <TTTTTTTTTTTTTTT>
##$WBST= 1024
##$WBSW= 25
##$XGAIN= (0..3)
0 0 0 0 
##$XL= 0
##$YL= 0
##$YMAX_a= 174716
##$YMIN_a= -235398
##$ZGOPTNS= <>
##$ZL1= 120
##$ZL2= 120
##$ZL3= 120
##$ZL4= 120
##$ABSF1= 10
##$ABSF2= 0
##$ABSG= 5
##$ABSL= 3
##$ALPHA= 0
##$AQORDER= 0
##$ASSFAC= 0
##$ASSFACI= 0
##$ASSFACX= 0
##$ASSWID= 0
##$AUNMP= <proc_1d>
##$AXLEFT= 0
##$AXRIGHT= 0
##$AXTYPE= 0
##$AXUNIT= <>
##$AZFE= 0.1
##$AZFW= 0.1
##$BCFW= 1
##$BC_mod= 2
##$BYTORDP= 1
##$COROFFS= 0
##$CY= 7568.61572265625
##$DATMOD= 1
##$DC= 2
##$DFILT= <>
##$DTYPP= 0
##$F1P= 17.9538593292236
##$F2P= -4.03888763876832
##$FCOR= 0.5
##$FTSIZE= 32768
##$FT_mod= 4
##$GAMMA= 1
##$GB= 1
##$INTBC= 1
##$INTSCL= 1
##$ISEN= 128
##$LB= 0.02
##$LEV0= 0
##$LPBIN= 0
##$MAXI= 945.577
##$MC2= 0
##$MEAN= 0
##$ME_mod= 0
##$MI= -402.1523
##$NCOEF= 0
##$NC_proc= 0
##$NLEV= 6
##$NOISF1= 8.587773
##$NOISF2= 6.764455
##$NSP= 1
##$NTH_PI= 0
##$NZP= 0
##$OFFSET= 17.95386
##$PC= 1
##$PHC0= 313.3581
##$PHC1= 18.43609
##$PH_mod= 0
##$PKNL= yes
##$PPARMOD= 0
##$PPDIAG= 0
##$PPIPTYP= 0
##$PPMPNUM= 100
##$PPRESOL= 1
##$PSCAL= 0
##$PSIGN= 0
##$REVERSE= no
##$SF= 200.13
##$SI= 32768
##$SIGF1= 18.5376
##$SIGF2= -6.396296
##$SINO= 400
##$SIOLD= 32768
##$SREGLST= <1H.CDCl3>
##$SSB= 3
##$STSI= 0
##$STSR= 0
##$SW_p= 4401.40845070423
##$SYMM= 0
##$S_DEV= 0
##$TDeff= 0
##$TDoff= 0
##$TI= <>
##$TILT= no
##$TM1= 0
##$TM2= 0
##$TOPLEV= 0
##$USERP1= <user>
##$USERP2= <user>
##$USERP3= <user>
##$USERP4= <user>
##$USERP5= <user>
##$WDW= 1
##$XDIM= 8192
##$YMAX_p= 0
##$YMIN_p= 0
$$ End of Bruker specific parameters
$$ ---------------------------------
##NTUPLES= NMR FID
##VAR_NAME=  TIME,          FID/REAL,        FID/IMAG
##SYMBOL=    X,             R,               I
##VAR_TYPE=  INDEPENDENT,   DEPENDENT,       DEPENDENT
##VAR_FORM=  AFFN,          ASDF,            ASDF
##VAR_DIM=   8192,          8192,            8192
##UNITS=     SECONDS,       ARBITRARY UNITS, ARBITRARY UNITS
##FACTOR=    0.0002272,     1,               1
##FIRST=     0,             0,               0
##LAST=      1.8609952,     6,               154
##MIN=       0,             -235398,         -235398
##MAX=       1.8609952,     174716,          174716
$$ Real data points
##PAGE= N=1
##DATA TABLE= (X++(R..R)), XYDATA
$$ plain form
0 0 0 0 0 0 0 0 0 0 0 0 0 0 0 0 0 0 0 0 0 1 -17 64 -64 64 -64 65 -65 94 -128 129 -129 183 -193 203 -255 264
36 264 -318 339 -385 437 -476 532 -592 658 -725 797 -886 975 -1075 1182 -1305 1436 -1585
53 -1585 1746 -1928 2138 -2373 2641 -2956 3323 -3764 4303 -4983 5869 -7075 8823 -11576
67 -11576 16683 -29249 127181 122596 -34990 109719 113263 29296 -46331 4436 123372 174716
79 174716 17619 -42422 96088 139884 -4024 -37023 36923 75964 52828 -12631 -55394
90 -55394 42375 103884 259 -49079 43083 51707 -26053 -62405 -69285 -41694 14677 -24122
102 -24122 -78320 -2138 54785 -22955 -68551 -39211 -27433 -18616 -32868 -87334 -52323 34259
114 34259 -9106 -81446 -22860 39708 12414 -30466 -64335 -53900 8921 -16426 -106101 -50512
$$ packed form
0@%%%%%%%%%%%%%%%%%%%Jj8Q1j28J28j28J29j30J59k22K57k58L12l76L96m58N19
36B64n82O57p24Q22r13J008j124J250j383J522j683J861k050K257k487K741l021
53a585L331l674M066m511N014n597O279p087Q067r286J0852j2944J5898k0399
67a1576K8259m5932J56430m585j57586J44709L544q3967p5627N0767J18936N1344
79A74716j57097o0041J38510M3796j43908l2999P3946L9041k3136o5459m2763
90e5394R7769O1509j03625m9338R2162Q624p7760l6352o880K7591N6371l8799
102b4122n4198P6182N6923p7740m5596K9340J1778Q817j4252n4466L5011Q6582
114C4259m3365p2340N8586O2568k7294m2880l3869J0435O2821k5347q9675N5589
$$ plain form
126 -50512 67811 30708 -58750 -45994 4178 20812 -18949 -91064 -59897 47466 11528 -103024
138 -103024 -56955 56373 46905 -19376 -41149 -11134 41963 9742 -90754 -57726 69427
149 69427 56010 -35891 -16967 51750 64593 32049 -19702 -10534 70202 58950 -40528 -25987
161 -25987 70964 74350 27086 22807 41072 69578 63405 -10302 -25518 53378 59802 -11869 -10014
174 -10014 39747 49390 39034 11110 -10515 31499 46200 -30352 -57655 6676 24458 -12807
186 -12807 -22220 -10822 15240 33475 -17695 -59350 -2368 28235 -40749 -69704 -21010 9673
198 9673 5572 -18563 -37014 7261 44974 -22112 -74495 -13256 27917 -18108 -49289 -30092
210 -30092 9075 35475 -3893 -49358 3041 53444 -12809 -70384 -28577 13764 4135 -23151
$$ packed form
126e0512J18323l7103q9458J2756N0172J6634l9761p2115L1167J07363l5938j14552
138a03024M6069J13328r468o6281k1773L0015N3097l2221j00496L3028J27153
149F9427j3417r1901J8924O8717J2843l2544n1751R168Q0736j1252r9478J4541
161b5987R6951L386m7264m279J8265K8506o173p3707j5216P8896O424p1671J855
174a0014M9761R643j0356k7924k1625M2014J4701p6552k7303O4331J7782l7265
186a2807r413J1398K6062J8235n1170m1655N6982L0603o8984k8955M8694L0683
198I673m101k4135j8451M4275L7713o7086n2383O1239M1173m6025l1181J9197
210c0092L9167K6400l9368m5465N2399N0403o6253n7575M1807M2341r629k7286
$$ plain form
222 -23151 -38135 627 49334 3921 -58591 -14574 36974 -4213 -48379 -36689 -6296 19120
234 19120 2613 -35903 -3992 54344 18710 -40410 -18242 18081 10293 -7365 -21041 -3825
246 -3825 43177 34812 -17017 3401 55823 35410 -6935 -6182 9628 25721 24420 -8034 1582
259 1582 57946 49642 -5922 712 36566 29545 5417 -12921 -10208 25732 29513 -19215 -14766
272 -14766 42935 38265 -11432 -20378 -2572 8754 1316 -34313 -37904 17715 27423 -29664 -33479
285 -33479 15574 21738 -10437 -33377 -32975 -1394 8963 -38339 -47891 13833 31780 -15469 -29486
298 -29486 -4808 11338 5693 -26464 -42902 296 24967 -21413 -37890 9460 30770 7681
310 7681 -12468 -17141 2467 19512 -15549 -42168 1339 31975 -1134 -19214 2675 19792
$$ packed form
222b3151j4984L8762M8707m5413o2512M4017N1548m1187m4166J1690L0393K5416
234A9120j6507l8516L1911N8336l5634n9120K2168L6323p788j7658j3676J7216
246c825M7002q365n1829K0418N2422k0413m2345P53J5810J6093j301l2454R616
259A582N6364q304n5564O634L5854p021k4128j8338K713L5940L781m8728M449
272a4766N7701m670m9697q946J7806J1326p438l5629l591N5619R708n7087l815
285c3479M9053O164l2175k2940M02L1581J0357m7302r552O1724J7947m7249j4017
298b9486K4678J6146n645l2157j6438M3198K4671m6380j6477M7350K1310k3089
310G681k0149m673J9608J7045l5061k6619M3507L0636l3109j8080K1889J7117
$$ plain form
322 19792 20789 226 -24653 -2549 25713 -6674 -34481 1037 29458 14563 -187 -2210 9782
335 9782 27090 4996 -29423 -4326 29773 3677 -21406 172 22219 25017 11537 -10241
347 -10241 1478 30776 5233 -34265 -9908 25302 11857 -8662 -7102 8380 27691 13114
359 13114 -24922 -11765 25948 5051 -33069 -19110 10014 15265 3819 -14876 -7351 25993
371 25993 13783 -32195 -24044 14419 8161 -18222 -19926 -4345 18537 17735 -15799 -16158 22806
384 22806 16988 -24539 -24912 2131 10526 3582 -10711 -10712 20419 26487 -12106 -18732 14710 15994
398 15994 -10802 -18201 -8584 8954 17404 -4875 -14429 18430 26349 -10424 -20771 1886 8381
411 8381 -886 -12394 -16370 7274 22993 -5577 -18836 12675 20778 -7982 -20278 -11352 1265
$$ packed form
322A9792R97k0563k4879K2104K8262l2387k7807L5518K8421j4895j4750k023J1992
335I782J7308k2094l4419K5097L4099k6096k5083K1578K2047K798j3480k1778
347a0241J1719K9298k5543l9498K4357L5210j3445k0519J560J5482J9311j4577
359A3114l8036J3157L7713k0897l8120J3959K9124N251j1446j8695P525L3344
371B5993j2210m5978Q151L8463o258k6383j704J5581K2882q02l3534l59L8964
384B2806n818m1527l73K7043Q395o944j4293jL1131O068l8593o626L3442J284
398A5994k6796p399R617J7538Q450k2279r554L2859P919l6773j0347K2657O495
411H381r267j1508l976K3644J5719k8570j3259L1511Q103k8760j2296Q926J2617
$$ plain form
424 1265 8545 -8515 -20880 8380 27413 -4105 -21062 2804 13604 363 -14342 -20212 -1546
437 -1546 18745 -2747 -22566 7245 28584 3629 -16027 -8368 3831 10002 -4677 -23657 -2557
450 -2557 26449 6190 -17999 1855 21012 11803 -4751 -14979 -5428 16106 5334 -21156 -2652
463 -2652 27041 13638 -7655 -3419 7711 14262 4718 -17347 -10620 18079 9874 -16005 -3787
476 -3787 19222 14836 1372 -7758 -5984 10914 6766 -19542 -13692 15831 10435 -10485 -6298 6748
490 6748 11856 6034 -12793 -15216 8228 6523 -20029 -14697 11821 12199 -1673 -7432 -4164 9320
504 9320 10062 -15635 -19059 8927 10374 -13384 -12589 5439 12856 9394 -6272 -12489 8138 13515
518 13515 -14875 -20418 5704 12196 -2066 -8941 -4890 9040 15599 -6296 -19785 3249 12470
$$ packed form
424A265P280j7060j2365K9260J9033l1518j6957K3866J0800j3241j4705n870J8666
437a546K0291k1492j9819K9811K1339k4955j9656P659J2199O171j4679j8980K1100
450b557K9006k0259k4189J9854J9157r209j6554j0228R551K1534j0772k6490J8504
463b652K9693j3403k1293M236J1130O551r544k2065O727K8699q205k5879J2218
476c787K3009m386j3464r130J774J6898m148k6308N850K9523n396k0920M187J3046
490F748N108n822j8827k423K3444j705k6552N332K6518L78j3872n759L268J3484
504I320P42k5697l424K7986J447k3758P95J8028P417l462j5666o217K0627N377
518A3515k8390n543K6122O492j4262o875M051J3930O559k1895j3489K3034R221
$$ plain form
531 12470 -11194 -19603 -3171 7946 7888 -3477 -13356 3069 16383 -5930 -21861 -2004 9438
544 9438 -3181 -11009 -8052 3984 15957 3637 -13732 1586 16744 -1529 -15144 -3034 7671
557 7671 8289 2501 -6171 4127 21262 8044 -10677 2478 15792 3622 -6638 -3860 4587
570 4587 15151 9486 -6522 3269 21331 7001 -11272 -1740 8839 5668 -1281 -8795 -2115 15769
584 15769 9592 -11295 -2444 14518 3947 -11370 -10287 -2767 5773 3304 -13019 -8164 13993
597 13993 8138 -13466 -9116 5060 3203 -5799 -14536 -12138 6012 7577 -12845 -10698 10139 7655
611 7655 -9391 -12045 -6042 1736 1921 -13238 -16018 5379 9672 -9798 -10756 3728 5317 -2412
625 -2412 -10559 -13092 -157 7064 -8888 -12944 6629 11190 -3099 -6211 -135 4782 6276 -4845
$$ packed form
531A2470k3664q409J6432J1117n8j1365r879J6425J3314k2313j5931J9857J1442
544I438j2619p828K957J2036J1973j2320j7369J5318J5158j8273j3615J2110J0705
557G671O18n788q672J0298J7135j3218j8721J3155J3314j2170j0260K778Q447
570D587J0564n665j6008R791J8062j4330j8273R532J0579l171o949p514O680J7884
584A5769o177k0887Q851J6962j0571j5317J083P520Q540k469j6323M855K2157
597A3993n855k1604M350J4176j857r002q737K398J8150J565k0422K147K0837k484
611G655j7046k654O003P778J85j5159k780K1397M293j9470r58J4484J589p729
625b412q147k533J2935P221j5952m056J9573M561j4289l112O076M917J494j1121
$$ plain form
639 -4845 -11923 3997 13058 -2120 -5577 10036 13869 6271 646 -1845 6076 13804 630 -8439
653 -8439 8861 17429 3803 -984 7395 12233 12035 2657 -7307 3523 14753 337 -9446 5241
667 5241 13553 5479 -1459 -3724 2410 10588 -522 -15473 -3654 9538 -2027 -11515 -4032 3839
681 3839 5520 -1439 -13370 -7611 6819 -2465 -17434 -8005 4285 -168 -6663 -8011 -3576 7014
695 7014 2287 -14115 -9287 5534 -603 -12145 -6732 1564 4327 1831 -6885 -5781 8055 4399
709 4399 -11336 -7497 4965 1538 -5067 -5076 -1415 6949 7435 -6242 -6850 7691 4787 -9051 -6241
724 -6241 2440 4214 2318 -3597 -3947 8635 9748 -5669 -6229 7147 5726 -3704 -4125 75 7348
739 7348 10051 -852 -4464 10235 12056 -3276 -4648 5093 7362 4065 -1473 -3470 8235 14755
$$ packed form
639d845p078J5920R061j5178l457J5613L833p598n625k491P921P728j3174r069
653h439J7300Q568j3626m787Q379M838j98r378r964J0830J1230j4416r783J4687
667E241Q312q074o938k265O134Q178j1110j4951J1819J3192j1565r488P483P871
681C839J681o959j1931N759J4430r284j4969R429J2290m453o495j348M435J0590
695G014m727j6402M828J4821o137j1542N413Q296K763k496q716J104J3836l656
709D399j5735L839J2462l427o605rL661Q364M86j3677o08J4541k904j3838K810
724f241Q681J774j896n915l50J2582J113j5417n60J3376j421r430m21M200P273
739G348K703j0903l612J4699J821j5332j372R741K269l297n538j997J1705O520
$$ plain form
753 14755 451 -5535 7553 10259 -571 -4667 -1804 3995 8524 -240 -8190 4239 11655 -1091
767 -1091 -7767 533 3640 260 -4696 -9412 -1734 8239 -826 -10372 85 6366 -2368 -7662 -5714
782 -5714 -2430 1799 -2838 -11716 -4060 7116 -1225 -9079 -1698 2904 -884 -4812 -8474 -4943 4506
797 4506 -323 -10345 -2489 6940 342 -6082 -2952 -3 2335 -764 -9664 -5034 7023 2244 -7611
812 -7611 -1023 6428 2992 -1736 -4772 -2628 6338 3825 -8034 -3678 9134 5339 -2850 -45 4690
827 4690 7157 4664 -4246 -3892 8681 8119 -3834 -1157 9057 8215 3691 124 707 8178 8757 -3266
843 -3266 -4786 6989 7849 -1090 -708 3951 6175 6085 -1743 -6138 3641 6797 -4588 -6320 2572 3247
859 3247 -1194 -2646 -3408 1354 4794 -4544 -10283 -699 2448 -6479 -7281 -1918 244 399 -3704 -8362
$$ packed form
753A4755j4304n986J3088K706j0830m096K863N799M529q764p950J2429P416j2746
767a091o676Q300L107l380m956m716P678R973r065r546J0457O281q734n294J948
782e714L284M229m637q878P656J1176q341p854P381M602l788l928l662L531R449
797D506m829j0022P856R429o598o424L130K949K338l099q900M630J2057m779r855
812g611O588P451l436m728l036K144Q966k513j1859M356J2812l795q189K805M735
827D690K467k493q910L54J2573n62j1953K677J0214q42m524l567N83P471N79j2023
843c266j520J1775Q60q939L82M659K224r0p828m395R779L156j1385j732Q892O75
859C247m441j452p62M762L440r338n739R584L147q927q02N363K162J55m103m658
$$ plain form
875 -8362 -1095 3900 -5867 -10117 -1378 1282 -3886 -4923 -3487 498 5065 -1558 -8427 -302 5461
890 5461 -3053 -6827 -580 2727 2449 -109 -4459 1360 8922 1240 -6810 368 5673 393 -2680
905 -2680 -1531 1900 7353 3511 -5290 25 9103 2551 -4627 -561 3492 2993 1169 -3126 -641
920 -641 8502 5186 -4708 -706 5687 2099 -1845 -1780 -262 4406 4112 -4016 -2558 7102 4167 -3871
936 -3871 -1640 2553 1119 45 -3312 -3464 4197 4770 -4158 -3059 4946 1987 -3162 -2507 -1383 1155
952 1155 1914 -4667 -5016 4478 4094 -4480 -2954 2067 760 -1524 -3981 -4810 1715 4136 -4640 -5498
968 -5498 3663 3531 -2792 -2971 -631 1324 1911 -3705 -6417 2083 5705 -2560 -4201 2702 2998 250
984 250 -2162 -4169 661 4843 -2486 -6616 1633 5314 -504 -2268 34 1640 3158 -1049 -6307
$$ packed form
875h362P267M995r767m250Q739K660n168j037J436L985M567o623o869Q125N763
890E461q514l774O247L307k78k558m350N819P562p682q050P178N305n280l073
905b680J149L431N453l842q801N315R078o552p178M066M053m99j824m295K485
920f41R143l316r894M002O393l588l944O5J518M668k94q128J458R660k935q038
936c871K231M193j434j074l357j52P661N73q928J099Q005k959n149O55J124K538
952A155P59o581l49R494l84q574J526N021j307k284k457q29O525K421q776q58
968e498R161j32o323j79K340J955N87n616k712Q500L622q265j641O903K96k748
984B50k412k007M830M182p329m130Q249L681n818j764K302J606J518m207n258
$$ plain form
999 -6307 -350 5672 -729 -4551 1194 3460 1099 -231 -2124 -20 4883 259 -6072 -35 4792
1014 4792 169 -2018 958 1967 3222 1423 -3864 -1080 5779 991 -4412 571 3916 965 49
1029 49 -465 302 4764 2089 -5343 -1755 5093 830 -3334 24 1875 2478 1413 -3241 -2075 5168
1045 5168 2347 -5702 -2624 2754 436 -1911 -1707 -932 3182 2829 -4847 -4198 3388 1296 -4521 -2745
1061 -2745 102 876 1042 -2733 -3806 3455 3859 -4508 -4255 1801 1063 -1737 -1655 -1634 2089 4023 -2136
1078 -2136 -4031 2925 3645 -2210 -2368 735 1103 1440 -724 -2879 2703 5575 -1191 -3433 2388 2586
1094 2586 -1157 -1069 -904 930 3819 -477 -3804 2342 4805 -1296 -2879 1010 864 120 -879 -3110
1110 -3110 446 4838 -917 -4484 1210 3277 -1060 -2245 -1123 -521 2004 -650 -4854 187 5040
$$ packed form
999f307N957O022o401l822N745K266k361j330j893K104M903m624o331O037M827
1014D792m623k187K976J009J255j799n287K784O859m788n403M983L345k951r16
1029D9n14P67M462k675p432L588O848m263m164L358J851O03j065m654J166P243
1045E168k821q049L078N378k318k347K04P75M114l53p676O49P586k092n817J776
1061b745K847P74J66l775j073P261M04q367K53O056p38k800Q2K1L723J934o159
1078b136j895O956P20n855j58L103L68L37k164k155N582K872o766k242N821J98
1094B586l743Q8J65J834K889m296l327O146K463o101j583L889j46p44r99k231
1110c110L556M392n755l567N694K067m337j185J122O02K525k654m204N041M853
$$ plain form
1125 5040 -308 -3587 135 1460 390 -1153 -3192 -898 4140 1018 -4583 -54 4211 856 -1279
1140 -1279 -462 241 2194 1255 -3739 -1396 4981 2443 -2797 167 2333 1775 688 -1505 -1659 3463
1156 3463 2817 -3596 -1541 4124 1902 -826 132 145 1475 1801 -2711 -2671 3261 2159 -3193 -1231 2046
1173 2046 663 -219 -1185 -2263 1263 2035 -3866 -3579 2172 979 -2453 -1267 241 96 751 -2443
1189 -2443 -3912 1532 2150 -3708 -3098 1209 644 -575 -995 -1707 671 2838 -2498 -4273 1626 2528
1205 2528 -1293 -1568 390 997 1996 -272 -2927 1483 4199 -983 -2839 1262 2339 691 269 -391
1221 -391 1224 4236 682 -3120 1251 4019 -45 -1192 898 1304 2210 1517 -1938 712 4533 503
1237 503 -3161 552 2104 -127 -300 -788 -401 2682 1146 -3276 -357 3102 -348 -2659 -431 -247
$$ packed form
1125E040n348l279L722J325j070j543k039K294N038l122n601M529M265l355k135
1140a279Q17P03J953r39m994K343O377k538n240K964K166n58j087k193j54N122
1156C463o46o413K055N665k222k728R58J3J330L26m512M0N932j102n352J962L277
1173B046j383q82r66j078L526P72n901K87N751j193l432J186J508j45O55l194
1189b443j469N444O18n858O10M307n65j219m20p12K378K167n336j775N899R02
1205B528l821k75J958O07R99k268k655M410K716n182j856M101J077j648m22o60
1221c91J615L012l554l802M371K768m064j147K090M06R06o93l455K650L821m030
1237E03l664L713J552k231j73m88L87L083j536m422K919L459l450k311K228J84
$$ plain form
1253 -247 -69 228 -2095 -1266 2722 364 -4099 -1188 1466 -719 -1444 -1083 -1012 1135 868 -3136 -1597
1270 -1597 3211 517 -3133 -1177 285 -45 -122 -1663 -1860 2738 1899 -2974 -1471 2220 660 -1092
1286 -1092 -925 -643 1302 1995 -2265 -2244 2879 2745 -2037 -1063 1051 851 617 -747 -1824 1700 2950
1303 2950 -1665 -1979 2147 1797 -515 -467 -127 317 2048 -836 -2669 1966 2830 -1242 -1222 1197 747
1320 747 453 -272 -1429 445 2442 -1081 -2699 1661 2283 -591 -218 -25 72 1344 -293 -2705 618
1337 618 3156 -918 -1850 828 1042 -21 -21 -1012 -363 2515 -342 -3057 303 2426 -508 -1086 114
1354 114 55 1118 338 -2702 -477 2650 -506 -3022 75 1228 172 -26 -1065 -1136 1806 351 -3500
1371 -3500 -1042 2094 -151 -1679 -447 -235 534 723 -1968 -1656 2151 841 -2898 -1005 1293 149
$$ packed form
1253b47J78K97k323Q29L988k358m463K911K654k185p25L61P1K147k67m004J539
1270a597M808k694l650J956J462l30p7j541j97M598q39m873J503L691j560j752
1286a092J67K82J945O93m260K1N123j34m782R74K114k00k34j364j077L524J250
1303B950m615l14M126l50k312M8L40M44J731k884j833M635Q64m072K0K419m50
1320G47k94p25j157J874J997l523j618M360O22k874L73J93R7J272j637k412L323
1337F18K538m074r32K678K14j063%r91O49K878k857k715L360K123k934n78J200
1354A14n9J063p80l040K225L127l156k516L097J153j056j98j039p1K942j455l851
1371c500K458L136k245j528J232K12P69J89k691L12L807j310l739J893K298j144
$$ plain form
1387 149 165 -319 -1030 1532 1808 -2182 -1332 2339 780 -1358 -99 461 699 1693 -132 -1317 2299
1404 2299 2115 -1749 -581 1932 339 299 434 -113 1054 2054 -1096 -1428 2366 1852 -1276 -344 510
1421 510 309 995 -400 -1681 1367 2168 -1936 -2004 948 455 -899 -574 -980 -131 1201 -1166 -2545
1438 -2545 1010 1697 -1709 -2163 -202 -228 221 -453 -1954 106 2279 -1078 -2611 620 884 -690 -818
1455 -818 -918 -444 1365 78 -1980 387 2469 -145 -1321 477 493 514 473 -1182 -427 2397 471
1472 471 -1766 757 2177 378 -332 367 -244 1321 1013 -1460 85 2698 495 -1369 356 858
1488 858 187 512 -598 -710 1681 692 -1746 -329 1901 133 -655 -13 -589 123 634 -1786 -1112 1584
1506 1584 700 -1805 -539 643 -203 -229 -950 -1406 840 664 -2092 -1621 1340 633 -1276 -440 -556 150
$$ packed form
1387A49J6m84p11K562K76l990Q50L671j559k138J259N60K38R94j825j185L616
1404B299j84l864J168K513j593m0J35n47J167J000l150l32L794n14l128R32Q54
1421E10k01O86j395j281L048Q01m104o8K952m93j354L25m06Q49J332k367j379
1438b545L555O87l406m54J961k6M49o74j501K060K173l357j533L231K64j574j28
1455h18j00M74J809j287k058K367K082k614j176J798J6K1m1j655P55K824j926
1472D71k237K523J420j799p10O99o11J565l08k473J545K613k203j864J725N02
1488H58o71L25j110j12K391r89k438J417K230j768p88O42n76P12N11k420O74K696
1506A584q84k505J266J182q46k6p21m56K246j76k756M71K961p07j909Q36j16P06
$$ plain form
1524 150 799 -1396 -1828 1147 1052 -1482 -952 952 350 157 -109 -907 635 1612 -706 -1297 1493 1287
1542 1287 -482 -230 310 264 1443 455 -1400 868 1942 -443 -1046 995 785 342 372 -633 35 1507
1560 1507 -242 -1772 1029 1578 -562 -550 229 -24 502 349 -1125 117 1423 -759 -1769 634 752
1577 752 -354 -203 -370 -415 1058 191 -2047 -4 1542 -503 -1155 -122 -183 368 348 -1185 -369 1478
1595 1478 189 -1640 -2 751 -298 -219 -539 -545 1010 669 -1610 -388 1497 250 -1055 96 -87
1612 -87 62 540 -718 -930 1413 794 -1630 -487 990 -8 -446 -230 -443 452 874 -876 -831 1259
1630 1259 719 -1064 -428 388 -73 490 66 -926 694 1406 -999 -565 1316 388 -78 15 60 450 1153
1649 1153 -285 -971 1449 1369 -490 -344 535 378 339 311 -844 699 1408 -553 -934 828 936 -302
$$ packed form
1524A50O49k195m32K975r5k534N30J904o02j93k66p98J542R77k318n91K790k06
1542A287j769K52N40m6J179r88j855K268J074k385o03K041k10m43L0j005O68J472
1560A507j749j530K801N49k140J2P79k53N26j53j474J242J306k182j010K403J18
1577G52j106J51j67m5J473q67k238K043J546k045o52J033o1N51k0j533Q16J847
1595A478j289j829J638P53j049P9l20oJ555l41k279J222J885j247j305J151j83
1612h7J49M78j258k12K343o19k424J143J477r98m38K16k13Q95M22j750M5K090
1630A259n40j783O36Q16m61N63m24r92J620P12k405M34J881r28m66R3M5L90P03
1649A153j438o86K420q0j859J46Q79j57l9k8j155J543P09j961l81J762J08j238
$$ plain form
1667 -302 -59 -156 -252 972 82 -1381 404 1294 -789 -1013 330 117 -63 77 -959 -569 753 -401
1685 -401 -1650 228 792 -793 -694 -513 -656 423 -80 -1490 -661 713 -578 -1365 -137 295 -351 -70
1703 -70 -823 -708 865 43 -1575 -258 1002 -400 -710 119 -43 473 715 -708 -100 1233 125 -605
1721 -605 353 672 338 742 207 -84 1002 1194 -564 33 1500 470 -200 496 596 668 1013 -219 -590
1740 -590 1311 858 -1060 68 970 49 1 158 -666 546 867 -630 -919 679 191 -879 -276 -127
1758 -127 -303 550 -262 -1200 311 557 -1019 -948 267 -119 -471 -122 -988 -235 679 -515 -1041 226 383
1777 383 -858 -452 -96 -572 116 -55 -1079 -261 1030 -408 -768 322 520 -350 -214 -127 -207 762 176
1796 176 -1015 550 1239 -219 -205 621 361 459 450 -415 48 1250 -92 -615 705 837 1 177 258 -186
$$ packed form
1667c02K43r7r6J224q90j463J785Q90k083k24J343k13j80J40j036L90J322j154
1685d01j249J878N64j585R9J81j43J079n03j410Q29J374j291p87J228M32o46K81
1703g0p53J15J573q22j618J317J260j402l10Q29j62N16K42j423O08J333j108p30
1721f05R58L19l34M04n35k91J086J92j758N97J467j030o70O96J00P2L45j232l71
1740e90J901m53j918J128R02r21m8J57q24J212L21j497k89J598m88j070O03J49
1758a27j76Q53q12r38J511K46j576P1J215l86l52L49q66P53R14j194n26J267J57
1777C83j241M06L56m76O88j71j024Q18J291j438l60J090J98q70J36Q7q0R69n86
1796A76j191J565O89j458J4Q26k60R8rq65M63J202j342n23J320J32q36J76Q1m44
$$ plain form
1816 -186 415 484 -821 126 1201 77 -726 144 157 362 170 -695 -556 784 467 -1024 22 760 -402
1835 -402 -317 -229 -234 434 518 -719 -819 705 -112 -850 -41 317 135 32 -484 -770 470 526 -743 -480 748
1856 748 -21 -278 185 16 49 707 -450 -580 791 460 -611 83 558 152 147 116 -517 244 612 -610
1876 -610 -736 530 120 -550 152 5 -98 237 -259 -595 199 548 -607 -733 288 85 -71 112 -470
1895 -470 -149 662 -247 -804 356 622 -312 -59 195 -265 301 426 -810 395 782 -29 -386 518 399
1914 399 42 234 -282 -122 958 193 -741 219 766 -292 -98 290 -105 207 303 -391 -27 884 125 -600
1934 -600 127 195 -339 0 -216 -494 236 389 -1012 -195 509 -238 -465 290 35 -11 151 -467 -635 421
1954 421 375 -750 91 267 -100 -135 -51 -315 286 184 -396 -274 590 109 -713 -21 310 -118 290 -84 -485
$$ packed form
1816a86O01O9j305R47J075j124q03Q70J3K05j92q65J39J340l17j491J046P38j162
1835d02Q5Q8nO68Q4j237j00J524q17p38Q09L58j82j03n16k86J240N6j269K63J228
1856G48p69k57M63j69L3O58j157j30J371l31j071O94M75m06nl1o33P61L68j222
1876f10j26J266m10o70P02j47j03L35m96l36P94L49j155j26J021k03j56J83n82
1895d70L21Q11r09n57J160K66r34K53K54m60N66J25j236J205L87q11l57R04j19
1914C99l57J92n16J60J080p65r34R60N47j058J94L88l95L12R6o94L64R11p59p25
1934f00P27O8n34L39k16k78P30J53j401Q17P04p47k27P55k55m6J62o18j68J056
1954D21m6j125Q41J76l67l5Q4k64O01j02n80J22Q64m81q22O92L31m28M08l74m01
$$ plain form
1975 -485 474 404 -353 -436 488 18 -369 34 -128 42 522 -206 -392 344 320 -373 30 90 -88 24 209
1996 209 -599 42 713 -245 -579 564 -7 -318 -80 -166 -238 385 114 -752 95 546 -381 -336 275 -136 2
2017 2 118 -380 -107 781 -150 -358 259 374 -324 -86 398 105 356 78 -420 -106 581 -167 -394 403 45
2038 45 90 203 -140 23 642 32 -685 267 729 -131 323 344 -110 368 508 -177 50 453 44 -471 125
2059 125 0 7 267 -107 -282 421 217 -483 37 305 -123 -328 221 -127 -88 176 -292 -570 346 170 -641
2080 -641 -246 32 -378 -34 -173 -551 -158 330 -407 -292 325 -235 -343 161 -14 -124 -75 -43 -687 174 384
2101 384 -318 150 367 -46 -84 226 -123 78 641 124 60 556 454 -120 301 334 386 349 522 -207 114 763
2123 763 -16 -61 434 198 118 434 -33 54 352 349 -355 192 468 130 81 406 -60 120 339 -179 64 229
$$ packed form
1975d85R59p0p57q3R24m70l87M03j62J70M80p28j86P36k4o93M03O0j78J12J85
1996B09q08O41O71r58l34J143n71l11K38q6p2O23k71q66Q47M51r27M5O11m11J38
2017BJ16m98K73Q88r31k08O17J15o98K38M84k93K51k78m98L14O87p48k27P97l58
2038D5M5J13l43J63O19o10p17R52M62q60M54K1m54M78J40o85K27M03m09n15N96
2059A25j25PK60l74j75P03k04p00N20K68m28k05N49l48L9K64m68k78R16j76q11
2080f41L95K78m10L44j39l78L93M88p37J15O17n60j08N04j75j10M9L2o44Q61K10
2101C84p02M68K17m13l8L10l49K01N63n17o4M96j02n74M21L3N2l7J73p29L21O49
2123G63p79m5M95k36q0L16m67Q7K98lp04N47K76l38m9L25m66J80K19n18K43J65
$$ plain form
2145 229 130 -330 135 233 -360 -64 164 -265 138 80 -514 -218 223 -86 -164 189 -52 -226 85 -268 -211 443
2167 443 163 -541 -63 264 -537 -269 14 -90 96 347 -365 -136 281 55 -244 -149 -122 -300 -13 -17 -271
2188 -271 205 381 -416 -56 221 5 -236 92 -33 394 502 -21 -282 575 237 -317 229 253 -148 184
2208 184 226 -245 205 344 -24 -223 321 107 138 327 61 86 782 -52 -281 111 384 317 -54 369 294 -19
2230 -19 36 -330 -145 610 76 -198 216 293 -270 115 265 -193 198 -39 -236 15 8 -119 -179 63 -204 -337
2252 -337 -44 -292 -384 67 -8 -530 -72 -395 -494 -31 -20 -237 -84 -257 -390 -533 116 -251 -303 22 67 -464
2274 -464 -340 -110 -312 153 22 -544 144 362 50 -309 243 53 27 227 122 -80 419 418 -260 94 239
2295 239 146 84 218 40 375 259 -73 190 479 190 -39 222 316 107 409 247 38 142 426 177 221
$$ packed form
2145B29r9m60M65R8n93K96K28m29M03n8n94K96M41l09p8L53k41j74L11l53N7O54
2167D43k80p04M78L27q01K68K83j04J86K51p12K29M17k26k99R5K7j78K87mk54
2188b71M76J76p97L60K77k16k41L28j25M27J08n23k61Q57l38n54N46K4m01L32
2208A84M2m71M50J39l68j99N44k14L1J89k66K5O96q34k29L92K73o7l71M23p5l13
2230a9N5l66J85P55n34k74M14P7n63L85J50m58L91k37j97K51pj27o0K42k67j33
2252c37K93k48r2M51p5n22M58l23r9M63J1k17J53j73j33j43O49l67n2L25M5n31
2274d64J24K30k02M65j31n66O88K18l12l59N52j90k6K00j05k02M99jo78L54J45
2295B39r3o2J34j78L35j16l32K63K89k89k29K61R4k09L02j62k09J04K84k49M4
$$ plain form
2316 221 236 30 173 213 -54 -429 279 -351 -61 -34 -70 -191 -8 -103 -160 -80 -38 -230 -147 202 -277 -471 223
2339 223 129 -232 -28 -14 -270 -62 -444 -296 -89 -249 -311 -330 -29 -216 63 14 -386 -94 19 -328 -175 86
2361 86 -51 -152 -119 -237 -290 405 14 -456 -15 89 -141 -42 221 145 -10 378 -157 -229 253 222 -179 212
2383 212 332 31 23 160 -154 153 266 10 -65 360 42 -118 290 242 -138 13 93 -69 186 355 -214 178
2405 178 365 -267 -24 312 -68 78 131 -9 11 378 -169 -108 323 222 62 -56 99 -292 117 63 -236
2426 -236 -299 360 53 -4 -16 -280 -214 -29 -164 -316 105 -61 -145 -69 126 -3 -70 -100 -1 -19 213 -116 -152 195
2450 195 -99 -263 -183 -92 -52 -141 269 -391 -59 -24 -284 -217 294 -109 -9 70 -354 -96 216 -67 -361 -56
2472 -56 208 -229 64 239 51 359 330 -19 87 372 -195 187 213 334 61 76 154 -35 187 70 -207 -59
$$ packed form
2316B21J5k06J43M0k67l75P08o30K90K7l6j21J83r5n7Q0M2j92Q3L49m79j94O94
2339B23r4l61K04J4k56K08l82J48K07j60o2j9L01j87K79m9m00K92J13l47J53K61
2361H6j37j01L3j18n3O95l91m70M41J04k30R9K63p6j55L88n35p2M82l1m01L91
2383B12J20l01qJ37l14L07J13k56p5M25l18j60M08m8l80J51Q0j62K55J69n69L92
2405A78J87o32K43L36l80J46N3j40K0L67n47O1M31j01j60j18J55l91M09n4k99
2426b36o3O59l07n7j2k64O6J85j35j52M21j66q4P6J95j29o7l0R9j8K32l29l6L47
2450A95k94j64Q0R1M0q9M10o60L32L5k60O7N11m03J00P9m24K58L12k83k94L05
2472e6K64m37K93J75j88L08k9l49J06K85n67L82K6J21k73J5P8j89K22j17k77J48
$$ plain form
2494 -59 614 108 316 443 -16 78 323 -289 -39 250 58 -284 29 137 23 2 160 -96 -55 97 -57
2515 -57 -159 57 -247 -262 310 -99 -315 134 -259 -286 -179 -111 -347 -95 37 -190 -37 148 -192 113 85 -172
2537 -172 -234 -165 83 -144 19 -172 -394 -4 72 -126 124 314 -41 96 88 -140 -30 46 5 -62 42 -24 -178
2560 -178 231 161 -84 -250 342 -75 -157 -69 -70 -232 213 3 -14 270 -65 -8 28 2 321 124 21 -120 202
2583 202 283 -43 183 281 -54 -185 -70 68 -84 33 24 -85 147 114 -106 161 1 22 -113 -17 -175 50
2605 50 161 -85 -243 282 29 -338 253 85 -279 45 -11 -26 19 147 -97 -173 222 -210 17 189 -64 -53
2627 -53 -166 -168 -76 -67 254 22 -43 31 -225 -70 -6 -51 -57 361 108 179 275 -49 -106 3 -63 -129 37 213 -271 70
2653 70 84 -337 5 51 92 6 -96 -92 -145 171 -167 -63 19 -41 258 -208 8 -198 44 113 -199 120 221 53
$$ packed form
2494e9O73n06K08J27m59R4K45o12K50K89j92l42L13J08j14k1J58k56M1J52j54
2515e7j02K16l04j5N72m09k16M49l93k7J07O8k36K52J32k27J53J85l40L05k8k57
2537a72o2O9K48k27J63j91k22L90P6j98K50J90l55J37qk28J10P6m1o7J04o6j54
2560a78M09p0k45j66N92m17q2Q8jj62M45k10j7K84l35N7L6k6L19j97j03j41L22
2583B02Q1l26K26R8l35j31J15J38j52J17rj09K32l3k20K67j60K1j35R6j58K25
2605E0J11k46j58N25k53l67N91j68l64L24n6j5M5J28k44p6L95m32K27J72k53J1
2627e3j13kR2RL21k32o5P4k56J55O4m5oM18k53P1R6l24n7J09o6o6J66J76m84L41
2653G0J4m21L42M6M1q6j02Mn3L16l38J04Q2o0K99m66K16k06K42O9l12L19J01j68
$$ plain form
2677 53 -176 255 120 64 215 111 61 -31 182 -81 205 219 120 -3 14 53 -100 264 161 -9 208 40 -152
2700 -152 354 -368 9 100 -52 -177 156 166 -171 147 -39 157 -405 33 -60 -169 134 -15 -166 -173 12 -331
2722 -331 50 89 -280 195 -164 -68 235 91 22 -137 97 -112 89 -42 220 -309 144 68 15 101 234 69
2744 69 -94 -25 46 -139 286 -55 223 92 -236 -56 -154 92 -175 206 -119 -80 37 199 -21 -55 17 54 -218
2767 -218 -71 124 -91 -183 -10 -76 443 -62 -52 -338 371 208 129 25 -162 184 216 -13 -304 47 75 42
2789 42 129 169 57 69 -3 45 154 162 -143 -13 -18 -22 -71 263 -229 -241 119 -5 -288 183 -22 -306 88 14 98
2814 98 -297 159 154 -213 -231 -193 -69 51 27 -111 20 98 -343 -199 242 -172 -422 -189 -42 -232 -217 81 -99
2837 -99 -93 290 -128 -34 -2 270 8 18 -14 -181 -93 -143 -210 33 48 -10 -237 -84 93 34 166 -30 -109 -159 -93
$$ packed form
2677E3k29M31j35n6J51j04n0r2K13k63K86J4r9j23J7L9j53L64j03j70K17j68j92
2700a52N06p22L77R1j52j25L33J0l37L18j86J96n62M38r3j09L03j49j51pJ85l43
2722c31L81L9l69M75l59R6L03j44o9j59K34k09K01j31K62n29M53p6n3Q6J33j65
2744F9j63O9P1j85M25l41K78j31l28J80r8K46k67L81l25L9J17J62k20l4P2L7k72
2767b18J47J95k15r2J73o6N19n05J0k86P09j63p9j04j87L46L2k29k91L51K8l3
2789D2Q7M0j12J2p2M8J09Ql05J30nmm9L34m92j2L60j24k83M71k05k84L94p4Q4
2814I8l95M56nl67j8L8J24J20k4j38J31P8m41J44M41m14k50K33J47j90J5K98j80
2837i9OL83m18R4L2K72k62J0l2j67Q8n0o7K43J5n8k27J53J77n9J32j96p9n0O6
$$ plain form
2862 -93 -108 161 224 35 273 -102 -20 -87 90 -101 -88 -119 129 -50 85 22 195 198 101 74 161 -170 126 68 -78
2887 -78 -84 258 211 -230 48 106 -11 -85 90 -12 -81 69 -215 65 5 44 5 51 122 -128 -22 -186 -254 -48
2911 -48 141 27 67 -102 -114 10 -180 -196 -171 -203 69 -70 -18 19 109 62 97 -110 191 -123 185 264 120 44
2935 44 -34 -41 -241 217 168 -40 62 138 -135 189 -32 85 -24 64 -19 55 -43 111 -20 -26 64 -219 -182 -74 87
2960 87 -64 47 172 50 36 -78 -152 122 -48 -192 171 71 -15 -70 238 110 178 -4 -79 108 -50 -49 -65
2983 -65 126 -155 56 87 74 111 -73 156 -157 37 88 27 -155 -3 -62 11 11 -257 -102 -53 -160 43 -125 148
3007 148 -1 53 -128 25 -86 -129 51 -114 -103 -127 -166 11 127 -72 -166 -64 39 38 10 201 -11 149 -285
3030 -285 -62 -100 -239 44 -227 -259 23 -166 -193 42 -52 -12 137 122 266 207 -49 -94 -183 17 76 -19 235 43
$$ packed form
2862i3j5K69O3j89K38l75Q2o7J77j91J3l1K48j79J35o3J73Lr7k7Q7l31K96n8j46
2887g8oL42m7m41K78N8j17p4J75j02o9J50k84K80o0L9l9M6P1k50J06j64o8K06
2911d8J89j14M0j69j2J24j90j6K5l2K72j39N2L7R0m7L5k07L01l14L08P9j44p6
2935D4p8pk00M58m9k08J02P6k73L24k21J17j09Q8q3P4r8J54j31oR0k83L7J08J61
2960H7j51J11J25j22j4j14p4K74j70j44L63j00q6n5L08j28O8j82p5J87j58Jj6
2983f5J91k81K11L1j3L7j84K29l13J94N1o1j82J52n9P3%k68J55M9j07K03j68K73
3007A48j49N4j81J53j11m3J80j65J1k4l9J77J16j99r4J02J03jk8J91k12J60m34
3030b85K23l8j39K83k71l2K82j89k7K35r4M0J49j5J44n9k56m5q9K00N9r5K54j92
$$ plain form
3054 43 -75 91 143 -68 171 65 -114 5 72 209 134 -86 22 -116 -102 -200 342 -150 -343 -282 73 54 -74
3077 -74 -121 -107 -57 1 2 -61 -11 -79 -5 -66 -23 -30 -21 32 15 56 -265 94 82 -115 170 -135 -211 -108 68 -125 -15
3104 -15 -50 133 -198 30 48 18 -53 -58 -222 -120 142 9 40 -127 -281 13 253 56 -364 62 -5 9 -95
3127 -95 -325 -92 276 -64 -177 217 -29 55 -53 162 -223 -107 -138 -186 -217 -29 -195 -268 -107 -46 125 82 -12
3150 -12 -117 73 262 -161 -79 -97 -10 -96 -186 112 -90 30 -41 127 85 -113 -134 -30 41 12 31 81 -282 -47
3174 -47 47 81 -82 -126 -102 -42 -171 -4 65 -103 192 -21 126 68 44 -50 258 -166 261 135 -55 -139 36 -53
3198 -53 167 -65 171 -80 62 -270 -216 117 16 -4 50 -175 110 118 -175 35 159 6 -81 -86 -194 123 22
3221 22 -28 -51 -92 4 -450 -40 105 -66 -98 -251 -49 -61 -264 330 -16 17 -72 -129 -33 311 85 179 70 11
$$ packed form
3054D3j18J66N2k11K39j06j79J19O7J37p5k20J08j38J4r8N42m92j93O1L55j9j28
3077g4m7J4N0N8Jo3N0o8P4o1M3pRN3j7M1l21L59j2j97K85l05p6J03J76j93J10
3104a5l5J83l31K28J8l0p1nj64J02K62j33L1j67j54K94K40j97m20M26o7J4j04
3127i5k30K33L68l40j13L94k46Q4j08K15l85J16l1m8l1J88j66p3J61O1J71m3r4
3150a2j05J90J89m23Q2j8Q7q6r0K98k02J20p1J68m2j98k1J04P1k9J9N0l63K35
3174d7R4L4j63m4K4O0j29J67O9j68K95k13J47n8k4r4L08m24M27j26j90q4J75q9
3198e3K20k32K36k51J42l32N4L33j01k0N4k25K85Qk93K10J24j53q7nj08L17j01
3221B2n0k3m1R6m54M10J45j71l2j53K02j2k03N94l46L3q9n7R6L44k26R4j09n9
$$ plain form
3245 11 -173 161 -37 72 296 -138 -61 -47 282 4 -273 -254 270 194 -15 -65 -185 115 575 -106 -26 76
3267 76 12 -35 157 28 -264 -60 60 -124 -68 -134 -6 -160 -42 -146 -166 18 190 5 110 -113 48 -76
3289 -76 22 98 -187 -19 312 -190 -67 115 95 45 32 219 -227 43 98 24 -84 -60 -75 -24 208 72 46 -182
3313 -182 48 -76 -22 -6 -4 -13 96 -51 -57 -16 294 -98 -3 117 19 6 276 105 -304 -7 -24 66 150 -91 138
3338 138 -118 -151 120 -15 -83 -228 116 135 -60 -39 132 23 40 -190 64 129 124 116 -31 49 -156 -17 78 94
3362 94 59 144 -40 -272 156 -164 4 70 -221 -29 224 -36 -298 -551 212 -17 -68 -77 -118 -33 47 -231 204
3385 204 70 -118 82 -2 -93 173 141 -28 -149 124 -117 191 43 261 264 77 76 -315 -3 114 152 7 -3
3408 -3 -6 51 12 63 25 95 -224 -3 79 -145 51 -104 28 -45 -208 -38 -82 227 -97 21 -157 111 -275 41
$$ packed form
3245A1j84L34j98J09K24m34P7J4L29k78k77J9N24p6k09n0j20L00M60o81Q0J02
3267G6o4m7J92j29k92K04J20j84N6o6J28j54J18j04k0J84J72j85J05k23J61j24
3289g6R8P6k85J68L31n02J23J82k0n0j3J87m46K70N5p4j08K4j5N1K32j36k6k28
3313a82K30j24N4J6KrJ09j47oM1L10l92R5J20r8j3K70j71m09K97j7R0Q4k41K29
3338A38k56l3K71j35o8j45L44J9j95K1J71j09J7k30K54O5nqj47Q0k05J39R5J6
3362I4l5Q5j84k32M28l20J68O6k91J92K53k60k62k53P63k29n1rm1Q5Q0k78M35
3385B04j34j88K00q4r1K66l2j69j21K73k41L08j48K18Lj87jl91L12J17L8j45j0
3408clN7l9N1l8P0l19K21Q2k24J96j55J32p3j63J70m4L09l24J18j78K68l86L16
$$ plain form
3432 41 138 -39 88 122 179 -6 52 -23 -15 126 -71 -53 92 -46 -79 -80 75 53 27 -23 -247 -61 -111 -63 -75 -5
3458 -5 -11 98 -109 70 -194 -54 -243 35 -83 175 59 -112 -26 60 -204 -309 -57 -62 -108 -112 18 -125 244 171
3482 171 12 -70 178 186 225 89 -152 -212 86 -36 133 -172 27 -139 86 -239 -26 47 77 33 214 -5 62
3505 62 180 -190 2 175 -139 142 -49 -83 351 255 119 86 -71 166 -66 -23 -85 6 -117 -114 193 -48 190
3528 190 221 -251 111 222 115 -5 179 12 57 -16 -40 164 -35 69 -76 2 -84 -1 119 -193 28 -279
3550 -279 0 -224 13 135 -126 -111 194 -63 40 -123 76 -85 61 116 -50 27 25 58 72 147 26 -354 78
3573 78 161 -111 -243 146 162 66 -132 2 56 -299 -22 45 -196 -23 158 -196 -9 -25 27 140 75 -165 -127
3596 -127 114 54 208 -67 34 -45 -33 2 240 158 -20 -30 -7 -92 -45 20 119 30 219 -68 -23 -200 -13 231
$$ packed form
3432D1R7j77J27L4N7j85N8p5QJ41j97J8J45j38l3jJ55k2k6n0k24J86n0M8j2P0
3458eoJ09k07J79k64J40j89K78j18K58j16j71Q6Q6k64j05K52nm6mJ30j43L69p3
3482A71j59q2K48QL9j36k41o0K98j22J69l05J99j66K25l25K13P3L0m4J81k19O7
3505F2J18l70J92J73l14K81j91l4M34r6j36l3j57K37k32M3o2R1j23LL07k41K38
3528A90L1m72L62J11j07j20J84j67M5p3k4K04j99J04j45P8q6Q3J20l12K21l07
3550b79K79k24K37J22k61J5L05k57J03j63J99j61J46N5j66P7kL3J4P5j21l80M32
3573G8Q3k72j32L89J6r6j98J34N4l55K77O7k41J73J81l54J87j6N2J13o5k40L8
3596a27K41o0J54k75J01p9J2L5K38q2j78j0K3q5M7O5R9q9J89k87M5j77J87K44
$$ plain form
3620 231 -87 -44 83 129 189 -77 90 165 -139 149 167 -89 64 -254 42 -66 128 -87 194 317 -236 17
3642 17 60 -92 -101 2 -63 -136 -59 -79 124 -135 -164 124 50 37 -1 -178 -140 -75 50 5 135 19 9 -102 154
3667 154 -151 -76 -22 17 70 -55 172 -109 163 238 -15 -164 22 87 -57 -74 247 218 -33 177 261 -5 129
3690 129 -64 -218 290 -32 -26 36 205 -234 -110 -48 -86 -47 34 -10 -8 166 178 -165 134 297 -121 147 -26 -84
3714 -84 -75 161 -160 -71 237 94 -54 -50 -87 41 -44 -121 -49 -82 -31 -143 91 -33 -11 -43 -155 -151 47 -150 -67 81
3740 81 87 49 -253 -139 106 56 -39 5 -62 -15 -107 138 -22 10 -87 87 -230 -59 -105 141 40 -108 -45 -53 -24 119
3766 119 -80 15 69 -78 -61 -217 -107 -62 -121 -11 -78 57 -1 113 78 40 -143 254 55 -39 148 162 -95 11
3790 11 -27 260 50 -199 84 -195 27 -138 -64 124 173 178 -154 141 77 -10 -31 35 195 -30 29 -43 21 -189
$$ packed form
3620B31l18M3J27M6O0k66J67P5l04K88J8k56J53l18K96j08J94k15K81J23n53K53
3642A7M3j52rJ03o5p3P7k0K03k59k9K88p4j3l8j77L8O5J25m5J30j16j0j11K56
3667A54l05P5N4L9N3j25K27k81K72P5k53j49J86O5j44j7L21k9k51K10Q4k66J34
3690A29j93j54N08l22OO2J69m39J24O2l8L9Q1m4KJ74J2l43K99J63m18K68j73n8
3714h4RK36l21Q9L08j43j48Ml7J28q5p7P2l3N1j12K34j24K2l2j12MJ98j97Q3J48
3740H1Ol8l02J14K45n0r5M4o7M7r2K45j60L2r7J74l17J71m6K46j01j48O3qK9J43
3766A19j99R5N4j47J7j56J10M5n9J10o7J35n8J14l5l8j83L97j99r4J87J4k57J06
3790A1l8K87k10k49K83k79K22j65P4J88M9Nl32K95o4q7k1O6J60k25N9p2O4k10
$$ plain form
3814 -189 65 -256 -61 -31 -37 153 104 -72 -263 -57 291 57 -7 206 286 20 37 -29 -155 151 -16 129 176
3837 176 59 62 -19 -41 -93 -206 -139 -111 -50 -93 51 -98 186 122 220 -145 164 205 -136 -26 -144 -70 -50 145 -175
3862 -175 -68 237 -79 -84 0 195 220 196 -55 -70 52 46 26 -67 116 88 -149 -136 109 29 -11 61 14 -158 36
3887 36 189 -139 -4 177 33 -87 -80 165 281 -160 86 -81 155 -113 -39 -6 -103 331 117 220 -59 -61 346
3910 346 298 -188 31 247 77 -88 -143 -156 237 -50 31 79 111 -118 52 159 47 228 -71 99 244 161
3932 161 -143 206 20 63 -183 208 97 -1 -4 -122 -58 27 231 -169 -3 108 7 155 -64 50 -48 -91 101
3955 101 -40 -241 147 112 54 93 39 59 89 -214 39 102 -67 172 97 45 -235 76 185 50 3 17 -58 -168
3979 -168 7 26 -32 137 200 -68 308 -14 -47 -61 -192 -34 -61 29 -54 42 -267 -65 190 -23 27 10 -86 29
$$ packed form
3814a89K54l21J95L0oJ90m9j76j91K06L48k34o4K13Q0k66J7o6j26L06j67J45M7
3837A76j17Lq1k2n2j13O7K8O1m3J44j49K84o4R8l65L09M1l41J10j18P4K0J95l20
3862a75J07L05l16nQ4J95K5k4k51j5J22ok0r3J83k8k37J3K45q0m0P2m7j72J94
3887C6J53l28J35J81j44j20PK45J16m41K46j67K36k68P4L3r7M34k14J03k79kM07
3910C46m8m86K19K16j70j65n5j3L93k87Q1M8L2k29J70J07j12J81k99J70J45q3
3932A61l04L49j86M3k46L91j11r8lj18O4Q5K04m00J66J11j01J48k19J14r8m3J92
3955A01j41k01L88l5n8L9n4K0L0l03K53O3j69K39p5n2k80L11J09j35m7J4p5j10
3979a68J75J9n8J69O3k68L76l22l3j4j31J58k7R0q3R6l09K02K55k13N0j7r6J15
$$ plain form
4003 29 -29 -65 -39 65 -137 57 -64 3 105 -163 61 18 -168 217 -133 100 -58 -163 -69 138 51 215 -39
4026 -39 131 -165 -124 110 -77 -114 -51 241 129 192 -36 -138 -90 11 -80 61 -94 59 -216 -181 50 -119 40
4049 40 -147 -126 -103 91 156 -199 -39 263 -126 -72 92 -195 276 25 12 159 -84 -68 143 -95 113 198 -51
4072 -51 -42 -65 -76 265 -237 105 110 -103 73 207 189 88 195 89 -17 -57 -242 -99 7 -65 -165 6 163
4095 163 -214 175 27 76 -210 -32 -49 176 -78 273 219 121 -41 -108 212 167 -73 55 118 -168 173 -280
4117 -280 -64 -101 -215 -148 -52 247 192 188 -66 83 19 -80 24 -33 154 -21 48 -107 -33 65 3 104 102 48 -76
4142 -76 -164 100 -11 -187 -56 -64 -126 115 138 -51 16 41 -146 253 53 70 -11 43 -9 -182 -164 104 14 213 134
4167 134 -55 120 -19 62 -173 -41 -14 -84 127 -65 -54 -146 30 7 -135 -101 -229 115 87 -69 -20 98 -107
$$ packed form
4003B9n8l6K6J04k02J94j21O7J02k68K24m3j86L85l50K33j58j05R4K07q7J64k54
4026c9J70k96M1K34j87l7O3K92j12O3k28j02M8J01r1J41j55J53k75L5K31j69J59
4049D0j87K1K3J94O5l55J60L02l89N4J64k87M71k51j3J47k43J6K11k38K08Q5k49
4072e1Rk3j1L41n02L42Nk13J76J34j8j01J07j06j06m0j85J43J06p2j00J71J57
4095A63l77L89j48M9k86J78j7K25k54L51n4r8j62o7L20m5k40J28O3k86L41m53
4117b80K16l7j14O7R6K99n5mk54J49o4r9J04n7J87j75O9j55P4R8o2J01kn4j24
4142g6q8K64j11j76J31qo2K41K3j89O7K5j87L99k00J7q1N4n2j73J8K68r0J99p9
4167A34j89J75j39Q1k35J32K7p0K11j92J1r2J76k3j42L4j28L44k8j56M9J18k05
$$ plain form
4190 -107 121 -363 -43 166 27 -188 -208 -150 103 52 148 228 16 -130 -99 140 11 164 -241 28 43 -47 -48
4213 -48 -14 -235 -64 -113 10 25 -68 -50 -90 -1 17 116 -60 68 -43 224 176 -99 71 -187 102 -69 7 -17
4237 -17 -66 -191 37 135 -121 26 -40 -78 28 109 2 -259 51 14 131 -177 111 273 -116 163 -95 -87 100
4260 100 -149 -203 -53 -97 130 -17 222 -165 477 119 -87 110 90 -91 42 -154 67 258 -185 -205 57
4281 57 7 186 111 166 -99 48 157 40 -72 28 157 6 161 -86 15 8 60 -1 -35 -150 -172 -142 16 -144
4305 -144 -202 119 143 -61 8 65 5 220 348 120 -12 -9 99 -198 -67 52 -17 130 22 -378 -60 -61 -30 -114
4329 -114 79 214 166 -85 56 -226 -153 -148 -244 29 274 -142 142 252 217 128 -179 50 -135 -46 -76 115 -129
4352 -129 -258 -10 89 -105 -51 66 -80 -273 33 -19 84 -150 -59 -7 156 -112 -44 157 -306 139 -22 -46
$$ packed form
4190a07K28m84L20K09j39k15k0N8K53n1R6Q0k12j46L1K39j29J53m05K69J5r0j
4213d8L4k21J71m9J23J5r3J8m0Q9J8R9j76J28j11K67m8k75J70k58K89j71P6k4
4237a7m9j25K28R8k56J47o6l8J06Q1j07k61L10l7J17l08K88J62l89K79k58QJ87
4260A00k49n4J50m4K27j47K39l87O42l58k06J97k0j81J33j96K21J91m43k0K62
4281E7n0J79p5N5k65J47J09j17j12J00J29j51J55k47J01pN2o1l4j15k2L0J58j60
4305a44n8L21K4k04O9N7o0K15J28k28j32LJ08k97J31J19o9J47j08m00L18jL1q4
4329a14J93J35m8k51J41k82P3Nr6K73K45m16K84J10l5q9l07K29j85Q9l0J91k44
4352a29j29K48R9j94N4J17j46j93L06n2J03k34R1N2J63k68O8K01m63M45j61k4
$$ plain form
4374 -46 26 -265 41 -62 -265 172 190 -185 -107 -111 100 66 -55 -28 -2 158 -86 14 434 2 35 -28 -60 -47
4398 -47 -115 -153 -102 81 40 285 -99 -126 -55 -101 -81 -29 -225 29 47 -100 -18 -84 -186 -19 47 27 -55 -253 278
4423 278 -21 183 -114 -47 74 -50 -49 -274 116 105 -232 -122 88 -75 -19 104 -80 -187 -144 -82 -40 233 -31
4446 -31 -70 273 -32 71 -139 -205 -242 55 -1 -103 -91 -24 -82 104 -25 -179 -136 -59 -99 101 42 233 -125 -53
4470 -53 -205 -184 171 -167 50 71 8 169 -129 -22 55 -13 84 -53 194 92 160 -14 -156 55 -2 -34 19 58
4494 58 -96 138 -214 124 33 39 132 24 147 94 241 1 -96 -49 28 7 239 124 7 -26 -62 137 -137 118
4518 118 27 -20 160 132 -51 -24 -114 -128 -52 115 40 127 119 32 -98 182 -9 -36 61 -23 -55 120 17 82 169 38
4544 38 18 52 289 64 378 230 139 8 13 65 43 -51 82 14 -7 11 -102 -30 -17 -158 40 -210 96 71 -165
$$ packed form
4374d6P2k91L06j03k03M37J8l75P8mK11l4j21K7K6J60k44J00M20m32L3o3l2J3
4398d7o8l8N1J83m1K45l84k7P1m6K0N2j96K54J8j47Q2o6j02J67O6k0q2j98N31
4423B78k99K04k97O7J21j24Jk25L90j1l37J10K10j63N6J23j84j07M3O2M2K73k64
4446c1l9L43l05J03k10o6l7K97n6j02J2O7n8J86j29j54M3P7m0K00n9J91l58P2
4470e3j52K1L55l38K17K1o3J61k98J07P7o8R7j37K47j02O8j74j42K11n7l2N3L9
4494E8j54K34l52L38r1OR3j08J23n3J47k40r7M7P7k1K32j15j17l3l6J99k74K55
4518A18r1m7J80k8j83K7r0j4P6J67p5Q7qq7j30K80j91k7R7q4l2J75j03O5Q7j31
4544C8k0L4K37k25L14j48r1j31NN2k2r4J33o8k1J8j13P2J3j41J98k50L06k5k36
$$ plain form
4569 -165 -10 69 -12 105 -142 101 134 45 -173 -59 264 -82 -126 -34 141 103 12 184 270 68 -83 -223 -87
4592 -87 -81 -138 -72 -4 62 -209 -192 59 -15 -144 266 -60 -108 -186 -45 -132 -172 -19 -16 164 -129 -127 -25 36 300 179
4618 179 95 63 -264 26 -211 193 45 22 -4 -137 35 -244 144 110 176 -90 120 73 3 -6 10 172 231 82
4642 82 -127 92 14 37 -57 -83 198 280 18 -121 248 -125 19 23 -102 -102 -16 -130 -141 96 -178 151 259 -3
4666 -3 26 -15 67 33 130 -126 51 47 -194 -107 -179 96 -46 57 250 40 -31 -119 -88 -89 41 144 -156 -54 -36 151
4692 151 -18 -273 65 150 -168 -128 -38 -3 -1 -193 181 74 5 319 -10 -8 -20 -157 -183 113 -14 -36 -25 -8 -38
4717 -38 59 63 141 -143 -153 52 -66 -287 -157 216 -204 104 168 -182 -111 -24 37 162 -108 255 -99 -106 -8 29 111
4742 111 212 -62 29 -214 -32 -209 -169 34 -90 -26 191 86 381 15 75 -283 -46 77 238 -72 -51 -18
$$ packed form
4569a65J55P9q1J17k47K43L3q9k18J14L23l46m4R2J75l8r1J72Q6k02j51j40J36
4592h7On7O6O8O6k71J7K51p4j29M10l26m8p8J41q7m0J53LJ80k93KJ02O1K64j21
4618A79q4l2l27K90k37M04j48k3k6j33J72k79L88l4O6k66K10m7p0rJ6J62N9j49
4642H2k09K19p8K3r4k6K81Q2k62j39L69l73J44Mj25%Q6j14j1K37k74L29J08k62
4666cK9m1Q2l4R7k56J77mk41Q7p2K75j42J03J93k10p1q8L1jJ30J03l00J02J8J87
4692A51j69k55L38Q5l18M0R0L5Kj92L74j07o9L14l29Kj2j37k6K96j27k2J1J7l0
4717c8R7MP8k84j0K05j18k21J30L73m20L08O4l50P1Q7O1J25k70L63l54pR8L7Q2
4742A11J01k74R1k43J82j77M0K03j24O4K17j05K95l66O0l58K37J23J61l10K1L3
$$ plain form
4764 -18 104 -57 -27 96 -131 -37 -51 1 234 62 103 -29 150 136 100 291 -33 -65 261 93 73 -280 -60
4787 -60 55 66 5 -7 336 -145 -74 -24 109 50 -111 -126 -150 -73 -222 -118 104 87 177 169 187 -71 198 -238 -66
4812 -66 63 -13 10 61 105 -4 -96 41 -307 -198 -15 -172 -118 -67 37 145 95 -257 11 35 -30 46 -92 251
4836 251 -104 -202 -201 -127 -137 67 -35 -13 40 33 124 -175 -14 116 -5 -50 -80 80 227 124 166 -71 -69 -38 35 59
4862 59 -206 -70 52 18 74 -269 -15 165 -15 -97 219 87 166 47 -102 -11 -164 -31 216 -55 -92 -79 -13
4885 -13 240 -70 -72 95 -36 53 -14 -195 203 82 102 23 48 -36 93 -4 4 9 -25 74 -85 76 104 114 210 196 -39
4912 -39 83 75 -46 -126 -162 -105 -110 140 -267 66 56 -171 58 -5 -218 65 207 39 -144 -186 -228 -50 -30 -161
4936 -161 -204 -43 -20 38 216 -149 7 57 8 133 65 41 -139 175 86 193 -257 5 216 40 -64 -3 -69
$$ packed form
4764a8J22j61L0J23k27R4j4N2K33j72M1j32J79j4l6J91l24l2L26j68k0l53K20
4787f0J15J1o1j2L43m81P1N0J33n9j61j5k4P7j49J04K22j7R0qJ8k58K69m36J72
4812f6J29p6K3N1M4j09r2J37l48J09J83j57N4N1J04J08n0l52K68K4o5P6j38L43
4836B51l55r8JP4j0K04j02K2N3pR1k99J61J30j21m5l0J60J47j03M2k37KL1P3K4
4862E9k65J36J22l4N6l43K54J80j80q2L16j32P9j19j49R1j53J33K47k71l7J3O6
4885a3K53l10kJ67j31Q9o7j81L98j21K0p9K5q4J29r7QNl4R9j59J61K8J0R6j4k35
4912c9J22qj21q0l6N7nK50m07L33j0k27K29o3k13K83J42j68j83m2m2J78K0j31
4936a61m3J61K3N8J78l65J56N0m9J25o8k4j80L14q9J07m50K62K11j76j04O1o6
$$ plain form
4959 -69 -185 86 -121 -171 19 308 -63 -98 -109 12 -22 -76 184 -22 90 -40 -111 135 45 154 -106 -187 52
4982 52 46 138 181 108 171 -246 6 55 167 -50 315 -2 -81 -70 99 153 99 149 47 120 145 -107 -187 -78 -27 -170
5008 -170 -10 221 -155 -161 -52 103 167 52 41 179 240 158 23 90 36 154 156 -53 -198 78 -126 -160 63 123
5032 123 241 -66 -34 27 -8 132 167 -244 112 -175 261 -29 -354 142 96 9 80 71 -194 167 -410 220 -7
5055 -7 228 56 104 143 -187 33 -266 -242 -140 -156 56 -59 80 227 4 -75 -20 -28 -312 -60 -28 -2 -46 -194
5079 -194 -55 125 13 46 -68 -47 84 5 -93 293 14 -150 -30 -158 -47 31 -30 -25 -6 101 -7 -37 26 55
5103 55 12 -158 -21 163 -4 243 72 -118 298 -8 -238 274 27 127 18 -43 -102 13 -17 51 -188 -4
5125 -4 -122 -30 -201 -36 -75 15 -110 209 117 102 38 45 106 -12 97 -99 -46 124 83 16 -43 62 17 -123 8
$$ packed form
4959f9j16K71k07n0J90K89l71l5j1J21l4n4K60k06J12j30p1K46r0J09k60q1K39
4982E2oR2M3p3O3m17K52M9J12k17L65l17p9J1J69N4n4N0j02P3K5k52q0J09N1j43
5008a70J60K31l76oJ09J55O4j15j1J38O1q2j35O7n4J18Kk09j45K76k04l4K23O0
5032A23J18l07L2O1l5J40L5m11L56k87M36k90l25M96m6q7P1rk65L61n77O30k27
5055gK35j72M8L9l30K20k99K4J02j6K12j15J39J47k23p9N5qk84K52L2K6m4j48
5079a94J39J80j12L3j14K1J31p9r8L86k79j64J20j28J11P8o1NJ9J07j08l0O3K9
5103E5m3j70J37J84j67K47j71j90M16l06k30N12k47J00j09o1n9J15l0O8k39J84
5125dj18R2j71J65l9R0j25L19r2j5o4PO1j18J09j96N3J70m1o7n9J05m5j40J31
$$ plain form
5150 8 -54 59 129 147 81 139 -152 -5 273 61 45 4 240 74 -76 -253 -55 -173 -218 24 138 0 132
5173 132 -37 207 168 -66 8 102 -410 102 158 -199 -136 82 276 43 48 -46 73 -112 -151 9 244 -178 -182 -203
5197 -203 -129 124 128 -69 311 -53 -256 -29 34 -47 102 -104 88 62 -210 -118 -7 -66 -3 11 -162 215 -202
5220 -202 133 -85 -15 122 141 2 -36 -30 -55 161 -62 -64 41 -73 -55 5 80 18 -114 155 -22 -98 -59 -136 -281
5245 -281 -241 -102 110 -89 -129 -86 10 -23 218 -240 -49 -38 80 -42 -85 83 10 81 120 -251 -196 -83 -24 -12
5269 -12 33 173 75 -23 -53 41 148 -117 -6 185 137 -41 -112 -73 -114 -88 -15 24 -115 14 -18 -68 -30 -109 -85 -68
5295 -68 33 194 -154 -108 -41 -28 15 -239 7 -228 55 -41 1 8 201 218 -40 150 -108 -17 -189 -24 9 -53
5319 -53 -30 23 -94 -68 73 121 110 -94 456 -195 -124 201 -361 -176 -29 -98 -128 71 -18 -214 -27 -28 -80 -41 -114
$$ packed form
5150Ho2J13P0J8o6N8k91J47K78k12j6m1K36j66j50j77J98j18m5K42J14j38J32
5173A32j69K44l9k34P4R4n12N12N6l57O3K18J94k33Nr4J19j85l9J60K35m22mk1
5197b03P4K53Mj97L80l64k03K27O3q1J49k06J92k6k72R2J11n9O3J4j73L77m17
5220b02L35k18P0J37J9j39l8Ok5K16k23kJ05j14J8O0P5o2j32K69j77p6L9p7j45
5245b81M0J39K12j99m0M3R6l3K41m58J91J1J18j22m3J68p3P1L9l71N5J13N9J2
5269a2M5J40r8r8l0R4J07k65J11J91m8j78p1L9m1K6P3L9j39J29l2n0L8p9K4J7
5295f8J01J61l48M6O7J3M3k54K46k35K83r6M2PJ93J7k58J90k58R1j72J65L3o2
5319e3K3N3j17K6J41M8j1k04N50o51P1L25n62J85J47o9l0J99q9j96J87jn2L9p3
$$ plain form
5344 -114 118 236 41 161 -232 -32 -62 118 31 195 65 170 -76 -57 43 38 46 -2 205 100 -257 -50 -96
5367 -96 176 -199 -21 176 -18 -14 -309 -59 -49 -73 7 129 -120 114 -42 218 -127 -69 -139 -7 -16 -50 -219 177
5391 177 46 16 11 -104 -11 13 355 117 -192 -51 -241 109 229 -7 271 -143 -23 -91 51 148 -7 178
5413 178 21 -138 152 244 45 -18 27 -69 -25 180 -176 182 -68 66 98 -22 89 261 200 118 4 -107 11
5436 11 174 26 -107 -72 -67 172 400 -115 93 -3 82 -295 130 99 -156 -343 -230 -165 204 30 158 91 -186
5459 -186 -61 -114 218 -90 19 160 78 202 214 150 -22 -27 -193 -124 227 257 -74 48 50 1 -58 -9 49 -115 -90
5484 -90 -71 -290 65 72 137 -52 135 -196 143 48 -58 -20 -251 -86 9 -89 -22 -101 149 -150 6 -12 -61 21 36
5509 36 -283 -113 139 23 -246 -78 -26 18 -91 -90 72 -55 -189 -140 33 441 240 111 40 -111 193 140 57
$$ packed form
5344a14K32J18j95J20l93K00l0J80q7J64j30J05k46J9J00nQm8K07j05l57K07m6
5367i6K72l75J78J97j94Mk95K50J0k4Q0J22k49K34j56K60l45N8p0J32rl4j69L96
5391A77j31l0nj15R3K4L42k38l09J41j90L50J20k36K78m14J20o8J42R7j55J85
5413A78j57j59K90R2j99o3M5r6M4K05l56L58k50J34L2j20J11J72o1q2j14j11J18
5436A1J63j48j33L5NK39K28n15K08r6Q5l77M25l1k55j87J13O5L69j74J28o7k77
5459a86J25n3L32l08J09J41q2J24J2o4j72nj66O9L51L0l31J22Km9n9M9N8j64K5
5484i0J9k19L55PO5j89J87l31L39r5j06L8k31J65R5r8O7p9K50k99J56j8m9Q2J5
5509C6l19J70K52j16k69J68N2M4j09JJ62j27j34M9J73M08k01j29p1j51L04n3q3
$$ plain form
5532 57 -132 28 -6 81 -227 94 8 235 -16 82 54 -260 258 -87 -21 98 -38 132 177 -114 -209 63 -243
5555 -243 236 -143 31 -81 164 210 1 101 -232 -59 -110 85 106 -70 182 57 -237 60 59 75 -12 -54 142
5578 142 -80 -52 -20 13 -3 103 72 -50 202 18 9 72 116 299 -160 92 215 -359 -43 25 -91 -119 -126 53
5602 53 -14 -167 -341 210 22 76 143 44 -85 58 78 -37 208 49 123 -208 -32 187 93 -158 -84 75 -150
5625 -150 -129 30 215 -122 84 60 -48 -37 165 -56 -128 -126 -24 -1 205 72 -156 -146 -8 11 -104 -80 -30 -55
5649 -55 -17 20 -153 124 11 19 -175 -38 -37 166 65 39 96 156 58 -114 4 241 146 118 62 43 -237 -224 246
5674 246 209 -175 27 35 6 158 239 -133 -3 290 134 9 -111 37 28 -113 -82 15 62 -35 22 -148 10 1 2
5699 2 8 -66 -56 -42 85 -89 314 74 -54 -225 -101 -99 -81 -106 -284 232 108 -11 101 -127 108 121 -51 20
$$ packed form
5532E7j89J60l4Q7l08L21q6K27k51R8k8l14N18l45O6J19j36J70M5k91r5K72l06
5555b43M79l79J74j12K45M6k09J00l33J73n1J95K1j76K52j25k94K97jJ6q7m2J96
5578A42k22K8L2L3j6J06l1j22K52j84rO3M4J83m59K52J23n74L16O8j16k8pJ79
5602E3o7j53j74N51j88N4O7r9j29J43K0j15K45j59P4l31J76K19r4k51P4J59k25
5625a50K1J59J85l37K06k4j08J1K02k21p2KJ02K3K06j33k28J0J38J9j15K4N0k5
5649e5L8L7j73K77j13Qj94J37JK03j01k6N7O0r8j72J18K37r5k8n6j9k80J3M70
5674B46l7l84K02Qk9J52Q1l72J30K93j56j25j20J48rj41L1R7M7r7N7j70J58rJ
5699BOp4J0J4J27j74M03k40j28j71J24KJ8k5j78N16j24j19J12k28K35J3j72P1
$$ plain form
5723 20 95 -6 -74 139 -62 81 -216 -57 5 -22 25 -145 -221 -126 -45 67 44 106 52 -225 -31 -37 -28 -13 159 -146
5749 -146 -21 133 -99 -18 32 -26 27 149 181 -3 -176 83 57 -50 62 23 45 -109 129 1 313 -55 -40
5772 -40 96 25 74 213 111 120 51 88 -198 -115 272 -46 -4 -83 -16 146 -48 -167 151 -189 -122 -35 49 -86 20
5797 20 -60 -131 96 -162 -83 37 8 122 143 50 36 -162 70 126 -33 -218 142 69 3 61 -186 63 120 40 -72
5822 -72 -133 -127 -25 -20 108 178 54 130 123 174 -20 295 -64 62 156 -114 176 98 316 97 -212 -159 -197 14 171
5847 171 -68 44 -41 91 223 100 -93 125 114 42 116 166 -187 -72 73 -80 -38 133 263 -170 34 6
5869 6 124 -11 228 -2 -24 -239 -16 -110 85 -131 -26 176 114 -122 -84 33 -193 29 -197 -44 42 2 176
5892 176 -50 138 -152 -335 80 -128 85 114 11 -58 -232 -73 72 45 7 3 104 109 29 3 136 29 249
$$ packed form
5723B0P5j01o8K13k01J43k97J59O2k7M7j70p6R5Q1J12k3O2n4k77J94oRJ5J72l05
5749a46J25J54k32Q1N0n8N3J22L2j84j73K59k6j07J12l9K2j54K38j28L12l68J5
5772d0J36p1M9J39j02Ro9L7k86Q3L87l18M2p9O7J62j94j19L18l40O7Q7Q4j35J06
5797B0q0p1K27k58P9J20k9J14K1r3j4j98K32N6j59j85L60p3o6N8k47K49N7q0j12
5822g2o1OJ02NJ28P0j24P6pN1j94L15l59J26R4k70K90p8K18k19l09N3l8K11J57
5847A71k39J12q5J32J32j23j93K18j1p2P4N0l53J15J45j53M2J71J30m33K04k8
5869FJ18j35K39k30k2k15K23r4J95k16J05K02o2k36L8J17k26K22k26J53Q6m0J74
5892A76k26J88k90j83M15k08K13K9j03o9j74J59J45k7l8mJ01Nq0k6J33j07K20
$$ plain form
5915 249 224 -84 28 146 168 48 44 -5 52 -134 -111 -154 -68 30 -108 13 230 107 232 -97 171 -171 -207 -93
5939 -93 -45 -52 -89 113 90 -94 -83 -11 -82 161 -150 -249 -115 223 40 -46 -295 106 18 120 172 8 -19 -158 32
5964 32 204 165 22 -256 56 -66 -107 -191 -76 -88 81 176 -96 -16 104 -211 8 -3 76 -117 47 42 12 93
5988 93 -91 35 -53 -161 15 6 13 112 -57 87 -155 97 74 -61 -37 26 31 -20 -32 111 -71 -25 -146 -47 -158
6013 -158 -86 -24 -11 72 -32 21 -35 -134 -232 -7 -180 158 41 40 36 -82 98 166 20 -10 104 308 -81 -179 54
6038 54 60 138 83 -43 72 133 -19 178 -161 -203 88 11 96 236 51 71 -113 19 100 -16 -122 83 -53 156
6062 156 -86 -117 191 5 65 -154 -135 117 153 122 149 -87 -86 -44 28 -189 -4 156 128 -26 64 -134 106 51
6086 51 184 138 -160 -33 191 -48 252 171 -6 -19 -42 -121 73 52 95 -178 -158 -6 63 -150 107 111 32 333
$$ packed form
5915B49k5l08J12J18K2j20mm9N7j86K3m3Q6R8j38J21K17j23J25l29K68l42l6J14
5939i3M8pl7K02k3j84J1P2p1K43l11r9J34L38j83q6k49M01q8J02N2j64k7j39J90
5964C2J72l9j43k78L12j22m1q4J15j2J69R5k72Q0J20l15K19j1P9j93J64nl0Q1
5988I3j84J26q8j08J76rPR9j69J44k42K52k3j35K4O3Nn1j2J43j82M6j21R9j11
6013a58P2O2J3Q3j04N3n6r9r8K25j73L38j17jmj18J80O8j46l0J14K04l89r8K33
6038E4OP8n5j26J15O1j52J97l39m2K91p7Q5J40j85K0j84J32Q1j16j06K05j36K09
6062A56k42l1L08j86O0k19J9K52L6l1K7k36JM2P2k17J85J60k8j54R0j98K40n5
6086E1J33m6k98J27K24k39L00q1j77j3k3p9J94k1M3k73K0J52O9k13K57Mp9L01
$$ plain form
6110 333 -174 -68 20 92 -265 30 184 -151 -111 -256 -146 12 -84 285 -151 181 -145 178 -135 -135 56 169
6132 169 -118 73 -83 201 -211 35 87 43 -177 -170 50 -243 132 109 157 -99 -99 -116 129 -129 -1 -179 338
6155 338 -77 50 -89 -17 39 -379 154 -248 251 -36 158 12 -12 -11 0 130 149 171 -146 141 23 90 4
6178 4 -58 49 39 89 -33 21 81 35 110 65 -120 -126 -83 5 -286 20 23 -53 -209 115 -182 -157 -110 -43 -59 19 -8 -286
6206 -286 4 19 -135 84 15 208 -19 312 -12 -54 109 -51 183 -172 49 -107 16 -2 132 67 43 41 5
6229 5 50 -39 40 -112 201 60 -101 268 -144 -64 -215 -44 -210 -272 -181 -84 90 -71 104 -60 124 8 162
6252 162 41 -3 161 -55 -144 -171 26 39 -102 286 69 12 -51 -96 81 -135 -109 28 49 -118 -87 -182 5 -40
6276 -40 -225 26 -45 -76 59 94 -165 95 13 26 3 -142 -119 3 -1 25 14 -260 -55 242 130 -2 254 56
$$ packed form
6110C33n07J06Q8P2l57K95J54l35M0j45J10J58r6L69m36L32l26L23l13%J91J13
6132A69k87J91j56K84m12K46N2m4k20PK20k93L75k3M8k56%j7K45k58J28j78N17
6155C38m15J27j39P2N6m18N33m02M99k87J94j46k4JJ1J30J9K2l17K87j18O7q6
6178Do2J07j0N0j22N4O0m6P5m5j85oM3Q8k91L06Lp6j56L24k97K5M7O7j6P8k7k78
6206b86K90J5j54K19o9J93k27L31l24m2J63j60K34l55K21j56J23j8J34o5k4kl6
6229EM5q9P9j52L13j41j61L69m12Q0j51J71j66o2R1R7J74j61J75j64J84j16J54
6252A62j21m4J64k16q9k7J97J3j41L88k17n7o3m5J77k16K6J37K1j67L1r5J87m5
6276d0j85K51p1l1J35L5k59K60q2J3k3j45K3J22mK6j1k74K05K97j12j32K56j98
$$ plain form
6300 56 -120 12 21 -68 271 36 47 104 27 145 -250 -106 -24 -71 -72 49 -93 98 -45 -91 46 25 180 -132
6324 -132 41 -1 -84 -68 23 31 -61 -36 -135 -231 -30 -212 -157 18 -30 -190 -76 226 199 -258 -127 11 -49 87 126
6349 126 21 -8 197 47 -120 24 102 -21 -126 -36 -10 48 -168 -91 247 -68 124 -106 18 34 99 71 291
6372 291 137 231 88 224 381 -228 -149 -256 -94 -80 -14 -121 -46 82 -106 48 317 -203 114 -95 38 147
6394 147 117 -1 -147 -98 -173 102 19 105 2 -125 9 -38 -24 -147 -66 -12 -115 -208 -55 -18 174 142 446 -93
6418 -93 -154 250 50 -211 149 4 92 -10 -82 37 -110 44 209 -51 194 50 -41 225 -130 -229 -68 -127
6440 -127 -219 -242 -161 -100 93 201 198 -23 195 149 82 -55 4 -46 -19 353 95 53 188 -176 4 146 99 -258
6464 -258 -182 -27 -130 -13 1 69 -55 -92 -22 143 41 156 19 107 -51 -227 8 189 -154 -281 -82 -31
$$ packed form
6300E6j76J32Rq9L39k35J1N7p7J18l95J44Q2m7jJ21j42J91j43m6J37k1J55l12
6324a32J73m2q3J6R1Qr2K5r9r6K01j82N5J75m8j60J14L02k7m57J31J38o0J36L9
6349A26j05k9K05j50j67J44P8j23j05R0K6N8k16P7L38l15J92k30J24J6O5k8K20
6372B91j54R4j43J36J57o09P9j07J62J4O6j07P5J28j88J54K69n20L17k09J33J09
6394A47l0j18j46M9p5K75q3Q6j03j27J34m7J4j23Q1N4j03r3J53L7J92l2L04n39
6418i3o1M04k00k61L60j45Q8j02p2J19j47J54J65k60K45j44r1K66l55r9J61n9
6440a27r2k3Q1O1J93J08lk21K18m6o7j37N9n0K7L72k58m2J35l64J80J42m7l57
6464b58P6J55j03J17J4O8j24l7P0J65j02J15j37Q8j58j76K35J81l43j27J99N1
$$ plain form
6486 -31 87 -2 -61 -7 -132 -54 148 18 -164 92 -53 -232 38 -60 -10 -38 48 -81 -236 82 110 -190 -67
6509 -67 148 -106 -8 296 307 242 -226 -225 -33 22 -190 -55 -137 276 186 117 -4 -121 23 283 46 -95 -32 -48
6533 -48 93 -206 226 40 203 -23 9 372 -33 -52 72 146 -212 -229 183 166 -68 130 -33 6 270 -71
6555 -71 -64 65 173 359 291 -361 -195 54 93 279 -95 102 -97 -120 127 -73 -36 58 -68 -10 -158 -104 -45 184
6579 184 285 -210 222 234 -172 129 86 252 -43 38 127 -200 229 -75 -109 64 -142 -115 -41 33 -298 -94 169
6602 169 122 -247 -139 52 13 56 115 3 -90 -256 -84 -113 -119 -43 13 134 -73 124 -235 14 -202 -88 -8 -41
6626 -41 153 -18 -96 142 -24 24 18 -99 37 103 112 -89 170 118 -22 -176 -67 142 214 129 90 82 88 -56 1 -70
6652 -70 -201 -167 -6 -111 206 -5 64 -99 35 79 97 75 -41 75 -6 -190 -101 116 104 119 -145 7 -165
$$ packed form
6486c1J18q9n9N4j25P8K02j30j82K56j45j79K70r8N0k8Q6j29j55L18K8l00J23
6509f7K15k54R8L04J1o5m68JJ92N5k12J35q2M13r0o9j21j17J44K60k37j41O3j6
6533d8J41k99M32j86J63k26L2L63m05j9J24P4l58j7M12j7k34J98j63L9K64l41
6555g1PJ29J08J86o8o52J66K49L9J86l74J97j99k3K47k00L7R4j26N8j48N4N9K29
6579A84J01m95M32J2m06L01m3J66k95Q1Q9l27M29l04l4J73k06K7P4P4l31K04K63
6602A69m7l69J08J91l9M3N9j12r3j66J72k9oP6N6J21k07J97l59K49k16J14Q0l3
6626d1J94j71p8K38j66M8oj17J36O6Rk01K59n2j40j54J09K09P2q5l9qOj44N7p1
6652g0j31L4J61j05L17k11O9j63J34M4J8k2j16J16q1j84Q9K17j2J5k64J52j72
$$ plain form
6675 -165 63 114 -191 -4 8 -149 1 182 4 201 -64 13 -108 -252 160 -44 90 85 -5 100 73 -80
6697 -80 286 18 -9 163 -6 127 -76 178 171 142 -153 255 -35 -204 12 185 85 93 53 -214 -116 218 155
6720 155 -202 216 141 -178 -64 1 -90 31 106 82 90 240 -8 220 104 117 313 -5 107 9 -200 -319 -128
6743 -128 -150 106 15 134 4 82 147 -87 2 -261 7 -98 179 -87 216 90 -37 12 -147 109 238 -84
6765 -84 -195 -34 -154 304 186 300 165 49 12 158 450 52 -121 -173 -112 27 -48 -116 -186 96 -56 -134 40
6788 40 27 -142 -289 22 59 -139 54 20 154 192 -181 160 90 -253 -147 -134 173 -86 -121 76 30 133 -90
6811 -90 -42 47 250 16 -133 278 254 -129 -122 131 263 -47 258 -1 -148 -64 -56 -194 365 -188 -6 -2 -40 89
6835 89 -43 261 -79 139 -114 109 241 35 50 -178 211 -68 -98 -53 -124 215 -294 -258 -162 -37 -154 65
$$ packed form
6675a65K28N1l05J87J2j57J50J81j78J97k65P7j21j44M12k04J34nr0J05k7j53
6697h0L66k68k7J72j69J33k03K54pk9k95M08k90j69K16J73j00Qm0k67R8L34o3
6720A55l57M18p5l19J14O5r1J21P5k4QJ50k48K28j16J3J96l18J12r8k09j19J91
6743a28k2K56r1J19j30P8O5k34Q9k63K68j05K77k66L03j26j27M9j59K56J29l22
6765h4j11J61j20M58j18J14j35j16l7J46K92l98j73n2O1J39p5o8p0K82j52p8J74
6788D0j3j69j47L11L7j98J93l4J34L8l73L41p0l43J06J3L07k59l5J97m6J03k23
6811i0M8Q9K03k34j49M11k4l83PK53J32l10L05k59j47Q4Qj38N59n53J82Ml8J29
6835H9j32L04l40K18k53K23J32k06J5k28L89k79l0M5p1L39n09L6R6J25j17K19
$$ plain form
6857 65 126 69 247 172 124 101 -162 -18 137 123 82 26 85 -62 161 1 -14 288 -4 103 -82 363 -120 -167
6881 -167 31 -96 -22 -67 -13 168 141 76 7 -108 -82 178 -72 -172 146 155 223 -11 -96 325 133 -49 233 205
6905 205 61 -70 148 37 -82 106 -6 192 -169 -194 2 -98 20 -103 22 66 63 46 -9 23 -107 -118 49
6928 49 -69 51 46 32 72 29 80 -47 115 31 -206 62 13 -62 -71 169 53 104 157 54 -65 183 -78 -175 -65
6953 -65 242 -131 -89 -232 17 -186 40 -195 182 -36 -118 -25 -74 -146 76 51 25 -10 -149 -112 46 37 31 -63 -31
6978 -31 90 62 62 57 -95 -157 -77 -86 42 139 53 -172 0 65 -57 1 -52 242 11 -48 100 65 -74 144 111 -175
7004 -175 -175 107 -76 90 186 127 -69 -34 -224 -228 165 -50 29 -139 38 38 69 -211 29 -42 61 -241 -9 -219
7028 -219 10 -78 -17 72 -159 122 -77 164 -83 -79 -180 107 -135 -4 -61 -53 51 -95 -216 44 -300 -61 197
$$ packed form
6857F5O1n7J78p5m8k3k63J44J55j4m1n6N9j47K23j60j5L02k92J07j85M45m83m7
6881a67J98j27P4m5N4J81k7o5o9j15K6K60k50j00L18RO8k34q5M21j92j82K82k8
6905B05j44j31K18j11j19J88j12J98l61k5J96j00J18j23J25M4lj7n5L2j30j1J67
6928D9j18J20nj4M0m3N1j27J62q4k37K68m9p5rK40j16N1N3j03j19K48k61r7J10
6953f5L07l73M2j43K49k03K26k35L77k18q2R3m9p2K22k5k6l5j39L7J58ror4L2
6978c1J21k8%nj52o2Q0rJ28R7q6k25J72O5j22N8n3K94k31n9J48l5j39K18l3k86
7004a75%K82j83J66R6n9j96L5j90mL93k15P9j68J77%L1k80K40p1J03l02K32k10
7028b19K29q8O1Q9k31K81j99K41k47Mj01K87k42J31n7QJ04j46j21K60l44K39K58
$$ plain form
7051 197 -57 -26 -33 184 217 18 -7 -72 104 13 170 -5 -42 55 -13 89 -55 -10 142 165 51 210 -203 48
7075 48 37 77 155 107 2 37 83 42 -40 273 -251 -203 63 23 1 -214 -210 -45 -80 157 -123 52 21 -396 -100
7100 -100 42 158 2 200 -115 -192 -218 -117 215 100 -46 135 88 -61 -95 -115 -38 -23 14 145 126 22 -336
7123 -336 23 19 -20 125 85 -181 0 -101 57 65 -19 -54 -109 179 243 26 -96 -151 -36 -75 -32 -78 -154 136 125
7148 125 56 115 2 106 -77 -214 30 270 96 96 56 -137 -4 -199 13 -135 -56 -193 -256 -201 19 43 213
7171 213 -105 5 184 -101 325 139 9 29 116 -71 -45 40 -89 56 -179 -103 51 -126 85 -29 14 -134
7193 -134 -36 -183 27 190 -276 -59 263 46 -194 -93 144 3 -9 138 1 139 83 -68 27 -33 176 -70
7215 -70 -241 48 108 59 -7 -104 154 43 35 -14 111 100 -10 -154 161 -208 -48 -12 -111 183 56 117 8 176
$$ packed form
7051A97k54L1pK17L3j99k5o5J76r1J57j75l7R7o8J02j44M5J52K3j14J59m13K51
7075D8j1M0P8m8j05L5M6m1q2L13n24M8K66m0k2k15MJ65l5K37k80J75l1m17K96
7100a00J42J16j56J98l15p7k6J01L32j15j46J81m7j49l4k0P7J5L7J31j9j04l58
7123c36L59ml9J45m0k66J81j01J58Qq4l5n5K88O4k17j22n5J15l9M3m6p6K90j1
7148A25o9N9j13J04j83j37K44K40j74%m0j93J33j95K12j48P9j37o3N5K20K4J70
7171B13l18J10J79k85M26j86j30K0Q7j87K6Q5j29J45k35P6J54j77K11j14M3j48
7193a34R8j47K10J63m66K17L22k17k40J01K37j41j2J47j37J38n6j51R5o0K09k46
7215g0j71K89O0m9o6r7K58j11qm9J25j1j10j44L15l69J60L6r9K94j27O1j09J68
$$ plain form
7239 176 -18 -13 158 153 106 -83 -257 82 -27 156 -244 20 127 -5 -194 -229 57 77 -15 38 -74 -122 59
7262 59 -80 197 218 106 -165 26 -10 213 -39 91 125 199 18 -84 37 41 -80 86 101 192 120 -16 219
7285 219 88 70 49 97 22 -65 26 -49 36 -142 23 -136 27 166 65 -27 -25 -131 -79 64 265 36 -29 35 291
7310 291 0 27 91 229 -69 -48 64 9 208 -19 -40 67 37 287 -36 25 -6 19 122 79 -90 5 68 -268
7334 -268 -84 -82 -62 18 105 116 -91 28 -67 44 -32 -187 1 -29 -197 126 -36 19 -131 61 -203 -103 -78 19
7358 19 261 -46 -98 -110 -45 -59 105 -141 54 92 127 31 -2 -83 147 5 50 117 -154 -135 185 -85 291 -115
7382 -115 9 224 -226 83 31 125 -150 -185 -2 127 102 -49 75 -47 33 -67 -21 -41 60 213 -110 -140 -223
7405 -223 120 1 -206 0 296 -123 266 207 105 206 -20 11 348 235 194 -99 -286 146 -225 -84 -20
$$ packed form
7239A76j94NJ71nm7j89j74L39j09J83m00K64J07j32j89l5K86K0r2N3j12m8J81
7262E9j39K77K1j12k71J91l6K23k52J30L4P4j81j02J21Mj21J66J5R1p2j36K35
7285B19j31j8k1M8p5q7R1p5Q5j78J65j59J63J39j01r2Kj06N2J43K01k29o5O4K56
7310B91k91K7O4J38k98K1J12n5J99k27k1J07l0K50l23O1l1K5J03m3j69R5O3l36
7334b68J84KK0Q0Q7J1k07J19r5J11p6j55J88l0j68L23j62N5j50J92k64J00K5R7
7358A9K42l07n2j2O5j4J64k46J95L8L5r6l3q1K30j42M5O7k71J9L20k70L76m06
7382a15J24K15m50L09n2R4k75l5J83J29k5j51J24j22Q0j00M6k0J01J53l23l0q3
7405b23L43j19k07K06K96m19L89n9j02J01k26L1L37j13m1k93j87M32l71J41O4
$$ plain form
7426 -20 87 195 -107 -163 -104 -143 28 -68 -86 -176 61 -43 102 -77 80 45 -72 -33 73 129 181 116 -4 441
7450 441 1 357 -163 -293 -20 -110 -112 159 -107 -60 -126 -7 199 -84 304 97 243 313 260 60 45 136 -4
7473 -4 -157 -95 195 -24 70 21 -176 122 135 26 -149 -34 66 -60 9 163 155 56 151 22 -148 253 -89 -105
7497 -105 39 149 -117 173 92 -67 34 -30 76 -291 -94 59 -23 132 280 35 -41 -156 -52 161 210 -55
7519 -55 -347 -134 -30 44 2 33 111 187 -149 -292 -80 -109 -216 170 -28 42 -131 -107 -150 97 -55 -267 218
7542 218 268 173 -26 19 175 -33 -141 -65 -31 117 -46 -73 -43 23 83 199 -6 -94 -83 -48 246 5 3 170 189
7567 189 78 87 128 61 144 -252 114 -23 -160 -9 86 39 -252 232 184 30 -8 111 59 50 -57 -9 -194 -83
7591 -83 65 28 87 99 241 70 -180 -20 112 6 97 129 233 -125 -76 -7 112 97 24 -31 150 -79 -7 88
$$ packed form
7426b0J07J08l02n6N9l9J71r6j8r0K37j04J45j79J57l5j17L9J06N6N2o5j20M45
7450D41m40L56n20j30K73r0kK71k66M7o6J19K06k83L88k07J46P0n3k00j5R1j40
7473dj53O2K90k19R4m9j97K98J3j09j75J15J00j26O9J54qr9R5j29j70M01l42j6
7497a05J44J10k66K90q1j59J01o4J06l67J97J53q2J55J48k45p6j15J04K13M9k65
7519e5k92K13J04P4m2L1P8P6l36j43K12k9j07L86j98P0j73K4m3K47j52k12M85
7542B18N0r5j99M5J56k08j08P6L4J48j63k7L0O6O0J16k05q8J1L5K94k41kJ67J9
7567A89j11RM1o7Q3l96L66j37j37J51R5m7k91M84m8j54l8J19n2rj07M8j85J11
7591h3J48l7N9J2J42j71k50J60J32j06R1L2J04l58M9O9J19j5p3n5J81k29P2R5
$$ plain form
7615 88 -296 130 44 21 -64 130 -4 97 -77 72 -12 -148 -201 41 -9 128 115 266 -55 -197 134 213 96
7638 96 -276 -9 -108 -13 -101 85 86 46 20 44 -141 -23 27 21 -91 -118 -39 -12 170 -10 34 283 153 216 52 -56
7664 -56 143 201 77 79 96 -224 2 91 -262 -85 121 -48 21 -90 23 218 25 -60 26 -251 -101 -33 -48 154
7688 154 1 -11 -47 25 -145 -290 -117 6 -13 80 111 8 94 -105 -87 -203 13 163 23 -106 65 39 -157
7711 -157 -100 -91 52 33 106 209 -201 -39 -165 -127 -227 -275 262 -256 -5 -118 40 7 132 -64 33 -255 -106
7734 -106 -169 -185 328 -122 186 19 120 -117 109 -231 43 -195 65 99 69 164 -37 62 -123 21 -48 182
7756 182 -172 -70 106 -85 15 104 -267 136 13 -244 84 172 97 -41 176 -38 153 -38 -21 0 219 -69
7778 -69 -32 -134 -12 151 65 54 21 146 -88 -72 68 4 11 6 -55 224 77 285 71 56 -30 173 79 8 -39 110
$$ packed form
7615H8l84M26q6k3q5J94j34J01j74J49q4j36n3K42n0J37j3J51l21j42L31P9j17
7638I6l72K67r9R5q8J86Jm0k6K4j85J18N0oj12k7P9K7J82j80M4K49j30O3j64j08
7664e6J99N8j24KJ7l20K26Q9l53J77K06j69O9j11J13J95j93q5Q6k77J50O8j5K02
7688A54j53j2l6P2j70j45J73J23j9R3L1j03Q6j99J8j16K16J50j40j29J71k6j96
7711a57N7RJ43j9P3J03m10J62j26L8j00m8N37n18K51j13J58l3J25j96R7k88J49
7734a06o3j6N13m50L08j67J01k37K26l40K74k38K60L4l0R5k01R9j85J44o9K30
7756A82l54J02J76j91J00Q9l71M03j23k57L28Q8p5j38K17k14J91j91J7K1K19k88
7778f9L7j02J22J63q6j1l3J25k34J6J40o4Pno1K79j47K08k14j5q6K03r4p1m7J49
$$ plain form
7804 110 14 45 169 -11 87 18 -93 -233 56 -242 -57 111 -170 -24 14 -7 53 34 -50 65 131 -117 95
7827 95 47 -75 38 71 67 -90 32 115 5 253 237 -52 198 41 94 11 36 -58 -196 -186 84 50 -111 -59 107
7852 107 34 165 -43 45 -103 42 71 -9 22 25 -41 -114 153 -214 -99 -32 -86 -29 262 12 16 -131 203 -96 292
7877 292 171 119 -8 2 60 -136 41 -56 -44 -93 -158 1 -11 -127 27 14 20 -137 110 288 58 29 -200 74
7901 74 53 147 91 82 21 39 -195 -88 96 -8 1 -1 -68 -130 30 -93 -60 20 -255 98 -5 -15 177 -79 -167 -202
7927 -202 79 100 -40 -424 253 -171 -34 -141 -49 -37 -49 -261 -49 -65 5 -51 -53 -98 -65 -155 -144 -88 -11 32 116 32
7953 32 -105 54 2 -50 2 -32 -69 -123 33 -218 -32 -72 -33 134 -220 -48 -70 -312 -60 -208 118 -129 -60 170
7977 170 -115 80 -42 -111 19 202 -55 149 233 -159 -146 55 -43 26 80 -184 81 138 -93 159 -149 198
$$ packed form
7804A10r6L1J24j80R8o9j11j40K89k98J85J68k81J46L8k1O0j9q4J15O6k48K12
7827I5m8j22J13L3mj57J22Q3j10K48j6k89K50j57N3q3K5r4j38J0K70l4j61N2J66
7852A07p3J31k08Q8j48J45K9q0L1Lo6p3K67l67J15O7n4N7K91k50Mj47L34k99L88
7877B92j21n2j27J0N8j96J77r7J2m9o5J59j2j16J54j3Oj57K47J78k30k9k29K74
7901G4k1R4n6ro1J8k34J07J84j04Rko7o2J60j23L3Q0k75L53j03j0J92k56q8l5
7927b02K81K1j40l84O77m24J37j07R2J2j2k12K12j6P0n6km5L3r0J1N6P7M3Q4q4
7953C2j37J59n2n2N2l4l7n4J56k51J86m0L9J67l54J72k2k42K52j48L26k47O9K30
7977A70k85J95j22o9J30J83k57K04Q4l92J3K01r8O9N4k64K65N7k31K52l08L47
$$ plain form
7999 198 91 -69 -96 -66 -48 -19 -3 -104 50 78 -76 -90 -95 -61 -127 -35 -18 -41 -79 -1 118 -35 45 -296 -44 -63
8025 -63 90 -12 24 148 220 -237 -20 -157 -21 0 220 -167 145 206 130 -198 39 122 163 65 53 -108 -112 -131
8049 -131 -220 14 -386 -73 -114 -81 -15 -103 113 50 -104 -144 -104 2 -196 88 -134 21 -182 -19 -244 213 -71
8072 -71 -198 52 -97 54 -149 -22 -20 -149 -62 51 22 223 -101 -11 -4 -134 -35 -41 -10 -6 146 118 44 71 -20 -132
8098 -132 163 275 -25 105 29 44 75 -136 -123 99 107 -174 -61 -69 194 -84 -66 75 -33 -22 70 -36 -154 -11
8122 -11 27 192 80 93 236 -109 -49 79 -53 -49 86 96 -70 -54 1 -16 -97 26 -204 98 -1 271 59 67 -40
8147 -40 -171 28 112 94 93 104 266 257 -12 -56 14 21 149 98 207 -46 -8 4 32 95 45 202 161 -42 21 -181 -97
8174 -97 -119 -55 -80 -12 140 -49 -108 -57 -115 5 125 36 38 245 4 -83 6
$$ packed form
7999A98j07j60k7L0J8K9J6j01J54K8j54j4nL4o6R2J7k3l8P8J19j53Q0l41K52j9
8025f3J53j02L6J24P2m57K17j37J36K1K20l87L12O1p6l28K37Q3M1r8j2j61mj9
8049a31q9K34m00L13m1L3O6q8K16o3j54m0M0J06j98K84k22J55k03J63k25M57k84
8072g1j27K50j49J51k03J27Kj29Q7J13k9K01l24R0Pj30R9oL1MJ52k8p4K7r1j12
8098a32K95J12l00J30p6J5L1k11J3K22Qk81J13qK63k78J8J41j08J1R2j06j18J43
8122a1L8J65j12J3J43l45O0J28j32MJ35J0j66J6N5j7q1J23k30L02r9K72k12Qj07
8147d0j31J99Q4j8jJ1J62rk69m4P0PJ28n1J09k53L8J2K8O3n0J57m1k03O3k02Q4
8174i7k2O4k5O8J52j89n9N1n8J20J20q9KK07k41q7Q9
8191F
$$ Imaginary data points
##PAGE= N=2
##DATA TABLE= (X++(I..I)), XYDATA
$$ plain form
0 0 0 0 0 0 0 0 0 0 0 0 0 0 0 0 0 0 0 0 0 0 0 0 1 -15 64 -64 64 -64 64 -65 66 -96 128 -129 129 -150 192 -194
38 -194 215 -256 265 -308 334 -375 411 -456 500 -555 608 -671 742 -820 899 -995 1099 -1224
56 -1224 1356 -1507 1695 -1907 2170 -2494 2913 -3457 4218 -5346 7208 -10797 20297 -93701
70 -93701 -235398 -8034 54356 -51662 -118910 -54802 40318 79326 -24888 -46893 113325
81 113325 159931 -14248 -70130 35247 89170 69659 49502 46378 121289 152655 25253 -47857
93 -47857 56587 97220 22881 5894 35055 49509 71889 35177 -17519 51440 117006 31806
105 31806 -34776 2860 15572 -322 -3429 -23075 11786 89216 42890 -52670 -10566 51755
117 51755 5446 -41884 -38961 -14148 32098 12355 -68497 -24974 88293 44428 -60963 -38282
$$ packed form
0@%%%%%%%%%%%%%%%%%%%%%%Jj6P9j28J28j28J28j29J31j62K24k57K58k79L42l86
38a94M09m71N21n73O42p09P86q67R56j055J163j279J413j562J719j894K094k323
56a224K580k863L202l602M077m664N407o370P675r564J2554j8005L1094j13998
70i3701j41697K27364O2390j06018o7248O4108R5120L9008j04214k2005J60218
81A13325M6606j74179n5882J05377N3923j9511k0157l124P4911L1366j27402p3110
93d7857J04444M0633p4339j6987K9161J4454K2380l6712n2696O8959O5566q5200
105C1806o6582L7636J2712j5894l107j9646L4861P7430m6326r5560M2104O2321
117E1755m6309m7330K923K4813M6246j9743q0852M3523J13267m3865j05391K2681
$$ plain form
129 -38282 21931 11127 -38601 -83786 -44837 55392 28192 -84993 -46242 63251 25717
140 25717 -69600 -76519 -30238 6962 -22519 -102379 -71294 46949 26212 -82500 -61209 20792
152 20792 12583 -42115 -78376 -61217 9198 8018 -76493 -55649 51324 46396 -27769 -30547 1992
165 1992 19508 11797 -36738 -40007 41661 57096 -16196 -11471 56310 62085 33025 12375 720
178 720 31263 49974 -9730 -28063 50154 75724 23481 9669 30447 42777 44090 3048 -32336
191 -32336 20302 55299 -11066 -40988 21356 52211 26482 -199 -11838 16275 40771 -19797
203 -19797 -68762 -1205 49223 -3869 -37794 -2539 30993 34093 -5136 -44460 -202 47257
215 47257 -15654 -71788 -14139 38446 14483 -16649 -18523 12753 43252 -2363 -64004 -20988
$$ packed form
129c8282O0213j0804m9728m5185L8949J00229k7200j13185L8751J09493l7534
140B5717r5317o919M6281L7200k9481p9860L1085J18243k0737j08712K1291Q2001
152B0792q209n4698l6261J7159P0415j180q4511K0844J06973m928p4165k778L2539
165A992J7516p711m8535l269Q1668J5435p3292M725O7781N775k9060k0650j1655
178G20L0543J8711n9704j8333P8217K5570n2243j3812K0778J2330J313m1042l5384
191c2336N2638L4997o6365k9922O2344L0855k5729k6681j1639K8113K4496o0568
203a9797m8965O7557N0428n3092l3925L5255L3532L100l9229l9324M4258M7459
215D7257o2911n6134N7649N2585k3963l1132j874L1276L0499m5615o1641M3016
$$ plain form
227 -20988 36532 -8418 -55983 -26512 11601 19225 -3139 -37165 -15788 31943 -5939 -69563
239 -69563 -40608 7859 -7194 -31589 -30997 -12492 20384 9193 -42368 -29246 23267 238
251 238 -47946 -34302 -2390 9122 6033 -15092 -7988 38880 30637 -27690 -19795 27575 19767
264 19767 -9104 -11496 4213 34313 39696 -1866 -1563 52806 45660 -12730 -15556 18003 26925
277 26925 16286 -5484 -3496 43669 50711 -8348 -17114 35096 35873 -8467 -24618 -10396 16612
290 16612 23883 -14821 -24997 31721 44321 -14477 -32896 1444 13457 -2688 -26103 -32460
302 -32460 6742 30285 -14367 -34907 13668 31702 -6863 -28863 -21752 -3554 8351 -17451
314 -17451 -38271 3859 34947 -4275 -29024 -719 14853 2153 -17346 -31271 -10999 17961
$$ packed form
227b0988N7520m4950m7565K9471L8113P624k2364l4026K1377M7731l7882o3624
239f9563K8955M8467j5053k4395N92J8505L2876j1191n1561J3122N2513k3029
251B38m8184J3644L1912J1512l089k1125P104M6868q243n8327P895M7370p808
264A9767k8871k392J5709L0100N383m1562L03N4369p146n8390k826L3559Q922
277B6925j0639k1770J988M7165P042n9059q766N2210P77m4340j6151J4222K7008
290A6612P271l8704j0176N6718J2600n8798j8419L4340J2013j6145k3415o357
302c2460L9202K3543m4652k0540M8575J8034l8565k2000P111J8198J1905k5802
314a7451k0820M2130L1088l9222k4749K8305J5572j2700j9499j3925K0272K8960
$$ plain form
326 17961 -7964 -35113 2287 32113 5315 -16886 -11443 -541 8541 -8444 -34611 -9836
338 -9836 27700 3014 -25364 1175 25384 14804 -3360 -17568 -6841 19430 1211 -32780
350 -32780 -4881 35284 16766 -10392 -1623 15093 22541 6682 -23559 -11327 27856 11130
362 11130 -27445 -6795 28814 23974 3688 -9246 -2973 21829 11092 -30843 -20848 23465 16042
375 16042 -16032 -12203 9254 21250 13025 -17395 -19653 16068 12487 -29315 -25356 11554 16948
388 16948 1335 -9061 -6286 15921 18761 -17959 -25906 10827 14593 -15747 -18004 2134 15770
401 15770 16933 -2812 -13483 13370 21482 -15686 -24912 5776 14217 -667 -7947 -4757 13436
414 13436 23941 -3289 -19314 10190 19848 -12565 -22749 -2811 10091 10618 -2209 -12575 10300
$$ packed form
326A7961k5925k7149L7400K9826k6798k2201N443J0902R082j6985k6167K4775
338i836L7536k4686k8378K6539K4209j0580j8164j4208J0727K6271j8219l3991
350c2780K7899M0165j8518k7158Q769J6716P448j5859l0241J2232L9183j6726
362A1130l8575K0650L5609m840k0286j2934O273K4802j0737m1935R995M4313p423
375A6042l2074L829K1457J1996q225l0420k258L5721l581m1802L959L6910N394
388A6948j5613j0396K775K2207K840l6720p947L6733L766l0340k257K0138J3636
401A5770J163j9745j0671K6853Q112l7168r226L0688Q441j4884p280L190J8193
414A3436J0505k7230j6025K9504R658l2413j0184J9938J2902N27j2827j0366K2875
$$ plain form
427 10300 26025 -6151 -26086 1456 14505 -5097 -16871 -12631 4661 19879 699 -20680
439 -20680 4971 24963 -5047 -26930 -10431 5473 5430 -6747 -18870 -166 25778 4277 -23476
452 -23476 -3173 17580 739 -17320 -17454 -4539 13623 4764 -18719 -2797 25789 8890 -17945
465 -17945 -9019 6420 7048 -2644 -16484 -8294 19405 13506 -13744 -3000 21913 12152 -7381
478 -7381 -10277 -3580 9840 8128 -13004 -7335 22195 16602 -9019 -4288 12091 10655 741 -11716
492 -11716 -11405 10577 12175 -13069 -8417 19407 15874 -4944 -8632 -1670 7059 5927 -14622 -16710
506 -16710 11796 15111 -10907 -9957 11805 13965 2701 -9826 -12796 5147 11937 -12769 -17423
519 -17423 11761 18455 -2215 -8068 652 9569 10991 -7859 -19356 3473 15576 -8083 -15860
$$ packed form
427A0300J5725l2176j9935K7542J3049j9602j1774M240J7292J5218j9180k1379
439b0680K5651J9992l0010k1883J6499J5904m3j2177j2123J8704K5944k1501k7753
452b3476K0303K0753j6841j8059j34J2915J8162q859k3483J5922K8586j6899k6835
465a7945Q926J5439O28r692j3840Q190K7699n899k7250J0744K4913r761j9533
478g381k896O697J3420j712k1132N669K9530n593k5621M731J6379j436r914j2457
492a1716L11K1982J598k5244M652K7824l533k0818l688O962Q729j132k0549k088
506a6710K8506L315k6018R50K1762K160j1264j2527k970J7943O790k4706m654
519a7423K9184O694k0670n853Q720Q917J422j8850j1497K2829J2103k3659p777
$$ plain form
532 -15860 5829 15512 6802 -4911 -11244 1505 12838 -7600 -23201 -1114 12944 -3407 -12229
545 -12229 -4233 5496 9872 -2957 -19156 -6238 9741 -7648 -21934 -4725 8363 2626 -4712
558 -4712 -8945 -1467 11866 -485 -19430 -6067 10820 -2094 -12837 -3413 6440 11394 5632
571 5632 -8416 -1174 15995 3331 -15197 -2212 12866 6637 -864 -2048 4895 17855 11388
584 11388 -9180 -1681 16851 6118 -10587 -4005 7744 12036 8154 -4806 -1315 18231 11891
597 11891 -11491 -6595 10826 7108 -4253 -7492 -1371 12884 13237 -6982 -7333 13257 9703 -10703
611 -10703 -10857 498 5632 3292 -7445 -9398 9419 12958 -8459 -11642 4759 4983 -7290 -12139
625 -12139 -9636 1216 6948 -7572 -13729 4573 8250 -10008 -13749 -3924 -1071 -3253 -11028 -15306
$$ packed form
532a5860K1689R683q710j1713o333J2749J1333k0438j5601K2087J4058j6351q822
545a2229P996R729M376j2829j6199J2918J5979j7389j4286J7209J3088n737p338
558d712m233P478J3333j2351j8945J3363J6887j2914j0743R424R853M954n762
571E632j4048P242J7169j2664j8528J2985J5078o229p501j184O943J2960o467
584A1388k0568P499J8532j0733j6705O582J1749M292l882j2960L491J9546o340
597A1891k3382M896J7421l718j1361l239O121J4255L53k0219l51K0590l554k0406
611a0703j54J1355N134k340j0737j953J8817L539k1417l183J6401K24j2273m849
625a2139K503J0852N732j4520o157J8302L677j8258l741R825K853k182p775m278
$$ plain form
639 -15306 -935 8056 -7513 -13558 2534 5736 -6612 -11289 -8704 -1779 4458 -5123 -12805 3536
653 3536 13282 -2281 -8228 3307 7879 3323 -3200 -8482 2666 14970 2914 -7256 8773
666 8773 18129 6133 -1440 1170 7097 12388 3912 -8446 3525 18187 6739 -4545 5010 13129
680 13129 9344 1343 -6690 -1413 12053 4404 -10991 -1078 13044 5604 -3916 -2958 1834 7067
694 7067 2082 -12234 -8217 8043 2677 -10670 -3920 6266 4450 -1176 -7398 -6575 4782 2843
708 2843 -12777 -8853 6200 2490 -6685 -4304 678 4198 2642 -8741 -10204 4066 2756 -11443
722 -11443 -8028 3968 3517 -1963 -5531 -5247 3960 4688 -10336 -11467 3470 2645 -8818 -6902 207
737 207 4299 3909 -5568 -9192 3844 6604 -8651 -10149 3184 5397 -477 -3513 -2921 6155 11140
$$ packed form
639a5306J4371Q991j5569o045J6092L202j2348m677K585O925O237r581p682J6341
653C536R746j5563n947J1535M572m556o523n282J1148J2304j2056j0170J6029
666H773R356j1996p573K610N927N291q476j2358J1971J4662j1448j1284R555Q119
680A3129l785q001q033N277J3466p649j5395R913J4122p440r520R58M792N233
694G067m985j4316M017J6260n366j3347O750J0186j816n626o222Q23J1357j939
708B843j5620L924J5053l710r175K381M982L520j556j1383j463J4270j310j4199
722a1443L415J1996m51n480l568K84R207P28j5024j131J4937q25j1463J916P109
737B07M092l90r477l624J3036K760j5255j498J3333K213n874l036N92R076M985
$$ plain form
752 11140 -2382 -8663 5106 9622 -2915 -5514 2354 7857 9142 1956 -4129 6096 14507 941
766 941 -6483 4140 8521 2988 -989 -1394 5211 12847 4250 -6010 3164 10811 368 -5797 -358
781 -358 3558 4808 1344 -5507 572 10852 2304 -7836 -500 5334 -1022 -5060 -4966 -1390 5901
796 5901 1955 -8247 -1905 7854 -45 -8597 -3565 774 -11 -3022 -8302 -4881 6626 1864 -9668
811 -9668 -3506 4670 -991 -7323 -7051 -3882 2141 507 -9742 -6633 6273 2476 -8384 -5195 1320
826 1320 545 -2472 -8485 -7194 4451 4795 -7142 -5194 6400 4168 -2719 -3491 -1687 4005 4824
841 4824 -4338 -6063 7236 9018 -1453 -1068 6012 6697 4108 -940 -2981 5405 9726 -473 -2680
856 -2680 7887 9131 2362 991 2656 5357 7004 -416 -5432 4212 8384 -806 -2525 4691 5409
$$ packed form
752A1140j3522o281J3769M516j2537k599P868N503J285p186o085J0225Q411j3566
766I41p424J0623M381n533l977m05O605P636q597j0260R174P647j0443o165N439
781c58L916J250l464o851O079J0280q548j0140P336N834o356m038R4L576P291
796E901l946j0202O342R759p899q552N032M339p85l011n280L421J1507m762j1532
811i668O162Q176n661o332K72L169O023j634j0249L109J2906l797j0860L189O515
826A320p75l017o013J291J1645L44j1937J948J1594k232o887p72J804N692Q19
841D824r162j725J3299J782j0471L85P080O85k589n048k041Q386M321j0199k207
856b680J0567J244o769j371J665K701J647p420n016R644M172r190j719P216P18
$$ plain form
871 5409 2280 -1047 -4084 1078 5648 -3093 -8507 969 4627 -2720 -4122 -890 871 2554 -3280
886 -3280 -9737 -2286 4409 -4413 -8746 -687 2436 -722 -3348 -5615 -1512 4897 -2416 -10530 -2397
901 -2397 4290 -1941 -5803 -2093 1488 3972 394 -7519 -2763 6136 -71 -7797 -2054 3588 1331
916 1331 -1032 -2609 -115 6537 3261 -6441 -3118 5434 1600 -3988 -1200 1897 4098 3521 -3131
931 -3131 -2233 6865 4333 -4861 -2152 3752 1899 -199 -981 -179 5574 6010 -3050 -2940 5703 3273
947 3273 -3508 -1312 2090 2572 2716 -1897 -2595 5547 5799 -3866 -3060 3816 1831 -1816 -2289 -1524 2910
964 2910 4774 -3041 -4735 4657 4628 -3815 -3719 555 1068 647 -2963 -5120 3001 6366 -2748 -5158 2329
981 2329 3144 -2063 -3306 -2947 820 4076 -1972 -6310 1853 5968 -1862 -4171 -35 1216 606 -1838
$$ packed form
871E409l129l327l037N162M570q741n414R476L658p347j402L232J761J683n834
886c280o457P451O695q822m333Q059L123l158k626k267M103O409p313q114Q133
901b397O687o231l862L710L581K484l578p913M756Q899o207p726N743N642k257
916A331k363j577K494O652l276r702L323Q552l834n588K788L097K201n77o652
931c131Q98R098k532r194K709N904j853k098p82Q02N753M36r060J10Q643k430
947C273o781K196L402M82J44m613o98Q142K52r665Q06O876j985l647m73P65M434
964B910J864p815j694R392k9q443R6M274N13m21l610k157Q121L365r114k410P487
981B329Q15n207j243L59L767L256o048m338Q163M115p830k309M136J251o10k444
$$ plain form
997 -1838 -5615 -289 5819 -367 -5468 740 3860 -709 -2494 -2288 -715 2635 -218 -6311 -590
1012 -590 5365 104 -3555 516 1431 556 -410 -4010 -1875 4657 798 -5177 212 4635 696 -1660
1028 -1660 -318 539 2921 1267 -5061 -1673 6028 1995 -3638 636 3878 1884 859 -1962 -1264
1043 -1264 4658 2851 -5057 -1640 5221 2163 -1363 165 1120 3033 2656 -3848 -3786 4363 3168 -3959
1059 -3959 -1845 2394 1968 486 -1832 -2578 2932 3214 -4623 -4985 2270 2069 -2317 -1847 -180 1215
1075 1215 2571 -2547 -4784 2025 3581 -3590 -3738 1253 1253 -113 -917 -2404 1404 4209 -2133 -5091
1091 -5091 1739 2850 -2202 -1625 215 1201 2530 -177 -3638 1785 4843 -1441 -3726 1473 2047 -189
1107 -189 -404 -1163 1465 4733 -12 -4538 1286 4160 -1190 -2806 97 1026 1642 228 -3275 467
$$ packed form
997a838l777N326O108o186n101O208L120m569j785K06J573L350k853o093N721
1012e90N955n261l659M071R15q75r66l600K135O532l859n975N389M423l939k356
1028a660J342Q57K382j654o328L388P701m033n633M274L242j994j025k821O98
1043a264N922j807p908L417O861l058l526J528R55J913l77o504O2Q149j195p127
1059c959K114M239m26j482k318p46N510K82p837l62P255k01m386M70J667J395
1075A215J356n118k237O809J556p171j48M991%j366q04j487L808K805o342k958
1091e091O830J111n052N77J840R86J329k707l461N423L058o284k285N199N74k236
1107a89k15p59K628L268m745m526N824K874n350j616K903R29O16j414l503L742
$$ plain form
1123 467 5243 -250 -4831 -276 2013 -701 -1664 -1985 -624 3450 801 -5204 -629 4128 -45 -3372
1139 -3372 -1290 -101 780 235 -3685 -1764 4492 1989 -4194 -1042 2686 595 -933 -1452 -1267 2771
1155 2771 2318 -3553 -1665 4461 2518 -2129 -396 1135 1225 1423 -1480 -1762 3961 3578 -2367 -970
1171 -970 3465 1614 -284 -164 -515 1694 2591 -1932 -2220 3486 2854 -1744 -596 1638 884 531 -1416
1188 -1416 -2787 1854 2956 -2771 -3121 2171 1709 -1484 -1225 -955 96 1361 -2363 -4774 1360 2710
1204 2710 -2523 -3087 261 382 -370 -1510 -3638 -34 2584 -2390 -4590 571 1973 -883 -1565 -1065
1220 -1065 84 2059 -958 -4020 358 3794 -816 -2374 776 1483 1242 508 -1413 -27 3859 434
1236 434 -3442 562 3316 526 -153 815 906 2693 1600 -2311 21 3979 793 -2355 859 2078
$$ packed form
1123D67M776n493m581M555K289k714r63l21J361M074k649o005M575M757m173l327
1139c372K082J189Q81n45l920J921O256k503o183L152L728k091j528n19J85M038
1155B771m53n871J888O126j943m647J733J531R0J98k903k82N723l83n945J397
1171i70M435j851j898J20l51K209Q97m523k88N706o32m598J148K234p54l53j947
1188a416j371M641J102n727l50N292m62l193K59K70J051J265l724k411O134J350
1204B710n233n64L348J21p52j140k128L604K618m974k200N161J402k856o82N00
1220a065J149J975l017l062M378L436m610j558L150P07k41p34j921J386L886l425
1236D34l876M004K754k790o79R68R1J787j093l911K332L958l186l148L214J219
$$ plain form
1252 2078 870 728 -621 -377 3078 1206 -3341 -544 2806 -6 -1642 -90 236 1080 1194 -2453
1268 -2453 -1667 2925 818 -3614 -1304 1310 -152 -669 -1466 -1366 1655 1642 -3277 -2638 2548 571 -2550
1285 -2550 -1031 -375 595 909 -1618 -2309 2415 2172 -2911 -2002 1176 468 -487 -538 -1459 1136 2341 -1753
1303 -1753 -2771 2155 1701 -1715 -1144 -206 203 1310 -232 -2278 1456 3164 -1450 -2026 1384 855
1319 855 -313 -235 -993 66 2458 -625 -2434 1635 2517 -930 -1172 429 195 828 13 -2100 475
1336 475 3344 -595 -2431 1461 1587 -285 4 -659 -26 2080 110 -2858 1012 3264 -461 -1681
1352 -1681 715 739 770 190 -1688 -95 3055 198 -2656 782 2373 378 -499 -667 -516 1698 1044
1369 1044 -2787 -706 2911 496 -2250 -324 646 472 262 -1531 -1572 1874 625 -3034 -1135 1752
$$ packed form
1252B078j208j42j349K44L455j872m547K797L350k812j636J552L26Q44J14l647
1268b453P86M592k107m432K310K614j462n17p97J00L021j3m919O39N186j977l121
1285b550J519O56R70L14k527o91M724k43n083R09L178p08r55n1r21K595J205m094
1303a753j018M926m54l416N71R38M09J107j542k046L734J708m614n76L410n29
1319H55j168P8p58J059K392l083j809M069Q82l447k42J601k34O33q15k113K575
1336D75K869l939j836L892J26j872K89o63O33K106j970k968L870K252l725j220
1352a681K396K4L1n80j878J593L150k857k854L438J591j995q77j68J51K214o54
1369A044l831K081L617k415k746J926R70j74k10j793m1L446j249l659J899K887
$$ plain form
1385 1752 38 -1031 -534 -1231 331 914 -2662 -2039 1482 636 -2264 -843 576 -70 17 -832 -1493
1402 -1493 1249 1275 -2367 -1554 1717 659 -714 172 -265 575 1451 -794 -1562 1869 2007 -1513 -787
1419 -787 1648 1145 1036 283 -499 1075 2422 -1106 -1700 1934 1706 -529 -96 254 716 1723 -320
1436 -320 -1833 1170 2229 -1181 -1789 834 604 159 58 -1190 -8 1736 -535 -2728 450 1526
1452 1526 -830 -1300 -590 -406 845 193 -2530 -363 1848 -1114 -2537 -113 355 -412 11 -1032 -807
1469 -807 1549 342 -2593 -14 1818 -562 -1088 -154 -31 564 661 -1130 -591 1971 603 -1898 566
1486 566 1441 -108 299 -48 -402 1521 1337 -1466 44 2459 500 -896 269 531 729 655 -506
1503 -506 -556 2146 1284 -1635 -120 1897 371 -524 -132 -854 799 1395 -1644 -1272 2013 811 -1634
$$ packed form
1385A752j714j069M97o97J562N83l576O23L521q46k900J421J419o46Q7q49o61
1402a493K742K6l642Q13L271j058j373Q86m37Q40Q76k245p68L431J38l520P26
1419g87K435n03j09p53p82J574J347l528n94L634k28k235M33L50M62J007k043
1436c20j513L003J059l410o08K623k30m45j01j248J182J744k271k193L178J076
1452A526k356m70P10J84J251o52k723K167K211k962j423K424M68p67M23j043K25
1469h07K356j207k935K579J832k380n26R34J23N95R7j791N39K562j368k501K464
1486E66Q75j549M07l47l54J923j84k803J510K415j959j396J165K62J98p4j161
1503e06n0K702q62k919J515K017j526q95L92p22J653N96l039L72L285j202k445
$$ plain form
1520 -1634 -632 107 -124 371 -1102 -1751 618 1212 -2075 -1647 1003 249 -863 -446 -1302 -337 776
1537 776 -855 -2102 819 1122 -1149 -608 263 -347 460 -193 -1445 346 1634 -703 -1290 1022 1066
1554 1066 -196 241 85 -167 1454 123 -1529 675 1859 -598 -718 815 693 357 405 -833 -55
1571 -55 1573 -128 -1371 676 1323 -328 -455 -51 -39 1029 571 -1539 -89 1729 -668 -1323 412
1588 412 741 306 477 -664 -482 1330 275 -1700 24 1334 -160 -597 -298 -229 678 806 -1183 -755
1606 -755 1503 205 -1561 125 405 -4 274 -339 -748 934 760 -1726 -675 754 -74 -761 -163
1623 -163 -425 175 775 -887 -1077 1113 599 -1394 -470 581 -288 -299 -277 -940 181 711 -839 -1109 1065
1642 1065 324 -703 -126 -236 -317 888 -214 -932 949 1166 -1242 -831 878 91 -25 -7 -362 243
$$ packed form
1520a634J002P39k31M95j473o49K369N94l287M28K650p54j112M17q56R65J113
1537G76j631j247K921L03k271N41Q71o10Q07o53j252J791J288k337n87K312M4
1554A066j262M37j56k52J621j331j652K204J184k457j20J533j22l36M8j238P78
1571e5J628j701j243K047O47j651j27M04J2J068m58k110J450J818k397o55J735
1588D12L29m35J71j141J82J812j055j975J724J310j494m37K99O9R07J28j989M28
1606g55K258j298j766J686K80m09K78o13m09J682j74k486J051J429q28o87N98
1623a63k62O00O00j662j90K190n14j993R24J051q69j1K2o63J121N30j550k70K174
1642A065p41j027N77j10q1J205j102p18J881K17k408M11J709p87j16J8l55O05
$$ plain form
1660 243 1476 -407 -976 1079 1315 -427 -239 382 372 757 317 -970 646 1749 -86 -615 1117
1677 1117 953 -7 163 -376 -1 1308 454 -1135 644 1486 -63 -406 201 -125 221 460 -850 -335
1695 -335 1197 -129 -1342 48 728 -543 -236 -591 -644 417 262 -1560 -429 797 -568 -1226 -282
1712 -282 -304 -384 -74 -973 -967 567 -161 -1479 -404 713 -355 -589 -248 -536 -28 457 -985 -751 1032
1731 1032 357 -619 130 604 422 535 -62 -290 1036 1056 -749 -99 1456 804 -92 431 49 719 1294
1750 1294 -20 -688 1268 923 -646 206 785 367 664 177 -400 531 1079 -450 -729 794 413 -183
1768 -183 125 -171 -7 879 -439 -1095 461 653 -804 -567 283 -130 -362 -256 -660 -354 756 -444
1786 -444 -943 209 238 -816 -489 1 -244 34 -112 -1305 -18 667 -616 -1193 292 6 -268 -40
$$ packed form
1660B43J233j883n69K055K36j742J88O21j0L85m40j287J616J103j835n29J732
1677A117j64r60J70n39L75J309q54j589J779Q42j549l43O07l26L46K39j310N15
1695c35J532j326j213J390O80j271L07l55n3J061j55j822J131J226j365o58R44
1712b82k2q0L10q99OJ534p28j318J075J117j068k34L41k88N08M85j442K34J783
1731A032o75r76P49M74j82J13n97k28J326K0j805O50J555o52q96N23l82O70N75
1750A294j314o68J956l45j569Q52N79m18K97m87n77R31N48j529k79J523l81n96
1768a83L08k96J64Q86j318o56J556J92j457K37Q50m13k32J06m04L06J110j200
1786d44m99J152K9j054L27M90k45K78j46j193J287O85j283n77J485k86k74K28
$$ plain form
1804 -40 -550 -119 677 24 -1139 164 853 -376 -353 266 43 380 651 -562 -238 1136 0 -603 458
1823 458 732 216 345 -137 -23 587 548 -734 -30 1136 -33 -565 77 5 323 503 -387 -573 710
1842 710 444 -802 124 544 -11 6 164 -533 389 571 -363 -336 984 -66 -695 76 -288 -76 416 -256
1862 -256 -657 522 672 -665 -4 732 234 -405 157 -259 348 785 -313 -447 649 475 -741 -116
1880 -116 168 38 -82 -204 -591 67 836 -555 -639 547 158 -601 -89 -233 -86 479 -195 -979 179
1899 179 719 -495 -305 200 -88 198 -101 -602 -116 555 -118 -748 416 335 -162 -177 -230 -277 433 249 -681
1920 -681 99 663 -66 -422 317 128 106 325 -255 -235 817 53 -610 205 718 34 -98 127 70 320 492
1941 492 -366 -290 975 -239 -451 212 499 -123 167 -97 -276 671 587 -675 -10 476 113 -197 65 -90
$$ packed form
1804d0n10M31P96o53j163J303O89j229K3O19k23L37K71j213L24J374j136o03J061
1823D58K74n16J29m82J14O10l9j282P04J166j169n32O42p2L18J80q90j86J283
1842G10k66j246R26M20n55J7J58o97R22J82r34K7J320j050o29P71l64K12M92o72
1862b56m01J179J50j337O61P36m98o39N62m16O07M37j098j34J096j74j216O25
1880a16K84j30j20j22l87O58P69j391q4J186l89p59N12j44J47N65o74p84J158
1899A79N40j214J90N05k88K86k99n01M86O71o73o30J164q1m97j5n3m7P10j84r30
1920f81P80N64p29l56P39j89k2K19n80K0J052p64o63Q15N13o84j32K25n7K50J72
1941D92q58P6J265j214k12O63K87o22K90k64j79R47q4j262O65M86l63l10K62j55
$$ plain form
1961 -90 251 778 -361 -328 464 186 -441 -134 388 -9 64 -277 -470 230 581 -751 -399 425 126 -376
1981 -376 -227 71 -125 318 -342 -258 375 369 -384 -239 183 121 109 153 -424 157 624 -275 -486 353 124 -634
2003 -634 105 197 -255 555 31 -650 45 674 -282 -300 409 -60 -52 141 -152 -280 497 -4 -657 208 185 -587
2025 -587 -407 297 -16 73 -23 -436 -287 476 -382 -352 213 6 -395 -139 -171 -255 199 128 -737 123 274 -432
2047 -432 -414 236 312 73 322 -318 -207 792 324 -414 315 587 -62 386 138 270 345 448 -204 -200 849
2068 849 166 -145 237 458 110 502 -167 -55 171 270 -377 -20 624 -278 -371 179 46 -315 341 -361 -643
2089 -643 351 72 -740 -207 24 -178 -108 -428 -594 -39 206 -796 -629 -23 -386 -465 22 -336 -235 40
2109 40 -321 -352 164 200 -410 -212 217 -245 -52 -135 -143 20 606 -16 -489 512 175 78 -66 211 -48 218
$$ packed form
1961i0L41N27j139L3P92k78o27L07N22l97P3l41j93P00L51j332L52Q24k99n02
1981c76J49K98j96M43o60Q4O33op53J45M22o2j2M4n77N81M67q99k11Q39k29p58
2003f34P39R2m52Q10n24o81O95O29r56j8P09m69QJ93k93j28P77n01o53Q65k3p72
2025e87J80P04l13Q9r6m13J49P63q58L0N65k07m01K56l2q4M54p1q65Q60J51p06
2047d32J8O50P6k39K49o40J11R99m68p38P29K72o49M48k48J32P5J03o52MJ049
2068H49o83l11L82K21l48L92o69J12K26R9o47L57O44r02r3N50j33l61O56p02k82
2089f43R94k79q12N33K31k02P0l20j66N55K45j002J67O06l63p9M87l58J01K75
2109D0l61l1N16L6o10J98M29m62J93q3qJ63N86o22m73J001l37r7j44K77k59K66
$$ plain form
2131 218 202 -516 91 769 -231 -387 331 88 44 302 -149 -93 430 124 -362 310 395 -87 -52 133 21
2152 21 401 331 -204 51 527 -17 -278 243 162 151 386 -136 -195 19 289 -441 3 195 -84 -16 149 12
2174 12 -89 74 -298 -276 302 -7 -385 -93 136 -181 -199 57 -456 71 -31 -400 -399 287 -35 -332 -138 -159
2196 -159 -293 64 -142 -491 312 113 -502 -159 80 -130 -4 317 -157 40 325 -117 -393 84 82 5 -130
2217 -130 106 -12 89 219 -313 204 453 322 -172 406 98 -9 313 130 -99 380 336 -216 352 238
2237 238 19 -13 161 8 241 220 -229 207 403 51 -165 715 393 -254 293 171 -11 343 348 141 3
2258 3 417 -117 -12 241 -168 -134 208 -279 -216 260 -7 -291 8 167 -132 -14 25 -210 -175 -8 -479 -368
2280 -368 56 -388 -358 -19 42 -274 -141 -244 -479 -177 -247 -513 -59 -4 -272 -158 -165 -23 -36 123 -233 -147 245
$$ packed form
2131B18j6p18O07O78j000j56P18k43m4K58m51N6N23l06m86O72Q5m82L5J85j12
2152B1L80p0n35K55M76n44k61N21q1j1K35n22n9K14K70p30M44J92k79O8J65j37
2174A2j01J63l72K2N78l09l78K92K29l17j8K56n13N27j02l69JO86l22k97J94k1
2196a59j34L57k06l49Q03j99o15L43K39k10J26L21m74J97K85m42k76M77kp7j35
2217a30K36j18J01J30n32N17K49j31m94N78l08j07L22j83k29M79m4n52N68j14
2237B38k19l2J74j53K33k1m49M36J96l52k16Q80l22o47N47j22j82L54Nk07j38
2258CM14n34J05K53m09L4L42m87O3M76k67k84K99J59k99J18L9k35L5J67m71J11
2280c68M24m44L0L39O1l16J33j03k35L02p0k66M54N5k68J14pJ42j3J59l56Q6L92
$$ plain form
2303 245 -237 -196 38 252 210 306 285 -28 77 386 -43 224 602 116 99 531 214 5 363 168 -22 128
2325 128 429 -35 187 772 64 -74 154 23 192 252 -125 -424 414 144 -27 33 153 -279 278 -65 -189
2346 -189 -38 325 -324 35 -22 -81 -74 -103 -49 -171 15 276 -586 3 -124 -213 146 57 -439 -159 -64 -395 120
2369 120 102 -325 -415 272 -39 -111 -111 -334 -253 198 -22 -277 -18 140 -171 -92 156 13 76 244 -206 -233 153
2392 153 138 -210 13 72 -6 92 -137 -160 102 268 -137 85 -13 -21 -156 102 -15 -66 343 148 -194 280 247
2415 247 -336 309 411 -132 94 127 194 141 325 59 -57 357 -90 -159 309 8 -10 116 90 -211 -65 235
2437 235 -375 -32 44 -45 -286 170 -107 -22 284 -223 -207 202 -57 -213 -141 207 -228 -113 157 -236 -211 55
2459 55 -1 -244 187 -64 -136 -138 28 -411 -30 -24 -207 -14 125 -85 -248 143 -124 -76 20 -100 -199 203 -30
$$ packed form
2303B45m82M1K34K14m2R6k1l13J05L09m29K67L78m86j7M32l17k09L58j95j90J50
2325A28L01m64K22N85p08j38K28j31J69O0l77k99Q38k70j71O0J20m32N57l43j24
2346a89J51L63o49L59n7n9Pk9N4j22J86K61q62N89j27q9L59q9m96K80R5l31N15
2369A20j8m27r0O87l11p2%k23Q1M51k20k55K59J58l11P9K48j43O3J68m50k7L86
2392A53j5l48K23N9p8R8k29k3K62J66m05K22r8qj35K58j17n1M09j95l42M74l3
2415B47n83O45J02n43K26L3O7n3J84k66j16M14m47o9M68l01j8J26k6l01J46L00
2437B35o10L43P6q9k41M56k77Q5L06n07J6M09k59j56P2L48m35J15K70l93K5K66
2459E5n6k43M31k51p2kJ66m39L81Oj83J93J39k10j63L91k67M8R6j20r9M02k33
$$ plain form
2482 -30 -147 76 44 -272 -144 119 15 138 438 -296 89 9 -53 -274 -64 35 -38 308 408 312 129 186 -46
2505 -46 111 219 -149 -5 24 -106 61 118 67 293 441 166 141 42 360 57 90 271 148 121 6 229 247
2528 247 202 -131 -24 11 -88 -83 139 -322 -240 2 -115 -28 158 -45 -117 76 -18 -104 -24 4 -19 -348 214 -150
2552 -150 -290 -22 63 -51 -46 -127 -124 -76 163 -241 76 128 59 -216 285 -38 15 218 -326 -203 -4 -61 135 80
2576 80 129 17 -226 7 -60 88 165 -66 -196 345 78 0 -14 216 -53 -52 138 52 56 312 -72 -98 -81 -98 163
2601 163 66 -25 -171 321 61 -66 -24 -280 -143 260 -48 174 -114 202 2 -59 204 -256 -174 -297 -132 89
2623 89 10 -233 -86 156 35 -250 118 -72 158 96 299 54 43 308 150 147 116 108 -217 93 -30 -155 62
2646 62 192 -101 56 9 -387 -12 208 36 -263 -5 -185 70 -286 131 117 -41 -5 -253 -49 137 -133
$$ packed form
2482c0j17K23l2l16J28K63j04J23L00p34L85q0o2k21K10R9p3L46J00r6j83N7k32
2505d6J57J08l68J44K9j30J67N7n1K26J48k75k5r9L18l03L3J81j23k7j15K23J8
2528B47m5l33J07L5r9NK22m61Q2K42j17Q7J86k03p2J93r4q6Q0K8k3l29N62l64
2552a50j40K68Q5j14Nq1LM8K39m04L17N2o9k75N01l23N3K03n44J23J99n7J96n5
2576H0M9j12k43K33o7J48P7k31j30N41k67p8j4K30k69JJ90q6MK56l84k6J7j7K61
2601A63r7r1j46M92k60j27M2k56J37M03l08K22k88L16k00o1K63m60Q2j23J65K21
2623H9p9k43J47K42j21k85L68j90K30o2K03k45j1K65j58ll1ql25L10j23j25K17
2646F2J30k93J57m7l96L75K20j72k99K58j80K55l56M17j4j58L6k48K04J86k70
$$ plain form
2667 -133 -350 246 72 -17 136 -84 -190 -67 16 -258 -297 4 133 79 -37 -157 78 131 -58 -164 -79 127
2689 127 -29 200 72 -238 -56 -210 -194 -76 -220 -33 -20 -8 63 83 171 133 361 238 -9 142 70 90 1
2712 1 29 91 -65 338 263 -167 -57 239 30 28 -70 131 -79 83 -126 -97 60 91 -162 64 3 -72 -63 109 -48
2737 -48 204 -12 182 128 -115 75 -26 -16 -97 86 204 -54 -182 158 156 -167 82 -3 -53 -37 -84 -240 -229 55
2761 55 -359 -110 133 31 -165 -73 -222 89 153 -73 -9 -131 19 -188 -114 73 -102 -93 106 388 205 44
2783 44 109 -133 -2 124 -198 -45 83 -34 55 99 284 11 -48 17 -106 -43 -28 -50 43 -187 -281 229 -70 91
2807 91 147 58 -79 -37 78 12 21 370 -273 107 180 178 -175 223 -38 -171 -17 139 -8 68 -1 50 -87 17
2831 17 -40 55 -36 -99 359 -153 124 68 259 49 -251 -50 85 153 -183 89 -27 71 -62 -370 -129 55 -98
$$ packed form
2667a33k17N96j74q9J53k20j06J23Q3k74l9L01J29n4j16j20K35N3j89j06Q5K06
2689A27j56K29j28l10J82j54J6J18j44J87J3J2P1K0Q8l8K28j23k47J51p2K0q9
2712AK8O2j56M03p5m30J10K96k09kr8K01k10J62k09K9J57L1k53K26o1p5RJ72j57
2737d8K52k16J94n4k43J90j01J0q1J83J18k58j28L40kl23K49q5n0J6m7j56J1K84
2761E5m14K49K43j02j96R2j49L11O4k26O4j22J50k07P4J87j75RJ99K82j83j61
2783D4O5k42J31J26l22J53J28j17Q9M4J85k73n9O5j23O3J5k2R3k30r4N10k99J61
2807I1N6q9j37M2J15o6RL49o43L80P3kl53L98k61j33J54J56j47P6o9N1j37J04
2831A7n7R5r1o3M58n12K77n6J91k10l00K01J35O8l36K72j16R8j33l08K41J84j53
$$ plain form
2854 -98 -136 169 69 -221 -217 -105 -189 -247 -213 -207 -133 -15 -9 -5 -19 -214 274 126 60 15 -244 80 44 40 140 -75 107
2881 107 209 207 90 99 -52 153 77 -147 128 1 29 -103 -102 61 99 161 93 36 118 78 -160 47 27 -168 72
2906 72 93 147 -325 106 -17 -311 -193 59 -171 -93 -97 -189 -180 -206 98 -100 -177 -133 -9 80 83 -170 -86 97 -386
2931 -386 104 145 162 -76 153 -156 110 240 -75 4 203 -219 -199 -51 106 11 -192 42 -89 246 -74 -14
2953 -14 -72 146 -121 -31 9 149 65 53 95 2 -12 -45 39 90 209 -167 -71 23 104 187 23 28 -34 -62 -9 88 -121
2980 -121 114 -16 11 311 165 -76 30 59 -87 237 286 -81 188 -10 -19 -78 -10 186 130 97 40 105 10 236
3004 236 -10 -3 1 -198 176 75 -29 15 134 -243 -62 -140 -50 83 -53 -89 94 82 37 278 6 -130 -90 -80
3028 -80 -117 -125 -220 -69 -57 -74 46 34 -52 130 92 103 -80 154 -75 -61 -169 -69 143 -252 123 -104 -77 -78 81
$$ packed form
2854i8l8L05j00k90MJ12q4n8L4OP4J18OMj4j95M88j48o6m5k59L24l6mJ00k15J82
2881A07J02kj17Rj51K05p6k24K75j27K8j32JJ63L8O2o8n7Q2m0k38K07k0j95K40
2906G2K1N4m72M31j23k94J18K52k30P8mr2Rk6L04j98p7M4J24Q9Lk53Q4J83m83
2931c86M90M1J7k38K29l09K66J30l15P9J99m22K0J48J57r5k03K34j31L35l20O0
2953a4n8K18k67R0M0J40q4j2M2r3j4l3Q4N1J19l76R6R4Q1Q3j64No2k8N3R7k09
2980a21K35j30K7L00j46k41J06K9j46L24M9l67K69j98rn9O8J96n6l3n7O5r5K26
3004B36k46PMj99L74j01j04M4J19l77J81p8R0J33j36l6J83j2m5K41k72j36M0J0
3028h0l7qr5J51J2j7J20j2q6J82l8J1j83K34k29J4j08J00K12l95L75k27K7jJ59
$$ plain form
3053 81 78 -156 -215 -136 -152 0 175 -144 -308 -1 -106 -161 116 106 -257 56 -49 8 173 19 146 103 -7
3076 -7 65 274 326 87 -129 -176 68 -105 139 139 107 248 373 77 147 -50 330 -137 143 156 182 225 -81 -47
3100 -47 116 -121 -258 -25 108 83 145 -38 -29 -35 108 -127 -4 -208 86 99 37 -114 -263 182 55 116 -123
$$ packed form
3053H1lk34n9P9j6J52J75l19j64L07j05n5K77j0l63L13j05N7J65j54J27m3j10
3076gP2K09N2k39k16m7K44j73K44%l2J41J25k96P0j97L80m67K80J3K6M3l06L4
3100d7J63k37j37K33J33k5O2j83RoJ43k35J23k04K94J3o2j51j49M45j27O1k39
$$ [...]
8191A54
##END NTUPLES=NMR FID
##END=
