##TITLE=1H ikalashn
3754-F
16.10.2024
##JCAMPDX= 6.0         $$ Bruker NMR JCAMP-DX V2.0
##DATA TYPE= NMR FID
##DATA CLASS= NTUPLES
##ORIGIN= UXNMR, Bruker Analytische Messtechnik GmbH
##OWNER= root
$$ TOPSPIN		Version 1.3
$$ 2024-10-16 16:25:25.265 +0400  Irina@DPX200
$$ Compression mode = diff/dup
##.OBSERVE FREQUENCY= 200.131392401
##.OBSERVE NUCLEUS= ^1H
##.DELAY= (6, 6)
##.ACQUISITION MODE= SIMULTANEOUS
##.ACQUISITION SCHEME= undefined
##.AVERAGES= 32
##.DIGITISER RES= 18
##SPECTROMETER/DATA SYSTEM= spect
##.PULSE SEQUENCE= zg
##.SOLVENT NAME= CDCl3
##.SHIFT REFERENCE= INTERNAL, CDCl3, 1, 17.95386
##AUDIT TRAIL= $$ (NUMBER, WHEN, WHO, WHERE, WHAT)
$$ ##TITLE= Audit trail, TOPSPIN		Version 1.3
$$ ##JCAMPDX= 5.01
$$ ##ORIGIN= Bruker BioSpin GmbH
$$ ##OWNER= Irina
$$ $$ F:/spectra/data/iren/nmr/1H/4/audita.txt
$$ ##AUDIT TRAIL=  $$ (NUMBER, WHEN, WHO, WHERE, VERSION, WHAT)
(   1,<2024-10-16 16:25:07.625 +0400>,<Irina>,<DPX200>,<TOPSPIN 1.3>,
      <created by zg
	started at 2024-10-16 16:22:57.171 +0400,
	POWCHK disabled, PULCHK disabled
       terminated by command 'halt'
       configuration hash MD5:
       BE 6D 3F 07 2A EA 11 49 91 17 2B D3 AF B3 58 0D
       data hash MD5: 16K
       F2 8D DE 86 83 E7 3D 55 C3 3C FF 10 0E 0B EA D4>)
$$ ##END=
$$ 
$$ $$ hash MD5
$$ $$ 6E B9 DD 0B 47 4F 88 8C 7E 89 C5 67 90 27 AC A0
##$RELAX= 
##$RELAX= 
##$RELAX= 
##$RELAX= 
##$RELAX= 
##$RELAX= 
##$RELAX= 
##$RELAX= 
##$RELAX= 
$$ Bruker specific parameters
$$ --------------------------
##$DU= <F:/spectra>
##$EXPNO= 4
##$NAME= <1H>
##$PROCNO= 1
##$TYPE= <nmr>
##$USER= <iren>
##$AMP= (0..31)
100 100 100 100 100 100 100 100 100 100 100 100 100 100 100 100 100 100 
100 100 100 100 100 100 100 100 100 100 100 100 100 100 
##$ANAVPT= -1
##$AQSEQ= 0
##$AQ_mod= 1
##$AUNM= <au_zg>
##$AUTOPOS= <>
##$BF1= 200.13
##$BF2= 200.13
##$BF3= 200.13
##$BF4= 200.13
##$BF5= 200.13
##$BF6= 200.13
##$BF7= 200.13
##$BF8= 200.13
##$BYTORDA= 1
##$CFDGTYP= 0
##$CFRGTYP= 5
##$CHEMSTR= <none>
##$CNST= (0..63)
1 1 145 1 1 1 1 1 1 1 1 1 1 1 1 1 1 1 1 1 1 1 1 1 1 1 1 1 1 1 1 1 1 1 
1 1 1 1 1 1 1 1 1 1 1 1 1 1 1 1 1 1 1 1 1 1 1 1 1 1 1 1 1 1 
##$CPDPRG= <>
##$CPDPRG1= <>
##$CPDPRG2= <>
##$CPDPRG3= <>
##$CPDPRG4= <mlev>
##$CPDPRG5= <mlev>
##$CPDPRG6= <mlev>
##$CPDPRG7= <mlev>
##$CPDPRG8= <mlev>
##$CPDPRGB= <>
##$CPDPRGT= <>
##$D= (0..63)
0 2 0 0 0 0 0 0 0 0.06 0 0.03 0 0 0 0 0.0002 0 0 0 0 0 0 0 0 0 0 0 0 0 
0 0 0 0 0 0 0 0 0 0 0 0 0 0 0 0 0 0 0 0 0 0 0 0 0 0 0 0 0 0 0 0 0 0 
##$DATE= 1729081504
##$DBL= (0..7)
120 120 120 120 120 120 120 120 
##$DBP= (0..7)
150 150 150 150 150 150 150 150 
##$DBP07= 0
##$DBPNAM0= <>
##$DBPNAM1= <>
##$DBPNAM2= <>
##$DBPNAM3= <>
##$DBPNAM4= <>
##$DBPNAM5= <>
##$DBPNAM6= <>
##$DBPNAM7= <>
##$DBPOAL= (0..7)
0.5 0.5 0.5 0.5 0.5 0.5 0.5 0.5 
##$DBPOFFS= (0..7)
0 0 0 0 0 0 0 0 
##$DE= 6
##$DECBNUC= <off>
##$DECIM= 32
##$DECNUC= <off>
##$DECSTAT= 4
##$DIGMOD= 1
##$DIGTYP= 9
##$DL= (0..7)
0 120 120 120 120 120 120 120 
##$DP= (0..7)
$$ [...]
##$SW= 21.9925939549014
##$SWIBOX= (0..15)
0 0 2 0 0 0 0 0 0 0 0 0 0 0 0 0 
##$SW_h= 4401.40845070422
##$TD= 16384
##$TD0= 1
##$TE= 300
##$TE2= 300
##$TE3= 300
##$TEG= 300
##$TL= (0..7)
0 120 120 120 120 120 120 120 
##$TP= (0..7)
150 150 150 150 150 150 150 150 
##$TP07= 0
##$TPNAME0= <>
##$TPNAME1= <>
##$TPNAME2= <>
##$TPNAME3= <>
##$TPNAME4= <>
##$TPNAME5= <>
##$TPNAME6= <>
##$TPNAME7= <>
##$TPOAL= (0..7)
0.5 0.5 0.5 0.5 0.5 0.5 0.5 0.5 
##$TPOFFS= (0..7)
0 0 0 0 0 0 0 0 
##$TUNHIN= 0
##$TUNHOUT= 0
##$TUNXOUT= 0
##$USERA1= <user>
##$USERA2= <user>
##$USERA3= <user>
##$USERA4= <user>
##$USERA5= <user>
##$V9= 5
##$VALIST= <valist>
##$VCLIST= <CCCCCCCCCCCCCCC>
##$VD= 0
##$VDLIST= <DDDDDDDDDDDDDDD>
##$VPLIST= <PPPPPPPPPPPPPPP>
##$VTLIST= <TTTTTTTTTTTTTTT>
##$WBST= 1024
##$WBSW= 25
##$XGAIN= (0..3)
0 0 0 0 
##$XL= 0
##$YL= 0
##$YMAX_a= 660186
##$YMIN_a= -510693
##$ZGOPTNS= <>
##$ZL1= 120
##$ZL2= 120
##$ZL3= 120
##$ZL4= 120
##$ABSF1= 10
##$ABSF2= 0
##$ABSG= 5
##$ABSL= 3
##$ALPHA= 0
##$AQORDER= 0
##$ASSFAC= 0
##$ASSFACI= 0
##$ASSFACX= 0
##$ASSWID= 0
##$AUNMP= <proc_1d>
##$AXLEFT= 0
##$AXRIGHT= 0
##$AXTYPE= 0
##$AXUNIT= <>
##$AZFE= 0.1
##$AZFW= 0.1
##$BCFW= 1
##$BC_mod= 2
##$BYTORDP= 1
##$COROFFS= 0
##$CY= 7568.61572265625
##$DATMOD= 1
##$DC= 2
##$DFILT= <>
##$DTYPP= 0
##$F1P= 17.9538593292236
##$F2P= -4.03888763876832
##$FCOR= 0.5
##$FTSIZE= 32768
##$FT_mod= 4
##$GAMMA= 1
##$GB= 1
##$INTBC= 1
##$INTSCL= 1
##$ISEN= 128
##$LB= 0.02
##$LEV0= 0
##$LPBIN= 0
##$MAXI= 945.577
##$MC2= 0
##$MEAN= 0
##$ME_mod= 0
##$MI= -402.1523
##$NCOEF= 0
##$NC_proc= 0
##$NLEV= 6
##$NOISF1= 8.587773
##$NOISF2= 6.764455
##$NSP= 1
##$NTH_PI= 0
##$NZP= 0
##$OFFSET= 17.95386
##$PC= 1
##$PHC0= 127.8902
##$PHC1= -8.432125
##$PH_mod= 0
##$PKNL= yes
##$PPARMOD= 0
##$PPDIAG= 0
##$PPIPTYP= 0
##$PPMPNUM= 100
##$PPRESOL= 1
##$PSCAL= 0
##$PSIGN= 0
##$REVERSE= no
##$SF= 200.13
##$SI= 32768
##$SIGF1= 18.5376
##$SIGF2= -6.396296
##$SINO= 400
##$SIOLD= 32768
##$SREGLST= <1H.CDCl3>
##$SSB= 3
##$STSI= 0
##$STSR= 0
##$SW_p= 4401.40845070423
##$SYMM= 0
##$S_DEV= 0
##$TDeff= 0
##$TDoff= 0
##$TI= <>
##$TILT= no
##$TM1= 0
##$TM2= 0
##$TOPLEV= 0
##$USERP1= <user>
##$USERP2= <user>
##$USERP3= <user>
##$USERP4= <user>
##$USERP5= <user>
##$WDW= 1
##$XDIM= 8192
##$YMAX_p= 0
##$YMIN_p= 0
$$ End of Bruker specific parameters
$$ ---------------------------------
##NTUPLES= NMR FID
##VAR_NAME=  TIME,          FID/REAL,        FID/IMAG
##SYMBOL=    X,             R,               I
##VAR_TYPE=  INDEPENDENT,   DEPENDENT,       DEPENDENT
##VAR_FORM=  AFFN,          ASDF,            ASDF
##VAR_DIM=   8192,          8192,            8192
##UNITS=     SECONDS,       ARBITRARY UNITS, ARBITRARY UNITS
##FACTOR=    0.0002272,     1,               1
##FIRST=     0,             0,               0
##LAST=      1.8609952,     -399,            384
##MIN=       0,             -510693,         -510693
##MAX=       1.8609952,     660186,          660186
$$ Real data points
##PAGE= N=1
##DATA TABLE= (X++(R..R)), XYDATA
$$ [...]
2394B12J326J69l031N9K293p64j467O21J912o74q89j511Q19K658n45k561N60J485
$$ 212 1538 1707 -1324 -1265 1028 264 -1203 -582 1330 656 -233 -1744 -925 1733 1188 -1373 -813 672
2412F72j200l94Q74k64J117j172j943J258K453r89j478J167O90j739M4L58R33
$$ 672 -528 -922 -48 -312 805 -367 -2310 -1052 1401 412 -1066 101 791 -948 -904 -546 387
2429C87N79n90k551J145J940j681J88R26K19q88m38k24R54J806k071r89J613O99
$$ 387 966 376 -2175 -1030 910 -771 -583 343 562 -326 -764 -988 -34 1772 -299 -1288 325 1024
2447A024j541q1J905m62p26j206k50J577J134j587j218K165L68j604n94K170L45
$$ 1024 -517 -598 1307 845 119 -1087 -1337 240 1374 -213 -1431 734 1102 -502 -1096 1074 1419
2464A419m12r29j677K978M39j865n24K435o41j653l55J412J108m73k297m79L023
$$ 1419 1007 78 -1599 1379 1818 -47 -571 1864 1223 -430 -785 627 1735 1262 -1035 -1514 1509
2481A509J12k468L08J846O2j860n13O08J513M25k855q05K979j89j820N28J090
$$ 1509 1621 -847 -539 1307 1369 -491 -1004 -396 1117 1542 -1313 -2118 861 672 -1148 -620 470
2498D70J13o58j250l58K414M77k908L12J773m89j293N14L21J276j45k263k35L022
$$ 470 583 -75 -1325 -1683 731 1208 -1700 -1388 385 -104 -1397 -883 -562 714 569 -1694 -1929 1093
2516A093J9k373K81J675m11j438N12N09Q39L61k319k51K894m98j597N31J079n35
$$ 1093 1112 -1261 -980 695 284 -1154 -642 -133 706 1067 -1252 -1503 1391 893 -704 -173 906 371
2534C71k84p47R0J888N20k840j46K514j390o04Q53L11J35k12p25n0K232r67j516
$$ 371 87 -660 -570 1318 1838 -1002 -1148 1366 -24 -628 225 536 671 459 -266 -316 1916 949 -567
2553e67J01J117l59l74Q47n76O29n40j010Q51J037r27j115J525K46p44n52K39
$$ -567 -466 651 292 -82 765 189 818 278 -732 119 1156 229 -886 639 885 141 -411 -172
2571a72J53Q29q25j489J697J176j799j03O31M87j334k31L39J012J72j092r98J683
$$ -172 -19 810 -15 -1504 193 1369 -430 -533 98 585 -749 -980 -641 371 543 -549 -1547 136
2589A36O33j327l74Q24L87J66j582l84J900Q86j852j073J999j89j463J385n50
$$ 136 769 -558 -932 -108 279 445 -1137 -1521 379 1265 -587 -1660 339 150 -1313 72 -478
2606d78J132J94k130k41K631O94j961j037J702L23p60n00L11J217J09k467m83
$$ -478 654 848 -1282 -1523 1108 1802 -159 -1196 506 829 69 -431 -120 1097 1206 -1261 -1744
2623a744K710L75k073p7J272p1k1p26k10J697Q01l191Q3J686J72j060J01M65L79
$$ -1744 966 1341 -732 -809 463 392 371 -355 -565 1132 1933 -1258 -1175 511 683 -377 -276 189 568
2642E68m0j247n88K357L19k332j33J876l83k15j89K59L86L35j485l58K065K91
$$ 568 528 -719 -1307 1050 1369 -963 -1096 780 397 182 -7 252 638 973 -512 -870 1195 1486
2660A486j833j34J071k02m0j39O6O58m20k126Q95J977l09j329L93K00o87N17n84
$$ 1486 -347 -481 590 388 348 209 275 933 513 -1613 -718 1259 950 -379 14 214 -473 44 -540
2679e40r7J384q27j014n29K266p76n71R96n98j52p0p31Q83J215q65j700J309O14
$$ -540 -637 747 -80 -1094 -1623 643 -133 -704 292 -306 -458 -528 -1259 -376 839 -26 -1726 -417 197
2698A97n25o1M40Q4K97n94j188J005J472j309j171J399L18q80M75N47L48J32j772
$$ 197 -328 -389 51 135 432 -162 -1350 -345 1127 -182 -1353 46 364 -516 -41 506 854 986 -786
2717g86n00J159J078r03m17M53J4j40K17m74R23R24j610j127J690O54j299j36
$$ -786 -1286 -127 951 48 -369 84 98 -42 175 -299 624 1548 -62 -1189 501 1155 -144 -280
2735b80O75K8J92j128l84J827Q25k034j011K122k57o89m68N12P03J75j224j114
$$ -280 395 423 615 -513 -897 930 1755 -279 -1290 832 575 -114 -582 -70 633 808 -416 -1530
2753a530K337M89k146l74J496m16N0m03p5L71J097k155o71J911Q06q94o98L17
$$ -1530 807 1296 -850 -1224 272 -144 -94 -497 -572 -201 896 -1259 -1930 -19 787 -107 -805 -488
2771d88p8P93p05o12J817L64k570L95J111P51p97J87j54k7L76o97n59J687M06
$$ -488 -566 227 -478 -1090 727 1091 -1479 -1084 27 778 -19 168 14 -13 363 -334 -893 794 1200
2790A200k055J16J130l12K13l10pJ77L91j444M23J095r3r36K38L11k24M97l88
$$ 1200 -855 -739 391 79 292 -18 -25 152 543 -901 -478 617 524 -412 -174 137 -87 410 22
2809B2l13J016j61j823J221Q71n73n40L1J22K68l17K60m75J170j41j938J056P99
$$ 22 -291 725 564 -1259 -38 833 260 -280 -249 -127 141 -176 84 -391 779 638 -1300 -244 555
2828E55n90m00P90l46k33p3j43L38J066r08q09J248O2j075K53K60K40K22q57n16
$$ 555 -35 -435 355 9 -224 -297 -440 -102 964 56 -753 495 557 -518 -265 -5 235 457 -400 -916
2848i16R59R90j119n20O82N31n25l41k85J048J25j030q03J321Q04j506j66J260
$$ -916 43 1033 -86 -606 76 607 82 -259 -544 504 629 -401 -1204 117 921 -585 -751 509
2866E09j68M23r14p91J012J156j210j093J043J046j091j78O92k14l26l19m20J392
$$ 509 341 764 -150 -941 71 1227 17 -1076 -33 1013 -78 -256 436 222 -104 -423 -843 549
2884E49P23j384p43J155K92m34j36o02M98J098j477j050K136p9n01n40N66J38
$$ 549 1272 -112 -855 300 592 158 22 -580 -82 1016 -461 -1511 625 546 45 -495 71 209
2902B09L9j48n24L66J150k041j10K036K93j621L06K79K1M25m87m02J251j44j657
$$ 209 248 100 -424 -58 1092 -949 -1059 977 1270 -351 -45 234 255 680 193 -209 1042 898 -759
2921g59P5J105L10q28l77K45L99L24q80j50J279R2j292K48K09j50N30l34r9j28
$$ -759 -684 421 731 -97 -474 -229 170 494 -386 -536 743 835 -457 -209 0 -150 380 46 -53 -181
2941a81Q9p21J70R71m05k41k12M97k39M79p72J52R68p18n90m8J921j449j057J772
$$ -181 -92 -813 -643 328 -77 -318 -530 -33 -272 207 -565 -413 555 -163 -753 -801 1120 -329 -1386 386
2961C86J87o41P2j42J7N46m59q15J034J019r99Lj44K82j63k57o00J152M79j128
$$ 386 573 -68 4 -138 -121 425 -34 -849 185 1204 205 208 64 346 183 -74 -674 478 957 -171
2981a71l44L28J375j175M16j38j77M94m36q46R58P23j073J47R8J43l38K65k75
$$ -171 -515 -187 1188 13 429 291 114 608 172 -674 284 1007 -66 81 179 322 -16 249 -26
3000b6j49J344j333m41J305N90j488rJ28K99j32k85m46P12N03q88r34J327L70
$$ -26 -175 1169 -164 -605 700 1290 -198 -207 -79 220 88 -197 -643 69 572 -316 -1250 77 447
3019D47N4o8q68O63l6m4n57R04j52j176k18J230N97p50j53l00q3J062j006k24
$$ 447 501 433 -435 228 192 148 -409 495 343 -833 -1051 179 776 26 -127 -427 -510 552 -454 -678
3039f78O55M44r08K13K20n3N20l04p30O23M00n74k54Q82J77r84L15m15K52K66
$$ -678 -23 421 -487 -274 -54 -107 413 109 -621 2 402 -172 -426 456 633 -351 -36 -451 -199 67
3059F7L47o61J080l33p13j15P78l12j09p8k76N33L75q26M71K95q4j066M26Q00
$$ 67 414 -247 833 500 -213 -328 450 138 29 -49 -325 208 583 -243 228 523 439 -627 -201 599
3079E99k36k86n90J02P31m55l23J42J093l55j127J256j58J6l30l99K89K95l53
$$ 599 363 77 -513 -411 320 -135 -458 -316 777 422 -705 551 393 409 79 -320 -31 264 -89
3098h9n66R70M24o00l58M86K99j48R0l91L99L69o52j222R99M98k35j77K11J41
$$ -89 -655 315 739 139 -219 267 566 418 508 117 516 885 233 -989 10 508 273 96 307 448
3118D48J69n23o24O36J251j581q37J129K30j10N5p82J034K71o05p56P17L31n92
$$ 448 617 94 -530 106 1357 -224 -1061 68 298 188 243 -539 495 766 161 -595 122 453 -139
3137a39n29K19P07k70k3l90L62O21n15j079Q26Q72r25j42K27K5N69p07o6K94M06
$$ -139 -668 -449 258 -12 -35 -425 -63 558 43 -1036 -210 662 -263 -405 -178 -153 416 -291 -357 -63 343
3158C43p22l3K17J66P5J68l9l67M60k68k54Q87L20j470k63O66K49K02k08n39K3
$$ 343 -379 -412 -195 -29 46 214 175 -192 268 0 -254 633 953 -517 -780 -114 135 337 129 -410 -387
3179c87R95q67J22N88K37j231L95K98P6J88n66k02R55l06l49o20J414m69j20l37
$$ -387 608 -259 -137 451 688 -543 -148 150 226 414 -152 -354 601 295 -54 -674 740 271 151 -186
3199a86k98M27Rj88k31Q23m9j023M46Q08p53l83M03J17L5M15q62R26K31q04n42
$$ -186 -484 -57 -48 -236 -467 356 307 -716 -270 538 -215 -598 -195 -78 -43 372 -490 436 667 -137 -679
3220f79R01Pl55j8J32l59K67M65q00M94P20q01n21J17M15r7K31n42K05J378j298
$$ -679 222 229 -126 -144 -12 -371 -104 361 -439 55 775 -26 -547 -430 -15 -112 119 -423 -218 1160 -138
3241a38k68K98P26l48k28k34P7L03o3m95L10P94m75p56M19L85k14l48K17m90P22
$$ -138 -406 -108 618 270 42 -192 -115 188 125 -370 -60 734 259 -497 -78 307 93 -255 -38 -528 194
3262A94J83j112O29M80k43o30M30L35J95k33p35O96J57k65o42L47L64M8p56K65
$$ 194 377 -735 -106 374 131 -499 -69 266 461 228 -507 189 346 81 -561 -214 150 198 -558 -293
3282b93P58l36Kl64N02J56n82n07N13Q40m50l60j20k09O35J35q47K12J233j116
$$ -293 465 129 131 -233 269 425 -157 -664 -151 689 239 -121 -241 -450 185 320 -527 -315 918 -198
3302a98m69N98J12n5O4l64M7J081j317M85jN85k61p13P1J02O89o64k51P31J88
$$ -198 -667 -69 43 -12 52 -312 -265 816 -501 -16 -17 568 307 -406 -335 -233 456 -208 -459 272 460
3323D60j298K15P88J49o92P4R93l48l37L44q40Q82j82o72J54P40j82n4m55K11
$$ 460 -838 -623 165 314 -378 -304 689 341 4 348 -492 390 208 -464 -310 430 248 194 -261 -50
3343e0K17J0k78J03Q4j99k97L76O64m34j53m37M03L07M90j026j49R11k74m22P
$$ -50 167 177 -101 2 86 -113 -410 -34 630 196 43 -394 9 316 806 -220 -369 542 268 -154 -147
3364a47P74l43P0q95N21K92J76o60K55P34m72p16P61L0j54J87p27K55O84p43j79
$$ -147 627 284 354 -541 -20 272 448 -212 43 777 305 -411 350 380 226 413 -314 -59 625 -118 -297
3385b97J8P64q1m69l2n4N64J77q51k12L23K67j017R58J33j01l22k32J62R26n32
$$ -297 -279 485 404 -65 -97 -151 413 590 -261 -473 -150 117 -900 58 191 90 -232 -464 -302 624 92
3406I2q91N48R94o42r18J383l05l16K25m20k48M79kk96J95K0J13j95r0K35L46
$$ 92 -799 -251 743 101 -817 566 261 -55 170 -250 -498 -19 -21 -317 -122 -102 11 -184 -274 -39 307
3427C07J24l73N1L91k82n32L49L58m23l91k15N95L73k08n39M04J06r8l18N12J13
$$ 307 431 58 109 500 218 -314 35 393 -30 -421 -636 -41 332 124 -415 -11 95 -3 -321 191 304
3448C04k33N8m10N85l16J16m42J035o88n75M32j6o6Q25m61m80O09N6n88L6N00
$$ 304 71 129 -281 304 -12 104 -338 697 9 -566 -134 -150 -216 609 148 -332 277 333 -255 -219 281
3469B81J01o72k19L59KL40J42m88J9K50o77N38O04J69j279Nj65J049J89m82l73
$$ 281 382 -290 -509 -150 -148 192 334 -154 -135 115 -562 -24 580 749 -530 -525 -690 359 548 66 -307
3490c07P62l96l59J76K38J81l78m64J74K37O39q01m0O15%j20k20O14j57m46j00
$$ -307 455 59 -300 -124 114 295 -83 -547 -373 -136 503 -298 -338 277 277 157 -63 551 394 -52 -152
3511a52o1P18l5o12m9N3j7M0l6M1M99L88j062j78J257n30m91q3L73J66L7l58Q2
$$ -152 -213 505 470 -142 -191 -138 -155 -115 -151 -110 389 777 -285 -463 794 264 -227 -310 63 229 266 -92 -10
3534a0K14J45k96R8p0P2l81j31J00M70k57m75K78J489j132J0l36J67p4l0L70m01
$$ -10 204 349 53 151 81 153 -228 -359 -259 211 -46 -521 -243 1246 114 124 -212 -45 -119 -149 221 -180
3556a80N87n45m43n9R90l97m55O83J99j07K34n8l92K90k69j09J43K42k72n7N92
$$ -180 407 -138 -581 -640 350 -47 -502 181 380 273 507 449 57 347 78 -31 112 354 82 25 617
3577F17p38N70m81N8L21l14J02l01K49J73n23Q6L64k27O6l9L0J88k5J36m72K86
$$ 617 -121 449 -32 26 347 33 135 -166 83 256 -267 -181 183 -44 22 -17 13 201 176 312 -160 126
3599A26K80j364J443l79L0L58l03m63M25J53o76M60k94j00J80q1J71j19K61K38
$$ 126 406 -958 485 106 136 494 191 -272 153 306 -370 90 -204 -304 -124 -205 -34 -153 108 346
3619C46j067R54K73r14J38N66j29k90K6j95M30L50l73k49P26k59k27k65O08n97
$$ 346 -721 233 506 -408 -270 296 167 -123 -97 -292 138 488 115 -134 592 333 106 -159 449 -148
3639a48L82k0k82L82l71l4m1k17Q6l42K47O22j41O9m82m1J93M45l82j44N5J28
$$ -148 234 214 -68 314 -57 -91 -132 -349 -263 -605 -358 264 123 192 -290 -331 -138 307 -75 -219 -164 -36
3661c6l35K77l18N23N39o96m98N18L25l37N0j34L88o89n6K89P3N50o06J15K44
$$ -36 -371 -94 -412 111 650 -46 -544 -26 299 -38 12 -122 266 -423 -479 -190 -117 433 -173 -58 186
3682A86J02n06J0J36J09j86j7jN05j16O3j52p3K31m20M49q94O5Q44K70n68L90
$$ 186 288 -218 -208 -72 37 -149 -166 -167 338 222 285 133 60 291 -129 320 -574 -509 335 605 37 427
3704D27k20k94N99o0l21j8j72l51N00k74m94O90k50k60L98L7J51K69m89K49n48
$$ 427 207 -87 512 452 131 113 -59 -410 90 -184 -678 12 -238 -498 -100 -63 88 357 -132 117 -431
3725d31N20j9N6j95j45J18j14R02p72l2l4K51K08J03n42K82j04N88o38K0p3pJ72
$$ -431 89 70 126 -69 -214 -96 -210 692 -80 -112 -146 105 313 416 -126 156 52 640 2 22 -51 -58 114
3748A14J28l56J00O33o13j49K32J3m61N03q59J011O7o70N81k22Q6l00l7M23r8
$$ 114 242 -114 -14 619 6 -143 89 102 -359 144 -715 296 363 -307 274 52 138 -162 -199 224 126
3769A26j26k63K55K40J91n71J61j89L56j31p3J25J90n47l68N49J45o51M73k19
$$ 126 0 -263 -8 232 423 -148 13 -176 180 49 -24 101 291 -256 -624 -75 70 -581 -108 -327
3789c27K34J68j19q7O9Q21p06J27n00R08m74J15j61Q3K57n39M29o58N68j10m07
$$ -327 -93 75 -44 -131 -62 759 53 180 -320 588 114 229 68 151 408 -131 298 -360 208 98 -309
3810c09K9J13O18l75j29j18J53l2k00K52J41K20j65k98L75k39PK1J1M73o08R1
$$ -309 -280 -167 451 76 -53 -171 -18 -50 -250 2 143 363 198 -100 275 36 43 64 75 548 -60 31
3832C1K2L45j63n26Q2L87j71n70P24l36J25M91k62k30M39K46p16M64l55o8n08
$$ 31 53 398 235 -291 -209 178 7 -563 161 -175 -50 441 179 -51 388 634 -82 382 27 -41 -549
3853e49Q30k0R3R6k63J06m48o0L41J41K59r15P71p99O11J92m07k73L54j18l8K85
$$ -549 281 261 354 450 187 293 -155 -215 126 267 526 -389 382 -417 194 386 -21 -294 60 -58 -96 189
3875A89l76j19M28p3j87J94K58n39N1M96l55j72O71k84n66P05n45K28J41J4m83
$$ 189 -187 -306 122 49 -138 56 314 -225 -174 322 -33 -205 466 182 -384 321 -224 4 145 159 -324
3896c24L97R8K55k62K0R5n0k23M70j074M81L63q87LR66l82K19k58j46M98J65p74
$$ -324 73 171 426 164 184 279 229 6 476 -598 -117 246 -641 -638 328 -54 165 -93 -239 259 424 -350
3918c50J15L68K2J87k56p9m0P84j282Q1J014j58m28K74J26n01l09K96R7n46J024
$$ -350 -235 133 155 342 86 7 -33 751 -531 -450 564 406 -22 252 378 -123 -432 -136 -39 -585 439
3939D39m90J34K33M1n7j33P5J5k57L8Q0n78L46j39J78J16j68O7K19p5N20r7m54
$$ 439 -51 83 316 357 300 167 242 257 0 38 118 -460 -114 -253 -75 41 -127 -60 159 84 604 507 53
3962E3J38j5l71M4P1P1L13J0o13m58L50N65m24J23N25k3k59M02o1n19m05M82L05
$$ 53 191 176 -195 -151 -80 -9 304 314 -299 -757 -407 158 -266 -143 382 359 100 502 441 -78 -483 -1 304
3985C04m60K03k48K32P7R0m82M38L16m33j06P6J97J51l14R0l0K94m29K16j01P8
$$ 304 -156 47 -201 31 108 198 -284 154 470 37 -69 7 204 355 41 131 101 395 -34 182 81 159
4007A59j57k67q3N67k77L47q14N55N20n28j07M69n86J77KJ46l40Q99q21L06n5
$$ 159 2 -265 -348 219 -58 289 -525 30 550 22 -85 384 -202 -25 -23 123 -217 682 -139 167 112
4028A12l9m57L27J78k15L59o42L00P7j52J20J32L11l85k07K43o75N62M50K0n70
$$ 112 73 -384 -57 121 -94 265 -377 -77 0 -152 -32 100 411 26 -181 62 -613 -51 399 419 -151
4049a51K91j75J19J0J11k22P7K2k67L31k56k15J63N27k86R0R6m21J2K73k52J60
$$ -151 140 -35 84 94 205 -17 60 82 -185 146 -110 -325 -162 365 79 169 265 -156 -144 129 -123 37
4071C7q5J97K70k63k77K51N2J5l48J19N5K99o12M18M0k38L75M59n06m0R6l82O43
$$ 37 -48 149 419 156 -121 130 182 197 -151 -32 23 322 -290 128 168 -70 305 764 258 218 314 -68 575
4094E75m82L63l97l34k5j28N88k02K88n29n2L48J02j7o3k4J42k74M53k65k25m6
$$ 575 93 456 59 -275 -300 -428 160 -42 246 -283 -335 13 115 98 35 11 153 -121 332 67 -158 -204
4116b04J80n4L67l22N6j33L70j95j27m20R42o59mL74l25J40J20m0R8l29K00O7
$$ -204 -24 -78 289 -33 23 -110 260 65 -62 -482 460 -199 -203 171 -154 -14 106 66 164 -165 35 102
4138A02M0k89J72J02k92K15j38J27M88n48j86P74o07j80n1M88k97k4M0oR4j44
$$ 102 142 -147 25 127 -165 50 -88 39 527 -21 -207 567 -40 -220 -271 217 -80 -104 -64 -70 24 -120
4160a20M00l2k71o83K88R0J54N19o57N15o56J51L57r9n15M9N75k28j06L67O5n32
$$ -120 280 248 -23 -706 -418 -328 -174 345 -312 203 -453 -302 55 -44 -559 -510 65 -163 -269 98 163 -369
4182c69J67k70R0J31N95p72J87M92n44K67J76l58K45l89M61q6j68L47j61p9k79
$$ -369 -202 -472 -382 -251 344 -428 -241 251 -293 -26 150 -208 37 -352 109 23 -145 202 41 -38 -317
4203c17K68K99n38Q82j165Q75p43J47J37J59K34k04j74J50k41o5L46m71N82R1
$$ -317 -49 250 -288 594 -571 304 -439 -292 -155 4 238 34 -140 10 -231 -296 50 -421 161 252
4223B52m19L46j32m22N03J15o89N45Q3m2j42j42K63l72J42o01O46N30m44J5J39
$$ 252 -167 179 47 -375 128 243 -446 99 182 140 -2 -144 119 -253 -111 -712 -66 464 20 35 174
4244A74q7L1o59P27n4j78k93K50j6o8L40k2q5j14M64k08n54K98L87l25J26l95
$$ 174 87 118 -541 186 132 -46 -339 -89 -105 -173 167 145 60 -54 410 202 -352 -54 333 8 134 -261
4266b61J33N78n22j73p1L00k22M3L99j93j89J51k93J28L92l6M0R8l62N1n34j31
$$ -261 -128 450 -72 -245 -316 -16 -238 -195 204 11 -178 -27 -320 -192 200 164 204 302 -60 -9 -543 -674
4288f74P75n9n65M94J2J72l82N2r1K29L42j30M9K17m23n59P46o09L68J00j47O78
$$ -674 101 42 -523 -29 -17 155 -227 -175 -266 -37 305 175 224 441 18 -541 205 -404 -36 64 -83 595
4310E95o07K40m83j02L50j18K39j04k08R3O3K82l29K35J29n03L62k6J7K07p44
$$ 595 -12 228 -255 -357 -7 -125 114 10 -198 -105 -42 240 -89 146 275 -228 134 108 125 332 -412
4331d12M59j02K2L91j40k69j23J71K50n22L74M4n2j85j81K55J45l63r9L93k21
$$ -412 47 -55 -33 358 218 -51 -174 -3 247 -275 99 143 91 -94 -275 -20 125 -238 -337 56 -165
4352a65K27j72j75R7R6j55M79l92L9N18k22o1m84L96m25M77k58k2J55J13q01N03
$$ -165 62 -110 -285 -188 -92 -247 232 -160 -121 397 175 114 -370 26 -399 78 -180 -202 -47 66 -735 -232
4374b32J51K10J05l41m16O67nm01L67M6n3j5j68n7J90K48l84L00k41J12j83L8
$$ -232 -81 129 234 -107 -523 144 139 -262 105 151 98 83 -85 -142 48 296 -88 212 -29 83 -100 -62
4396f2n8K50L38k66J63j09k08j22N1O2j98K3K61l11J46J68J24k60J9J14k84L36
$$ -62 -120 130 468 202 365 256 48 -74 -23 39 -159 -136 125 -186 -40 128 252 -8 11 125 -159 177
4418A77l67P4K54l56K84P8q8L01l95M7q1L33o86N91Q0j71l75O55l62K07k1l31
$$ 177 -190 -116 138 -218 66 144 56 357 -38 9 -72 261 -425 166 246 75 -300 355 -7 200 179 -152
4440a52L17m53Ql7j0L75J05l14J94jM33o30Q5q8K13o40J052k74J24m87M14n36
$$ -152 165 -288 -280 -317 -327 48 153 -161 33 32 465 -165 -80 -168 45 -595 457 183 307 -180 234 -302
4462c02p3Q96j18j59J89n26L48j97J7q5j92M39m97J79M2K2K52J53m17K26l59Q4
$$ -302 -375 521 403 244 433 -93 255 58 75 -10 -202 237 -260 -81 -39 -17 235 388 -29 197 -162 -78
4484g8N8P0K77l29M39k73j57k50K63k24k54M79N3k27M01l83K74m29M89m9j59K70
$$ -78 -20 50 327 -2 437 164 7 -243 20 -204 -458 21 74 -153 248 -135 139 -290 199 150 -9 261
4506B61m46k35L38M5PL44q23J35L36J83L0l25J46m5J13l81P66n39K89J83q45M74
$$ 261 -185 -420 -82 -37 -30 314 -509 -374 -38 145 175 -150 -4 -49 64 -317 449 -90 199 382 -463 11
4528A1Q2j4j24K4r8o6L66j06J28l65k73M50l84K40L89l94K8O4J90m32M48p38J39
$$ 11 93 79 -45 -21 -119 -185 181 75 203 -162 -435 15 -369 -129 260 -134 -106 -42 148 -284 164 -574 -435
4551d35N15K26m62M08j10l14L05r0k30J00l8K10j69J62m02K69N47m61j2j27O32
$$ -435 80 306 -156 252 142 -172 133 43 -187 -87 -125 85 -84 78 -324 -55 492 31 19 -108 524
4572E24o88j51J90J0M69j35l17K00n67L22J77K52j31m27K00k65N62n18k9k28K06
$$ 524 -164 -315 -125 -115 354 219 -98 102 -465 -143 34 286 155 -272 -72 -337 225 -293 -322 -550 -344
4593c44k18N10J94l09N94J84k88n89K78n07K82j87L28l3L35q4M56o49k58O10l69
$$ -344 -562 -52 142 -167 427 611 323 -266 12 -495 -213 -400 -72 -105 230 146 602 -47 -305 305 -64
4614f4K73k40j17O30p32J34J9P2K59p1j86k00M59j13j00K21k6k27k72l57Q42k61
$$ -64 209 -31 -148 482 -250 -116 -97 -25 234 163 -23 -223 236 123 23 244 218 -9 -281 -638 204 -57
4636e7K2J53p2k45J01N33o87J05Q5q2K78k63J70j04J8Q7o3m04M95K9k80JK53K69
$$ -57 -35 118 46 -199 -98 435 -252 -147 -62 -144 134 -129 41 -63 -45 42 -21 -425 70 99 -181 -180 73 342
4660C42j70N61n66m21N59l0k80n18N60k97P1J31m9O15o6m77m61Q04l9K95r59l8
$$ 342 172 733 167 -254 305 275 -5 -523 37 -260 -189 -58 -107 508 442 -35 -496 308 269 564 -395 -433
4682d33J086o04j75O05k11m33j95K89M27n37J44K60O7J01j75k23o9n4P54o30j89
$$ -433 653 49 -126 479 268 -165 -360 -71 356 -181 -37 223 290 391 216 -7 -76 -130 624 -6 -195
4703a95L84l87l7L09L37l77n5L15P6n97L46l07Q17p98K20K80l33k36k77O14L7
$$ -195 189 -198 -235 74 411 34 -21 294 370 -227 119 -188 629 -169 51 331 -2 -238 -515 99 136
4724A36n7k11K92l11J32L67L8p77J60M30r42K66Q21m53L27l43N7M9k52n1P9J83
$$ 136 79 -132 160 -151 -19 348 386 -391 -231 199 -743 -477 344 -109 218 -125 -68 -19 -271 -322 -243 -60
4746f0m33M75N6L76k86p51M83K31K5l33J74K35j70L32l51k3l74O89k72m4K47m71
$$ -60 -493 -18 38 414 128 -623 -140 91 116 -217 -43 192 22 354 3 -20 -394 295 23 -21 226 -245
4768b45rk0K11K08o43P71l28j19j39M4J81j53J42L44m88J57J24o30O29k85O06
$$ -245 -254 -274 -63 145 -498 273 -55 -174 -313 -269 -88 -241 -99 245 -243 -86 38 -592 37 -248 358
4789C58m84O01q73R6M12j73L9J39j29OK02Q8l41r8j49P23n59jK23J41k89n9k99
$$ 358 -126 475 -398 -302 110 -63 -24 115 -14 -8 194 282 -59 -157 -306 417 -142 -143 80 221 -68 -127 -426
4812d26M88K5j63p2K07P1n65M94J64p96P47o3k6L19l77J30n15Q37j71k99n4k60
$$ -426 62 87 -76 -148 59 130 -435 59 223 -573 174 111 85 404 27 157 -358 479 308 9 -45 -305
4834c05J45j9R3R6J11n53O48m40M23l26J6K08J81k21L70k14m87N35o01Q5K16L0
$$ -305 -160 -179 -86 10 121 -432 216 -224 199 -127 -111 97 278 57 427 213 -274 261 -340 -255 -39 -9
4856ij22L5J03k5j94p1L98K47j96j24o08J214p51K89R8m05J66m8L1o9k99M15r3
$$ -9 -131 -96 7 -18 -212 -283 115 362 166 42 -566 648 -103 186 284 -121 45 -3 28 -41 -340 75 -18
4879a8k32K78L57m93Q8M22n07Q6j81J32R9M02k97j86J01P0j76j7K53l59K41K75
$$ -18 -250 28 385 -108 -20 402 -105 -19 -200 -68 31 433 136 -50 51 121 -55 -72 181 -178 63 338
4901C38o3J70k19l6o85J32J81k96K67k05P55l24r8L27k53K38L50q22L45o4J5n
$$ 338 275 445 226 190 -495 -363 -182 -478 -211 -416 339 15 -83 244 -9 229 579 -243 102 38 53 48
4923D8j93P8r0j3N48j93j11J51n42K00O93p36n04O13J13l35K89L47m11k51L54
$$ 48 -145 -67 -157 -170 378 185 74 225 -317 -117 576 -160 -664 -51 62 -273 16 363 -48 -299 55
4944E5K01l28L61k82j37O09p39k09Q46l98p6M13m58M00m77N4N52k6r6K63k40m71
$$ 55 256 -72 289 7 -130 479 -260 -469 377 -21 -97 316 -142 258 -219 -165 387 361 265 528 288 -183
4966a83J84K24l2L56l26J97l03j65J96J05k23j52K44l71K14Q8l00k59P40l36O8
$$ -183 1 225 193 549 223 420 117 -48 148 253 30 -122 122 -249 -35 53 -247 -506 234 -102 -34
4987c4j27J51L06l82k7K68j76k86O18k15j1J64n36L29J24k65J38L77m73J99M3
$$ -34 -161 -10 296 -86 -113 155 -21 -307 311 96 85 249 -287 42 166 -99 39 416 -57 142 185
5008A85j71k4j04K23j27J22J71j042R68J05l28m10L16OK86k25R5j23M1K4n58O33
$$ 185 14 -10 -114 109 -18 104 275 -767 201 306 -22 -432 -116 -110 176 -49 46 -77 -36 -12 -570 63
5030F3k06J11jN6P9J90k34o1m22L52p9J30j61o0R5J74k21k04N16K0l05r4L14m56
$$ 63 -143 -32 -33 23 102 292 58 -3 -425 -73 -152 -22 -183 -243 -148 26 -195 -399 117 137 -168 -262 52 -404
5054d04M42m79L61L59J92p44M58K00l52K49m5k70J01O1N9m66J23Q7K74k98k63
$$ -404 38 -441 -80 279 471 -273 185 385 33 282 237 -33 68 129 188 -278 -155 -68 206 -92 -355
5075c55K13K87J64J9P0l55m61N91J33k93m5j72O94l45k06j60N57L8r4n61K81K32
$$ -355 -142 145 309 328 398 43 -418 173 306 13 -32 -204 490 145 -61 -221 336 374 280 -281 0 232
5097B32r2j19o4L79n27Q26p46Lp5j45L6K50M99n76N9J54k00j2j1K48K58l79o5
$$ 232 140 21 -43 336 -191 635 -111 -108 -183 -328 -292 -42 457 -119 -60 94 -106 -118 -129 119 377 -2 -67
5120f7M73j65j93K0l8K56k64P4j64j59L00K40m36N1L01K26l65L76l36o3J30j43
$$ -67 406 241 48 68 30 286 22 96 -68 -227 73 313 -123 -72 229 455 90 466 130 67 197 54
5142E4j54K16j30j75M79l78J91M0o13K6M24l0N37l80j86K56P9n5j5k29N5j55M49
$$ 54 -100 116 -14 -189 290 -88 103 143 -470 -444 -20 -50 487 107 -79 177 256 201 186 -43 12 -143 306
5165C06o87M37Q8L56l48j59j69L49q0n01M9P62m03J26K17n56M19K49o52N1Q0l91
$$ 306 -381 56 144 500 152 -7 -176 173 93 -408 -359 403 0 126 343 -213 206 455 -197 -146 -66 -457
5187d57L09L94j60j85l22J07N98o33J72K03J3j53J6K18n63N77J1R7r34R98p19
$$ -457 -148 246 86 -99 -421 -314 284 -349 -177 26 39 -114 -98 120 -443 134 145 242 -692 306 -413
5208d13J22NN32n63J88k23K10l7J51L43j82K55m89M9J98q6m75M66k49M00k08k19
$$ -413 -291 -286 246 -317 -129 -352 -142 -179 -28 315 133 388 -101 -52 146 60 -415 51 -198 202 -6 -225
5230b25L35J53N8p8j55P1k47M85j84m18P33m52k13K57J87k46n3l33J80m8L58J96
$$ -225 110 263 321 243 88 159 -88 397 213 -205 528 76 -137 120 307 61 8 -325 -145 -193 165 361
5252C61K4p13J20J35P6J73R7k50rM30r11J82N57Kn47O07l17K89l32j34l5M28j75
$$ 361 385 -328 -208 -73 3 176 273 23 14 444 -467 -285 272 274 -273 334 17 306 -26 -160 -195 233 58
5275E8o23N45o8l59M37k50R8L8L29p64M64N04r05O75p4J17k10k14J44J57j55L07
$$ 58 -565 -20 -88 -447 -10 -260 -162 -124 205 -559 -95 409 -496 179 105 222 12 -202 -58 99 -56 251
5297B51k08m24M01r1m77j61R34j16j33K1J31k02R8r6K37K09p26N31j31k45K9M83
$$ 251 43 -381 20 -71 -548 -709 225 109 -24 -3 128 -74 24 -72 165 374 -352 179 48 -197 -168 315
5319C15n80O99n92M80k28p6j41Nj89M5J79K30K56p14P22l13o7j46J96j8o67J468
$$ 315 -265 434 -158 322 94 18 -123 -118 -307 -262 -83 147 403 -311 411 98 31 -115 81 63 -604 864
5341H64j054K12K77j43o76N99l74n7J32K47n81K77K7J73k40M59K00o82K71q4L91
$$ 864 -190 22 299 156 -520 79 -295 -352 -220 27 -554 -277 -250 -77 -317 142 342 -340 -69 -153 238
5362B38j00j64r6J15j86K65k19R4L50m67N25K72q55L0M74m57ML61m33L78M20m84
$$ 238 138 -26 -122 -7 -193 72 -147 -53 297 -170 355 627 -228 -198 276 -181 -177 184 -249 129 549 65
5384F5l96L10L6O4k80J18K32l16L15j2Q2nJ6l74m4L33m91O74n16J25j5m62K98
$$ 65 -331 -21 15 79 -201 -83 149 -167 148 136 218 213 229 -145 -189 144 -347 327 -189 -64 -79 -541 -243
5407b43L36m7K13k17J77Q8J46o00j22M05k87L49k60K75p24O46K60j81k48QQ9L86
$$ -243 93 46 259 42 219 307 453 -147 -269 136 -151 198 -62 213 -511 135 395 214 -34 -26 63 449
5429D49J8l69L72n40M05l54k2J00K3K66n03M74l29Rn0L5k79N89p5k07l39J00j09
$$ 449 467 98 470 -70 335 -19 -41 59 82 348 -155 319 -10 -1 -51 -16 -295 294 219 12 -327 -227 -336
5452c36M74k04J08k16O28o53J89k40J37j88L39j1L4l36L49m58J54J99K45J04p76
$$ -336 138 -66 42 -174 454 -199 -10 -250 -113 -301 38 27 61 -275 74 -384 -230 -31 214 318 -458
5473d58N16Q9M3j1j08o25N50L52k57J72om72L24m26M29k2p5q5n97Q62M8j13j15
$$ -458 58 147 190 179 71 -554 -4 348 91 263 257 -215 109 -317 112 90 15 -70 -667 195 243 130 15
5496A5n3p13Q93l02k40J88R1N05n39J83l05J20k9r9M97l44j16OL65j13l0L51l23
$$ 15 -38 -751 142 -160 -400 -212 -121 384 -155 28 -277 -157 -186 -285 212 -132 -248 -242 123 10 -20 331 8
5519Hj68m29O76J88m00P61j138L60qj17K88j0Ql21K62R6k1j07Q17r59L54J78k55
$$ 8 -160 -589 87 275 -125 636 -502 -142 -150 -267 21 11 19 -302 -40 56 35 -72 745 -214 140 318 63
5542F3k72K81k26J79Q7l46K54k15M03k07j92k07J60P6Q4R6R8J6J53j76k79j40
$$ 63 -209 72 -154 25 112 -234 20 -195 208 1 -191 -398 -238 -162 -78 18 116 132 285 109 -170 -310
5564c10N49J03l57K4O5J72k76J29n0j92K7L96k26L26Qk06j24l0K19p0n83L81n72
$$ -310 239 342 -15 9 74 246 -30 99 49 -143 -116 280 54 380 388 182 58 28 247 177 -406 -25 -597
5587e97L95M05l33L03k57K06K44m12l7J9K48J75Qm5l39L69k71R2j92L6n28K07
$$ -597 -202 203 -130 173 -84 122 366 -46 -83 -64 184 359 367 322 -17 352 81 173 -19 17 -511 -304
5609c04L53r3nl40N97n21O34n35J24J35K26l11J81Pm76K76J91l77L66J1r8k50
$$ -304 49 -44 -49 -389 208 -313 321 -214 -90 45 271 -40 141 148 -328 -52 139 -238 128 139 41 -209
5631b09L09J77n69J44J23M45n09L27k77L59l52J36O7m17K24k62J53j9K99lk1m4
$$ -209 100 277 -292 -148 -25 420 -89 238 -39 320 -32 104 171 -246 -22 -284 -131 -150 149 146 125 81
5653H1N1K57m88M8k6j08K4J63K88l9j37l29K13k45M2J03p3K95Kl75N72k94k79
$$ 81 132 389 -99 -51 -77 -185 -161 2 290 251 114 -215 -2 -247 -205 -102 -175 120 122 -253 319 25 -254
5676b54j6j7j62O39j58K79m21n2Q7J17j18O72j41n10R8j77L41l18J31J10N94j014
$$ -254 -270 -287 -449 190 32 311 -110 -162 -75 42 -76 596 455 -55 43 -134 207 -111 20 130 724 -290
5698b90L94m85j3L09L44n50J64L09k63m70M57O8k36M20j11j30q1K40qm13Q1J16
$$ -290 104 -381 -394 -85 259 -291 -127 182 -81 -551 -94 -26 -262 158 47 -83 -164 76 68 -345 -264 -148
5720a48j17O93m63k53M32q4j07M3L32n71M55k38L7M27n57k97Q25n25K88k60K01
$$ -148 -265 428 -35 -288 144 60 -47 -4 328 -243 212 -26 11 438 -119 -416 409 -116 172 -88 113
5741A13k65K13p7l22M47l0o08O07r0J10J70L7l91J4R3L94k83k94L43l90M37J2
$$ 113 -152 61 -16 -338 109 79 -529 78 -12 98 268 305 -86 -72 21 415 132 -162 181 -209 228 240
5763B40k63q4J72n7R7k55O82p19k63N94k19j60L68k01l1j25n9N50n65L14n0L62
$$ 240 -23 -107 65 8 105 -150 532 -187 -450 144 -75 -235 133 -68 -99 -224 -283 267 -298 16 -34 328
5785C28j82RO1q9R7p29Q78m51p8R2p0K06m7j49K38k68P9K35l51O7l0K31k54k35
$$ 328 146 155 216 127 224 -505 373 -78 -156 -64 -134 72 25 -124 114 -154 -75 160 -191 -124 -154 77 -177 -412
5809d12O31J52l61L61k25J59j54k26m18L59J08n7O3j43j17N73k00L38n36J51l61
$$ -412 219 371 10 371 146 305 151 -75 -493 -134 -26 -83 -20 -163 -280 293 93 431 -105 46 -315
5830c15K42o9j2l2K05M66m53J53k5m6j66p4L65j80nj5l38J33r8Q9K73Q3N2r4q5
$$ -315 -73 -142 -154 -186 19 485 32 185 160 114 -52 -126 239 59 54 39 -299 -166 -264 -175 98 181 233 139 54
5855E4j46L86l34j96J9O3O08q06M76J12l3k45O05p68K43M77o58K03K46Q5o22K64
$$ 54 -92 294 -40 -236 -217 -154 454 -352 124 236 203 -42 563 -205 38 515 -143 60 306 391 -231 33
5877C3M29m40k00P18o85M17l12M5J27M4m53J69L81k11j98M42k94N10l83J1k48
$$ 33 462 22 -178 540 -145 272 -40 5 132 176 -277 -108 273 62 -136 306 12 522 139 150 -98
5898i8j12M48m5j05k07m8M52k75J45m98O01p17R10K13p85J19L16l97J6j04M1J21
$$ -98 -210 238 193 88 -119 -167 285 10 155 -343 258 -459 451 664 -121 -2 314 -83 -67 -171 -130 -9
5920in0L09j59m46J96q5j22R20m75l46L58k34K96o5j47k54N51k91l1j64r9K25
$$ -9 -59 250 91 -355 -159 -244 -366 554 79 -267 91 -143 153 88 -59 -313 238 -53 -84 -248 -347 -122
5942a22M5M1j41j44N62l30J37lM01p65K25K66J41l18K38j87L00m58j76L41J87
$$ -122 -77 -36 -177 -321 241 -89 48 45 446 -319 -94 172 313 -5 233 46 346 -112 -288 53 240
5963B40On06O72m17l22m2N93n55N47J62o87N02k26m07O69R6o56L31lj55J77M42
$$ 240 246 -260 412 -5 -327 -369 224 -331 216 378 -309 193 -33 -440 229 325 -331 0 -3 -158 19 461
5985D61j50l45l39O32l51L9K7r6N28m47J19m5k47J92L25p1k24j91j0%K45K44R2
$$ 461 311 -34 -373 259 -92 -53 -26 -122 406 -41 78 33 -214 -22 303 232 8 -183 -193 -193 52 296 388
6008C88o3J4k80k10J84R1L5k06p0K07j30K76j54l42K99J21K32j75l47K36K89k43
$$ 388 325 339 59 -151 33 124 159 -47 -117 90 -40 236 82 -260 39 160 392 217 -130 106 395 152
6030A52m53M49q0j84l03P63k96n17O23o57M91K36j84k75J47Q19j175L60J92J98
$$ 152 -301 148 68 -116 -419 344 48 -469 154 -503 -12 224 40 -235 -88 731 -444 -84 108 306
6050C06q6k31O5P4p0r7j99N86m29m40M56N43q92K00K70o64Q30m52K18m05L65L8
$$ 306 220 -11 54 128 58 -39 -238 348 -81 -521 -65 478 -414 -214 56 -608 222 -230 -12 -417 -52 -14
6072a4O78k86o93K36n0J96j30n60P52Q7l28oJ71J09O0l00q7K92K57m10J40L56
$$ -14 664 378 -315 -79 -129 67 -63 -623 129 216 -112 -118 53 162 222 -78 -165 127 384 -26 114 470
6094D70n42L20j61j28M6k51K41L65l04O8j02J14k74R4J46K32l93K52J80k21L14
$$ 470 -72 248 87 -41 5 -246 -5 360 56 124 22 136 -138 -44 102 334 -59 193 373 152 466
6115D66q42L05J37l81K73k63J90K1j50O45l92m06J37L14j28K95k44o5j0p7J9o3
$$ 466 -376 -71 66 -315 -42 -305 -115 -94 -244 401 9 -397 -260 54 -74 221 -23 -88 -98 -175 -156 -219
6137b19P22n43Q5J05J7l60L03l39N21j92l21n5P1K45K38j42l54M40o12O00n98
$$ -219 503 -40 45 150 167 -193 110 -229 292 100 -221 -276 -205 40 278 136 -218 222 -390 210 -388
6158c88K49J91O1J8j57o1L67n77J38mJ06J05L10m43K56L1l23K80k95J34j72k1
$$ -388 -139 52 113 131 -26 -87 280 -297 -159 -163 -57 48 358 -85 171 202 -121 159 -136 -2 -174 -195
6180a95M50j87j23M48l60K62l77l14L76j2n98J120p62m83P89k06K04n05R39l45
$$ -195 255 68 -55 393 33 295 -82 -396 -20 -32 -630 490 -272 -755 34 -172 32 -473 466 121
6200A21o8j07K72m6l13L96O8m85L20l66N77j044P26j61Q9J13m53N63j96q9j89
$$ 121 53 -54 218 172 -141 255 323 -162 158 -208 369 -675 51 -110 -21 92 -361 202 6 -83 -272
6221b72R3K35m92M24Jp5J64j31p7L2k56k31P16l60l6P73Q0j366R11n65M47k16
$$ -272 -179 56 -436 -12 -11 -86 78 -53 -130 -98 -354 -585 131 -229 -265 508 588 -778 133 -432 15 -201
6243b01J72J63q29J000k95k06K86k11J03M37q21O15n7l48O93p65K72j25J60K34
$$ -201 -29 134 -695 305 10 -196 90 -121 -18 419 -402 213 156 -192 501 -264 8 -117 43 277
6263B77k22l1L25l18R0j80J75k19n21L27M97j29J49k67j55N26l29J64l61r0O0
$$ 277 55 24 349 31 121 -59 116 -103 -624 -297 200 71 220 -47 -202 324 -5 159 -202 -292 -232
6284b32L55j89J63O1N5l50MM8M22m31J65k67j55L80n7k26K33l4L79m53J18J89
$$ -232 123 -66 97 158 213 -137 -133 -85 337 -94 71 -196 -351 29 -28 -254 -21 -55 324 -129 -11 178
6306A78k01j03K58nk66N93o90j0K02K19Nl78RL92j30J11o91L68M01j62m07O36
$$ 178 -23 -126 132 127 -139 454 -236 -246 -44 175 180 -198 -189 203 73 184 -507 -139 262 100 -307 329
6328C29k00k98M08N1l94q5L44m6QM30o13k19J64m1J36K10J40p38J47J58L61J96
$$ 329 129 -169 239 290 -104 -189 155 109 117 547 -66 -285 -121 -162 -26 184 324 -414 -267 -109 252 448
6350D48m25K51n34o2K72m40M25Q9r5J25K72n31M41l96J38q0J67n54M61k3L02l45
$$ 448 23 274 -260 -322 -50 -490 -65 24 -71 54 326 -205 236 -160 -22 -102 65 -489 -28 -51 251 -94
6372i4J87J23k20L2o4K86j70J45l68M33j67N4l73L8N95n22j75J39L34l72O04m28
$$ -94 93 216 -4 28 -36 250 80 225 -143 290 123 177 -196 -158 437 -85 -260 -121 213 -159 445 17
6394A7J03J21l33n76N15N15l66J22m61K76P8k31K56L85j72j46l19K51K94k86o4
$$ 17 120 241 -92 -668 -153 362 -4 118 -343 -67 11 -220 36 421 249 103 -216 35 329 43 -21
6415b1o7k72M75J14m94M0ORL82j78P2j6j77P2l26M70l1Lk50J99K38k08l04K42
$$ -21 -88 -360 115 229 -265 -225 -219 -210 172 -6 66 50 -127 -55 -381 89 58 61 -189 10 248 40 -264 -22
6439b2j56M20K08o85L77R5l91J71K32l14Q0j3K07m44J42l8M20j14J52k86k06K9
$$ -22 -178 242 450 -235 142 237 -154 17 249 -65 15 2 209 -235 -93 -131 289 175 327 41 -165 -136
6461a36j05j42K10lR4L86n62M27o24Q14o79N7K26n71P47q8L40k83K45k24m76P55
$$ -136 -241 -383 -173 -176 -82 304 -258 169 -455 359 -320 -263 -37 -608 139 51 391 108 353 129 -347 408
6483D08l42L07o43J06L4j1p4J29j87N36k46r3K86m14J42J85P93q70N01k05k06
$$ 408 66 373 -270 -164 -130 -141 -215 -86 -273 263 17 -76 210 -204 -62 123 916 46 547 342 136
6504A36k8O8l57M66l73L20k32j83K76n59M26p1R3K60j79J64n53M2N21l90k72M95
$$ 136 108 176 -181 285 -88 232 0 -183 93 -466 -40 -111 -18 242 63 227 -326 -284 237 -153 -425 70
6526G0l08L07k78M27Mk94l14j13L98nL43k65L8J34M7j17K67n44O50p03N24m25
$$ 70 -238 69 -209 218 222 -72 -386 -499 -101 -106 237 -28 10 144 191 74 341 -203 447 -256 268 -157
6548a57K75j33j51l26J184r05RL4M66N86j206K19o9q4Q10n99k54m4J73L12L90
$$ -157 118 -15 -166 -492 692 -213 -204 -170 296 882 -324 -105 -174 -258 552 -47 -301 -345 -172 140 530
6569E30q60j4M77n49P11M0o93Q30q02L91P3l22O50n06K63n05M65j07j20L91r1
$$ 530 -330 -344 133 -416 295 335 -358 472 -330 61 134 -188 462 -44 219 -286 179 72 -48 343 252
6590B52m92L84o83N03K11J0p60J124q89L38M56j22o02J49J58r4K5q2J64n37L14
$$ 252 -240 144 -539 -36 175 185 -575 549 -340 -2 454 332 -270 -121 37 -57 -32 -114 50 -487 -173
6611a73J18M04k48j94K04R5l2l00K90j15o64L87p4P71m34M7k43L87o9N2j40k30
$$ -173 -55 349 101 -93 111 206 174 -126 164 49 -615 -228 -302 469 35 82 -161 226 157 209 69 -161
6633a61J09L46P2p94M07L37o70K53k39PQ5K80J97k2l05o4J64M8J02Nn00M26n88
$$ -161 -52 294 366 -428 -21 316 -354 -101 -340 -333 -248 32 229 207 -98 -162 2 50 152 157 -343 83 -505
6656e05M83q6J17j83N22n91K64r0o5j86Q6L21j39O76q08J62R9Q9j68k19L75O5
$$ -505 -22 -108 9 -174 348 -243 21 -69 -134 -320 -234 87 -52 624 -184 -22 77 166 -2 -221 154 219
6678B19n1K14k77n59O56j25k65L90j24M17n17R1n22R05p97L13K13m15K48m93M9
$$ 219 168 382 105 -454 202 77 -188 202 78 495 -22 69 -453 452 -345 -32 181 -234 14 -479 -430
6699d30q4Q37j67m90K93MK11o18N9M36l80L17m02N8P03m37N7K42j56L83m62J30
$$ -430 -514 323 156 -334 -41 -37 174 -444 -385 51 -329 -12 -414 -356 347 -90 -33 209 53 436 -26 104
6721A04m49J49L73j67q2J74L12o66O76j60n20J14r5K10J52l80P64o81K59n11M58
$$ 104 -345 -196 177 10 -72 102 414 -252 424 264 -256 -142 -237 -27 125 -255 509 -172 87 -424 34
6742C4K96l18k29N40k93K17o72P4O71m72J25l1p7J92k07L03k01r2J01r3K57n02
$$ 34 330 12 -217 323 30 247 -425 -351 320 -152 -27 -58 -135 57 -150 153 -48 -140 -39 -132 125 -377
6764c77j3M43N95k04m80N27o51K20K96k37P9p4m09l5j7L74j70J20j09L27J70q93
$$ -377 -390 53 648 444 -36 491 -160 60 356 119 198 124 -285 -320 -337 37 -133 -13 -122 205 375 -518
6786e18N58M60o33m00O26j78N8Q7J32P7j9q4p2l04N3R0L56k17K94l39l11K19j82
$$ -518 40 500 -133 -533 93 -85 -27 60 192 269 250 166 94 -210 -157 -67 289 72 366 27 -284 -65 -247
6809b47J64M39k1L2l46j5k28J10N60l44M69l69m05j54M25K08k56n07K64N82q97
$$ -247 -83 356 335 367 21 6 -222 -112 448 104 573 204 -201 -355 70 278 22 -485 -221 361 -536
6830e36O0J004n16M3l83M83k44J89K91l24ll48Q6J85p1m5N8J74M05l90k43J88
$$ -536 -476 528 12 55 -328 155 -89 100 391 67 64 -284 -198 -13 -84 -129 -71 103 508 118 -125 63
6852F3ql70L40J72k88m77K43K24j24N80m21j90K25M21o31K36K64k23k13M12n23
$$ 63 55 -315 25 197 -91 -568 -325 -101 -225 355 -66 -256 -31 390 -241 -5 259 36 -177 235 -288
6873b88K77l63M04p8K0K7J46L77q94N27m69P06l32J5J08l64l9m05N38J46l50K78
$$ -288 -11 -374 30 -48 -28 -1 145 522 -372 155 -314 392 60 75 183 -181 -220 -625 -87 59 -291 -13
6895a3K12k28O34j82l16j44j20k71O37P1n18K67J08K81m08l11M54j69L7M21n02
$$ -13 199 -29 605 423 107 -37 -157 -428 209 280 -238 29 137 418 10 -301 153 -16 21 442 -60
6916f0K98j85k5l99K90N5m6%J70K58Rp92P72m50m40O57k94M93k25m04L40L2j52
$$ -60 238 53 28 -371 -81 -26 -72 -72 98 356 365 -427 345 -105 -545 112 -182 311 86 -318 22 54 -98
6939i8l94O44j89N73p40P5J5K44l54L64j32j40k3R5J07L74R2n14j1K69K6M3p38
$$ -98 -492 152 -37 536 -204 -129 -114 130 -224 140 8 -132 -155 -60 47 421 513 -1 -12 257 283 326 -412
6962d12N95n99L08J16j63N91k19k17l41J4j80O10j12R0J24l2j48q3M09k88K64
$$ -412 183 -416 -108 8 -155 436 217 0 -341 -327 -507 103 -9 81 205 173 25 -58 351 63 327
6983C27j80k18P27l38l53j0m2J85p1k80L39M30n73J31l06K66J97l10M31n35J38
$$ 327 147 -71 656 318 -35 -45 -87 98 27 -253 86 516 -57 74 -232 34 231 -79 352 -183 -45
7004d5j27L93k13M70p66J58M58J0k57N5k81K40P0m81N9O80m4k11j34k94J7K31
$$ -45 -172 221 8 478 -288 -130 328 338 81 136 -145 95 165 -316 -257 423 379 168 34 -260 -243 -12
7026a2J94J59n54O17k46k44K08j38k68O96k40k21l20M50m08L08m6L22m50L93l40
$$ -12 182 341 -213 404 158 -86 122 -16 -284 412 172 -49 -369 81 -327 -19 -65 257 -193 200 -140
7047a40j39K59R3m8J80j33j50o03N87L59k5J91K2l70L8l27J41J36m16L01j28r8
$$ -140 -279 -20 73 25 205 72 -78 -681 -94 265 240 431 453 83 121 -206 -65 71 -345 -44 -172 -270
7069b70j96L85K5J74j17kJ20n34R43o67l27P11r5L6j60l33N34L2l7j65Q4k75M45
$$ -270 -466 -81 -56 118 1 -1 119 -415 528 -139 -466 245 150 186 26 -307 227 259 222 57 141 -134 311
7092C11k09m6M6l24q5M60J24k42l22M82o7Op1m13N70p6j77j2M53n78K30k41O28
$$ 311 102 56 102 -222 -307 153 277 35 -287 195 128 134 63 -350 220 144 -33 -45 408 -170 60 -181 447
7115D47l02l32L29j27j50L97j41m84L28N65n46P2k13K68j06q8K68n89M23J67J87
$$ 447 145 -187 142 15 -135 262 121 -363 -35 530 -16 56 -157 111 5 -83 185 -404 19 186 373
7136C73n17K37k58K77l72P79o25J37M6P7L1k7j57L6J62k6k73R8Q6j0r8m92Q55
$$ 373 -144 93 -165 112 -260 519 -106 31 77 154 185 158 1 37 199 173 -100 -2 84 74 -24 -516 339
7159C39l35k01M80j37J20k23j24M66n49K13Mr5k35J4L01K61k27K22m02K17j16
$$ 339 4 -197 283 146 266 43 -81 385 -164 49 53 -42 -277 -263 38 299 72 294 -108 109 -7
7180gL66l98j07l30J19N64j94m62n9L62K33m78K5O52m60M81j4L31o96K54n58K30
$$ -7 359 -39 -146 -476 -357 207 13 -449 -508 -146 87 -391 -366 286 -174 307 293 624 -72 182 -376 -146
7202a46l0L35L89m79J8l88M36k4k29L18k59k79J54j20L57k5nl08OK51k79M85l87
$$ -146 -176 159 548 69 87 -301 135 111 -118 200 -59 -338 -184 -304 53 28 23 -285 -279 -28 -307 178 -209
7225b09M17o35P96k84k92J86p5j94P18q1k85l01K83K97m7J0q39M07N2o4M67n31
$$ -209 208 -427 369 85 -207 -21 -96 -290 428 347 62 -239 44 341 294 304 -535 -128 -76 -140 327 -204
7247b04J94L84n42j51K73P9l52L77L60n9J0j19l10m9kl02K72J77K33o57M56p2
$$ -204 -10 374 -168 -319 -46 33 -319 58 418 359 369 250 -60 -109 -111 -413 -141 36 269 -388 68 -4
7269dj42L54p55M16M1K57n22L72R7l68K69j91O2K52K91l18n32N18l05k43M00M14
$$ -4 -146 208 -547 -131 -90 167 -355 17 114 -254 15 -176 -114 138 429 111 -421 97 -208 -451 -51 363
7291C63o7m45m7j18O76o91r3M88j97L07J3o37O44n16J19m4P59o52K94l51K16j40
$$ 363 296 -149 -196 -314 362 -329 -422 66 -131 176 189 -448 196 -320 -201 -245 514 -138 156 -195 21 -119
7313a19m3k82M37j88M05nk21J98R2k19L98p46q7P99m81K53j89k69Q0k64L42r1
$$ -119 -162 -444 -7 -195 210 205 -16 182 274 55 453 -293 -380 419 -62 191 2 -267 -187 -451 -109 -200
7335b00P99m68M76l11o43N11M8L4l05K24M9j88k62L82j08J96l49J87M67o41l24
$$ -200 599 131 607 296 -347 164 212 246 -59 165 214 26 -236 146 38 234 -115 72 539 -102 -426
7356d26L97R7l54j20P51k42l18M52On61M81k28p0n6J8L22J34M9n22J50J03J82
$$ -426 -29 68 -286 -406 345 103 -215 237 243 -318 163 -65 -135 -191 -173 149 283 332 -190 -40 63 245
7378B45k71J89k07m3L42m2r0m6L39p67M92k30J04l80L39j8J84l78J90o3K18Q6
$$ 245 -26 163 -44 -87 255 213 123 77 416 -351 141 -89 15 -365 -26 -44 140 -238 -48 -111 107 193
7400A93J88p08L17K2K0J37Nk35k91K59L39o04L04M2l80K37O73m91J03m80J32J08
$$ 193 381 -327 -10 12 32 169 174 -61 -352 -93 246 -358 -54 -12 -392 -155 518 27 130 -350 -218 -110
7422a10j47K98k82K07J43K68o60M12J62j76l96K49l8J4J99l05J34k65p0N23k02
$$ -110 -257 41 -241 -34 109 377 -283 129 291 115 -281 -32 -70 -56 143 -162 -28 -293 -363 160 -42
7443d2j83L85j73M0j64K36K76p74Q23n53P4P7j66K70l61j09J38M52K43m53j66
$$ -42 -225 160 -13 27 -137 99 375 -399 424 -129 -55 22 -144 126 -235 -344 -206 246 489 36 -130
7464a30K45j58l11Q29p75K12k48m9l01J022r2k53k04j9N17l70M9j80K80L31k16
$$ -130 115 -43 -354 475 -300 -88 -336 -385 -686 336 244 -9 -213 -232 285 -85 -36 -216 64 395 179
7485A79j28j18k81j79J74Q31k66k48K1j13K23j94l05M06L53J00n31J68J5J83l22
$$ 179 51 -67 -348 -527 -353 478 212 -36 -15 -128 95 -99 -404 2 355 455 -76 92 107 290 -32
7506c2Q7pR5n63J43O40n43o0J03M31n35K19L31j26j48ll79P89l06J62k98L97K59
$$ -32 55 48 143 -420 -277 363 -180 -240 -137 294 -241 -22 309 183 35 32 -347 442 136 298 0 397 656
7529F56p16K2k42M06l88J56m5L56p06M05O06q48Q9j43J43J84m15N00J07j07j35
$$ 656 -60 -38 -280 126 -262 -106 -151 205 -501 -96 510 -338 -249 -392 -249 -65 -480 20 127 20 -115
7550a15L09J4j50m21l28J058n88R9J93n08M79L9Q4p5j29K45k47j64J27K10k82
$$ -115 194 208 58 -363 -691 367 -221 -122 71 -437 42 81 165 90 -39 206 -41 -205 -78 132 -150
7571a50K13K64l22M16k73j32L80l51j32j7J93N1J87k66Jl74L3M26N61n78l04L6
$$ -150 63 327 5 421 148 16 396 45 -87 -104 89 140 327 61 62 -312 -279 147 708 130 -174 -138
7593a38M13k54J33m15M72l60j9K69L40l45j44j16k05J012p87J15k45N98p19L74
$$ -138 275 21 154 -261 211 -149 -168 101 441 96 -48 -164 -369 643 -144 -29 -274 324 -395 -21
7613b1J66m81J10k06O27n00L43l53K26K60k32L20N8m29n6J39M8l24L95J8M45j056
$$ -21 145 -336 -226 -432 195 -305 38 -315 -89 171 -61 259 317 -112 -168 -29 19 -305 90 108 553 -503
7635e03N20L35J2k92J11l14%k58L61L26l08m06K72k1m9L56j22J07r1M12m80o3
$$ -503 17 352 364 72 183 -131 -131 -389 -28 298 -10 -416 -144 -165 -214 142 20 127 36 448 -32 -95
7657i5j96k9M30k06J20J75q02O68N5Q6m53L26j34K42q3n41O24L02o49l00M66K40
$$ -95 -291 -320 110 -96 24 199 -603 65 120 206 -247 79 -55 187 104 -437 187 489 -160 -460 6 246
7679B46j89J03J59n65m8K04k91L22j34J6J91J18l77K00j11o0O9J15Pp8K5k72L42
$$ 246 57 160 319 -246 -294 -90 -381 -59 -193 -177 14 132 -245 -45 -156 -216 -147 -32 -25 -103 -78 -350 -8
7702hJ50K54k47J76m80L70n7K24q86R58j8k97q1R3L37o18M84k68K77l08J87p23
$$ -8 142 396 149 325 -155 215 158 382 -504 454 436 139 58 151 488 -130 354 86 363 55 242 -481
7724d81P9L90N1j43j47J97J32k9k86p2K0K75k57J75L86m77L49R8l96K49J2j17
$$ -481 -402 -12 39 -104 -251 -54 78 49 -237 -309 -289 -14 -271 -96 290 -187 162 260 -136 113 125 8
7746HJ42k93J45K87L0l53M05m97J42m75L38K22k90O62m77J33j81J59j64k54O52
$$ 8 150 -143 2 289 319 -34 371 -126 16 -459 -121 101 -189 473 -4 129 -52 107 -57 -311 341
7767C41k30l32j35L71J33j14k18k41L83j63L99o5N37p46l10L18j60K4M75n25j01
$$ 341 111 -221 -356 15 148 34 -184 -425 -42 -205 194 129 666 -80 -390 -72 -232 -208 267 -258 -359
7788c59K74Q16n05l87n3L29K78n27n9K2L65m11L89k59L33Mm56M94m03J86nj13
$$ -359 -85 731 226 -161 -214 115 393 -134 -193 -171 194 -217 172 -87 246 250 -206 288 -115 71 66 -47
7810d7k7k80K17J94r3K57L92o21K72o13L40j7M43k84k78N66n07l72jN40M6m9j61
$$ -47 -74 -354 -137 57 -36 221 613 -8 264 -349 -9 -26 417 133 -145 421 -86 -458 -459 81 127 78 -83
7833h3M2N10o83j69L42J14p95P34M14k53l51N09k55k03L66k70J10n1j3j29J61
$$ -83 -41 469 -214 -383 -41 73 -722 12 426 173 -178 331 76 -127 239 -31 79 28 15 -114 47
7854D7j88J32k51N41n71L24Qk28O3k43K32J63M16l13o90N04L48O3l02n6j10k7
$$ 47 -141 -9 -260 281 -290 34 42 -186 -123 -366 -134 29 445 132 -558 -54 294 357 55 -1 -111 -138
7876a38R5j0M96p72K84M38N9k67k52L64j146O59K18M94n32J19k2J08p11M37L3
$$ -138 -43 -53 443 -329 -45 393 452 185 -67 297 -849 -190 28 522 -10 109 87 195 -516 -79 -46
7897d6M64o4k29l04L28R0k84M24n82N15k59J52q9L03m57P8k12O2M90o33M03n5
$$ -46 418 354 125 -179 149 239 -45 379 -203 312 53 205 116 419 -38 40 -172 -110 380 -253 150 95
7919I5N4j44J37p7r4K28o2o03O87J01o39J22K99J61Rl04K03j06q7k35Q5j41j24
$$ 95 149 5 142 65 -29 199 137 -466 221 322 -317 -195 104 265 274 -30 173 67 -20 -255 -170 -311 -435
7942d35M97l41K0j8P8Q22l22n38P06p21J57J5K88l15K60k99K34J56q8J79L2n94
$$ -435 62 -279 -259 -277 -199 623 301 -237 469 -252 -95 -80 208 -107 153 -146 88 244 156 335 367 -227
7964b27L34M9n78M00J03m29O75l78KM7J96o08L21J82J4M90p35m56P82K66p67L7
$$ -227 107 156 -422 -22 81 -348 327 -51 -49 -2 194 -414 -93 89 103 593 -142 -598 184 450 -317 -280
7986b80J37j08M02n44P0J058o02k54k52l4MM70o44N81K4J12o49P0N47J19m38K68
$$ -280 -143 -251 151 -393 -323 735 133 -121 -373 -407 -403 67 -577 4 28 140 -509 -439 108 227 -211 57
8008E7j98K22k29m94P38K37N7m34j28M90j76p59J06L31J19J34j85P1j98N43m55
$$ 57 -141 81 -148 -642 96 333 390 -44 -172 318 142 -617 -511 -180 -61 73 -112 -41 -239 304 -151
8029a51J00L15l50K36K6J19r6l51m6L09M74r10n2M36J50n3J90r35P18p05M93m07
$$ -151 -51 264 -86 150 176 295 199 -152 -198 111 585 -325 -377 59 209 156 346 -589 129 -576 -83 -490
8051d90Q17m95k70k34M05L80l21J24K63j66J12l77L38M6r6q2M38j02j78o0R2k33
$$ -490 327 -168 -438 -672 -267 113 -208 -84 179 13 125 -252 86 132 36 -46 392 290 112 52 144 -89
8073h9Q7k65M38n86N99k40J78r7K35o33mk18N41J7j26R2J90Oj95j11K63n8K11
$$ -89 -2 -267 171 -415 184 -56 122 25 260 -373 -377 -595 -54 -37 -163 -71 119 125 -70 -181 82 24 235
8096B35L29j002N72k09M71n56j06K87J46L33l03j9k40L4l58N99N8j67k19k48L32
$$ 235 564 -438 134 -75 396 -160 -266 21 167 500 197 178 -62 -28 -386 213 271 104 -115 -363 -31
8117c1j00K92j42J88j18J62R5J02r16K66J25k00K97k39L10M84q18j96K80k10K13
$$ -31 -131 161 19 207 89 251 346 448 -468 -202 -77 -277 20 -219 91 575 -243 -439 -159 -369 -156
8138a56K52J47l36r6K15J68P1l83k08M08k17M3O8K41l81K7K06l15j51L26n8K34
$$ -156 96 243 -93 -189 26 194 265 -118 -326 82 -135 -92 -24 217 -164 -137 69 -246 -397 -71 -129 105
8160A05N65p36J21n4RJ46l29M4L21m39r7N89k97o51R36l11m09r1O91l00K87l15
$$ 105 670 -66 55 1 10 156 -173 -129 192 -247 -344 245 -52 -703 233 -78 -487 -578 113 -187 100 -215
8182b15J43K99m10L03N3m24K24K28o00
$$ -215 -72 227 -183 120 173 -251 -27 201 -399
8191c99
$$ Imaginary data points
##PAGE= N=2
##DATA TABLE= (X++(I..I)), XYDATA
0@%%%%%%%%%%%%%K9o1O4o4O4q3J15j28J60j92K24k57K90l53M15m78N44o10O82
$$ 0 0 0 0 0 0 0 0 0 0 0 0 0 0 29 -32 32 -32 32 -51 64 -64 96 -96 128 -129 161 -192 223 -255 289 -321 361
32C61p79Q91j003J126j268J423j589J776j979K196k436K701k990L307l649M021
$$ 361 -418 473 -530 596 -672 751 -838 938 -1041 1155 -1281 1420 -1570 1737 -1912 2109
48B109m433M884n379N926o532P205p959Q811r773J0869j2143J3640j5432J7617
$$ 2109 -2324 2560 -2819 3107 -3425 3780 -4179 4632 -5141 5728 -6415 7225 -8207 9410
62I410k0343K3866k8622L5443m6093O5186j10043M05071L26311n91135r8490R8235
$$ 9410 -10933 12933 -15689 19754 -26339 38847 -71196 333875 660186 69051 -29439 68796
74F8796O1434j42175o1934P7326J83235j58079k89193J14587L94204o309k73486
$$ 68796 130230 -11945 -73879 3447 186682 28603 -260590 -146003 248201 241892 -31594
85c1594j44478K3891K3304k8226p2607J29530K18825j10351k94301O9622K68515
$$ -31594 -176072 -152181 -128877 -157103 -229710 -100180 118645 8294 -286007 -216385 52130
96E2130L9415j35593j01317l7374K6193m0497o8498J70800K58884q7808k36201
$$ 52130 91545 -44048 -145365 -182739 -156546 -197043 -265541 -94741 164143 76335 -159866
107a59866K4232J50209L3039l8923o3449k5358K1077q9638r6106J82979K31541
$$ -159866 -135634 14575 47614 8691 -54758 -80116 -59039 -148677 -244783 -61804 169737
118A69737p8623j74998j2903L2643O632K163k4046L2126M4713j25362r9022J83987
$$ 169737 91114 -83884 -96787 -64144 -57512 -55349 -79395 -47269 -2556 -127918 -226940 -42953
130d2953J93022n1801r5844j9700k3133j4353j2557M185J16215O7787j54390r1212
$$ -42953 150069 98268 2424 -17276 -40409 -54762 -67319 -63134 53081 120868 -33522 -124734
142a24734J70320J36822l8215l6195n018k5335l3925o4744J1339J78852P3151
$$ -124734 45586 182408 144193 107998 102980 77645 43720 -21024 -9685 169167 242318
153B42318j72928q4656J21501O4781m4887k5071k110K549m9361j32538L35K08077
$$ 242318 69390 -15266 106235 171016 126129 101058 98948 101497 52136 -80402 -80067 128010
165A28010P3687j59086p3754P4816K5512m2282m1745M982O6260l8430j80314j1718
$$ 128010 201697 42611 -31143 43673 69185 26903 -14842 -9860 56400 17970 -162344 -174062
177a74062K12292P7170j22141n6637M3228K2621l5004o5788K3836J30087j7740
$$ -174062 38230 115400 -6741 -63378 -20150 2471 -32533 -98321 -74485 55602 37862
188C7862j89207j5291J85803O9969p7309m8447J5587L0098l5029j03828K7696
$$ 37862 -151345 -166636 19167 89136 11827 -36620 -21033 9065 -25964 -129792 -102096
199a02096J67886j831j78922k5536J35958O1354m1683n4326L35N3796l7137j34769
$$ -102096 65790 63959 -114963 -140499 -4541 56813 15130 -39196 -38861 14935 -22202 -156971
211a56971K8372J79128J1177j42435l2879P9478N6448j1721n9687K10P8969l5811
$$ -156971 -128599 50529 61706 -80729 -113608 -34130 22318 10597 -49090 -48880 30089 -5722
223e722j35708L4622J61800K3457q6009l0901L1250M9894L150o0653J3285Q7657
$$ -5722 -141430 -106808 54992 78449 -7560 -38461 -7211 42683 45833 -14820 -1535 86122
235H6122m2174j20319L4619J21110K6278l9238l3716k182L8161o998o2369L3768
$$ 86122 43948 -76371 -41752 79358 105636 66398 32682 30500 68661 61663 -706 33062
247C3062Q3422n6124j00249K9069P5177K0025j3064l4591j1415K3561l7836n8106
$$ 33062 116484 60360 -39889 -10820 64357 84382 71318 36727 25312 48873 11037 -47069
259d7069O2942P2535o4941p4322K5715M2373J4252l361k5950P611J4614p2605
$$ -47069 15873 88408 23467 -50855 -25140 17233 31485 28124 2174 9785 24399 -48206
271d8206n0083Q9672O6597o2040n1177J8446K5085J4861j4360j7067M4982J3882
$$ -48206 -98289 -8617 57980 -4060 -55237 -36791 -11706 3155 -11205 -28272 16710 30592
283C0592j04254m4174J02668O3192m8548l9023Q802K5222R101m2349j0612Q5219
$$ 30592 -73662 -117836 -15168 48024 -524 -39547 -30745 -5523 3578 -38771 -49383 35836
295C5836J4538j21523m4247R5037O0144k6187l5928m499L7438N517p4050p906
$$ 35836 50374 -71149 -115396 -20359 39785 13598 -22330 -26829 10609 16126 -57924 -65830
307f5830J12455K2905j15633m8501O8181O1104L43m1875j3284N5545J772r9033
$$ -65830 46625 69530 -46103 -94604 -26423 34681 35024 -6851 -20135 35410 37182 -61851
319f1851q084J21525L5220r0548n4287L3578O1337J7283m9273j2530P2578o537
$$ -61851 -69935 51590 86810 -3738 -58025 -24447 36890 54173 4900 -7630 64948 58411
331E8411j13423j0802J09531M4770n5916n7700n49N6621K1572n7639l591Q1290
$$ 58411 -55012 -65814 43717 88487 32571 -25129 -25678 30943 52515 -5124 -8715 72575
343G2575j3800j10680j7230Q0139N0552j7330n4660k1863M8840J1081o2325J1819
$$ 72575 58775 -51905 -69135 11004 61556 44226 -10434 -32297 16543 27624 -34701 -22882
355b2882Q3639j6080r1600k3065M6238N1512J2593m5976k0524M1982j1134o2994
$$ -22882 60757 44677 -46923 -69988 -23750 27762 40355 -5621 -26145 15837 4703 -58291
367e8291L0312P8119j1655o4001k7535J6303M7039K2071l3504j470L6449l8545
$$ -58291 -27979 50140 38485 -25516 -53051 -36748 10291 32362 -1142 -2612 33837 -4708
379d708o1432L9294O7852l078l7212l0389k328L7093J0257k4644K8467L4079o0035
$$ -4708 -66140 -26846 41006 37928 716 -29673 -32001 5092 15349 -9295 19172 53251 -6784
392f784o2029L6671N5950R219j9347l0120k379K5422j7478k0311N8750L8390o7913
$$ -6784 -68813 -32142 23808 33027 13680 -16440 -18819 6603 -10875 -31186 27564 65954 -1959
405a959o0278K3733M3058K1357q699k5230J1546J4286m8846k0770P7367M3675
$$ -1959 -62237 -38504 4554 25911 17212 -8018 3528 17814 -31032 -51802 25565 69240
417F9240n8195n4221N226L1753K7087j1607j6729L5763Q212p6178k7780P9864
$$ 69240 11045 -43176 -37950 -6197 20890 9283 -7446 28317 36529 -39649 -67429 12435
429A2435M8759l7553m7685j2023K7912K4916k6344q029O2350R423q9257l6715
$$ 12435 61194 23641 -24044 -36067 -8155 16761 -9583 -17612 44738 54161 -35096 -71811
441g1811O3912N1466j0062m1248k3485K9778J9494m4385l697P8447J5983q2513
$$ -71811 -7899 43567 33505 -7743 -31228 -1450 18044 -26341 -30038 48409 64392 -18121
453a8121m5277L5665N0707J4943l5622k5963L5730R160o0442k919Q0438K4509
$$ -18121 -63398 -27733 22974 37917 2295 -23668 12062 21222 -39220 -42139 38299 62808
465F2808n9308n0317M646M5361K9219l1551j7451M2765j413o8221n971O8492L2622
$$ 62808 3500 -46817 -42171 3190 32409 858 -16593 26172 24759 -43462 -49433 19059 51681
478E1681k9451m5898j7527L6750K7921k9371PM9582j0497o5739q924M7188L4373
$$ 51681 22230 -23668 -41195 -4445 23476 -5895 -5888 43694 33197 -32542 -41466 5722 40095
491D0095j431l7552k4664K7890J2117l0065J6280N1385j4102n5780j4403K1992
$$ 40095 38664 1112 -23552 4338 16455 -13610 2670 54055 39953 -15827 -30230 -8238
503h238L0502J4037k7778j7600K1530j1655l4095K8731M8104j4890m0306j7825
$$ -8238 22264 36301 8523 -9077 12453 798 -33297 -4566 43538 28648 -11658 -29483
515b9483L601K4714J2860j9129N342J9916l4870l7265L5828M3545r084k5602j9679
$$ -29483 -25882 -1168 11692 -7437 -2095 17821 -17049 -54314 -18486 25059 15975 -9627 -29306
528b9306K56J9317o98j3775L1446K5183m9052m0202L2702L9174K647j8098k0545
$$ -29306 -29050 -9733 -10431 -24206 7240 32423 -16629 -56831 -24129 15045 17692 -406 -20951
541b0951O710J7959k2714j5252N1104L1464n0185m2847J8996L3666J2796j7471
$$ -20951 -14241 3718 -18996 -34248 16856 48320 -1865 -44712 -25716 7950 20746 3275
553C275j9980K0121J6358m3002j9939N8566L6054l8976m0507J928K8953K0653
$$ 3275 -16705 3416 19774 -23228 -43167 15399 51453 12477 -28030 -26102 2851 23504
565B3504k0269j8908L5411J7334n3254k4198N3360L8212k0219l5870j3024K6873
$$ 23504 3235 -15673 19738 37072 -16182 -40380 12980 51192 30973 -4897 -17921 8952
577H952K4138k7339j6220M6016J7188n4622k7109L6104L7172k141l3732k2963
$$ 8952 33090 5751 -10469 35547 52735 -1887 -28996 7108 44280 42139 8407 -14556
589a4556K6547K0564l7106j2627M9233J5175m7582k9917J6253L2791J1916l1758
$$ -14556 11991 32555 -4551 -17178 32055 47230 -352 -30269 -14016 18775 30691 -1067
601a067k5656K8591J3283m0972q981M6083J5649l1983k9627o01K9781K0303k8714
$$ -1067 -26723 1868 15151 -25821 -34802 11281 26930 -5053 -34680 -35281 -5500 14803 -13911
614a3911j6947L0880L569l9089j616L8674J5160j5387k6348r131K7343J7149k6090
$$ -13911 -30858 22 3591 -35498 -37114 1560 16720 1333 -25015 -34146 -6803 10346 -15744
627a5744l198L2235o177l5950K328K8182J4576m564k4743j0400K4879N487k5300
$$ -15744 -18942 13293 7116 -28834 -26506 1676 16252 11688 -13055 -23455 1424 6911 -18389
640a8389R919L2092j4277l0440O99J8040J6955l20k4486m828K4410q846k5330
$$ -18389 -8470 23622 9345 -21095 -20396 -2356 14599 14279 -10207 -15035 9375 529 -24801
653b4801K1775L0843j5278k5991l451J4599K0148k148k3991Q041K3782k2186k5043
$$ -24801 -3026 27817 12539 -13452 -16903 -2304 17844 15696 -8295 -254 23528 1342 -23701
666b3701K9019L0139j1481k3994j0652J3695K4966j0315k4953K1383K3138l2242
$$ -23701 5318 35457 23976 -18 -10670 3025 27991 17676 -7277 14106 37244 5002
678E002k5869K6137K9441k633k4962k1299J6723K6915k1104k3899K9934K1726
$$ 5002 -20867 5270 34711 32078 7116 -14183 2540 29455 8351 -15548 14386 36112
690C6112l3832k9841J6612K9438J0681k6675k8502J9163K6663k7225k1808L3292
$$ 36112 2280 -27561 -10949 18489 29170 2495 -26007 -6844 19819 -7406 -29214 4078
702D078K2386k7517k9918J282L0416K3269k4990l0861K1980K2188k9569j7513
$$ 4078 26464 -1053 -30971 -29689 727 23996 -994 -31855 -9875 12313 -17256 -34769
714c4769L1243K4022j4804l1096j2409K8647L0520k2925k6365K4091J5157k9280
$$ -34769 -3526 20496 5692 -25404 -37813 -9166 21354 -1571 -27936 -3845 11312 -17968
726a7968j4655K3999K5637o09l0669k3288K5710K8854k0768j6279K5107P151k6093
$$ -17968 -32623 -8624 17013 16404 -14265 -37553 -11843 17011 -3757 -20036 5071 12222 -13871
739a3871j3535J3885K6654J2553k7862k6064K1788J9397j8443l222K4373K865
$$ -13871 -27406 -13521 13133 25686 -2176 -28240 -6452 12945 -5498 -8720 15653 18518
751A8518k0282j4955L274K8075J8175k3530j9319J8219N043j8640N957K4875K890
$$ 18518 -1764 -16719 -13445 14630 32805 9275 -10044 8175 13218 -5422 535 25410 28300
764B8300j5358j8941l613K5989J5321j9862p473J6784r858k2413J0050K2633O819
$$ 28300 12942 -5999 -9612 16377 31698 11836 4363 21147 11289 -11124 -1074 21559 28378
777B8378j0897k4290p095K3410O436j8430P787J6039j8019k5703N567K0560J5334
$$ 28378 17481 -6809 -13904 9506 15942 -2488 5299 21338 3319 -22384 -16817 3743 19077
790A9077p249k7215m980K1217m609j7255J8513K1095j7645k6886m116J8397K4960
$$ 19077 11828 -15387 -20367 850 -3759 -21014 -2501 18594 949 -25937 -30053 -11656 13304
803A3304m642k7271L888J8836j6514j7348K3783K5328q707k5946j5577J5027L0452
$$ 13304 8662 -18609 -14721 4115 -12399 -29747 -5964 19364 10657 -15289 -30866 -15839 14613
816A4613n682k4370J2699J7312k4035k0415J9639K8070M986k3874k6783J2655
$$ 14613 8931 -15439 -2740 14572 -9463 -29878 -10239 17831 22817 -1057 -27840 -15185
828a5185L0291r272k0717J9316J6885k3165k4068Q182K7563J8066j8944l1155
$$ -15185 15106 5834 -14883 4433 21318 -1847 -25915 -17733 9830 27896 8952 -22203
840b2203J1327K5164j3853j4181K2092J6285j6321k4197m923K3995K7054j4558
$$ -22203 -10876 14288 435 -13746 8346 24631 8310 -15887 -20810 3185 30239 15681
852A5681k7467J1060J6462j7235j0097K0848J6543o098k3419j7038J9747K7570
$$ 15681 -11786 -726 15736 -1499 -11596 9252 25795 19697 -3722 -20760 -1013 26557
864B6557j1671j9555J2374P490j9579q136J3953J7370M694k2724k2228J5790K1014
$$ 26557 14886 -4669 7705 15195 -4384 -12520 1433 18803 23497 773 -21455 -5665 15349
877A5349j2149q676J5673P45j8567r306P510J8352J1076j9781k0028J3638J1291
$$ 15349 3200 -5476 10197 10942 -7625 -16931 -9421 8931 20007 226 -19802 -6164 5127
890E127j3569J107J8067j063j5675j0900J293J8776J3283j7132j2311J3453k64
$$ 5127 -8442 -7335 10732 9669 -6006 -16906 -15613 3163 16446 -686 -12997 456 192
903A92j6164P791J8518R92j1693j4882k584K0038R273j7593j081J5761j0410j7809
$$ 192 -15972 -8181 10337 11329 -364 -15246 -17830 2208 11481 -6112 -7193 8568 -1842 -19651
917a9651P595J7435P266q413j9818k122K1350J917j7522Q155J8122j2303j9466
$$ -19651 -12056 5379 12645 4232 -15586 -17708 3642 5559 -11963 -3808 14314 2011 -17455
930a7455J987J5518J5751n075k3158K73K1723n073j7265J3325J8926q593j8915
$$ -17455 -15468 50 15801 10726 -12432 -12159 9564 4491 -12774 551 19477 10884 -8031
943h031p354J3734K2494m188k4982L835K0752j1308j7340J3280J8888j355j8024
$$ -8031 -15385 -1651 20843 16655 -8327 -4492 16260 4952 -12388 892 19780 18425 401
956D01j6819J1385K5877o461k4155Q710J7627j3332j7391P790J7915Q210j6384
$$ 401 -16418 -5033 20844 14383 -9772 -1062 16565 3233 -14158 -6368 11547 19757 3373
969C373k3492R726K5917p589k0384J0375J4732j1285j5518J95J6297J6071j3190
$$ 3373 -20119 -10393 15524 7935 -12449 -2074 12658 1373 -14145 -13950 2347 18418 5228
982E228k5635R033K2326r455j3448J0794J0798n618j3527p624J4409K0705j1829
$$ 5228 -20407 -11374 10952 1497 -11951 -1157 9641 4023 -9504 -17128 -2719 17986 6157
995F157k1943Q351J5187r369p709R537P848j112j2788j1511J3604J9818j0919
$$ 6157 -15786 -7435 7752 -1617 -9326 211 8059 6947 -5841 -17352 -3748 16070 5151
1008E151j5408R500O704r847l290O924Q025L587j3450j4465J5064J5156j1491
$$ 5151 -10257 -757 5947 -3900 -7190 -266 7759 11346 -2104 -16569 -1505 13651 2160
1021B160p408J0748K97r647k714L966J1299O203j6204j2232J4811Q323j1901k55
$$ 2160 -5248 5500 5797 -3850 -6564 -2598 8701 14904 -1300 -13532 1279 9602 -2299 -2554
1035b554J1411k115j0197n272K328J5008N184j8573p487J5444O34j2727M431J1531
$$ -2554 8857 6742 -3455 -8727 -6399 8609 13793 -4780 -12267 3177 3811 -8916 -4485 7046
1049G046k72q898j1483K231J9526L754k0204k297J5998l754j2536L378J1895O060
$$ 7046 6774 -2124 -13607 -11376 8150 11904 -8300 -10597 5401 1647 -10889 -7511 4384 10444
1063A0444p734j7910J359K3749J320j9451J910J4470n135j1530m37J0751J3653
$$ 10444 2710 -15200 -13841 9908 11228 -8223 -6313 8157 3022 -8508 -8945 1806 15459
1076A5459o496k3486J468K4006o23j6910M113J1692k641j0814p273J0034K0470
$$ 15459 8963 -14523 -13055 10951 10328 -6582 -2469 9223 6582 -4232 -11505 -1471 18999
1089A8999o046k5217J753K0186k505j2536M160R293J517j0598j4350R641K3601
$$ 18999 12953 -12264 -10511 9675 7170 -5366 -1206 8087 9604 -994 -15344 -5703 17898
1102A7898m803k3133K699J4710m318p685K263Q217O369j0493j8813Q346K3745
$$ 17898 13095 -10038 -7339 7371 3053 -4632 -2369 5848 12217 1724 -17089 -8743 15002
1115A5002m495j6704K252P848l494n293p26Q187J1726j0336k0633P222J8312l542
$$ 15002 10507 -6197 -3945 3903 409 -4884 -5610 2577 14303 3967 -16666 -9444 8868 5326
1129E326r511L847K355k477m669m490R714J4965j1452j7576N987J1360l138k056
$$ 5326 -4185 -338 2017 -460 -5129 -9619 95 15060 3608 -13968 -7981 3379 241 -1815
1143a815L423Q55k058p129o256J2069J4504j0790j2678N955M102m963K289M784
$$ -1815 1608 2463 405 -6724 -12980 -911 13593 2803 -9875 -3920 182 -4781 -2492 2292
1157B292K734l98j1636p947J4646J1646r892o670P108k276o083J825M825P928
$$ 2292 5026 4628 -7008 -14955 -309 11337 1445 -5225 1883 -393 -6476 -4651 174 8102
1171H102J589j6526p903J5647P195r739L23P144l842p151k862M872J4809K251
$$ 8102 9691 -6835 -14738 909 8104 -1635 -1312 5832 1990 -5161 -8023 -3151 11658 13909
1185A3909j9747n812J5271J833q255K898P918l00q104j0112M015J9454L233j9441
$$ 13909 -5838 -11650 3621 5454 -2801 97 8015 7715 -389 -10501 -6486 12968 16201 -3240
1199c240l695J2061j026p696K854Q157N597p839j7421J687K2467L292j6858j769
$$ -3240 -6935 5126 4100 -3596 -742 7415 13012 5173 -12248 -10561 11906 15198 -1660 -3429
1213c429Q811k076o831j531P561J2083n473k1794m95K0317J546j1516M91N484
$$ -3429 5382 3306 -3525 -5056 2505 14588 9115 -12679 -13174 7143 8689 -2827 -2336 3148
1227C148j175p278o334O878J7700l718k1548j015J4440O08n752J466L072J940
$$ 3148 1973 -5305 -11639 -4761 12939 9221 -12327 -13342 1098 1706 -4046 -2580 492 2432
1241B432o517j2178O580K0471k838j7440m3Q067p54k363J118L774O413o691j5853
$$ 2432 -4085 -16263 -9683 10788 7950 -9490 -9533 -1466 -2220 -4583 -3465 309 6722 31 -15822
1256a5822O093J8441j790j0863J367K586k810o7k15N412R544p877j5878N393J3655
$$ -15822 -9729 8712 6922 -3941 -2574 12 -2798 -2865 -3080 2332 11876 3999 -11879 -6486 7169
1271G169k454l885L117r96k872j959k822Q745R987r035j2719O110O384m343J365
$$ 7169 4715 830 3947 2951 79 -1880 -4702 4043 14030 4995 -7724 -1614 4770 427 1792
1286A792M113l02k560n842m972J1515R813j0335p319N807J004n611J560N058L444
$$ 1792 5905 5603 3043 -2799 -7771 3744 13557 3222 -4097 1710 2714 -2897 -1337 3721 7165
1301G165m38j1474o172J3619Q278j0392l867O798j537o071j227M251R186R45j5646
$$ 7165 6727 -4747 -10919 2700 10978 586 -3281 3517 1980 -4091 -5318 -1067 8119 9064 -6582
1316f582n801J4414N239j0333j65N919k99n544n428J944J3810L084j7048n039
$$ -6582 -12383 2031 7270 -3063 -3228 2691 2392 -3152 -8580 -6636 7174 10258 -6790 -11829
1330a1829J2886L053q801O81N609K555l919j0925O32J6923L393j5639l105R177
$$ -11829 1057 4110 -4691 -4010 1599 4154 235 -10690 -10058 6865 10258 -5381 -8486 691
1344F91J338n398j444L962P864k860j4602p66J7245L352j2786j896O667N02l015
$$ 691 2029 -3369 -4813 -851 7013 4153 -10449 -11215 6030 9382 -3404 -5300 1367 1869 -1146
1359a146m155L007J1043q49j7246o05J4523K295q541j357L610J872k185o586K421
$$ -1146 -5301 -2294 8749 7900 -9346 -9951 4572 6867 -1674 -3031 579 2451 266 -6320 -3899
1374c899J3367j436j5614m5J1047L91l686o78J087L877k244q932L168J3573k557
$$ -3899 9468 8032 -7582 -7627 3420 3811 125 -553 534 4411 2167 -6765 -3597 9976 7419
1389G419j1563R09O320n25j138p10N63N363l509j0071M557J2322l967q057K576
$$ 7419 -4144 -3235 3085 2560 1422 712 1275 6638 3129 -6942 -2385 9937 5970 -2087 489
1404D89J524p60m22j510K582N572n929r914O434Q340m694l581K326l43r58j267
$$ 489 2013 1253 831 -679 1903 7475 1546 -8368 -1934 6406 1712 -1869 457 114 -844 -2111
1420b111k318N119O246q866p919P655M910n162k90K036QN06n079l280J0605N388
$$ -2111 -4429 690 6936 -1930 -9849 -2194 2716 -2446 -2736 -700 -692 -186 -5265 -8545 2060 7448
1436G448j1130n758Q127K913m045q34J311M111Q32r630k766J3011N278j1523m482
$$ 7448 -3682 -9440 -1313 1600 -2445 -3279 -1968 2143 2975 -6655 -9421 3590 8868 -2655 -7137
1451g137P013K241k094k841M94P488J028j2590l200J3914M842r368l605L993K010
$$ -7137 -124 2117 23 -2818 -2324 5164 6192 -6398 -9598 4316 9158 -210 -3815 178 2188
1466B188l36n371L36J0371J769j4241l979J2489M178n971k769Q99L328Q65q158
$$ 2188 1852 -3519 -3183 7188 8957 -5284 -9263 3226 7404 1433 -1336 -437 2891 3756 -4402
1481d402k03J2748J759j3301l645Q092L862j803l385m57N060O00j1422O34J3395
$$ -4402 -4605 8143 9902 -3399 -7044 1048 4910 3107 -278 -735 4325 4925 -6497 -5863 7532
1496G532J571j0957l115M092K830P85l498o08O718j359j1307R11J1982Q52o745
$$ 7532 9103 -1854 -4969 -877 1953 2738 -760 -1368 5350 3991 -7316 -6405 5577 6429 -316
1511c16k419k4K338J403l686R73Q351k778j1264J109R309J7k250j396j633K647
$$ -316 -2735 -2759 -421 982 -2704 -1731 6620 3842 -7422 -6313 2996 3013 763 -633 -2266 381
1527C81m69n063M256Q801n046r413K548M623N06K7p22n02J935l199o653P236Q468
$$ 381 -88 -5151 -895 7906 2860 -6553 -4005 618 1124 1151 429 -73 1862 -1337 -7990 -754 7714
1544G714n818o649J880J125N58N42n68K195L223p680o843Q953P493n259m209J338
$$ 7714 1896 -4753 -2873 -1748 -1190 -648 -1216 979 4202 -3478 -10321 -1368 6125 866 -3343 -2005
1560b005K75J156j687j421O567L642r675o271P755O250l622j617j64J743O75n105
$$ -2005 -1730 -574 -2261 -3682 2885 6527 -3148 -9419 -1664 4586 964 -653 -817 926 1601 -3504
1576c504j746R983N512j1282o434P110M711k012j747l0L187J358r204k759J2651
$$ -3504 -5250 4733 10245 -1037 -7471 -361 4350 2338 591 561 3748 5106 -4098 -6857 5794
1591E794N469r860n698L672L488M38l007p00O199J432j1387l934J1578N051o250
$$ 5794 11263 1403 -4295 -623 2865 3303 296 -404 5795 7227 -4160 -8094 3484 8535 2285
1606B285m496N58K800J748m775j589R536J399j2028m576R444M515k720l574j503
$$ 2285 -2211 -1653 1147 2895 -1880 -3469 6067 7466 -4562 -9138 306 4821 2101 -1473 -2976
1621b976K815K093p248p78J0869K196j0695l263M801L297P52l088j703M071L87
$$ -2976 -161 1932 -5316 -6094 4775 6971 -3724 -6987 -2186 1111 1863 -1225 -2928 1143 1530
1636A530q247L6J0551J340o970k679R68K735J844k434j013N052m00q824R53R096
$$ 1530 -6717 -6681 3870 5210 -1760 -4439 -3471 -736 1108 -1326 -2339 2713 2313 -6511 -5558 3538
1652C538K93l988j781l68J746J507k839Q20O281k738q126K035N929L59j601p23
$$ 3538 3831 -157 -1938 -2306 -560 947 -1892 -1072 5209 2471 -5655 -3620 2309 2668 1067 344
1668C44r08J762j070m499M145P430m364p232K135L210K94l18n76L81K288l242
$$ 344 -564 1198 128 -4371 -226 7204 2840 -4392 -2257 953 1247 929 353 734 3022 -220
1684b20n221O356O167m462n410J993J325R54n85k187L582L607o707o348O985O395
$$ -220 -5441 915 7082 2620 -2790 -797 528 1482 897 -1290 2292 5899 -808 -7156 -171 6224
1700F224l686m151N18J535J323k465k532N522N202q413n905O185M886k152k984
$$ 6224 2538 -1613 -1095 440 1763 -702 -3234 2288 7490 -923 -6828 -643 4243 2091 -893
1715h93q83K056K637m887l793Q413M679p808n832M745L867j44k711j931L355L314
$$ -893 -1776 280 2917 -1970 -5763 2650 7329 -479 -6311 -1566 2301 2157 -554 -2485 870 4184
1731D184p344l810Q122N216o214m493J508K857J794k673l192N200L427q072l996
$$ 4184 -3160 -6970 1152 6368 154 -4339 -2831 26 1820 -853 -4045 1155 4582 -3490 -7486
1746g486P619M212l741l822j59K376K570l275k974O253K271p369k911N716L044
$$ -7486 133 4345 604 -3218 -3377 -1001 1569 -1706 -4680 1573 3844 -3525 -6436 -720 2324
1761B324j066k615j688K718K614m372j229O524J321o293j793L268K135J083k459
$$ 2324 1258 -1357 -3045 -327 2287 -2085 -3314 3210 4531 -1762 -3555 -287 1848 2931 472
1776D72k158L923P02n061L14O317o3m489q20J205J369J477k733o49L924p98n738
$$ 472 -1686 2237 2939 -2122 -1808 4509 4446 -43 -863 342 1711 3188 455 -194 3730 2932 -2806
1793b806J084N575j118k776p97P44R70R19l259Q91M815l059n576K894M233q84
$$ -2806 -1722 3853 2735 -41 -838 -94 876 1795 -1464 -573 4242 1183 -4393 -1499 2734 1850
1809A850k565o44j62K014n69l310K985N051m227n175K405L688P7j898j898R00
$$ 1850 -715 -1359 -1521 493 -76 -3386 -401 4650 423 -4752 -2347 1341 1418 -480 -2378 -1478
1825a478L627k811m152M106N601m687m372J530K966J229j582k875K549L370m345
$$ -1478 2149 -662 -4814 -708 4893 206 -4166 -2636 330 1559 -23 -2898 -349 3021 -1324
1840a324m829N790M657l486l888j72K458K968j909l994M290M083n938l958M662
$$ -1324 -6153 -363 4294 808 -3080 -3252 -794 2174 265 -3729 561 4644 -1294 -5252 -590
1855e90M574j357l686k466L464L723l614l599N387L048n338l462K498L991J074
$$ -590 3984 2627 -1059 -3525 -61 3662 48 -3551 1836 4884 -454 -3916 -1418 2573 3647
1870C647l618l109L520L544m522l018N123L058l911l864J218K670L081l220l657
$$ 3647 29 -3080 440 3984 -538 -3556 1567 4625 714 -3150 -1932 738 3819 599 -3058
1885c058L220K678m345j943M550K205j919l122j616K966L316k584k428L584J023
$$ -3058 162 2840 -1505 -3448 1102 3307 1388 -1734 -3350 -384 2932 348 -2080 1504 2527
1900B527n021J57L724Q44k66k148k866K507K951k600j300M378k97m466k58K470
$$ 2527 -2494 -2337 1387 2231 1965 -183 -3049 -542 2409 -191 -1491 2887 2590 -1876 -2134 336
1916C36J264P44k146k836L342L62l046P68M618j507l694l96J081J762J123k687
$$ 336 1600 2344 198 -2638 704 1066 -1980 -1212 3406 1899 -1795 -2191 -1110 652 1775 -912
1932i12p72K691j449l935K685M724j883l102p60J97K533J133l111P83L676k997
$$ -912 -1684 1007 -442 -4377 -1692 3032 1149 -1953 -2713 -2516 17 1150 -1961 -1178 2498 -499
1948d99m461L281M327q14k191j484J45L376o53l703L027L692l255m483K043L362
$$ -499 -4960 -1679 2648 1834 -357 -1841 -1696 1680 1027 -2676 351 4043 788 -3695 -1652 1710
1964A710J275j305l341K71L964k004l634M283M154l976l956j54L053L170j096
$$ 1710 2985 1680 -1661 -1390 2574 570 -3064 1219 5373 1397 -2559 -2713 340 3510 2414
1979B414m471J364M088l689l680M766L400j579m157j499K064L548j052l529K391
$$ 2414 -2057 -693 3395 -294 -3974 792 4192 2613 -1544 -3043 -979 2569 1517 -2012 379
1994C79K828m206l226L847K912L05k711l646K038L351j696k791L794K193l818
$$ 379 3207 -999 -4225 -378 2534 2839 128 -3518 -1480 1871 175 -2616 1178 3371 -447
2009d47k860J739K674J677j998l369J350K962k404j849L721J718k501k726K09
$$ -447 -3307 -1568 1106 2783 785 -2584 -1234 1728 -676 -2525 1196 2914 413 -2313 -2104
2024b104J577K810j563k880K199J535k822r22L415J134j431j789j445J722K348
$$ -2104 -527 2283 720 -2160 39 1574 -1248 -2170 1245 2379 948 -841 -2286 -564 1784
2039A784q54k229L205k87l651q3L197J038o46j387k173K129J389j983j90L289
$$ 1784 930 -1299 1906 1619 -2032 -2115 1082 2120 1474 87 -2086 43 1432 -551 -741 2548
2055B548p07l697p4K289J012J75j778r90K465o48k907J059L691r70l057m26J342
$$ 2548 1841 -1856 -1930 359 1371 1546 -232 -1222 1243 595 -2312 -1253 2438 1468 -1589 -2015 -673
2072f73J587M31k324k22K908k014l046J718L913q85j937q91k37K616K90k905R11
$$ -673 914 1345 -979 -1201 1707 -307 -3353 -1635 2278 1393 -544 -1435 -1672 944 1234 -1671 -760
2089g60L174k545l340K135L045K56j613k543Q25K788k89l106K082L297k438l433
$$ -760 2414 -131 -3471 -1336 1709 1965 352 -2191 -1366 1422 1133 -1973 109 3406 968 -2465
2105b465R11K584J703j405l108O42L516j892l316K744L372j843k518p13J651K485
$$ -2465 -1554 1030 2733 1328 -1780 -1138 2378 486 -2830 -86 3286 1443 -1075 -1788 -137 2348
2121B348o77l985J619L196k250l678L043K761q85j812j902R91L045m43l400R10
$$ 2348 1671 -2314 -695 2501 251 -3427 -384 2377 1492 -320 -2222 -1231 1814 1371 -2029 -1119
2137a119L542k948j967K065J372J66q30l014J640L127j364l015K526R50j716n17
$$ -1119 2423 -525 -2492 -427 945 1111 281 -2733 -1093 2034 670 -2345 181 1131 -585 -1102
2153a102K65J358Q17j157k186J556K135k258j181K575P24j855j394PJ604K215
$$ -1102 -837 521 1338 181 -2005 -449 1686 -572 -1753 822 1546 -309 -1703 -1696 -92 2123
2169B123j903j881J734Q94k376l3K721q57n37r21j43J176J286r91j713K951l41
$$ 2123 220 -1661 73 967 -1409 -1442 1279 422 -115 -1036 -1179 -3 1283 292 -1421 1530 1189
2186A189k981M52K491q5p00j324k84J478J293k924M91K699j378k056K54J525J054
$$ 1189 -1792 -1340 1151 1066 366 -958 -1242 236 1529 -1395 -904 1795 417 -1639 -1385 140 1194
2203A194m35k020j97K281Q93l499J121K950j393j904J44R06J673M2l283L32K924
$$ 1194 759 -1261 -1458 823 1716 -1783 -662 2288 895 -1009 -865 41 1714 1756 -1527 -1195 1729
2220A729l20l012J202K541o54j398j885Q79K784N66l893N27L129j175k895J760
$$ 1729 1409 -1603 -401 2140 1486 88 -1797 -918 1866 2432 -1461 -934 2195 1020 -1875 -115
2236a15J329N82j292k594O79L648k41l853J133K827j992k305N53K041J293j358
$$ -115 1214 1796 504 -2090 -1411 2237 1996 -1857 -724 2103 111 -2194 -1641 400 1693 335
2252C35k743N01L731j302k257P19J811n67j974rJ034K191l34l542O02K906j212
$$ 335 -2408 -1907 1824 522 -1735 -1016 795 228 -1746 -1755 -721 1470 1136 -2406 -1804 1102 -110
2269a10j355J468J236j279q28j333R94L774j016l247P09K151j828l53J367L68
$$ -110 -1465 3 1239 -40 -868 -2201 -1207 2567 1551 -1696 -987 1164 -664 -1017 350 718
2285G18L19q75k053J134L086j510j886J588J55r68m72J468O01Q18j260k028J335
$$ 718 1037 162 -1891 -757 2329 819 -1067 521 676 -292 -764 704 1305 2123 863 -1165 170
2302A70J881k153J88J547q88j063j08K8J193J141j270k120J964J010k464L90K261
$$ 170 2051 -102 86 1633 745 -318 -426 -398 795 1936 666 -1454 510 1520 -944 -554 1707
2319A707q04q62j145q65K983Q30k372o43J694k43k029M32K214J96j095j898k60
$$ 1707 903 41 -1104 -1969 1014 1844 -528 -1171 523 280 -1749 -1317 897 1093 -2 -1900 -2160
2336b160K785R97k916l09K564m84k684J015J352N88l72k057o68L405j60k531R77
$$ -2160 625 1622 -1294 -1603 961 477 -2207 -1192 160 748 376 -1681 -2349 1056 896 -1635 -658
2353f58K223j062k111J12R51J875J29k992r7K586k34j869M80K855j040j926j149
$$ -658 1565 503 -1608 -1496 -545 1330 1459 -1533 -1630 956 722 -1147 -667 2188 1148 -778 -1927
2370a927R11K783M36l512J34K428r81j544J156P30O62m06k684K73K731R27l364
$$ -1927 -1016 1767 2203 -1309 -1175 1253 272 -1272 -116 614 1276 870 -1814 -1541 1190 2117 -1247
2387a247J075R02j091l51m1R83J332j10l315J36L469m88j831J232O54r60p78q29
$$ -1247 -172 730 -361 -712 -753 230 1562 1452 -1863 -1727 1742 1254 -577 655 1309 349 -429 -1258
2405a258J304K200j155k645P31J886p79o70J263K97p43l45j346J014K255r72k007
$$ -1258 46 2246 1091 -1554 -823 1063 284 -386 877 1174 431 86 -1260 -246 2009 1037 -970
2422i70Q88R35j456o9J335l42J48r16j109J150J632p05j087P35l2j319L47L86
$$ -970 -82 853 -603 -672 663 321 469 -447 -1556 -406 1226 521 -566 169 137 -1182 -835 -449
2440d49R40N48j313j633J308J107j272n38J898K5j461o69O48J193O32j365r56
$$ -449 491 1039 -274 -1907 -599 508 -764 -1302 596 621 -840 -1509 -861 332 964 -401 -1357
2457a357J132Q92k344R99J764k68p46j223p28K814O45j871r38J986k01j565N98
$$ -1357 -225 667 -1677 -678 1086 818 72 -1151 -1879 935 1580 -291 -1229 757 556 -1009 -411
2474d11J314P20q77j612r45L562M17k498N1K091o70j891K73L57J624O2k239o34
$$ -411 903 1623 746 -866 -1811 1751 2168 -330 -279 1812 1142 -749 -476 -119 1505 1567 -672 -1306
2492a306K848J99k313N49J202M69j474j010J86K507K15l396J9K720n63j827R4
$$ -1306 1542 1741 -572 -23 1179 1648 174 -836 -650 1857 2072 -1324 -1305 1415 852 -975 -881
2509h81J857J7j193j301o0L031J27l198L69J703n41o44M6M11Q58l27j918l12K512
$$ -881 976 993 -200 -1501 -1561 1470 1597 -1601 -1232 471 -70 -714 -668 -257 601 274 -1644 -1956 556
2528E56j01j988J008R20j027j03j61N81J582l61k931J066J791r46k19Q41m9o7
$$ 556 455 -1533 -525 395 -632 -735 -896 -315 1267 906 -2025 -959 832 -114 -333 508 459 392
2546C92n61o69J108J105p12k349J367J250n79q84N07O65m45l60o40K33J984p07
$$ 392 -169 -838 270 1375 663 -1686 -319 931 352 -532 -25 640 195 -165 -805 -572 1412 705
2564G05k052J464L80j126L62P79l60M72k20j444J290J236j451n45J479k71r52
$$ 705 -1347 117 497 -629 -267 512 152 624 404 -1040 250 1486 35 -510 969 698 -254
2581b54j46M91N75K50j276j373K441J266k491j56J054N47j067q73O10J095J150
$$ -254 -400 91 666 916 -360 -1733 708 1974 -517 -673 381 928 -139 -1012 -402 693 1843
2598A843k682q27J971M29j615m98J358J13j64o39q00K214J069k827m39J777K31
$$ 1843 -839 -1666 305 734 -881 -1379 -21 92 -72 -711 -1511 703 1772 -1055 -1494 283 514
2615E14j040P9R0J143j19j606n37K257J313k729q04J994J16j236J45M97J81R58
$$ 514 -526 -447 -357 786 667 -939 -1476 781 2094 -635 -1439 555 671 -565 -420 77 258 1216
2633A216k529l38K810k20j677q0R65l17p8p31NJ726O56k590oJ746rj117Q1P07
$$ 1216 -1313 -1651 1159 939 -738 -818 147 -170 -248 -979 -974 752 1408 -1182 -1188 558 549 -568 -487 220
2653B20k64K23j480M83J357J208k562l63J426L52p78R22l66L73m28p11o10K342
$$ 220 -44 179 -1301 -818 539 1747 -815 -1178 248 600 -178 744 378 751 323 -388 -998 1344
2671A344K43j590j10K57M27o47L83o51J142m66j423P87J899j109j045J085J6j215
$$ 1344 1587 -3 -113 144 571 -76 307 -344 798 332 -1091 -304 1595 486 -559 526 542 -673
2689f73J082o47M07O01r64j303J185N66k55o11O26m56L16l34m45O91J314j436
$$ -673 409 -238 169 770 -194 -1497 -312 254 -1 -612 14 -442 -126 -460 -905 -214 1100 -336
2707c36j313J541K56l3n42M00L41m05j06j429K219J208j713j294J064M04p85O60
$$ -336 -1649 -108 148 115 -427 -27 314 -91 -197 -1626 593 1801 88 -1206 -142 262 -523 137
2725A37L6O2J015j842j191K268M98r88k87K54k68L58o8o59J330J254k204j047
$$ 137 173 235 1250 -592 -1783 485 983 -5 -292 -38 -306 52 -16 -675 655 1909 -295 -1342
2743a342J673P77r93j68O18l5M36j227o98K011Q84k109o67J609m8r99K01J31Q49
$$ -1342 331 1108 115 -53 565 530 966 -261 -959 1052 1936 -173 -840 769 721 -278 -77 54 903
2762I03n0j209p17K328M98k556j36J086L10k56J0p40R37N18j964n04J783M52j306
$$ 903 853 -356 -1073 1255 1753 -803 -939 147 457 201 211 -529 408 926 -1038 -1542 241 693 -613
2781f13l1K08RK12n70K24J376r2j957P5J518L8o13P2L17o51J29j75j69K198o39
$$ -613 -644 -436 -427 -215 -785 -561 815 723 -1234 -1159 359 397 -216 -144 173 -478 -349 -524 -693 1505 866
2802H66j473k9P16L31k02k9j57qL18j463L28J447k50q52J63R85q06J31J04O4N31
$$ 866 -607 -636 80 411 209 180 23 15 333 -1130 -802 645 395 -457 -294 691 -115 16 120 184 715
2823G15j024r74R39R24n78n77L80M00Nj96m94P34J189o78k099J304O79o58o65
$$ 715 -309 -1283 -344 580 2 -575 -195 205 210 14 -480 254 1443 765 -1334 -30 649 -9 -674
2842f74J380n17l0m99l63P42J590j505j232J286K41n72n88Q54q6K29k98j211J078
$$ -674 706 189 159 -340 -703 39 1629 124 -1108 178 419 -153 -741 113 27 256 -42 -1253 -175
2861a75J793k205N7O38O41o59l96J39O71M82o95j412J583P04j500k38R70k5q08
$$ -175 1618 -587 -530 108 749 90 -306 -167 504 986 291 -1121 462 1166 -334 -572 398 373 -435
2880d35N16o69Q17P82j196q72J466N45j438J15P3L10O99j319n69J603R69j752
$$ -435 81 -588 229 1011 -185 -1057 409 954 -484 -369 -296 14 713 -606 -1175 428 1397 -355
2898c55m97J043K9k16J76n99K72R51j413n85J737K69j567L43N10L83M0o20n40
$$ -355 -852 191 220 4 180 -419 -147 804 -609 -1194 543 812 -755 -412 98 481 521 -99 -639
2917f39P91M74j377O2J225q2k53l59l23O69K90n50l16J261j98j571O85Q63n18
$$ -639 152 626 -751 -689 536 454 201 -158 -481 188 478 -72 -388 873 675 -896 -211 652 134
2936A34L94j90L3k61N02j113M3J553n37o48J31N28q75P90k68n09O10o84k53O03
$$ 134 528 338 371 110 612 -501 -458 1095 558 -90 41 569 -306 484 216 -293 317 -367 -620 -17
2956a7P72q35k69K50Mm8L5l19J53Q98r08l80L83O18q43j51N35K0j58J12n48M96
$$ -17 755 -80 -349 -99 -95 -143 -108 -427 -274 624 -284 -664 -281 337 -506 -657 -122 -102 -260 -148 -696 -200
2978b00J041j318k84P34Q09o47j04j15L2O21m68p43N62P95o55r84R57P62o15O4
$$ -200 841 -477 -761 -27 782 135 31 -84 -52 569 101 -642 -80 715 60 -924 33 795 180 244
2998B44n2J18Q27j123j163J324J103j218o01P37M26l2j032k90J481J14q48j142
$$ 244 192 310 1137 14 -1149 175 1278 60 -541 196 622 590 -442 -732 749 863 15 -1127
3016a127K021J44p59k98l83M59K85J52j257P94R88j014j338J375P23j153J45n3
$$ -1127 894 1038 279 -19 -402 57 342 494 -763 31 1019 5 -1333 42 765 -388 -243 -296
3034b96J42M49m26l86P49P84j183k22K72J07J65jo83M26Q8p63K14Q75k09r86M42
$$ -296 -154 295 -131 -517 232 1016 -167 -389 -117 -10 155 154 -529 -103 -15 -778 -564 311 102 -884 -442
3055d42J56j64M60k87J8M81K62j134L06J316o25m87K85m16J25N25p51N95P16p51
$$ -442 -286 -450 10 -277 -259 222 484 -650 -344 972 347 -140 145 -271 -146 379 -372 223 939 188
3075A88l96n19J104M6m05L7j64K81N16j116O09M19k64j301O89RN33k17k99J45
$$ 188 -208 -727 377 423 18 55 -109 172 688 -428 181 600 336 -965 -276 -267 266 49 -250 -105
3095a05M17L0o51M50J102j187q49M61MQ58p26K40j93Q89m96j098J080M73p11l89
$$ -105 312 342 -309 141 1243 56 -793 -332 -328 530 -196 44 -149 740 244 -854 226 699 -12 -401
3115d01J68Q56q9J07p97J39R52j284q78J396N01j14n00m58L3N60J39j390J402
$$ -401 -233 623 534 641 -156 -17 935 -349 -1227 169 670 556 56 -402 -369 191 330 -1060 342
3134C42O53j010o85N33O47m23k20k30Q33k33k58n14O15J039q61q28M19N37J5K59
$$ 342 995 -15 -700 -167 480 57 -163 -393 440 207 -51 -565 50 1089 228 -600 -181 356 371 630
3154F30j467R85L58o32q49R94M17o95Q8j007J363n05K34m13N66M67q00p97J296
$$ 630 -837 148 506 -126 -975 19 436 -259 -171 -1178 185 -320 -86 -499 67 534 -266 -1063 233
3173B33q8J08k33j50p9J41k55n81J012N42r32L55M32j52J52j83l26j31R04q96
$$ 233 145 253 20 -130 -209 -68 -323 -904 108 650 -282 73 505 353 505 322 -4 -135 769 -127
3193a27j66J039o43m43K82R7L01M13r36m6O38R1j124M21O90j70o69L10J42J46
$$ -127 -293 746 103 -340 -58 39 340 753 -183 -229 409 500 -624 -203 487 317 -352 -42 100 246
3213B46n27j03jN92K83j515P48O46O4n68n7l09L38N09q66L25N30k37j266N53J105
$$ 246 -281 -384 -385 207 490 -1025 -277 369 433 -135 -192 -501 -163 346 -520 -195 335 98 -1168 -615 490
3234D90p66K75q2j17K71k76l28Q47M28q39K7j67R67n78k2k19q0Q17r62m17R99
$$ 490 -276 -1 -83 -200 71 -205 -533 314 742 -97 -70 -237 730 152 130 -89 -169 648 -314 -731 268
3255B68L03l88p56O87J04M1L7m94J08O43j037l31R10O98q23J14n00K40Q76o45
$$ 268 571 183 -573 114 218 259 296 -198 -90 553 -484 -815 95 793 -30 84 -416 -176 700 55
3275E5p45M43Q20q37j00R2J14M16K55q99J96R90l81q99P55M91r84K00P6m51J470
$$ 55 -690 -247 573 -264 -364 -272 -158 258 513 -386 -190 800 419 -480 275 766 -218 -18 58 -393 1077
3296A077q94j95N2M74n44o45R19J8j60j16q9j18P67l56o85M84K41k71k88N74K50
$$ 1077 183 -12 40 514 -30 -675 244 262 102 -14 -103 -221 546 190 -495 -11 230 -41 -329 245 495
3317D95p78O4OM1M44m52M2O93l75o62N29m3P9K15o17k64P21l54j18j34P90q12
$$ 495 -283 -219 -213 -172 272 -180 -138 555 180 -482 47 4 83 298 -319 -583 138 -216 -334 -468 322 -490
3339d90l65J95Q37M2k17k8k36J70M42m92k01L94J84m52K95l86P14K24o91Q1M80
$$ -490 -855 -660 177 219 2 -26 -262 -92 350 -142 -343 51 235 -217 78 -308 406 630 -61 20 500
3360E00l36m29p3P57l03k48n93R14L89m92l43j95J025m12p38M83Q57o14k2j77
$$ 500 164 -265 -338 419 116 -132 -725 189 578 86 -257 -452 573 161 -577 -94 763 149 127 -50
3380e0k35Q15K03n96j21P10n36r57O97j53R4R4j14Q6R83j201n15L86M23N48p91
$$ -50 -285 530 733 137 16 726 190 -767 -70 -223 -129 -35 -149 -63 920 -281 -796 -410 13 561 -230
3401b30K46k55O49k33m83l34J260m33o40L10N63l62m27L07r2L21K57j158P15K24
$$ -230 16 -239 410 177 -306 -640 620 187 -453 -143 420 58 -369 -62 -154 167 424 -734 -19 205
3421B05j30o92R14J49l57m25l50P29j02J06k42m3N73l25k95O09n29j43R21p47
$$ 205 75 -617 297 446 89 -336 -686 43 -59 47 -195 -238 335 10 -285 324 -205 -348 573 -174
3441a74J73N1k18o4J22P41l45j90n2K71K64k03o21M46L10o32Q8O04n05J68K6n29
$$ -174 -1 50 -168 -232 -110 631 286 96 44 315 579 376 -245 201 511 -121 -33 571 66 234 260 -269
3463b69O61m1L3p49Q62p9n46J92J68K06j45m0o67K57j55j05K55Q06o69m33L64
$$ -269 392 351 384 -365 497 418 -128 64 232 438 293 253 -414 -157 -312 -417 -162 644 -25 -458 -94
3484i4k22L88L41o39j26M08K89r22K13J050p98l51O04o37O73j84l45R5O55o6p25
$$ -94 -316 72 413 -226 -352 56 345 -577 -364 686 -112 -463 141 -496 177 -7 -352 -257 398 332 -393
3505c93P01k33O65n89j5n6L4K47m08L12o3k3m69J29N35j82pm86r0N09jj84l69
$$ -393 308 75 740 151 136 80 114 361 -47 265 202 179 -290 -161 374 192 185 -301 -391 118 117 -67 -436
3528d36J034N2q79j31J60N95m0p92K67O77m62k57O9K32K12l24k66K77R5K03q13
$$ -436 598 650 -229 -360 -200 395 355 -437 -170 507 45 -212 -143 89 301 -23 -289 -12 83 286 -527
3549e27L37O09l93j45M00M81p52P2o60P80K76O2o83o7K37j35L13o6L61k34j48
$$ -527 -190 419 26 -119 281 762 10 82 -578 202 478 540 -143 -210 27 -108 205 139 500 266 118
3570A18l83k14Q46j83l83J73Q93j155j4N58l66lK97n29K62k32L37qL55k85J40
$$ 118 -265 -479 367 184 -199 -26 867 -288 -302 256 -110 -113 184 -345 -83 -315 22 14 369 84 224
3591B24n5m45K96K7qm73P40l98K8K53P4M17r23M6J17L23m8o00K14N10j13l49l00
$$ 224 169 -276 20 47 39 -434 306 -92 -64 189 263 680 -243 -197 -80 243 195 -405 -191 319 206 -143 -443
3614d43R49l91M81o02j70N7K47j71K37m5p8L0l8n59P29o9j09j94K94Nl16n8N34
$$ -443 506 115 596 -6 -176 -119 128 -43 194 149 71 101 63 -496 233 164 55 -139 155 160 -156 -214 320
3637C20l83R2m3Q2J67J31r4K3J56j92n62M59J72j96p7l53Q6J62M46r31l6P66k06
$$ 320 -63 29 -14 68 235 366 272 295 451 259 -303 156 328 132 55 -298 -212 -50 396 -535 -571 195 -11
3660a1l33M4j31J03N6N68m32J49K13n14M81R9o24L89m18M99Qq2p30N37L12o54
$$ -11 -344 -300 -431 -328 -272 296 -136 13 226 -288 193 292 -332 57 -361 138 146 64 -666 -129 183 -471
3682d71K32O45j88l88j54K50l20M11K04m57K14K03J23q32P75K21o55O75l94n43
$$ -471 -239 406 218 -170 -324 -74 -394 17 221 -236 -22 181 304 -528 247 468 -187 488 94 -449
3702d49N56L49m40P4J23M5k23l56m9M51k55j93M26M03n03l80R56j096O29r5J24
$$ -449 107 456 16 90 213 258 35 -321 -370 81 -174 -367 59 462 -41 -421 535 -561 68 -27 97
3723I7J45k59J5l01M08J85r38K76JP38l78k62J22q8L92L4n53N38N1n22K39L08
$$ 97 242 -17 -2 -303 105 290 -648 -372 -371 367 -11 -273 -151 -239 153 187 -366 172 223 -299 -60 248
3745B48j00k70J41j38O5p3j31k33L95M58m11L8j1K58k15j1L1M25Q3o52k63P60
$$ 248 148 -122 19 -119 -54 -127 -258 -491 -96 362 -49 -11 -22 236 21 10 41 466 549 -103 -366 394
3767C94l08k67O29m41N37n89K05m07N18k15l12N89M7k8n55J13K90o6j4k83J35
$$ 394 86 -181 448 7 544 -45 160 -247 271 56 -256 333 380 352 -203 -90 200 134 120 -163 -28
3788b8k19N66n60L31k18M6L50m19j8M95l43j26j51L29j9O7K67n9l91k9L66o7Q0
$$ -28 -247 319 -241 90 -128 -82 268 -151 -169 326 -17 -143 -294 35 16 83 350 291 -100 -129 237 170 250
3811B50l38j79M09pm08J73l58J52M67k76k49J77L37l09N9K9L09q5l78L28O9j45
$$ 250 -88 -267 142 135 -273 -100 -458 -306 161 -115 -364 -187 150 -159 -100 -71 238 153 -225 103 172 27
3833B7L26n84N61m01l39J29K59q9j51K40K73l75M02J49p38N91k47l58n3L5L75
$$ 27 353 -231 330 -71 -410 -281 -22 -111 -262 -22 251 -124 278 427 -311 280 33 -325 -378 -343 32
3854C2K27l01k8K1k4k15J30r6P0K43l01L00j44j11K5j63L31k3J45J23k35K17J55
$$ 32 259 -42 -70 -49 -73 -288 -158 -254 -184 59 -242 58 -86 -197 -172 -335 -4 -27 118 241 6 223 378
3877C78j34l28j4L28l03J84J1Q5r8K24m59J95k37L7k17K72O80j115N54l49M98
$$ 378 244 -84 -98 230 -73 111 122 207 109 333 -126 69 -168 -131 -348 -76 604 -511 43 -306 192
3898A92m87J09K91j07k83o7K54J83k14J07P1L74k06m8j42m7K96k14J78l36K15
$$ 192 -295 -186 105 -2 -285 -352 -98 85 -129 -22 49 423 217 169 27 -20 276 62 240 -96 119
3919A19j62r0K61j06J58j78kj69Q15l16l72k23Q4K72o25L33K60J06p4j43j28M15
$$ 119 -43 -133 128 22 180 2 0 -169 646 330 -42 -265 -181 91 -534 -201 59 165 91 -52 -180 235
3941B35l02J58p2m17K3J45L16m38k01R70n44J62K38M7l55l00J27k52Q09j88n42
$$ 235 -67 91 19 -398 -375 -230 86 -352 -553 417 -127 35 273 320 -35 -335 -208 -460 349 161 -381
3962c81O09J69p17J79O95m45J15m03O83o71Q9L0L3J0l15jL79j23k04l19P01J24
$$ -381 228 397 -320 -141 554 109 224 -179 504 -167 -78 -48 -15 -5 -320 -321 58 -65 -269 -588 113 237
3984B37o90K41K57o1J83j0l76J93k80L11J97o00L07K61k81L9J02l8j29J12N6j49
$$ 237 -453 -212 45 -16 167 157 -219 -26 -306 5 202 -398 -91 170 -111 -72 30 -8 -137 -25 31 -118
4006a18K67q8M54l80j18j60m5J33L83k22K02k09k6L28m38N5o2L21j99n44N87J6
$$ -118 149 61 515 135 17 -143 -188 -55 328 106 308 99 73 401 -37 18 -44 277 78 -466 121 137
4028A37j85j14N42m52j63N52m68r5N04l38j37M06k78j63J14l25L31J05L14j11
$$ 137 -48 -162 380 -72 -235 317 -151 -246 258 -80 -217 189 -89 -252 -138 -463 -132 -27 287 176
4048A76n50M99k67k00O86k59k70O85n77M73j71k85k79L03K7J78J19l97j43J71
$$ 176 -374 125 -142 -342 344 85 -185 500 -77 396 225 -60 -339 -36 -9 169 288 -109 -252 -81
4068h1J9m99N06r5J0K23j40j82M00m09M82k41j10j38P28m77J61k99m09M12K69
$$ -81 -62 -561 -55 -150 -140 83 -57 -239 161 -248 234 -7 -117 -255 473 -4 157 -142 -551 -139 130
4089A30l5p9k4J20Q5k50k68L31Lm2m12M06K39m13L86J31r5l42k78N8P08m0n48
$$ 130 95 16 -8 112 197 -53 -321 10 13 -29 -441 -35 204 -209 177 308 213 -129 -407 -349 359 319 -229
4112b29J57o22O95j44j63L07p0P9j84J59N2l76M58k72P3NL12J03k79K84j22l08
$$ -229 -72 -694 1 -143 -306 1 -69 10 -174 -15 37 -339 119 -153 -80 -75 237 340 61 345 223 -85
4134h5k46R84n04Ol32K25l8qn32K72J34K24O0j41J24k89L1j3k5M03j62k21M15
$$ -85 -331 653 149 155 -177 48 10 2 -530 -258 -124 100 160 19 143 -146 -115 -128 -153 250 88 -133 282
4157B82m49k14P4L43p86J081l72l62Q11n74K50n18K23O60o32K2L8k75O47j49l30
$$ 282 -167 -381 -307 36 -750 331 -41 -403 408 -166 84 -434 -211 449 -183 -161 -123 -398 249 100 -230
4178b30M58J62l18J2K6k95K09k84L27k09M72j55j35J24k08L2m7M38n67OJ06k00
$$ -230 228 390 72 84 110 -185 24 -260 67 -142 330 175 40 164 -44 -12 -59 379 -188 -182 -76 -276
4200b76MK38r4k65P67o25K00k46Q0p8J55m83K83j53J060m26J13P4j39k35O9K85
$$ -276 -272 -34 -128 -393 374 -251 -51 -297 -217 -295 -140 -623 -340 -493 567 141 254 328 189 -46 23 308
4222C08l73PM09l95L20m78j38L11l48L55j93K2J57P0J61k82J17j65J48k00l1J97
$$ 308 -65 -58 351 -44 276 -202 -340 -29 -377 -22 -215 -193 -36 34 195 -87 30 -135 13 -187 -218 -21
4244b1L4K01n83K18K76L86k2m07k82K14L64o98N48m48j75N49l62L65J25k33l08
$$ -21 13 214 -369 -151 125 511 489 82 -200 14 378 -320 228 -220 -395 154 -208 157 282 49 -259
4265b59L64l8k94L03l47l6M36J51j9J26l17l82N79J08m25L52m86L80l38j36M95
$$ -259 105 67 -227 76 -271 -307 129 280 261 387 70 -312 267 375 -50 302 -184 196 -142 -278 217
4286B17l19O57o1l16l07M57k21m30K81n47L36M85M8m73J99m47KM64O0k93J50k
$$ 217 -102 555 494 178 -129 328 107 -323 -42 -589 -253 232 280 -193 6 -441 -439 25 85 -208 -58 -60
4308f0k22L35L52q06L06M0J83k61p6l5K25J32K18l91l5K30K4o26N95J09K4J04
$$ -60 -282 53 405 -401 -95 -55 128 -133 -209 -244 -19 113 331 -60 -95 135 159 -467 128 237 261 365
4330C65J53p74O26m33L69J46p31O02r1j10k6j70K95K9J57q13K4O16m86K93l16
$$ 365 518 -256 370 -63 306 452 -279 323 232 122 96 -74 221 250 407 -406 -382 234 -252 41 -275
4351b75j99N58M0j94Q8J2m3J69k43j04O28j073O33n18O92o01K56J59k19O12n48
$$ -275 -474 84 124 -70 18 30 -13 156 -87 -191 437 -636 -3 -521 171 -430 -174 -15 -234 378 -170
4372a70M14l55N6M70K93j208K00P16j44l46P3J00m63K03K17k3n3j6j67J58r9j38
$$ -170 244 -111 -55 415 708 -500 -300 416 272 -74 -1 99 -364 -161 56 33 -20 -36 -203 -45 -144 -282
4394b82L92J72j15l00K36%J20m32J85k22N5j93J40pM00l27K14J64n5k67K54J56
$$ -282 110 282 167 -133 103 103 223 -209 -24 -246 -191 -384 -244 -251 149 -178 36 200 145 -122 132 288
4416B88l39j35J17j04M51J0k11k47K0K70l14K55j80p3L77L81n61k34J35J60j06
$$ 288 -51 -186 -69 -173 278 288 77 -170 -150 120 -194 61 -119 -192 185 566 5 -229 -94 66 -40
4437d0J15J52j13L63J83o62m6J37L7k09k8L80j21J42m60J16j22j26J28N52k54
$$ -40 75 227 114 477 660 -2 -48 89 126 -83 -111 269 148 290 -170 -54 -176 -302 -174 378 124
4458A24J22l93J48K08j38M9l66n7M62J2k02L14o39P8M40l79j35P29n41K09K06
$$ 124 246 -147 1 209 71 120 -246 -303 159 171 -31 283 -356 -278 162 -217 -352 377 -164 45 251
4479B51j18N77m12m06J30j20j93k53M56j59l3P00k35o4J36o39O98n80P91p31j85
$$ 251 133 710 298 -108 22 -98 -291 -544 -88 -247 -280 420 185 121 257 -382 316 -264 527 -204 -389
4500c89N48j44k0pj99L39Pj31J7O6r1J97M3L6l92L1j12L13J17j63k25J9O18m56
$$ -389 159 15 -5 -12 -211 128 135 4 21 87 -4 193 236 272 -120 -89 -201 112 229 66 -159 -140 478 22
4524B2p5pl22P58k79j3L76m18L30l56j3l36L31O1O45j038o0L33l47N17J81j44
$$ 22 -53 -60 -382 376 97 84 460 42 372 16 3 -333 -2 59 704 -334 -394 -61 -408 109 290 146
4546A46k14J18j59J81L15Q7M9n29M05k82l18k21M54L86l68j12K71p02Q15K89q23
$$ 146 -68 50 -109 72 387 474 523 -6 399 117 -201 -422 32 418 50 -62 209 -493 322 611 -212
4567b12N56n06j8N7M20m46P18k97l42NK53j01j97O6K99m11K25k44K89M70n71K05
$$ -212 344 -162 -180 -123 297 -149 569 272 -70 -65 188 87 -110 -44 255 -156 69 -175 114 584 13 218
4589B18o66M53K6J19O0m0k59O1n8j6p5J37N65m05j54j48K45j71l25Q12p27N77
$$ 218 -448 5 31 150 210 170 -89 -28 -86 -102 -177 -40 525 120 -34 -182 63 -108 -433 379 -348 229
4611B29j82o38P39j38J33j38j21j65L33n37M67K71m29L89o35Q60k99K84j51l4
$$ 229 47 -591 148 10 143 5 -116 -281 52 -485 -18 253 -176 213 -422 438 139 423 272 238
4631B38O3o3q49N66J36o4R7J1K90l24M28p97M48j43K14J07l00rj42n7j86M92K18
$$ 238 301 238 -611 -45 91 27 124 135 425 101 529 -268 180 37 251 358 58 49 -93 -150 -336 156 374
4654C74k15p16J098o37N42l83j16K66l13J46o4k48J05J18J68k6l59P2L61j41j09
$$ 374 159 -557 541 -96 446 63 -53 213 -100 46 -18 -266 -161 -43 125 99 -260 -188 173 32 -77
4675g7K29K22o79kN19k57k02N3M0J84j06K45k94M03j48k20J53n00N60Q9l82M18
$$ -77 152 374 -305 -307 212 -45 -247 -194 -154 30 -76 169 -125 278 130 -90 63 -437 123 212 -170 248
4697B48j10K37m92p3L10j55k32O32k64q1n4j36N46n31j27M11r0j3k49k11J71P96
$$ 248 138 375 -117 -190 120 -35 -267 365 101 20 -34 -170 376 -155 -282 129 39 26 -223 -434 -263 533
4719E33m02o21K94k10K59J2k97J94M13l87N28j62J24l87M2K14L60o69L14n82L22
$$ 533 131 -490 -196 -406 -147 -135 -432 -238 175 -212 316 154 278 -109 -67 147 507 -162 152 -430 -108
4740a08j19O55l44n30J132n54M1M48r11L70q7L91n45L9m0L20j61k58L42K80k91
$$ -108 -227 428 84 -446 686 132 173 621 -290 80 -7 384 -161 -122 -162 158 -3 -261 81 361 70
4761G0J16k27k42J64o4L33j94k64NK28j7k50M33K9p5n50J41K20K05K4m32P54k96
$$ 70 186 -41 -283 -119 -183 150 -44 -308 -303 -75 -92 -342 91 120 45 -505 -364 -144 61 85 -347 407 111
4784A11j3P2l94j4L29J65n50O74k91m40L69n9J43J6J4k94M10m83N25J05k95m5
$$ 111 98 170 -224 -238 91 256 -294 380 89 -351 18 -41 102 118 132 -162 248 -235 290 395 100 55
4806E5J33l42J60N90r37M50J15l99qQ9j67J29j15L61q0J50K43n86M26n2p1l81
$$ 55 188 -154 6 596 -341 109 224 -175 -183 -94 -261 -132 -247 114 34 184 427 -159 267 215 144 -237
4828b37K26J56l21J59o8r9J69K13r0q7J57P4m47J65J19j10O14p02R1n7N8O36l92
$$ -237 -11 145 -176 -17 -85 -184 -15 198 108 21 178 252 -195 -30 89 -21 593 -109 -18 -75 -17 619 227
4851B27l14J94j0j78q3j65L30l7K08l03K64L69p37k38L37K02Rj69pM9j01O88l03
$$ 227 -87 107 97 -81 -164 -329 1 -36 172 -131 133 502 -235 -473 -136 66 75 -94 -101 -52 -153 535 232
4874B32J47J98l40l44L94p4K31m50o5m1M9k0j88j03K73k37r3K91N55P4l67P9J09
$$ 232 379 577 237 -107 287 213 444 -6 -71 -112 -63 -83 -271 -374 -101 -338 -431 -140 415 489 122 201 310
4897C10l8k36r0K04m54K65J53j59k4M53R2m01oj35l4J56O6l4J68j83J58j84K03
$$ 310 272 36 -54 150 -304 -39 114 -45 -69 384 476 75 69 -66 -100 56 122 88 256 73 231 47 250
4920B50m62J54K69k20l97L42k9k50K13K77j17m42K69m43Q45k39J5l96O06j73K38
$$ 250 -212 -58 211 -9 -406 -64 -93 -343 -130 147 30 -412 -143 -586 259 20 35 -361 245 72 310
4941C10k61l2k61R3L95n86N12k10Q2P5r6L05j75j31j59N02K29m43J38k7J5l22
$$ 310 49 17 -244 -151 244 -342 170 -40 42 117 21 326 151 20 -139 363 592 149 287 260 275 -47
4963d7n5M0k05j32M44l35P32m67N3p1P2M11o59L20k8J92k96k70J26L52m57j01
$$ -47 -102 -62 -267 -399 45 -290 442 -25 28 -43 29 440 -219 101 73 265 -31 -301 -175 177 -280 -381
4985c81J20M6L81l35P2K20l42L21J61j51j12l65o6O03j26k6M76k90k78J84n69
$$ -381 -261 -215 166 -169 -97 123 -219 102 263 112 0 -365 -431 172 46 20 496 206 -72 112 -457
5006d57N24l20L7j17M3N95n22M15k52l9O8n1j36L36m50R48q16J4O81o07L53m96
$$ -457 67 -253 -216 -333 -290 305 -217 198 -54 -93 -25 -76 -212 124 -326 622 -194 -180 501 -106 247 -249
5028b49l19J042n55j69J38J21J25J93P5n49K25L78m06l77M50j76J83l22o3M71
$$ -249 -568 474 -81 -250 -112 9 134 327 402 -147 78 456 50 -327 123 -53 130 -192 -255 216
5048B16n16n3K46l96O61j62j15q0K48J97p0N7k90O25m94J93o6R9k97o6K0O24q09
$$ 216 -300 -353 -107 -503 158 -4 -119 -199 49 246 176 233 -57 568 74 267 201 300 3 -63 -43 581 -228
$$ [...]
8191C84
##END NTUPLES=NMR FID
##END=
