##TITLE=1H ikalashn
3752H
21.10.2024
##JCAMPDX= 6.0         $$ Bruker NMR JCAMP-DX V2.0
##DATA TYPE= NMR FID
##DATA CLASS= NTUPLES
##ORIGIN= UXNMR, Bruker Analytische Messtechnik GmbH
##OWNER= root
$$ TOPSPIN		Version 1.3
$$ 2024-10-21 14:10:53.500 +0400  Irina@DPX200
$$ Compression mode = diff/dup
##.OBSERVE FREQUENCY= 200.13100065
##.OBSERVE NUCLEUS= ^1H
##.DELAY= (6, 6)
##.ACQUISITION MODE= SIMULTANEOUS
##.ACQUISITION SCHEME= undefined
##.AVERAGES= 32
##.DIGITISER RES= 18
##SPECTROMETER/DATA SYSTEM= spect
##.PULSE SEQUENCE= zg
##.SOLVENT NAME= CDCl3
##.SHIFT REFERENCE= INTERNAL, CDCl3, 1, 15.99637
##AUDIT TRAIL= $$ (NUMBER, WHEN, WHO, WHERE, WHAT)
$$ ##TITLE= Audit trail, TOPSPIN		Version 1.3
$$ ##JCAMPDX= 5.01
$$ ##ORIGIN= Bruker BioSpin GmbH
$$ ##OWNER= Irina
$$ $$ F:/spectra/data/iren/nmr/1H/4/audita.txt
$$ ##AUDIT TRAIL=  $$ (NUMBER, WHEN, WHO, WHERE, VERSION, WHAT)
(   1,<2024-10-21 14:10:30.421 +0400>,<Irina>,<DPX200>,<TOPSPIN 1.3>,
      <created by zg
	started at 2024-10-21 14:08:17.906 +0400,
	POWCHK disabled, PULCHK disabled
       configuration hash MD5:
       BE 6D 3F 07 2A EA 11 49 91 17 2B D3 AF B3 58 0D
       data hash MD5: 16K
       B8 B3 06 62 2C 7B 87 2F 42 64 DF A3 60 B2 64 D1>)
$$ ##END=
$$ 
$$ $$ hash MD5
$$ $$ 19 B3 77 62 9C 7D AF 00 B1 DA 78 CA 43 53 2A EB
##$RELAX= 
##$RELAX= 
##$RELAX= 
##$RELAX= 
##$RELAX= 
##$RELAX= 
##$RELAX= 
##$RELAX= 
##$RELAX= 
$$ Bruker specific parameters
$$ --------------------------
##$DU= <F:/spectra>
##$EXPNO= 4
##$NAME= <1H>
##$PROCNO= 1
##$TYPE= <nmr>
##$USER= <iren>
##$AMP= (0..31)
100 100 100 100 100 100 100 100 100 100 100 100 100 100 100 100 100 100 
100 100 100 100 100 100 100 100 100 100 100 100 100 100 
##$ANAVPT= -1
##$AQSEQ= 0
##$AQ_mod= 1
##$AUNM= <au_zg>
##$AUTOPOS= <>
##$BF1= 200.13
##$BF2= 200.13
##$BF3= 200.13
##$BF4= 200.13
##$BF5= 200.13
##$BF6= 200.13
##$BF7= 200.13
##$BF8= 200.13
##$BYTORDA= 1
##$CFDGTYP= 0
##$CFRGTYP= 5
##$CHEMSTR= <none>
##$CNST= (0..63)
1 1 145 1 1 1 1 1 1 1 1 1 1 1 1 1 1 1 1 1 1 1 1 1 1 1 1 1 1 1 1 1 1 1 
1 1 1 1 1 1 1 1 1 1 1 1 1 1 1 1 1 1 1 1 1 1 1 1 1 1 1 1 1 1 
##$CPDPRG= <>
##$CPDPRG1= <>
##$CPDPRG2= <>
##$CPDPRG3= <>
##$CPDPRG4= <mlev>
##$CPDPRG5= <mlev>
##$CPDPRG6= <mlev>
##$CPDPRG7= <mlev>
##$CPDPRG8= <mlev>
##$CPDPRGB= <>
##$CPDPRGT= <>
##$D= (0..63)
0 2 0 0 0 0 0 0 0 0.06 0 0.03 0 0 0 0 0.0002 0 0 0 0 0 0 0 0 0 0 0 0 0 
0 0 0 0 0 0 0 0 0 0 0 0 0 0 0 0 0 0 0 0 0 0 0 0 0 0 0 0 0 0 0 0 0 0 
##$DATE= 1729505425
##$DBL= (0..7)
120 120 120 120 120 120 120 120 
##$DBP= (0..7)
150 150 150 150 150 150 150 150 
##$DBP07= 0
##$DBPNAM0= <>
##$DBPNAM1= <>
##$DBPNAM2= <>
##$DBPNAM3= <>
##$DBPNAM4= <>
##$DBPNAM5= <>
##$DBPNAM6= <>
##$DBPNAM7= <>
##$DBPOAL= (0..7)
0.5 0.5 0.5 0.5 0.5 0.5 0.5 0.5 
##$DBPOFFS= (0..7)
0 0 0 0 0 0 0 0 
##$DE= 6
##$DECBNUC= <off>
##$DECIM= 32
##$DECNUC= <off>
##$DECSTAT= 4
##$DIGMOD= 1
##$DIGTYP= 9
##$DL= (0..7)
0 120 120 120 120 120 120 120 
##$DP= (0..7)
150 150 150 150 150 150 150 150 
##$DP07= 0
##$DPNAME0= <>
$$ [...]
##$SW= 21.9926370048069
##$SWIBOX= (0..15)
0 0 2 0 0 0 0 0 0 0 0 0 0 0 0 0 
##$SW_h= 4401.40845070422
##$TD= 16384
##$TD0= 1
##$TE= 300
##$TE2= 300
##$TE3= 300
##$TEG= 300
##$TL= (0..7)
0 120 120 120 120 120 120 120 
##$TP= (0..7)
150 150 150 150 150 150 150 150 
##$TP07= 0
##$TPNAME0= <>
##$TPNAME1= <>
##$TPNAME2= <>
##$TPNAME3= <>
##$TPNAME4= <>
##$TPNAME5= <>
##$TPNAME6= <>
##$TPNAME7= <>
##$TPOAL= (0..7)
0.5 0.5 0.5 0.5 0.5 0.5 0.5 0.5 
##$TPOFFS= (0..7)
0 0 0 0 0 0 0 0 
##$TUNHIN= 0
##$TUNHOUT= 0
##$TUNXOUT= 0
##$USERA1= <user>
##$USERA2= <user>
##$USERA3= <user>
##$USERA4= <user>
##$USERA5= <user>
##$V9= 5
##$VALIST= <valist>
##$VCLIST= <CCCCCCCCCCCCCCC>
##$VD= 0
##$VDLIST= <DDDDDDDDDDDDDDD>
##$VPLIST= <PPPPPPPPPPPPPPP>
##$VTLIST= <TTTTTTTTTTTTTTT>
##$WBST= 1024
##$WBSW= 25
##$XGAIN= (0..3)
0 0 0 0 
##$XL= 0
##$YL= 0
##$YMAX_a= 1651505
##$YMIN_a= -2021198
##$ZGOPTNS= <>
##$ZL1= 120
##$ZL2= 120
##$ZL3= 120
##$ZL4= 120
##$ABSF1= 10
##$ABSF2= 0
##$ABSG= 5
##$ABSL= 3
##$ALPHA= 0
##$AQORDER= 0
##$ASSFAC= 0
##$ASSFACI= 0
##$ASSFACX= 0
##$ASSWID= 0
##$AUNMP= <proc_1d>
##$AXLEFT= 0
##$AXRIGHT= 0
##$AXTYPE= 0
##$AXUNIT= <>
##$AZFE= 0.1
##$AZFW= 0.1
##$BCFW= 1
##$BC_mod= 2
##$BYTORDP= 1
##$COROFFS= 0
##$CY= 7568.61572265625
##$DATMOD= 1
##$DC= 2
##$DFILT= <>
##$DTYPP= 0
##$F1P= 17.9538593292236
##$F2P= -4.03888763876832
##$FCOR= 0.5
##$FTSIZE= 32768
##$FT_mod= 4
##$GAMMA= 1
##$GB= 1
##$INTBC= 1
##$INTSCL= 1
##$ISEN= 128
##$LB= 0.02
##$LEV0= 0
##$LPBIN= 0
##$MAXI= 945.577
##$MC2= 0
##$MEAN= 0
##$ME_mod= 0
##$MI= -402.1523
##$NCOEF= 0
##$NC_proc= 0
##$NLEV= 6
##$NOISF1= 8.587773
##$NOISF2= 6.764455
##$NSP= 1
##$NTH_PI= 0
##$NZP= 0
##$OFFSET= 15.99637
##$PC= 1
##$PHC0= -37.76482
##$PHC1= -1.641439
##$PH_mod= 0
##$PKNL= yes
##$PPARMOD= 0
##$PPDIAG= 0
##$PPIPTYP= 0
##$PPMPNUM= 100
##$PPRESOL= 1
##$PSCAL= 0
##$PSIGN= 0
##$REVERSE= no
##$SF= 200.13
##$SI= 32768
##$SIGF1= 18.5376
##$SIGF2= -6.396296
##$SINO= 400
##$SIOLD= 32768
##$SREGLST= <1H.CDCl3>
##$SSB= 3
##$STSI= 0
##$STSR= 0
##$SW_p= 4401.40845070422
##$SYMM= 0
##$S_DEV= 0
##$TDeff= 0
##$TDoff= 0
##$TI= <>
##$TILT= no
##$TM1= 0
##$TM2= 0
##$TOPLEV= 0
##$USERP1= <user>
##$USERP2= <user>
##$USERP3= <user>
##$USERP4= <user>
##$USERP5= <user>
##$WDW= 1
##$XDIM= 8192
##$YMAX_p= 0
##$YMIN_p= 0
$$ End of Bruker specific parameters
$$ ---------------------------------
##NTUPLES= NMR FID
##VAR_NAME=  TIME,          FID/REAL,        FID/IMAG
##SYMBOL=    X,             R,               I
##VAR_TYPE=  INDEPENDENT,   DEPENDENT,       DEPENDENT
##VAR_FORM=  AFFN,          ASDF,            ASDF
##VAR_DIM=   8192,          8192,            8192
##UNITS=     SECONDS,       ARBITRARY UNITS, ARBITRARY UNITS
##FACTOR=    0.0002272,     1,               1
##FIRST=     0,             0,               0
##LAST=      1.8609952,     -59,             -43
##MIN=       0,             -2021198,        -2021198
##MAX=       1.8609952,     1651505,         1651505
$$ Real data points
##PAGE= N=1
##DATA TABLE= (X++(R..R)), XYDATA
$$ [...]
2228a325Q10J714P71k97j491j770n77P71J661J257N44j155j756j197L91J093J380
$$ -1325 -515 1199 1970 1673 182 -1588 -2165 -1394 267 1524 2068 913 -843 -2040 -1649 -556 824
2245H24P65j77j278j114o40N37J122J056N37q41j309r36J16R12J159Q01l65j229
$$ 824 1589 1412 134 -980 -1620 -1083 39 1095 1632 791 -518 -1454 -1338 -426 733 1534 1169 -60
2263f0j010n47P19J461R70J37j230j076j363JJ520J605P49l66j162j254j050N78
$$ -60 -1070 -1617 -898 563 1533 1670 440 -636 -1999 -1998 -478 1127 1876 1510 348 -906 -1956 -1378
2281a378J350J132N32n22j047j283p9M04J428N96j21n35j150n86P6Q00J309O04
$$ -1378 -28 1104 1636 1114 67 -1216 -1295 -891 537 1133 1012 477 -673 -1259 -1183 -383 926 1530
2299A530n80j367j102k00J051J359J073k33j148j365m89L84P82J128P66l39j102
$$ 1530 950 -417 -1519 -1719 -668 691 1764 1531 383 -982 -1471 -1087 -305 823 1589 1250 148
2316A48j222k86N13P95J014J90m54j144r54N6P61J535N49k58j545j037k51J163
$$ 148 -1074 -1360 -847 -52 962 1152 698 -446 -1400 -1344 -583 952 1501 1243 -302 -1339 -1590 -427
2334d27J163R38l56j225r58o27M43J236N75N72k79m21j090q08j98J016J382P79
$$ -427 736 1674 1318 93 -865 -1492 -1049 187 762 1334 1055 634 -456 -1264 -1462 -446 936 1715
2352A715n30j336j483j88J153J797R08q47j645j094J94J494Q19O91m42j071p96
$$ 1715 1185 -151 -1634 -1822 -669 1128 2036 1189 -456 -1550 -1356 138 957 1648 1206 135 -661
2369f61l64J63O46L94O47J20l36j233j136l52J152J770J086n76j914j254J43J743
$$ -661 -1025 -862 -216 178 825 945 609 -624 -1760 -2112 -960 810 1896 1320 -594 -1848 -1705 38
2387C8J686L31p21j796n50K91P44Q20j31l09l36R4n37q24l05J070Q40J014k57
$$ 38 1724 2055 1334 -462 -1012 -721 23 843 712 403 67 161 -376 -1200 -1505 -435 405 1419 1162
2406A162k129j416K6K093K051O59j318j718j195Q19J804P72L6j150o74m86N92
$$ 1162 -967 -2383 -2357 -264 1787 2446 1128 -590 -1785 -966 838 1610 1646 496 -178 -664 -72
2423g2l65j4M21J50M94M5j110j343l13J555J628J147j006j988j250M69J797J952
$$ -72 -437 -451 -30 120 614 659 -451 -1794 -2107 -552 1076 2223 1217 -771 -2021 -1552 245 2197
2441B197J57j494j557l13N34R95N78n34m77l80J66n71m11o0L61R83Q56k04j222
$$ 2197 2354 860 -697 -1010 -476 519 1097 563 86 -294 -128 -699 -1110 -1170 -809 174 1030 826 -396
2460c96j319j10J384K043R98j085k068r83M62J557J241j28j337j030m15P81P59
$$ -396 -1715 -1825 -441 1602 2600 1515 -553 -1536 -1074 483 1724 1596 259 -771 -1186 -405 354
2477C54m72j97k5K85j72L1j264j24Q84J666Q16l22j807j324J86K011J683M05j629
$$ 354 -118 -315 -340 -55 -227 -196 -1460 -1584 -700 966 1782 1460 -347 -1671 -1485 526 2209 2614 985
2496I85j414r87P76J151Q12n96j226m75K86K72L8l24j57O79P57J06q60r55k45
$$ 985 -429 -1416 -640 511 1323 727 -499 -974 -688 -416 -378 -702 -859 -180 577 683 -177 -1132 -1377
2515a377J333J534R38q90k079j410Q41J932J189k8j680j575k76P25R86L51n24
$$ -1377 -44 1490 2428 1538 -541 -1951 -1110 822 2011 1983 303 -1272 -1548 -823 163 514 -10
2532a0o21J37K35m8l79r6J74J482N43l1j255j589M05J612J840L41j676k153j010
$$ -10 -631 -494 -259 -307 -686 -782 -608 874 1417 1386 131 -1458 -1053 559 2399 2740 1064 -1089 -2099
2551b099J048J436J279n32j675p75K8Q75J43J14k09K65M65J36j44j063l81J262
$$ -2099 -1051 385 1664 1132 -543 -1318 -1290 -415 -272 -158 -367 -102 363 499 355 -708 -1089 173
2569A73J247Q51q19j685j721P46J709J204M62k037j431n82J347R47L61p61n93
$$ 173 1420 2271 1452 -233 -1954 -1208 501 1705 2167 130 -1301 -1883 -536 411 772 11 -582
2586e82l83N64M79K5m06K07N68N73l24q51j139N27J352J224M38j374j992q09N37
$$ -582 -965 -401 78 103 -303 -96 472 1045 721 -130 -1269 -742 610 1834 2272 898 -1094 -1903 -1366
2605a366J525J194l75j201p14r1M75N79K7m08L9L04L43P4m40j74K61J074K77r95
$$ -1366 159 1353 978 -223 -937 -1028 -553 26 53 -355 -316 -12 331 405 -35 -209 52 1126 1403 408
2625D08j156q82Q74J205J048J39j364j415p76P40J425O38k20j166Q0q1L90q5J51
$$ 408 -748 -1630 -756 449 1497 1636 272 -1143 -1919 -1179 246 884 664 -502 -422 -503 -113 -198 -47
2644d7K33J41J40K4m86k84j4P10P80J31j085j366n93O63J321J013l3j032j245
$$ -47 186 327 467 491 5 -279 -293 417 1197 1328 243 -1123 -1716 -1053 268 1281 1248 216 -1029
2663a029j10M38N64O44j68k06j01L88k15m82Q3N10M90J25n84o30n27L78O24Q62
$$ -1029 -1139 -701 -137 507 339 133 32 420 205 -277 -194 316 806 931 347 -283 -810 -432 192 1054
2683A054k40j030r66l11N43J238P63j61m78r41j0j53O45L52M15l29ll34l61j47
$$ 1054 814 -216 -1182 -1493 -950 288 1051 890 412 -529 -539 -692 -47 305 720 391 388 54 -307 -454
2703d54K85N67M11k7n11q75m44M79Q23N97o2j021k45m49N66Q8Q71J89l09o15l98
$$ -454 -169 398 809 782 271 -604 -1048 -569 254 851 789 -232 -477 -926 -360 -272 599 788 479 -136 -534
2724e34QL06M70N05J16n85m83l85p8N78L82L80O5o91p09l21K23P96O75L21k90
$$ -534 -526 -220 250 755 871 286 -197 -582 -660 -82 300 680 745 54 -655 -976 -753 43 718 1039 749
2745G49o59j065N4P16P30M73n68n48l27NK50N08Kl8l59J54n61r5M01N53j1J67
$$ 749 90 -975 -921 -205 525 998 430 -118 -445 -440 -190 318 320 282 -77 77 -484 -579 -178 375 364 531
2767E31l83n04p09L75O03J003K72o42q31o79J51M92Q24L08k15l95m08n07K22J90
$$ 531 148 -356 -1065 -690 -87 916 1188 546 -285 -964 -813 -321 503 811 596 201 -207 -714 -492 -302
2787c02O97K49n3m38m14n47J52O95P04J33p54o78k71K0P51O79J91n08m36l27k7
$$ -302 395 644 591 153 -261 -808 -656 39 743 876 122 -556 -827 -807 -56 623 814 306 -130 -457 -484
2808d84L79L56K43m4m65L4l86o0K45L27N30o8o84n09Q0J86N58O21j57m44q74k10
$$ -484 -105 251 494 450 -15 19 -367 -427 -182 145 675 607 -77 -586 -506 -320 238 859 702 258 -616 -826
2830h26N3O93R75p1j94n72n33j91L54K77K93L51k90k12o37J65r3L97O44k47k78
$$ -826 -773 -80 895 824 630 58 -475 -666 -312 -35 258 609 319 107 -530 -365 -458 -61 583 336 58
2851E8n45j46J21L93Q17j92k65m57k32J64j9O87j39J26l22n07k34J86M15O47J3
$$ 58 -487 -633 -512 -119 698 506 241 -216 -448 -284 -303 384 245 371 49 -458 -692 -506 -91 556 569
2872E69l90k91m66n3L31O16N80m24p74j59j50J74L94R52k92j19o35l60l98M71
$$ 569 179 -112 -578 -631 -300 316 896 472 -302 -461 -611 -437 -43 909 617 498 -137 -497 -895 -424
2892d24L98N08O4j33l50m15n1l2N60L99m16k10k9l85K37Q13K37l92m37l71n3J06
$$ -424 -26 482 546 413 63 -352 -403 -435 125 524 108 -102 -131 -516 -279 534 771 379 -58 -429 -482 -376
2914c76P78lK04j90o47l55m8J92L83O34P2op96o81N3Q0J062L41l19m46m89j9K34
$$ -376 402 399 603 413 -234 -589 -637 -445 -62 572 644 638 -158 -839 -786 -706 356 697 378 -68 -557 -576 -342
2937c42L45L24L21n17m49J08p9o5N39O55j37n40j73m22n0M23M67K0r3n80j09j5
$$ -342 3 327 648 131 -318 -210 -289 -354 185 840 703 163 -10 -432 -482 -59 408 428 335 -245 -354 -369
2959c69J49M93N4j29k17o12M2M29K93L66q9k21m32l2n3K50K85K82J7r8n26l30
$$ -369 -220 273 327 198 -19 -631 -589 -160 133 499 410 189 -243 -275 -328 -78 207 489 506 408 -118 -448
2981d48k80P61L15J38j85k42o05q1M07N82P6o1m29k52Qk2N07J88l15J76j70k36
$$ -448 -728 33 348 486 301 59 -546 -627 -220 362 438 377 -52 -304 -296 -318 189 377 62 238 68 -168
3003a68o0J00J42OL01k4k39l60j52Q4N50M12k09n24q37L34N29O78K53m97m45m09
$$ -168 -228 -128 14 20 321 297 58 -302 -454 -370 180 592 383 -141 -978 -644 -115 563 816 319 -126 -535
3025e35J94J29M27J63N6k33k09o0k74j88J62K43K32L64n52n19L2J78N88M84l61
$$ -535 -341 -212 215 378 434 201 -8 -68 -342 -530 -368 -125 107 471 -81 -600 -568 -390 198 682 321
3046C21m04m46L02N5R34K3o54k84J27j47J53o4j80K58K84n25M8k53l24N14N51
$$ 321 -83 -529 -227 -172 762 785 131 -153 -26 -173 -20 -84 -264 -6 278 -247 -199 -452 -776 -262 289
3067B89L89m9p05m25k12N04Q89K02n13m57j16o3K95L75k59k60p4J74n44K84j14
$$ 289 678 629 -76 -501 -713 -209 680 882 369 -88 -204 -267 28 403 144 -116 -190 -16 -560 -276 -390
3088c90K30K77o2M17m84n26j13K20O50O79j68o29o22K7M41O79K3n27k74j36J4
$$ -390 -160 117 55 472 -12 -538 -651 -431 219 898 730 101 -521 -494 -53 626 649 122 -152 -288 -274
3109b74O05L5j96n44J86J81J34l41m18K64L12M34Q2q20j68k57O70P63LK07p15
$$ -274 331 366 170 -374 -188 -7 127 -214 -632 -368 -56 378 460 -360 -528 -785 -115 648 651 858 143
3130A43n44m4N52K46k02k28m14K20K54j51p9k9L39j73R7r0j91l36M15N80K93K77
$$ 143 -401 -445 107 353 151 -77 -491 -271 -17 -168 -247 -276 63 -110 -13 -103 -294 -630 -215 365 658 935
3152I35o53l76j03J40M91J06k55o21j51L17M16j15q0k47K33j33Oj70L7j38M53
$$ 935 282 -94 -197 -57 434 540 285 -336 -487 -170 246 131 51 -196 37 -96 -90 -260 -223 -361 92
3173I2L52K7j58p20m69Q85M57M73j36q57j12l89N59K59N0l07m09J62K10j26p8
$$ 92 444 471 313 -407 -876 9 466 939 803 -54 -166 -555 4 263 313 6 -403 -241 -31 -157 -235
3194b35K16j71k3L21q8j93l87M10J85O34o2k48r43O5L61O29J74O8o45m57k80M48
$$ -235 -19 -190 -213 108 20 -173 -560 -150 35 669 607 359 -584 -519 -158 471 645 713 68 -389 -669 -221
3216b21M30l2k38L47k73k25L58l15j30M81K76k03m5l16m5K06N48P6j28n51o78
$$ -221 209 177 -61 286 13 -212 146 -169 -299 182 458 255 210 -106 -151 55 603 679 551 0 -678
3237f78r2O25N78K89k61p62m06J28K69L27L79m30K4P1j32K7q4j07O91r1M37m52
$$ -678 -770 -145 433 722 461 -301 -707 -579 -310 17 396 -34 -10 61 -71 -44 -128 -235 456 365 802 350
3259C50n88q8K64M07K24o8m51n39j32L40N62K24m44j29j18o9K30L4k7M6k0J63
$$ 350 -238 -326 -62 345 569 501 50 -489 -621 -281 281 505 61 -68 -186 -255 -25 9 -18 28 8 171
3281A71kn71K04j0L36K97Mm57m24J28J5L00L01j24l7q31J87N24R4N6k38J3j33
$$ 171 169 -402 -198 -208 128 425 429 -28 -452 -324 -309 -9 292 168 131 -700 -513 11 105 161 -77 -64 -197
3304a97J03k4K33mq9M84k4o21q0O3l5M98j11K55m30l06j64K75M26J95p5l19l92
$$ -197 -94 -118 115 111 22 506 482 -139 -219 -156 -191 307 196 451 21 -285 -449 -174 252 447 372 53 -339
3327c39K72M8KkN7K50N9l77j56mK42K71m8l35k04j8J31l1L96J21p1j29m26j00
$$ -339 -67 -19 -17 -19 38 288 347 -30 -186 -190 52 323 275 -60 -264 -282 -151 -182 214 335 264 135 -291 -391
3351c91L21K85K68j42j55j51k72P7j5L47Q2K27k76k59k91N5K80J65L59k61n49
$$ -391 -70 215 483 341 186 35 -237 -160 -175 172 254 481 205 -54 -345 -290 -10 155 514 253 -296
3372b96J38k02n6N24K3J79l89lk36K12J83K38p6o0m70N8k4p4L85J57N1q0j97k82
$$ -296 -158 -360 -416 108 131 310 -79 -82 -318 -106 77 315 239 179 -291 -233 -257 -331 54 211 262 182 -15 -297
3396b97J67J6L69J18l25j27l02J11J42J30L87K6l88r1k41J99J83K24J90l03j56
$$ -297 -130 -114 255 373 48 -79 -381 -270 -128 2 389 415 27 -64 -305 -106 77 301 491 188 32
3417C2l54k21M80R2K68K94m06l50j07l4K86J33L75j68j85j74l28J18M54K4L4N
$$ 32 -322 -543 -63 29 297 591 185 -165 -272 -306 -20 113 488 320 135 -39 -367 -249 205 229 263 268
3439B68l22o4m4J15K90N5J9n34j88k69M34L86O0J38l10j56k05j7J84K06L77j13
$$ 268 -54 -118 -162 -47 243 298 317 -217 -405 -674 -240 146 206 344 34 -122 -327 -344 -160 46 423 310
3461C10k12l18l64m1L59O93J7k15l43k46R1K87J14J85j3j54j46j71j44L71K04
$$ 310 98 -220 -584 -625 -266 427 444 229 -114 -360 -269 18 132 317 304 150 4 -167 -311 60 264
3482B64Q2j6l44m40m0L33J30K34j36L72l19n33J08K21K77j6P3k90k75J62J85P2
$$ 264 346 330 -14 -454 -494 -161 -31 203 67 439 120 -413 -305 -84 193 177 250 -40 -315 -153 32 104
3504A04R2l3j5q3j81l59J52M04J07N0k66l12L2j3M57J08N1j25j51l86L85j38K13
$$ 104 196 163 148 65 -116 -475 -323 81 188 238 -28 -340 -308 -321 136 244 295 170 19 -367 18 -120 93
3527I3K39J0j37l32l52J14L24L53P2j49j12o76K01K59J08J50%m48l8j12J70K43
$$ 93 332 342 205 -127 -479 -365 -41 312 384 235 123 -553 -352 -93 15 165 165 -283 -321 -433 -263 -20
3549b0N5J07L1j87j19K5j77K70J61K70k24k07n19K74K77J38O6K19n13l89k6N91
$$ -20 35 142 173 -14 -133 -108 -285 -15 146 416 192 -15 -534 -260 17 155 221 440 -73 -462 -488 103
3571A03J19K37j41m10L4k61L1L05J19j84J58J36j93l90NM03J59j76Pj48m45J25
$$ 103 222 459 318 -92 -58 -319 -288 17 136 -48 110 246 53 -337 -332 71 230 54 61 -87 -532 -407
3593d07M84K55Q3l2l90m76P0J55P65L0m36R0j94m45M17n3J38J36ok9m84j25R1
$$ -407 77 332 415 383 -7 -483 -413 -258 507 537 101 191 -3 -448 -31 -84 54 190 184 155 -329 -454 -363
3616c63L44N84p2n4o64n86M77J81O35j12k04l07m6P9L52l9m0J3l8J78k51j24k10
$$ -363 -19 565 493 439 -225 -811 -334 -153 482 370 166 -141 -187 -108 244 205 165 178 140 318 67 -57 -267
3639b67K51K77J3j08m20j83j05N44J49L37k45m21l54K23L25J95L73n95j4mK19
$$ -267 -16 261 274 166 -254 -437 -542 2 151 488 243 -178 -532 -309 16 211 584 -11 -25 -29 190
3660A90p0l0r5J54J74j52n0m33j77L40M91J5k42l88l55K3K82R17m10J98o62j87
$$ 190 120 90 -5 149 323 171 121 -312 -489 -149 342 357 115 -273 -628 -605 -323 594 184 382 -280 -467
3682d67L48K43M03l79l3Q2j66O9j47k36L27j47L34o6k39m55K04J28N25Rj79m66
$$ -467 -119 124 527 148 115 197 31 100 -47 -283 44 -103 231 165 -74 -529 -325 -197 328 337 158 -308
3704c08m29M27O78L41p2m14n13K71q2L15J2j04p1Q0j06j7l57j79K48M29K38q1
$$ -308 -737 -310 368 709 637 223 -290 -19 -101 214 226 122 51 131 25 8 -349 -528 -280 149 387 306
3726C06n66l71k2O01N78m8k52o18J0L03L41L00l8n47k06J66Q5N2J1p3k02K94O5
$$ 306 -260 -631 -653 -52 526 478 226 -392 -382 -79 262 562 524 -23 -229 -63 22 74 85 12 -190 104 169
3749A69k92l39R2M6P21J38l28l80k76p3M30O66K21l42p36M0J61K43K45k61l4j67
$$ 169 -123 -462 -370 -324 397 535 207 -173 -449 -522 -92 574 795 453 -283 -243 -82 161 406 145 111 -56
3771e6j49rK98m56J56K74LJ68l58l79p8O68L52K98l01q35p6K11O66J80J18o39
$$ -56 -205 -214 84 -372 -216 58 61 229 -129 -508 -586 82 434 732 431 -404 -480 -269 397 577 695 56
3793E6l96J4L88O6l07J67k79K96J26j54l57J68n4K86L79k07m22k42K1R36K39n1
$$ 56 -340 -326 62 128 -179 -12 -291 5 131 -23 -380 -212 -266 20 399 192 -230 -472 -451 485 724 673
3815F73o35l07j55R7O72K92k23l05k96k00J19J56o1l7J43L13Lk81j57j29J04M63
$$ 673 38 -269 -424 -327 345 637 414 109 -187 -387 -268 -112 -173 -210 -67 246 249 -32 -189 -318 -214 249
3837B49L33m08k89k26Q7M68M39j48k50p29J2L21K44K70q5m15k82J85K9p6K41j26
$$ 249 582 174 -115 -341 -254 214 653 505 255 -474 -462 -141 103 373 288 -127 -409 -224 -195 -271 -30 -156
3859a56K16L50j14l49n30M89J5P29m7n00k81k82L62M35n3J99o09k33R0k5J88J31
$$ -156 60 410 296 -53 -583 -94 -79 650 603 103 -178 -460 -98 337 284 483 -126 -359 -269 -294 -106 25
3881B5K90j30j72j22J1j84J35K34L59P3l25n30k0K86J2O19k44j05m52k73J64L68
$$ 25 315 185 13 -109 -98 -282 -147 87 446 519 194 -336 -356 -70 -58 561 317 212 -240 -513 -349 19
3903A9L87k53j48L3J03l32K0K26K05m3R7k43k94m0n3N15K8J57j05p00l8J58N56
$$ 19 406 153 5 38 141 -191 -171 55 260 217 314 71 -223 -263 -316 199 227 384 279 -421 -459 -301 255
3926B55L76k89n02O8m42M17K57J4J62m5m7j56K2j83j12J69J47L77k4o60j35J38
$$ 255 631 342 -160 -92 -534 -117 140 154 316 271 224 68 90 -93 -205 -36 111 488 464 -196 -331 -193
3948a93J85L45j06j80l29O2J10J75J38p2j52k04j22j8J44K65M4K78q1k11l47R6
$$ -193 -8 337 231 51 -278 -216 -106 69 207 135 -17 -221 -343 -361 -217 48 92 370 289 78 -269 -173
3970a73j14L34M95k93j99n09PL50J62K66j38k18n7l4r3L80K05k59J50l53q4j71
$$ -173 -287 47 542 249 50 -459 -452 -102 60 326 188 -30 -87 -121 -214 166 371 112 262 -91 -175 -346
3992c46K61L07j82N12l75k25k88K07j65M14P0K67m13k82k98Q22k47L38l26p4j50
$$ -346 -85 222 40 552 177 -48 -336 -129 -294 120 190 457 44 -238 -536 286 39 377 51 -23 -173
4013a73j16K42j7K35j04L3k15j93M3J09lK19ok30l6j3j82O55J01L5l51Rm71k6
$$ -173 -289 -47 -64 171 67 100 -115 -308 -265 -156 -159 60 54 -176 -212 -225 -407 248 349 384 33 42 -429 -455
4037d55K41K05J26L39m08Kk36r3J94K27L8J9m3l63j42K39N9L00N5m73oj54J32
$$ -455 -214 -9 117 456 48 50 -186 -279 -85 142 180 199 156 -207 -349 -110 -51 249 304 -169 -175 -329 -197
4060a97K53M65N1k51l74j62l3R5J81K88j59J20m82p9J87K8L68p5J07k94l68k7
$$ -197 56 521 572 321 -53 -215 -248 -153 28 316 157 277 -205 -284 -97 -69 299 224 331 37 -331 -358
4082c58J06K52K29K4Ko10J72k49K94L79Nr9k31m9j68R3J48K59j35Rl13O9j01K44
$$ -358 -252 0 229 253 255 -355 -183 -432 -138 241 246 147 -84 -133 -301 -208 -60 199 64 73 -240 -171 -272 -28
4106b8O3P2J12j90k18k9l10N22J84J18j25k35l8l1j48K36L52J20k68l49PK19k26
$$ -28 35 107 219 29 -189 -218 -528 -6 178 296 171 -64 -102 -133 -281 -45 307 427 159 -190 -183 36 -190
4129a90M69K02m24K5o32J58L09J08K19K17m90l5m8l07M41L6J95o1Rm50O0L1L34
$$ -190 279 481 57 82 -550 -392 -83 25 244 461 -29 -64 -112 -419 22 58 253 192 201 -249 -189 -158 176
4152A76J47q5k53j45j30K63j11M79j38P9l00j71N4l88M64J08K05j65j39m43L06
$$ 176 323 238 -15 -160 -290 -27 -138 341 203 282 -18 -189 -135 -523 -59 49 254 89 -50 -493 -187
4173a87K59K32M3k93j32l19j92K82P02l30j06j31P2L84k92M3j6K09J73j08l88
$$ -187 72 304 347 54 -78 -397 -589 -307 395 65 -41 -172 -100 284 -8 35 19 228 401 293 -95
4194i5j46j98L83J64K79k57n60k7j8M17M87l05k5m64J7k2M22L20J37k63l33K26
$$ -95 -241 -439 -56 108 387 130 -430 -457 -475 -58 429 124 99 -365 -348 -370 52 372 509 246 -87 139
4216A39k06j35j29N51K91j27k22n20j27J6r6P38N08o24k10m42J00N13L79k38p5
$$ 139 -67 -202 -331 220 511 384 162 -358 -485 -469 -565 173 681 57 -153 -595 -495 18 397 159 84
4237H4m24N03k59j04K43J22j83J22j36j95j10m6L27K18L53l68l35l81R1N24M27
$$ 84 -340 163 -96 -200 43 165 -18 104 -32 -227 -337 -383 -56 162 515 147 -188 -569 -478 46 473
4258D73r3p9p34j94O73O7K11j65k8l01J70j66J26r2K91k63M92l08l78l16J97M30
$$ 473 380 301 -433 -627 46 113 324 159 131 -170 0 -166 -40 -132 159 -104 388 80 -298 -614 -417 13
4280A3L78j22k86l84O0J41M84K15l01j05m89K15Q1J10j27P9j04K19J14j71j51
$$ 13 391 269 -17 -401 -341 -200 284 499 198 93 -396 -181 -100 10 -117 -38 -142 77 191 20 -131
4301a31k08Q9Q25K1n73o23k42J69P89L62j77j85m20K8J4N09L03n04q0j52L25N2
$$ -131 -339 -250 575 596 23 -600 -842 -673 116 478 301 116 -304 -276 -262 247 550 46 -34 -186 139 191
4323A91k22Q9j81p9K89J70k45o11K02O4N68J94m47l07k35K39O19J43J87n17m09
$$ 191 -31 58 -123 -202 87 257 12 -599 -397 -333 235 429 -18 -325 -560 -321 298 441 628 111 -298
4344b98J7K19M10j07p6n8j83K17J05o50L65l5R8K30j1n69j80J15M05O38J0m73
$$ -298 -281 -62 348 241 165 107 -76 141 246 -404 -39 -74 24 254 243 -326 -506 -391 14 652 662 189
4366A89p25K5N77N06pl76r4o30M89J87K13l02l14K14N7J05k81k27J24J04M65P4
$$ 189 -536 -511 66 572 565 189 95 -535 -46 141 354 52 -262 -48 9 114 -167 -394 -270 -166 299 373
4388C73n7r05o6M35N46K23j14l41l98k98M83M92m7k80Q4l20M9Q5l28k5K55L24
$$ 373 316 -589 -655 -220 326 549 435 94 -304 -602 -119 373 326 46 130 -190 -141 -56 -384 -409 -154 170
4410A70j07J1L4o62P2N69M18R7o49l27j05M03N58M02n80l61m07N8M20J99j25K8
$$ 170 63 74 108 -554 -482 87 505 602 -47 -374 -479 -76 482 884 304 -57 -464 -406 14 213 88 116
4432A16k85j01J01J16J6l50L13N70j39k93m78J39O1M59L17m8l13m63J5O4L50K47
$$ 116 -169 -270 -169 -53 -37 -387 -74 496 357 64 -414 -275 -214 245 562 514 201 -262 -247 -183 167 414
4454D14k79k76j24J16k42L96J89j98L5K06j20k65p3k15L46N54N7k24o42L2K01
$$ 414 135 -141 -265 -149 -391 5 194 -4 31 237 117 -148 -221 -436 -90 464 521 297 -345 -313 -112
4475a12L82L71k67n34l34J63Q2O34j01j48k97l4K8J35J09k82K10J78j29J48l34
$$ -112 270 641 374 -160 -494 -331 -249 385 284 136 -161 -195 -167 -32 77 -205 5 183 54 202 -132
4496a32k89L59L26M55j06m31n48O4L20L02J98m38L2k65j92K90K15j12J78l04P9
$$ -132 -421 -62 264 719 613 182 -366 -302 18 320 518 80 112 -153 -345 -55 160 48 226 -78 1
4517AQj97K9K15K17r2L33n75r4m83M43L32N12k34l50q68L84J27N40J50l06J43
$$ 1 9 -188 -159 56 273 181 514 -61 -155 -638 -195 137 649 415 65 -803 -419 -292 248 398 92 235
4539B35m87P4pL04J10r2k67L61q9k90j36L14K37J1j8qn84j54M19K49n9J28o47
$$ 235 -252 -178 -185 119 229 137 -130 231 142 -148 -284 30 267 278 260 252 -332 -486 -67 182 123 251 -396
4562c96nr1M22K03J38j88k22K64m78K75k44J89L90j61j17J75l37l44N67L03J50
$$ -396 -401 -492 -70 133 271 83 -139 125 -353 -78 -322 -133 257 96 -21 154 -183 -527 40 343 493
4583D93m27n0l22o3K89K77n3J0J16n63j7M43K13k48J21k10Ll00k4K6M15Q0Q6m9
$$ 493 66 16 -306 -369 -80 197 144 154 270 -293 -310 133 346 98 219 9 12 -288 -312 -286 129 209 295 246
4607B46o30K64l10K91N49k99q6m0k62K00j03K00J66K63o18Nl4J70L7M42l15l28
$$ 246 -384 -120 -430 -139 410 111 25 -15 -277 -77 -180 20 186 449 -169 -164 -198 -28 9 451 136 -192
4629a92M11o2k25k38M46O3j06K6k42l26J13K74K62L3P2l33l80q1L06J00K22P9
$$ -192 219 157 -68 -306 140 203 97 123 -119 -445 -332 -58 204 237 309 -24 -404 -485 -179 -79 143 222
4651B22o7l54K11q2O2j50K67J50k66l75O8L92K6J46j05j28k33j53M70k1O9K50
$$ 222 155 -199 12 -70 -8 -158 109 259 -7 -382 -314 78 104 250 145 17 -216 -369 101 80 149 399
4673C99l91J0l29O7K79j11J68L9j08k50N1O0N0q4J93J81k97j12k93L08K16J40
$$ 399 8 18 -311 -244 35 -76 92 131 23 -227 -176 -116 -66 -150 43 224 -73 -185 -478 -170 46 186
4695A86L9k15l01q7J38N26k60K05p6j41m4l15J61K32k8K44j98rl35J85K09J97
$$ 186 225 10 -291 -378 -240 286 26 231 155 14 -30 -345 -184 48 20 264 66 57 -278 -93 116 313
4717C13J42n6j61n15m9J06M7N51J5j17j74m14K26M9K94n5j74j29j95m0K25O9J45
$$ 313 455 399 238 -277 -326 -220 -173 378 393 276 102 -312 -86 -37 257 202 28 -101 -296 -336 -111 -42 103
4740A03J44J65m90j80k28L09K12L73l94J53j98l76P7J62J62K67K3l27o6k41K54
$$ 103 247 412 -78 -258 -486 -177 35 408 14 167 -31 -407 -330 -168 -6 261 284 -43 -109 -350 -96
4761i6p3L91j17k15r5N6PO5K51J00k04O4m74N6J6M13J12J2m37r2j15l8N01m3L41
$$ -96 -169 222 105 -110 -205 -149 -142 -77 174 274 70 134 -340 -284 -268 145 257 269 -168 -260 -375 -413 88 45 386
4786C86l33j6j75k73K06K62o1K44m0l72K1j18L28J67R1k0m34Rl84J82M92K02j59
$$ 386 53 37 -138 -411 -205 57 -4 240 200 -172 -151 -269 59 226 317 297 -137 -128 -512 -330 162 364 205
4809B05J0m77K2L12j87L82rl25RM9J8J1l9K60k46L41j99l24j83K36J44K13J97
$$ 205 215 -262 -240 72 -115 267 258 -67 -58 -9 9 20 -19 241 -5 336 137 -187 -370 -134 10 223 420
4832D20l77n02QJ57L98L85k19k40k24k0J47J84j13J81K02k31j20j82K27j98P6
$$ 420 43 -459 -451 -294 104 489 270 30 -194 -214 -67 117 4 185 387 156 36 -146 81 -117 -41
4853d1M23l38K18n44j54Q0O51L08l81k47k00k15J65M16M52l25l64J42l72K38K05
$$ -41 382 44 262 -282 -436 -356 295 603 222 -25 -225 -440 -275 141 593 268 -96 46 -326 -88 117
4874A17n3j64K45qk21j12j61o3L30N66Q5o88n99M2J31P76L50j44m08l84J79K61
$$ 117 64 -100 145 137 -84 -196 -357 -420 -90 476 561 -127 -726 -684 -553 223 573 429 21 -363 -184 77
4896G7rJ00j31j10P6K9J69q2l11l0L31N5k72j87j86J53L17N50j95m87j93l36P37
$$ 77 68 168 37 -73 3 32 201 119 -192 -222 109 164 -108 -295 -481 -328 -11 539 344 -143 -336 -672 65
4919F5J14M48j87k75n79K76K60j68L26P4m16M64m57j63n7rK35K88K52n36l55j59
$$ 65 179 627 440 165 -414 -138 122 -46 280 354 -62 402 -55 -218 -275 -284 -49 239 491 -45 -400 -559
4941e59K86N62L33j75q38KM7M35N62j01l52m46J46J85J17J50n06m7J82K59k45
$$ -559 -273 289 622 447 -391 -389 -342 93 655 554 202 -244 -98 87 204 354 -152 -199 -17 242 -3
4962ck82r9J24N51K81o0m92l34l16Q00J46J53J18o73k67K31L52J70k43n96K51
$$ -3 -285 -384 -260 291 572 512 20 -314 -630 170 316 469 587 -86 -353 -122 230 400 157 -439 -188
4983a88J97j71K80m20J46j30M40J25j99l97l85O39K89K03K12o54n08M6K54O34
$$ -188 9 -162 118 -302 -156 -286 154 279 80 -317 -702 -63 226 429 641 -13 -521 -475 -221 413
5003D13K81l82l18m48K46K09M71p42K12K6L9P9j40j97Q4L31L18p2l20o19r5O67
$$ 413 694 312 -6 -454 -208 1 472 -270 -58 -32 7 86 -54 -251 -167 164 482 410 90 -529 -624 43
5025D3K36L67m13n44j28Q7M01K73K5k95l26N2L62r4L5k60QP7K92j16j44j93j13
$$ 43 279 646 233 -311 -439 -352 49 322 347 52 -274 -222 140 46 81 -179 -171 -94 198 82 -62 -255 -368
5048c68O51P5o6n84J7L4R9Q08k8p63l11J51J84J04L44j20m58J32N6L39n44J06
$$ -368 283 358 292 -292 -275 -241 -142 666 638 -125 -436 -285 -101 3 347 227 -231 -99 -43 296 -248 -142
5070a42p5P6N83k69J9m51j68K75K89M78l58l25n74K81L04M59o3l89k74j80K28
$$ -142 -217 -141 442 173 192 -259 -427 -152 137 615 257 -68 -642 -361 -57 402 339 -50 -324 -504 -276
5091b76L72J57j57p0O2Kj96lj77K79L8K96j8j96l95q0L99K99m5o0l53l5m1J93
$$ -276 96 253 96 26 88 90 -106 -109 -286 -7 31 327 309 113 -282 -362 37 336 291 231 -122 -157 -198 -5
5115eL06P0l94l3l91K37L08J60n2L4p3P2l61q9l5J51M53L2n7n97P0RL4N66j1l66
$$ -5 301 371 -23 -56 -447 -210 98 258 206 240 167 239 -122 -211 -246 -95 358 390 333 -264 -194 -185 -151 415 404 38
5141C8l30oJ54J41j34K63j94k54L45J11j97O4l27L24J13k22J8j74j53M11K45K9
$$ 38 -292 -298 -144 -3 -137 126 -68 -322 23 134 -63 1 -326 -2 111 -111 -93 -267 -420 -9 236 265
5163B65Mm32j60P1J59M02J11k82m30K50J17j03l4J40lJ60l25M5k27L03K2R7nj1
$$ 265 269 -163 -323 -252 -93 309 420 138 -292 -42 75 -28 -62 78 75 235 -90 -45 -272 31 53 150 145 134
5187A34k45m79M94J81K39r1j84r8l22K09K14L41k43o2l5j49j92L53L2NK08k97
$$ 134 -111 -590 -96 85 324 233 49 -49 -371 -162 52 393 150 88 53 -96 -288 65 97 102 310 13
5209A3nk73R7Ok7O63j07p4p76J26J55K93Q2l23K33m05K21j52J57K44L01l16o4
$$ 13 8 -265 -168 -162 -189 474 367 293 -483 -357 -202 91 173 -150 83 -322 -101 -253 -96 148 449 133 69
5232F9j3k15N2L4M3M3J72k27k21J57J62N1L17l02j96k38j30K02J9L77J78j82l19
$$ 69 56 -159 -107 -73 -30 13 185 -42 -263 -106 56 107 424 122 -74 -312 -442 -240 -221 156 334 152 -167
5255a67l7q9k9M46J59k11j42l6j04L7L56k22M13j47m68K5J3j36Q4L38L97l05k48
$$ -167 -204 -293 -322 124 283 72 -70 -106 -210 -173 183 -39 374 227 -241 -216 -203 -339 -255 83 480 175 -73
5278g3k73N3J07M56j8K9k1k32j75J10K22j49n6J21k15k02J20O2L74P5k82K35l14
$$ -73 -346 -293 -186 270 252 281 260 28 -147 -37 185 36 -20 101 -114 -316 -196 -134 240 315 33 268 -46
5301d6j41mL02J69j03j9k67o3J63j06M56k72j4j09j87RJ09L3L48J21k92P0j55
$$ -46 -187 -191 111 280 177 158 -109 -172 -9 -115 341 69 55 -54 -241 -232 -123 -90 258 379 87 157 2
5324Bm52L88n3K57J90k86m07K78n5J02M23k96j23m6j5j4J82Q2j09J79k7j70j4
$$ 2 -450 -62 -115 142 332 46 -361 -83 -138 -36 387 91 -32 -78 -93 -107 75 157 48 227 200 30 16
5347A6k65L00kK57j27k37m38M87l14L22J31J05k90k65j10L38K44k01M35n96K84
$$ 16 -249 51 49 306 179 -58 -496 -9 -323 -1 130 235 -55 -320 -430 -92 152 -49 386 -210 74
5368G4k99K7q3N95j22j63r2J85k19j69L13R1o0J66q9m65Q9L8K54J24Q8k94j73
$$ 74 -225 -198 -281 314 192 29 -63 122 -97 -266 47 138 78 244 155 -310 -221 -183 71 195 283 -11 -184
5391a84R7J3j26L06N5L58m33k01jj99L06N0L48l00m03K69p7K1L11j16J13k76k58
$$ -184 -87 -74 -200 106 161 519 86 -115 -116 -315 -9 41 389 89 -314 -45 -122 -101 210 94 207 -69 -327
5414c27p4K22L99j03J45O8n62J60l63K93L02lj5j51j33j01J97j74K34L52k21l15
$$ -327 -401 -179 220 117 262 330 -232 -72 -435 -142 160 157 142 -9 -142 -243 -46 -220 14 366 145 -170
5436a70l6j6L8K40K22l1l96j3%L0M29J55j63j37k83j04O3K01q0K81r0n3o6k07
$$ -170 -206 -222 -184 56 278 247 -149 -162 -162 -132 297 452 289 152 -131 -235 -172 29 -51 230 140 87 21 -186
5460a86k39K29N25k2j19o1l36q1K13K78Ok22Q1l14P2K01K02j3k29n0Q1J20k79
$$ -186 -425 -196 329 307 188 127 -209 -290 -77 201 207 -15 66 -248 -176 25 227 214 -15 -65 16 136 -143
5483a43l4l6L62L82j48m37j95m10K23P52j88J04k66k84j29L05L35J6j08J09k27
$$ -143 -177 -213 149 531 383 -54 -249 -659 -436 316 128 232 -34 -318 -447 -142 193 209 101 210 -17
5504a7k55K85j05N6j3M8J37j21ll0l12L79K27K03l56m40k86O46L07J58k68m06
$$ -17 -272 13 -92 -36 -49 -1 136 15 12 -18 -330 49 276 479 123 -317 -603 43 350 508 240 -166
5526a66q8J27M26M3k93jJ01k13J67j73k5R9o1J59j4J96m76r8Q3K35L75j31k84
$$ -166 -254 -127 299 342 49 48 149 -64 103 -70 -95 4 -57 102 88 284 -192 -290 -207 28 403 272 -12
5549a2l39j60M67L31J38k01k58l05K57L21k4J27m40J84j03Q4q0l71l9Q7O17j30
$$ -12 -351 -511 -44 287 425 224 -34 -339 -82 239 215 342 -98 86 -17 67 -13 -384 -423 -336 281 151
5571A51rl99j15J69K94L10k00k94k23P4L11L09k6n00J45q0M2L9q0J31k72K79K64
$$ 151 142 -257 -372 -203 91 401 201 -93 -316 -242 69 378 352 -148 -3 -83 -41 -2 -82 49 -223 56 320
5594C20m75j17j17j09O47L39n0o18l70O2M77L10K79m84j38j22Q6P9L12o6k03q
$$ 320 -155 -272 -389 -498 149 488 438 -180 -550 -488 -11 299 578 94 -44 -166 -80 -1 311 245 42 34
5616C4j65MQ4k62m6K32K08L1k1j3o33L93M07K30k29r9o93l0Q06K31j0q1m89k65
$$ 34 -131 -127 -43 -305 -351 -119 89 120 99 86 -547 -154 253 483 254 155 -538 -568 238 469 459 378 -111 -376
5640c76N16p4R9k31J08j75K91N2L6n11r4N47L34k1p18J63m92N69J3N10l95o50
$$ -376 140 66 165 -66 42 -133 158 210 246 -265 -359 188 522 501 -217 -54 -546 23 36 546 151 -499
5662d99K73j01O51p1j44j76k52J28J59j26K64j65O2L0L71l06j15m20J15L06M64
$$ -499 -226 -327 324 253 109 -67 -319 -191 -32 -158 106 -59 3 33 404 98 -17 -437 -322 -16 448
5683D48j8k19m94L0L86L15m5n41j85J51Q1J34J0l9j99R3oM3J28q0K61j69k21L93
$$ 448 430 211 -283 -253 133 448 403 -138 -323 -172 -91 43 53 14 -185 -92 -98 -55 73 -7 254 85 -136 257
5707B57p9o06J22J89L45J45n1m32k55L07K91P9q3k64j71L4J09J43%j55Q9j55N1
$$ 257 178 -428 -306 -117 228 373 322 -110 -365 -58 233 312 229 -35 -206 -172 -63 80 80 -75 14 -141 -90
5730i0r4J82j25J06L55m0L5k12m55Q8L49K40k38K03m41o2k6K56J78L4j21l49k5
$$ -90 -184 -2 -127 -21 334 294 329 117 -338 -250 99 339 101 304 -137 -199 -225 31 209 243 122 -227 -252
5753b52N10j05j10J2L7N5J06j96k24L6J59L2R5j34k22j7j5K97M7R7k52l39L55
$$ -252 258 153 43 55 92 147 253 57 -167 -131 28 60 155 21 -201 -218 -233 64 111 208 -44 -383 -28
5776b8l69K58L26j8k74J30j18R5J28l19r6L24K00k72K79p21J88K24R6K44q7m09
$$ -28 -397 -139 187 169 -105 25 -93 2 130 -189 -285 39 239 -33 246 -475 -287 -63 33 277 190 -219
5798b19j56J29J46K86l5K0k51J51j61L4p0K55M5m5K5k73j16J15L57k02J38K25
$$ -219 -375 -246 -100 186 151 171 -80 71 -90 -56 -126 129 174 129 154 -119 -235 -120 237 35 173 398
5820C98l25l00L01k42K69r9l9Ll58L68m6K33p8O0l11k3J15ll9K92k80O5J8k40
$$ 398 73 -227 74 -168 101 2 -37 -34 -392 -24 -70 163 85 145 -166 -189 -74 -77 -116 176 -104 -39 -21 -261
5844b61J96j50J93p0L76k93k37q4K43J6K85k21L13j62l62J63k0P0N3N7q1N2l62
$$ -261 -65 -215 -22 -92 284 -9 -246 -330 -87 -71 214 -7 306 144 -218 -55 -75 -5 48 105 24 76 -286
5867b86P5N6M6R0M7K0j82P2o9K00J22k9k80K16l10NJ05K13J11j08o3l52J50Q3
$$ -286 -211 -155 -109 -19 28 48 -134 -62 -131 69 191 162 -118 98 -212 -207 -102 111 222 114 51 -301 -151 -68
5891f8J36M5P9j61lj49o1L14R9q7j15L0K55m77K24k10L44J27m54J5j35M6J96j5
$$ -68 68 113 192 31 28 -121 -182 132 231 144 29 59 314 -163 61 -149 195 322 -132 -117 -252 -206 -10 -25
5915b5k26K78j08M9j53J31j9J57k10O4j84k5J94P7L1M4R7k45l4l48L95L11k33
$$ -25 -251 27 -81 -32 -185 -54 -73 84 -126 -62 -246 -271 -77 0 31 75 172 -73 -107 -455 -60 251 18
5938A8O5qk82q9K53J62j43N9J20k05p3K82l81J15N21o9m16Q8j15l54L51J60K9
$$ 18 83 75 -207 -296 -43 119 -24 35 155 -50 -123 159 -222 -107 414 345 -71 17 -98 -452 -101 59 88
5961H8J25N1n43R3j97N25J00Om4l42p6j46K01J6K24j91J75l9j09J24r0K4K18M
$$ 88 213 264 -279 -186 -383 142 242 248 204 -138 -214 -360 -159 -143 81 -110 65 26 -83 41 -49 -25 193 197
5985A97k48r3m7R4N7L00j40J51k89k5M5J4J33N3m2k49k41M57j94O4J18J0j81j
$$ 197 -51 -144 -191 -97 -40 260 120 271 -18 -43 2 16 149 202 160 -89 -330 127 -67 -3 115 125 -56 -57
6009e7K12k86j17M93k47Q1l7k21J77j11J78K19l26K5J6k76K91J4kq2J9m9J3r6
$$ -57 155 -131 -248 245 -2 79 42 -179 -2 -113 65 284 -42 -17 -1 -277 14 28 26 -56 -37 -86 -73 -169
6033a69K82k3P8pO3k58j24L1J08K28j30K06j86m50J29Q7J45J85j30j21k61L69
$$ -169 113 90 168 161 224 -34 -158 -127 -19 209 79 285 99 -351 -222 -135 10 195 65 -56 -317 52
6055E2QK16l77n7K16K27N9k93j94J04OL34P0l31m40J35J51J42N1R6j93j37m9P
$$ 52 60 276 -101 -158 58 285 344 51 -143 -39 -33 301 371 40 -400 -265 -114 28 79 175 -18 -155 -204 -197
6079a97L41m0j67k69M08l3j32J02k70Q8K83o6j06J62l35m2Q5O27l16r0l79j36
$$ -197 144 104 -63 -332 76 43 -89 13 -257 -169 114 48 -58 104 -231 -273 -188 439 123 33 -346 -482
6101d82M30M62j47o7m52J63l07M69q4R6K04j21Q4l06J6k20J47p5K81O8j41m00
$$ -482 -52 410 263 196 -256 -93 -400 69 -15 81 285 164 248 -58 -42 -262 -115 -190 91 159 18 -382
6123c82P1n5M12K81J78o26k51J82J95K86R9k82l47J08J6L07j44j62K97J27k65
$$ -382 -311 -366 46 327 505 -121 -372 -190 5 291 390 108 -239 -131 -115 192 48 -114 183 310 45
6144D5J48r3l21N3J50K38J39j46m88k16L55L00K54l53k62l32M44J66J90P2k42
$$ 45 193 100 -221 -168 -18 220 359 213 -275 -491 -136 164 418 65 -197 -529 -85 81 271 343 101
6165A01k97J45j49L07j1q3o6L4K87l44m6k24j84L59L56J53n00o0m0R3M72j04q
$$ 101 -196 -51 -200 107 96 13 -53 -19 268 -76 -122 -346 -530 -171 185 338 -162 -222 -262 -169 303 199 191
6188A91j94j26J48J26k58K50j99K4L2J63j00j97k79L30M68m5j59m01o0J51K07
$$ 191 -3 -129 19 145 -113 137 -62 -38 -6 157 57 -140 -419 -89 379 334 175 -226 -286 -135 72
6209G2J49N4k57k42K0J81J62K9j21P6k11M1J14j89J49j12p6L49R3m35o0k13M67
$$ 72 221 275 18 -224 -204 -23 139 168 47 123 -88 -47 67 -122 27 -85 -161 188 281 -154 -214 -427 40
6232D0M76k56j73j62m84O10L23Q3l18j50k35J1L68J06j65k20K08k71J10J5J13
$$ 40 516 260 87 -75 -559 51 374 457 139 -11 -246 -235 133 239 74 -146 62 -209 -99 -84 29
6253B9j58k38L37L00l78l5l75K88L43n0J46q8n67J46M69K04N1l62k09p5K2K04
$$ 29 -129 -367 -30 270 -108 -143 -518 -230 113 63 209 121 -446 -300 169 373 424 62 -147 -222 -200 4
6275DK7J2j65nL63j77q6k77J46P9L49K06o62j20j99L26L33J09j21q6n7k04K31
$$ 4 31 43 -122 -127 236 59 -27 -304 -158 -79 270 476 -186 -306 -505 -179 154 263 142 56 -1 -205 26
6298B6M72m02j60k75K45L1J52qj01p3J61K31p2l04j94k8L82RL93n39j31k25L93
$$ 26 498 96 -64 -339 -94 -63 89 81 -20 -93 68 299 227 -77 -271 -299 83 92 485 -54 -185 -410 -17
6321a7K33R1j54k02j03J19R0J80P1j67k06K82k63R7L5l4k42M85K6l48j45j32L24
$$ -17 216 307 153 -49 -152 -33 57 237 308 141 -65 217 -46 51 86 52 -190 295 321 -27 -172 -304 20
6344B0L3L37j33l66j83jL04P1K7r3j46j42K55R3k60M1L10l71L77j49l2%J43o2
$$ 20 53 390 257 -109 -292 -293 11 82 109 16 -130 -272 -17 76 -184 -143 167 -204 173 24 -8 -8 135 73
6368G3J23M9k47n6j6j81K84K72m96q1j40M17OM03k25j98j43Q4j57L24k54k52O99
$$ 73 196 245 -2 -58 -74 -255 29 301 -195 -276 -416 1 7 410 185 -13 -156 -72 -229 95 -159 -411 288
6391B88k17l0j97J15l70K55K29R6q1k87m1K05J65j58K50k70rrj24J61Q6K06k93
$$ 288 71 41 -156 -41 -411 -156 73 169 88 -199 -240 -35 130 -28 222 -48 -57 -66 -190 -29 57 263 -30
6414c0N8J77p4l0k64L06p1K10l04J0m2Nj00M12j6J0k17j99p8J04K29j11R1k55
$$ -30 28 205 131 101 -163 143 72 282 -22 -12 -54 -49 -149 263 247 257 40 -159 -237 -133 96 -15 76 -179
6438a79K41j02J56k77L49k31J13k16k0j9L77K0J26k14q3j64M7J29r8J75jQk58
$$ -179 62 -40 116 -161 188 -43 70 -146 -166 -185 192 212 338 124 41 -123 -76 53 -45 130 129 137 -121
6461a21J08k79J24Q8M38o5l94J55n5n9K34j48N9j50k3J49l69J88K2J82Lj97R3
$$ -121 -13 -292 -168 -80 358 293 -101 54 -1 -60 174 26 85 -65 -88 61 -308 -120 -98 84 87 -110 -17
6484a7r7L8M0J08M7Ok38m8J86k91L54P4j90J65k83j45N2M9J92J48m6P0L7k20j03
$$ -17 -114 -76 -36 72 119 125 -113 -161 25 -266 88 162 -28 137 -146 -291 -239 -190 2 150 104 174 211 -9 -112
6509a12K62K17j04K5m25k01K16nL15pR5l86q7K72p3K78J08m37k07M06j64j92J27
$$ -112 150 367 263 288 -137 -338 -122 -127 188 181 276 -110 -197 75 2 280 388 -49 -256 150 -14 -206 -79
6532g9L67j94N3l2k38Q3P5Q2k09J26O5j48J6l45J12K55L13k66k85K06M9j38N0
$$ -79 288 94 147 115 -123 -40 35 117 -92 34 99 -49 -33 -378 -266 -11 302 36 -249 -43 6 -132 -82
6555h2j0K66j96M0j50j43K99M7N5q1O6j48j40l1K03J44L78j21l15k42L9o3J48
$$ -82 -92 174 -22 18 -132 -275 24 71 126 45 111 -37 -177 -208 -5 139 517 396 81 -161 -122 -185 -37
6578c7J66j28j15J31o7k36L46J2N3N4q6J30k78J05J25j39K4k60ql9K20K27j10
$$ -37 129 1 -114 17 -50 -286 60 72 125 179 93 223 -55 50 175 36 60 -200 -208 -247 -27 200 90
6601I0O7p4m8o9p5M1J35K01j94L8k20J13K2k71J73K13j84K86j51L6j17j84J64
$$ 90 157 83 35 -34 -109 -68 67 268 74 112 -108 5 27 -244 -71 142 -42 244 93 129 12 -172 -8
6624hQ9J70m54K15k9J32n0R1k87N9j58J33j15J73P9K16j76o2j05q8J61j61K80
$$ -8 81 251 -203 12 -17 115 65 156 -131 -72 -230 -97 -212 -39 40 256 80 18 -87 -175 -14 -175 105
6647A05m6k54L16k70M01m43L14j46L7k8j38J92j35qJ33N1l9J38r6j24q3J14J37
$$ 105 59 -195 121 -149 252 -191 123 -23 14 -14 -152 40 -95 -103 30 81 42 180 84 -40 -123 -9 128
6670A28k3K04k73k23J27Q2K00R9j46n05N4M63j69P9J30j55k76NJ26K51J14m66
$$ 128 105 309 36 -187 -60 22 222 321 175 -330 -276 187 18 97 227 72 -204 -199 -73 178 292 -174
6692a74N83l54Mj21Mk38K23p7K09j2l33L27n7J42M2j5l38j28j59K96N76J20n78
$$ -174 409 55 59 -62 -58 -296 -73 -150 59 47 -286 41 -16 126 168 153 -185 -313 -472 -176 400 520 -58
6715e8j69Q5L3K0P0j35K24J43j28J99j25l82J02l4N17j29m10j43K2J83K38Q6q6
$$ -58 -227 -142 -109 -89 -19 -154 70 213 85 284 159 -223 -121 -155 362 233 -177 -320 -298 -115 123 209 123
6738A23k38n6j17K78J92o4k00J5L4L9kj16j12Q0L43kL8m32j89K7K21O62l62l01
$$ 123 -115 -171 -288 -10 182 118 -82 -67 -33 6 4 -112 -224 -144 199 197 235 -197 -386 -359 -138 524 162 -139
6762a39J00o8O3K03J37j62k31j12J14N13r7l35J18j06n0K40l50K32k62r3L54L88
$$ -139 -39 -107 -44 159 296 134 -97 -209 -95 418 321 -14 104 -2 -52 188 -162 70 -192 -285 69 457
6784D57k84l77m52J24O77J40j46k66k26Q6M81o2P4k34k50R8J17M9j7k00kJ25L54
$$ 457 173 -204 -656 -532 145 285 139 -127 -353 -267 214 152 226 -8 -258 -160 -43 6 -11 -211 -213 -88 266
6807B66k03l47J27j06K67M29l07M0k12m86P72M7j33k6k25n5j18L45K16m52J96
$$ 266 63 -284 -157 -263 4 433 126 166 -46 -532 240 287 154 128 -97 -152 -270 75 291 -161 35
6828C5j69J23J54o3j44k08Q1L11L95m15k15k69L96L59j3k41j34k39l8L52J52K71
$$ 35 -134 -11 143 80 -64 -272 -191 120 515 100 -115 -384 12 371 358 117 -17 -256 -294 58 210 481
6850D81m24l89J24J52K25Ml51NJ68K33j86n12K12J4K32J74j84L9j45j09L21J36
$$ 481 57 -332 -208 -56 169 173 -178 -173 -5 228 42 -470 -258 -244 -12 162 -22 17 -128 -237 84 220
6872B20J3Ml11J9J3J89K46m64l7Q2M0q8R5Mj08J20j13K19j98M1k70j37N97J03
$$ 220 233 237 -74 -55 -42 147 393 -71 -108 -26 14 -74 21 25 -83 37 -76 143 -55 -14 -284 -421 176 279
6896B79m7m28l3j72O32K31l5m56j26K01jJ78j56j76K49n00L36%Qj73K36J13K69
$$ 279 232 -196 -229 -401 231 462 427 -29 -155 46 45 223 67 -109 140 -360 -24 -24 -16 -189 47 160 429
6919D29L3m33Nl60K13L15L17k35m28l17K15J50L45K4l59Q9k1n2p3L54j56j45R1
$$ 429 462 29 34 -326 -113 202 519 284 -144 -461 -246 -96 249 273 -86 3 -18 -70 -143 211 55 -90 1
6942AJ30J0j34k79O7K08K31m5j73l34Q1K46K62K65l42n41j32M79P5m3m2j21N1
$$ 1 131 141 7 -272 -205 3 234 189 16 -318 -237 9 271 536 194 -347 -479 0 75 32 -10 -131 -80
6965h0L3J44p9j33M39l01PJ02J85m22p1n3J18L61O7l63n2k4K21L3J89l44j75K8
$$ -80 -47 97 18 -115 324 23 30 132 317 -105 -176 -229 -111 250 317 -46 -98 -122 99 132 321 -23 -198 -170
6989a70J8J60N18o43K1k10L70j74M7k17J21K69R7k14m4k21J37M9J89J79j47l27
$$ -170 -152 8 526 -117 -96 -306 64 -110 -63 -280 -159 110 207 -7 -51 -272 -135 -86 103 282 135 -192
7011a92j08N06q0P2l52K66j30k54J09J62j31r2r8M78k23j27m8J01K45lJ66j19
$$ -192 -300 206 126 198 -154 112 -18 -272 -163 -1 -132 -224 -322 156 -67 -194 -242 -141 104 101 267 148
7033A48l62K34k03M8L80r4k8l32N2K75j77L25k07L1l07J97M2o8N0p4Mj02L06k19
$$ 148 -214 20 -183 -135 245 151 123 -209 -157 118 -59 266 59 90 -217 -20 22 -46 4 -70 -66 -168 138 -81
7057h1O5K7l2R6M7j08k3k56r1M46L06m87K12j98p6K28q9r9M3N9J77l44J72q4N3
$$ -81 -16 11 -21 75 122 14 -9 -265 -356 90 396 -91 121 -77 -153 75 -14 -113 -70 -11 166 -178 -6 -90 -37
7082c7r4P6Q7J92k00n9K20r5J65j92J71j91l50J74J09J41kn3j15j77m4L55k35
$$ -37 -131 -55 32 224 24 -35 185 90 255 63 234 43 -307 -133 -24 117 115 62 -53 -230 -274 81 -154
7105a54J72O6J16l13J45k88J79r7J08L12k18J08o8NK6j40K28j23l18J58J3J49
$$ -154 18 84 200 -113 32 -256 -77 -174 -66 246 28 136 68 73 99 -41 187 64 -254 -96 -83 66
7127F6r9L55m03K06k41j29L22JK24k84Q8J24l62J76j3Q8O1l9j4k19kk79M27J6
$$ 66 -33 322 -81 125 -116 -245 77 78 302 18 106 230 -132 44 31 119 180 141 127 -92 -94 -373 54 70
7151G0J59Qm53M6j0L42R2k93O4j09J32j0o6k28J90j6J22p6J9J61j79o8J57J60
$$ 70 229 237 -216 -170 -180 162 254 -39 25 -84 48 38 -28 -256 -66 -82 40 -36 -17 144 -35 -103 54 214
7175B14j14q9k15J6K39R3k5M9j76k67L20j86K80j11p0K63n47K21J73j02n3K42
$$ 214 100 11 -204 -188 51 144 119 168 -8 -275 45 -141 139 28 -42 221 -326 -105 68 -34 -87 155
7197A55Kj65r6j04N46j56J95m4k78k28J30O8P0J09j33J33k68j35K20Ln6j00K14
$$ 155 157 -8 -104 -208 338 182 377 333 55 -173 -43 25 95 204 71 204 -64 -199 21 24 -32 -132 82
7220H2J02j07j28r1J82oj73qJ63p0l7j12M10Q9k27l27Q2N3J15J39j54J63l27K19
$$ 82 184 77 -51 -142 40 34 -139 -147 16 -54 -91 -203 207 296 69 -258 -176 -123 -8 131 -23 140 -187 32
7244C2j0j99J40l7J42j5J91j73j00j1p5J20K22J05k12k44j85L33r9N9j17J20k24
$$ 32 22 -177 -37 -74 68 53 244 71 -29 -40 -115 5 227 332 120 -124 -309 24 -75 -16 -133 -13 -237
7267b37J33k9K99k02j33K10Q6Lj33k16J72K22J00l90L36l05j81J49L79O6l33k17
$$ -237 -104 -133 166 -36 -169 41 127 130 -3 -219 -47 175 275 -115 221 -84 -265 -116 263 329 -4 -221
7289b21J56K15k18N84n49J37j48J1K22k31j40J03K14o1K17k90j05q0J70L32n9
$$ -221 -65 150 -68 516 -33 104 -44 -33 189 -42 -182 -79 135 74 291 1 -104 -184 -14 318 259
7310B59k3k16j41l58K96K03J95k11j30q1M10j49J62j50k13L71q8p3M0n45L69k45
$$ 259 236 20 -121 -479 -183 20 215 4 -126 -207 203 54 216 66 -147 224 136 63 103 -442 -73 -318
7332c18N11K32n52l2j43p8M74R1n3j42k87K19R7L08m9n73K07J32l2N3K0k7n0o5
$$ -318 193 425 -127 -159 -302 -380 94 185 132 -10 -297 -78 19 327 278 -295 -88 44 12 65 85 58 8 -57
7356e7J42N9j89k02J11J63K96j18k70M0l48L23K46j7k59l59L00J00L26j26j48
$$ -57 85 144 -45 -247 -136 27 323 205 -65 -25 -373 -50 196 179 -80 -439 -139 -39 287 161 13
7377A3m9l28M34j20M0roq0J70m4R9k07m04J39M92J56p3k00n48K51L80K96m36N7
$$ 13 -36 -364 70 -50 -10 -19 -25 -105 65 21 120 -87 -491 -352 140 296 223 23 -525 -274 106 402 -34 23
7401B3j26p7K21J47J0m68K63j28K32p4j77Kr9J01L60k09L9l89J12K48L50k5m65
$$ 23 -103 -180 41 188 198 -270 -7 -135 97 23 -154 -152 -251 -150 210 1 40 -349 -237 11 361 336 -129
7424a29Q6j19m4L72K01m60J3O1K20q5K8r6j67j7M31K1j10k77j37L6K81J86r7l44
$$ -129 -43 -162 -206 166 367 -93 -80 -19 201 116 144 48 -119 -136 295 316 206 -71 -208 -172 109 295 198 -146
7448a46k67L37K10K44j55m49K94n95P05N4J12k32m38L03J53r0k31k29L01q2K20
$$ -146 -413 -76 134 378 223 -226 68 -527 178 232 344 112 -326 -23 130 40 -191 -420 -119 -201 19
7469A9J05j96j01op3L67Q9q8j83k50L60J71J20p6k08j81J25j60L53j50Q4j54J2
$$ 19 124 -72 -173 -179 -252 115 204 116 -67 -317 43 214 334 258 50 -131 -6 -166 187 37 121 -33 -21
7492b1J34P2l81RO8PN40l27l06p8p4K74P1K27j94j57l29M18L23j35k27P1j74J30
$$ -21 113 185 -196 -187 -119 -112 428 101 -205 -283 -357 -83 -12 215 21 -136 -465 -47 276 141 -86 -15 -189 -59
7516e9R3%n8o6j71O03k6m54q9r7L45J92o7Nl58J61l03M79j30R8k5l35j7J78M54
$$ -59 34 34 -24 -90 -261 342 316 -138 -227 -324 21 213 146 151 -207 -46 -349 130 0 98 73 -262 -279 -101 353
7541C53n25L57k28J72k1j6J26k75k41L05K56k46J00k81J16K85k3k1m38L63l13
$$ 353 -172 185 -43 129 108 92 218 -57 -298 7 263 17 117 -164 -48 237 214 193 -245 118 -195
7562a95j34L41L13k73j04k82K02K54qj47j38L36j28j21J5K5J16r9J99j7L2l07
$$ -195 -329 12 325 52 -52 -334 -132 122 114 -33 -171 165 37 -84 -69 -44 72 -27 172 155 187 -120
7584a20O6j08L03L6N9j93k27R8K14J40j60p5K2j20K03%M9j91k04P9L38n3J64m79
$$ -120 -54 -162 141 177 236 43 -184 -86 128 268 108 33 55 -65 138 138 187 -4 -208 -129 209 156 320 -159
7608a59J39Q2J00J55j97j96k36J16L40J20k14j06M1O3l22M11j52n1J25k80K24
$$ -159 -20 62 162 317 120 -76 -312 -196 144 264 50 -56 -15 48 -274 137 -15 -66 59 -221 3
7629Cj53l0J3J76J52J29j84j55o8k02K96L1o0K7j5k33K38O1K13l28K03l29M23
$$ 3 -150 -180 -167 9 161 290 106 -49 -117 -319 -23 8 -52 -25 -40 -273 -35 26 239 -89 114 -215 208
7652B08k22P0J91p6m22J37J05l3N4m8J45J32r8k29o5k27L37j83N08j13J08l92
$$ 208 -14 56 247 171 -251 -114 -9 -42 12 -36 109 241 143 -86 -151 -378 -41 -224 284 171 279 -113
7674a13j51r3N00qP0m83K18J5j19L24r3J44j63K49l63p6J84M7q5j05J9L7j19n
$$ -113 -264 -357 143 135 205 -278 -60 -45 -164 160 67 211 48 297 -66 -142 42 89 4 -101 -82 -45 -164 -169
7698a69L02k42J49J77p4j64m0k0J00j8L9J7k31J37k13J79J44K21j78J26k29j43
$$ -169 133 -109 40 217 143 -21 -61 -81 19 1 40 57 -174 -37 -250 -71 73 294 116 242 13 -130
7720a30o7P9j50J43O3J13m34K90M8P4J44k02j35K53l11L27k21l9p5K03m8j4R7
$$ -130 -197 -118 -268 -125 -62 51 -383 -93 -45 29 173 -29 -164 89 -222 105 -116 -155 -230 -27 -75 -89 8
7743HJ90q1Q3n3k6l7k53K40l19M64k70K38j88j34p8J43q3K75m5P3q4n34L44M46
$$ 8 198 117 200 147 121 84 -169 71 -248 216 -54 184 -4 -138 -216 -73 -156 119 74 147 63 -471 -127 319
7767C19m13J77O5j59l2k40K33K96j0k55L9J11k4k46K55k60J81J64k90R9J8j27
$$ 319 -94 83 148 -11 -43 -283 -50 246 236 -19 20 131 107 -139 116 -144 37 201 -89 10 28 -99
7789i9O3j40J85J18k2n5K9j30r4j08K18m2rQ4j29K77N3K51m06j70O5j42M18j58
$$ -99 -36 -176 9 127 105 50 79 -51 -145 -253 -35 -77 -86 -2 -131 146 199 450 44 -126 -61 -203 215 57
7813E7J19k8r8j7l33J92M2J50q5r6K32k05rL0J76j41j75L34k7j80J37N8j77N2
$$ 57 176 148 50 33 -300 -108 -66 84 -1 -97 135 -70 -79 -49 127 -14 -189 145 118 -62 75 133 -44 8
7837HJ79L5m80K03o0L44l26L61m74J12K00j84K80p6q7Q9k82K14j5q5j23K72l8
$$ 8 187 222 -258 -55 -115 229 -97 264 -210 -98 102 -82 198 122 35 124 -158 56 41 -44 -167 105 67
7860F7J27l32m9J95L1J25k77L91l44J3J60jj35J25j51LK03j05k66K61n3J61j8
$$ 67 194 -138 -187 8 39 164 -113 278 -66 -53 107 106 -29 96 -55 -52 151 46 -220 41 -12 149 131
7883A31k19K16l33J18j56M63j13J25l73J85J7l3K81l47K92n25K87J55j82r3j01
$$ 131 -88 128 -205 -87 -243 220 107 232 -141 44 61 28 309 -38 254 -271 16 171 -11 -104 -205
7904b05K84M4O4j1l88j30L15j25M24K9j56k28Q2K08l7O0J02l59mq1Q8K67j08k25
$$ -205 79 123 187 176 -212 -342 -27 -152 272 301 145 -83 -1 207 170 230 332 -27 -31 -112 -24 243 135 -90
7928i0K31P8K2k21j8j52K65J79m18L0n7J00p3L16j82j28p6l4K80L6J76k03j49
$$ -90 141 219 241 20 2 -150 115 294 -124 -94 -151 -51 -124 192 10 -118 -194 -228 52 88 264 61 -88
7951h8R5L1j1j13Q3j55L56M2l19M7o8M4j50J73J95k2j50j45k53O00P5k86P7k16
$$ -88 7 38 27 -86 -3 -158 198 240 -79 -32 -100 -56 -206 -33 162 140 -10 -155 -408 192 267 -19 58 -158
7975a58K26j68l2K52J15k43o0N8J40k1R5l20o7J71O2K1j95k4K38J11o5q2r8k61
$$ -158 68 -100 -132 120 235 -8 -68 -10 130 109 204 -116 -183 -12 50 71 -124 -148 90 201 136 54 -44 -305
7999c05J27J87O7L2j73j16M4L97o2l0k43k78L25j02J56J69j11l87L35L18j56k30
$$ -305 -178 9 76 108 -65 -181 -137 260 198 168 -75 -353 -28 -130 26 195 84 -303 32 350 194 -36
8021c6l96J48L24l4L28l11k25QQ0J70K31m32L4j49P1R1K15j03j07n8Q0K40l72
$$ -36 -432 -284 40 6 334 23 -202 -194 -114 56 287 -145 -111 -260 -189 -98 117 14 -93 -151 -71 169 -203
8044b03M51k81l89N17L0Ml07M8L3K05J88o8k05l61J04L75Q9J08j80p9M2j19M1
$$ -203 248 -33 -422 95 125 129 -178 -130 -97 108 296 228 23 -338 -234 141 230 338 158 79 121 2 43
8067D3j5j9j84m6M22k40k41J24j1J54N29n24N2l27j00J97M20j28j61J89n56K39
$$ 43 28 9 -175 -221 201 -39 -280 -156 -167 -13 516 -8 44 -283 -383 -186 234 106 -55 134 -422 -183
8089a83K31J00J12k38j26N2P5J13l17J04j44M30j6M4j75p3j55Q7L60K50o88J0
$$ -183 48 148 260 22 -104 -52 23 136 -181 -77 -221 209 193 237 62 -11 -166 -79 281 531 -157 -147
8111a47K65J9r1R7j71o3j66R0J81L09l09j39j01N1J45J03J43m57K25J75J91k76
$$ -147 118 137 46 143 -28 -91 -257 -167 14 323 14 -125 -226 -175 -30 73 216 -241 -16 159 350 74
8133G4k31l26M04p6M2J15l75K19N9L6K40K5k62j86J82j11N89k65m90r5M98M6J6
$$ 74 -157 -483 -79 -155 -113 2 -373 -154 -95 -59 181 206 -56 -242 -60 -171 418 153 -337 -432 66 112 128
8156A28Q5m22r5L70Q1J09m31L02k45K1K18N9j29M7j79j6J20J90l08j76J81J04
$$ 128 213 -209 -304 66 147 256 -175 127 -118 -97 121 180 51 98 -81 -97 23 213 -95 -271 -90 14
8178A4k3jJ31l18n0K01N3o3K94m08q5K13j7
$$ 14 -9 -10 121 -197 -247 -46 7 -56 238 -170 -255 -42 -59
8191e9
$$ Imaginary data points
##PAGE= N=2
##DATA TABLE= (X++(I..I)), XYDATA
0@%%%%%%%%%l2L2l2O4o4Q9j21J29j61K24k57K89l53M18m93N89p04Q21r50J089
$$ 0 0 0 0 0 0 0 0 0 0 -32 0 -32 32 -32 57 -64 65 -96 128 -129 160 -193 225 -268 321 -383 438 -512 577
29E77j249J440j634J852k104K374k669L006l374L770m208M688n213N785o408P089
$$ 577 -672 768 -866 986 -1118 1256 -1413 1593 -1781 1989 -2219 2469 -2744 3041 -3367 3722
45C722p838Q657r548J0525j1596J2772j4075J5512j7108J8899k0915K3201k5815
$$ 3722 -4116 4541 -5007 5518 -6078 6694 -7381 8131 -8977 9922 -10993 12208 -13607
58a3607K8844l2404L6655m1842M8334n6728O8080q4374J09942j56135K66181j013349
$$ -13607 15237 -17167 19488 -22354 25980 -30748 37332 -47042 62900 -93235 172946 -840403
70h40403j180795J358078J377088Q77869n04948r28387o25218K71824M65697J19198
$$ -840403 -2021198 -663120 713968 1591837 1086889 158502 -466716 -194892 270805 390003
80C90003m73014l60679J78973O66623L57565l63030q64841m99409K87478Q05320
$$ 390003 -83011 -443690 -264717 401906 759471 396441 -468400 -967809 -680331 124989
90A24989M93085j85722n57805j99373L98401N96676J02097n65277p81614l22636
$$ 124989 618074 432352 -125453 -324826 73575 670251 772348 207071 -574543 -897179
100h97179L15605N70014K71093j43675k32268N7856L10586J90291k21298m80790
$$ -897179 -581574 -11560 259533 115858 -116410 -58554 252032 442323 221025 -259765
110b59765l04620J56852M57574L48329j1882k38918j52374P4741J29956p4127
$$ -259765 -564385 -407533 50041 398370 386488 147570 -4804 69937 199893 125766
120A25766l16991l03935P929L58872M41093J95729j54241l34489k67361q7688
$$ 125766 -191225 -495160 -487231 -128359 312734 508463 354222 19733 -247628 -335316
130c35316M4518R1981J21541J72798J89575R7974q4968k41070k52401j13947P1037
$$ -335316 -290798 -198817 -77276 95522 285097 383071 298103 57033 -195368 -309315 -238278
141b38278J79499J71297R1059P6o8815j13665j26196r0425j2766N9277P9119N2613
$$ -238278 -58779 112518 203577 203653 134838 21173 -105023 -195448 -208214 -148937 -69818 -17205
153a7205L1242M6840O7514L3406n7907j32861j09838P082J21425J32350L4478
$$ -17205 14037 60877 128391 161797 103890 -28971 -138809 -131727 -10302 122048 156526
164A56526p6328j00106l2456L9662M1346j0087l5199Q391O2005L9306o7778j54396
$$ 156526 80198 -19908 -52364 -12702 28644 18557 -16642 -8251 53754 93060 25282 -129114
176a29114j12454M4828J79859J63122P269j44409j55921k5372J20403J55920P1699
$$ -129114 -241568 -196740 -16881 146241 153510 9101 -146820 -172192 -51789 104131 175830
187A75830l5019p1367m1434j6232l7565o3264k9853N8828J19586Q3119k8551j11911
$$ 175830 140811 69444 28010 11778 -25787 -89051 -118904 -60076 59510 142629 114078 2167
199B167r2566K359P3130N2792k5806p4041l9857L9541Q3058M9796k0529n7746
$$ 2167 -90399 -88040 -14910 37882 12076 -61965 -101822 -62281 20777 70573 50044 -7702
211g702l7405P514L1277K8757K8311L4438K0888l4288r8284j05185k4967R0661
$$ -7702 -45107 -37593 -6316 22441 50752 85190 106078 71790 -26494 -131679 -156646 -65985
223f5985J42753Q2639m2241j26083j04324j1316O5756P2439L1621L883N122J970
$$ -65985 76768 159407 117166 -8917 -113241 -124557 -58801 13638 45259 49142 54264 56234
235E6234l7293q2385o8655K3408J21403J26876K1013j06242j34821m2174P9594
$$ 56234 18941 -63444 -132099 -108691 12712 139588 160601 54359 -80462 -122636 -43042
246d3042J09113K3048q4271r8383l590R7627R7833j845r4981q6942L674P2820
$$ -43042 66071 89119 4848 -93535 -97125 502 98335 96490 1509 -85433 -81759 -8939
258h939N0005k3924n1700N516P8874P0132l5468j34805j16623K1519J54682J53320
$$ -8939 41066 17142 -34558 -29042 49832 119964 84496 -50309 -166932 -145413 9269 162589
270A62589J2951j33466j51293l3381R4716J12039K0308p0490o8049Q400O3111
$$ 162589 175540 42074 -109219 -142600 -47884 64155 84463 13973 -54076 -45676 17435
281A7435L4208l7588o3265p773O7753P2614j0611r7984r2967J0666J14556J15422
$$ 17435 51643 14055 -49210 -56983 10770 83384 72773 -25211 -118178 -107512 7044 122466
293A22466J0827r8949j12853k8501O5176Q0589K0392m3160m6998K021M2581L1108
$$ 122466 133293 34344 -78509 -107010 -41834 38755 59147 15987 -31011 -28990 13591 44699
305D4699j7567m6169k5965J7929L3917O497k7200k0137K4657N8386L5303l2810
$$ 44699 27132 -19037 -45002 -27073 6844 13341 -13859 -33996 -9339 49047 84350 51540
317E1540q5162p1957J151P5014R2303M5488k5384o7323n8544k0100J4655K7795
$$ 51540 -33622 -105579 -104428 -29414 62889 108377 82993 15670 -42874 -62974 -48319 -20524
329b0524K4068J7393R384l905j8958k3398r293J3227K3330J1740j3540k9572k1594
$$ -20524 3544 20937 30321 26416 7458 -15940 -25233 -12006 11324 23064 9524 -20048 -41642
342d1642R523M0059M5029J6026k7977n5566m6576q172L2948N0359L5751J495k8825
$$ -41642 -32119 7940 52969 68995 41018 -14548 -61124 -69296 -36348 14011 49762 51257 22432
355B2432l6239j9991P106K2781J9249J757j4601j9260j0890O122K3596L1972K0258
$$ 22432 -13807 -33798 -26692 -3911 15338 17095 2494 -16766 -27656 -21534 2062 34034 54292
368E4292r223m0409n0720k9720J4028N2471O0265L0389j9178n4754n2926j9774
$$ 54292 45069 4660 -46060 -75780 -61752 -9281 50984 81373 62195 7441 -45485 -65259
380f5259J9118L7204K9693J0410p355j4874j2787n322M337R766N593n488j6790
$$ -65259 -46141 -8937 20756 31166 23811 8937 -3850 -9172 -4835 4931 10524 5036 -11754
393a1754j6962j200K2609L6813K6965o490m0706n1022k6312J4331M3468M3722
$$ -11754 -28716 -29916 -7307 29506 56471 49981 9275 -41747 -68059 -53728 -10260 33462
405C3462K0657j0915l0497l1823j6141M586K0177K3106J2670l217j7360j9345
$$ 33462 54119 43204 12707 -19116 -35257 -30671 -10494 12612 25282 22065 4705 -14640
417a4640q071J0121K2177J7447k392k2895k8282j2671J2305L0876K9722R296j8347
$$ -14640 -22711 -12590 9587 27034 24642 1747 -26535 -39206 -26901 3975 33697 42993 24646
430B4646l4535k7723j785K4056L1414J7906m670k1187k2495j0917M358J5306J7793
$$ 24646 -9889 -37612 -39397 -15341 16073 33979 29309 8122 -14373 -25290 -20932 -5626 12167
443A2167J1435p28j4358k3844k0615k73K6019L8103K2124j4610m2688l7410k283
$$ 12167 23602 22874 8516 -15328 -35943 -36216 -10197 27906 50030 35420 -7268 -44678 -46961
456d6961L4263M1215J5488j9689l4300j8448J0111K4788J4941n187j4457r583
$$ -46961 -12698 28517 44005 24316 -9984 -28432 -18321 6467 21408 16221 1764 -7819
468g819j270j451n628P54J8164K8865J3315k3573n0538l8952R964N6139N9428
$$ -7819 -9089 -10540 -16168 -15414 2750 31615 44930 21357 -29181 -68133 -58169 -2030 57398
481E7398J5191m1354n9997k8914K2535M7591K8916r044k9732j9898K539J2346
$$ 57398 72589 31235 -28762 -57676 -35141 12450 41366 32322 2590 -17308 -14769 -2423
493b423O306l050j269P162O485j0410k6086j9597J1649M3743M1799R28m7060n8176
$$ -2423 3883 833 -436 6726 13211 2801 -23285 -42882 -31233 12510 54309 55237 8177 -49999
507d9999k2426L4745O2547M1634p746m4898m2936j1063K1267K8896J3654o673
$$ -49999 -72425 -37680 24867 66501 58755 13857 -29079 -40142 -18875 10021 23675 17002
519A7002j3533p514p86k043n796j744P790J2692M114j2427k0455p597J9079L6818
$$ 17002 3469 -4045 -4831 -6874 -12670 -14414 -6624 6068 10182 -2245 -22700 -30297 -11218 25600
533B5600K6697r957m4475m6919j0099L8755N9648L4843j5246n1174m5906j0911
$$ 25600 52297 42340 -2135 -49054 -59153 -20398 39250 74093 58847 7673 -38233 -49144
545d9144K2765K9263J1712p454j0747k6N391m084j6965j3068J0122L1360K3672
$$ -49144 -26379 2884 14596 7142 -3605 -3631 1760 -2324 -19289 -32357 -22235 9125 32797
558C2797q593l4473k4027J7022M8540L7348j1676n6404n4130n770M4816N2969
$$ 32797 24204 -10269 -34296 -17274 31266 68614 56938 534 -53596 -59366 -14550 38419
570C8419J5068k9847m0670j4360J3751J3821q754k0609k676K7813L5386Q407k7818
$$ 38419 53487 23640 -17030 -31390 -17639 -3818 -12572 -33181 -35857 -8044 27342 35749 7931
583G931l4534l463L4905L8443J061m0549m2683J903M9033N3371Q908m3855n8751
$$ 7931 -26603 -30066 4839 43282 44343 3794 -38889 -36986 12047 65418 74326 30471 -28280
596b8280k9854J0907K7538J8064L723L029R519M942j7231l6024k6918R603M4970
$$ -28280 -58134 -47227 -19689 -1625 2098 5127 14646 19588 2357 -33667 -60585 -50982 -6012
609f012M5649J2181k4798l1305o255K1176K2436p68k4232k4734n673J2141J6816
$$ -6012 39637 51818 27020 -4285 -10540 10636 33072 32304 8072 -16662 -22335 -10194 6622
622F622R317Q55l945j0970k0823k5673j2892J6879M0819L5741L391k9956l3703
$$ 6622 15939 16794 12849 1879 -18944 -44617 -57509 -40630 189 35930 39321 9365 -24338
635b4338p880K2763K8484R358j0088j0707K055Q664L17j1014r651O073J3262k929
$$ -24338 -32218 -9455 19029 28387 18299 7592 9647 18311 18628 7614 -2037 4036 17298 14369
649A4369l1600l9587p684M1583O1373K6341l5378o7550l9309K1796N8230L9808
$$ 14369 -17231 -56818 -64502 -22919 38454 64795 29417 -38133 -77442 -55646 2584 42392
661D2392p753l3449j5620K0035L0658L484k8500k8621N337L2710J8615k5726m9451
$$ 42392 34639 1190 -14430 5605 36263 39747 11247 -17374 -12037 20673 39288 13562 -35889
674c5889k0918L6510O0417K0146m8809p7535l3461M4008Q1587M5489k6590o4911
$$ -35889 -56807 -20297 40120 60266 11457 -66078 -99539 -55531 26056 71545 44955 -19956
686a9956l6267K4289N3467K6114k2156l5569k513L4209L0041j3625m8089l2478
$$ -19956 -56223 -31934 21533 47647 25491 -10078 -12591 21618 51659 38034 -10055 -42533
698d2533J8821M8944K3287l5667o6032l2712L6673P5327M5676k4731o9436m8880
$$ -42533 -23712 25232 48519 12852 -53180 -85892 -49219 26108 71784 47053 -22383 -71263
710g1263J2851N4122M1013m524l1446j6173J7813L0841P803k3806k9085k691K6340
$$ -71263 -58412 -4290 36723 32199 753 -15420 2393 33234 41037 17231 -11854 -14545 11795
723A1795K3160j1140m0208l1996R258M2761L4391j0287m8317m3050K361M5813
$$ 11795 34955 23815 -16393 -48389 -39131 3630 38021 27734 -20583 -63633 -61272 -15459
735a5459N1101J6638k5512l9532j8902J1654K4561J3186l826o205N572J3729L782
$$ -15459 35642 52280 26768 -12764 -31666 -20012 4549 17735 13909 7704 13276 27005 30787
748C0787j7295k7636j3301J2331K4592J0231j8528l3185j6311J9773M2018K7798
$$ 30787 13492 -14144 -27445 -15114 9478 19709 1181 -32004 -48315 -28542 13476 41274
760D1274j1711m1777l4944L899L8114L9679J0123k1233k6505q687J1182J2050
$$ 41274 29563 -12214 -47158 -43259 -5145 34534 44657 23424 -3081 -11768 -586 11464
772A1464k251j1840l260J4577J6932l557k8738l1359l169K9433L3420L357l1437
$$ 11464 9213 -2627 -5887 8690 25622 22065 -6673 -38032 -41201 -11768 21652 25009 -6428
785f428l5349k131L7834M4953J2991k9611m3471j8829J8598L3970J6976q300j4855
$$ -6428 -41777 -43908 -6074 38879 51870 22259 -21212 -40041 -21443 12527 29503 21203 6348
798F348k185R157N81j8328k3155k121K5613L0586M288k9451l6844q898K8239L8078
$$ 6348 4163 13320 13901 -4427 -27582 -29703 -4090 26496 30784 1333 -35511 -44409 -16170 21908
812B1908J2087k4492l4571r321K4830L4326J2487j6244k5255j0316P265R358j987
$$ 21908 33995 9503 -25068 -34389 -9559 24767 37254 21010 -4245 -14561 -7296 2062 75
825G5o297M692J7218J3590r481l1365k9058J270L2049L3960N788k5721l0895o898
$$ 75 -6222 -1530 15688 29278 19797 -11568 -40626 -39356 -7307 26653 32441 6720 -24175 -31073
839c1073K0279K5003O775j3193j5288j815J0004P944k584o883J305R882O111j1327
$$ -31073 -10794 14209 20984 7791 -7497 -9312 692 8636 6052 -831 474 10356 16467 5140
853E140k2504j2023J3252L0667K0632r340l2704k7198J25K4106K4572O597j1577
$$ 5140 -17364 -29387 -16135 14532 35164 25824 -6880 -34078 -33953 -9847 14725 21322 9745
866I745j3649l513N284L450l204l730N342J1775M861j0492j8605p650J3423K4105
$$ 9745 -3904 -7417 -2133 1317 -1887 -5617 -275 11500 16361 5869 -12736 -20386 -6963 17142
880A7142J1144j3815k8912j8362P329K6610K3267K028j7837k1175q278N819J0419
$$ 17142 28286 14471 -14441 -32803 -25474 1136 24403 26431 8594 -12581 -20859 -15040 -4621
893d621P475L763M558M400l129j2716j5626n018J2005J9488J0818q470k0878j4416
$$ -4621 2854 6617 11175 15575 12446 -270 -15896 -20914 -8909 10579 21397 12927 -7951 -22367
907b2367N004K1151J9511Q19j8331k2941r671Q699J8111J4553L031n841r265q182
$$ -22367 -17363 3788 23299 24118 5787 -17154 -26825 -18126 -15 14538 17569 11728 2463 -5719
921e719m857j383L875R616J1527N520o156j4967j3937r19J3360J5662L628j2501
$$ -5719 -10576 -11959 -8084 1532 13059 18579 12423 -2544 -16481 -17400 -4040 11622 15250 2749
935B749j7928o807J1322K2889J5558k745k0266k2531r594O887J5925J3946O569
$$ 2749 -15179 -21986 -10664 12225 27783 25038 4772 -17759 -27353 -20466 -4541 9405 15974
948A5974M30l716p876j1637r803r22J0386J5121Q650n341j3963r971M769J5007
$$ 15974 16404 12688 4812 -6825 -16628 -17550 -7164 7957 16607 11266 -2697 -12668 -7899 7108
962G108R667o588j9505j5725J515J9639K2612J0118p384j6293j5744q282j467
$$ 7108 16775 10187 -9318 -25043 -23528 -3889 18723 28841 21457 5164 -10580 -18862 -20329
975b0329M352J0127J3782J2988L575j0575j9223j4834J142J3078J3084J872q356
$$ -20329 -15977 -5850 7932 20920 24495 13920 -5303 -20137 -18995 -5917 7167 9039 683
988F83p087K938J1879Q914k770j4246j5935o822M992J2475J2912Q700L803l155
$$ 683 -6404 -3466 8413 17327 14557 311 -15624 -22446 -17454 -4979 7933 16633 20436 17281
1002A7281j1033j7116j3979j660J4040K0562J3482j636j2395j3476l665M923N556
$$ 17281 6248 -10868 -24847 -26507 -12467 8095 21577 19941 7546 -5930 -9595 -4672 884
1015H84O86n048l925J505O520O842L394k55l401o967j0212r600j206J1188J9346
$$ 884 1570 -3478 -7403 -5898 622 7464 10858 10603 7202 235 -9977 -19577 -20783 -9595 9751
1030I751J6191J059j4949k0836j3325J128J2089J2882N779j402m303k255p61k18
$$ 9751 25942 27001 12052 -8784 -22109 -20981 -8892 3990 9769 8367 4064 1809 1048 830
1044H30q60k78m96j982m484l534L377J1439J2955N856q312j9074j8415m542J1252
$$ 830 -30 -308 -804 -2786 -7270 -10804 -7427 4012 16967 22823 14511 -4563 -22978 -27520 -16268
1059a6268K0029J5550L125q682j2967r441k635K635M669M581J972j066j696l36
$$ -16268 3761 19311 22436 13754 787 -8654 -11289 -8654 -3985 596 2568 1502 -194 -530
1073e30L447M924L125l385j0692j3486p157N987J7964J9552R349o338j9085k0118
$$ -530 2917 7841 10966 7581 -3111 -16597 -23754 -17767 197 19749 29098 22760 3675 -16443
1087a6443j0466M177J4973J7170R002k052q012q049l855m2J111o83k513j879Q09
$$ -16443 -26909 -22732 -7759 9411 18413 16361 8349 300 -3555 -3597 -2486 -3169 -5682 -7561 -6752
1102f752N253P810P280J776n643j2206j4404q770K685J5947K1354J4375j017j5814
$$ -6752 -1499 6311 13591 15367 9724 -2482 -16886 -25656 -22971 -7024 14330 28705 27688 11874
1116A1874k0892j2257J492J2068J3382N723k235n162k551J646J383k789n866n500
$$ 11874 -9018 -21275 -19783 -7715 5667 11390 9155 3993 1442 3088 4471 1682 -4184 -9684
1130i684k328J717M426O401P850O539Q46p902j5184j3871l277J1800K1182J6740
$$ -9684 -12012 -10295 -5869 532 8382 14921 15767 7865 -7319 -21190 -24467 -12667 8515 25255
1144B5255J441j2924j7942r725K506P998N910j127m507j485L266N294J931k891
$$ 25255 26696 13772 -4170 -13895 -11389 -3391 2519 1392 -3115 -4600 -1334 3960 5891 3000
1158C000n410l540j186p00j297Q38Q068J3061J0085k471j5664j9116q454Q903
$$ 3000 -2410 -5950 -7136 -7836 -9133 -8295 -227 12834 22919 20448 4784 -14332 -22786 -13883
1172a3883J8978J4376p63j2738j2343k672O618N299k615q413n233L029Q514N644
$$ -13883 5095 19471 18708 5970 -6373 -9045 -2427 2872 257 -8156 -13389 -10360 -1846 3798
1186C798J38k057O00M011K6p937j2056m608J1061K2251J5846l193k1404k2542
$$ 3798 3936 1879 2479 6490 6516 -1421 -13477 -18085 -7024 15227 31073 27880 6476 -16066
1200a6066o624J1447J6458O811o392j0437l578M808N867r37p210m967K907P354
$$ -16066 -22690 -11243 5215 12026 5634 -4803 -8381 -3573 2294 1357 -5853 -10820 -7913 -559
1214e59L414l659m727M190J3292J0438m008j8322j8641k382J5562K1914R117r783
$$ -559 2855 -804 -5531 -1341 11951 22389 18381 59 -18582 -20964 -5402 16512 25629 15846
1228A5846j9582j2370K249J0452O453l218o760k123M449N346O07l135j077M869
$$ 15846 -3736 -16106 -13857 -3405 3048 -170 -6930 -9053 -4604 742 1349 -1786 -2863 2006
1242B006O239k99q939r927O59J4226J7719O425j1117k2090j5855R49J3070J4093
$$ 2006 8245 7946 -993 -10920 -10261 3965 21684 28109 16992 -5098 -20953 -20004 -6934 7159
1256G159M078o161q818m797M22J864L98j50K434M310L609r41l446j385M503P168
$$ 7159 11237 5076 -3742 -8539 -8117 -6253 -5855 -6005 -3571 739 4348 3407 -39 -1424 3079 10247
1272A0247L099m743j0302p271K223J0246R871J484r432j3512q995J437Q999Q664
$$ 10247 13346 8603 -1699 -8970 -6747 3499 13370 14854 5422 -8090 -17085 -15648 -6649 2015
1286B015K879m454o566l479J172M843O163M578K012j049l629n748l583J720P197
$$ 2015 4894 440 -6126 -9605 -8433 -3590 2573 7151 9163 8114 4485 -1263 -4846 -3126 4071
1301D071R074M172n542j3120j1832k951O962J1551O057k909r105p789o13N221
$$ 4071 13145 17317 11775 -1345 -13177 -16128 -9166 2385 8442 5533 -3572 -11361 -11974 -6753
1315f753N992K549j589j904N10L036L065K132O91K83j081l761n093l723J334O154
$$ -6753 -761 1788 199 -1705 -1195 1841 4906 7038 7729 8012 6931 3170 -1923 -5646 -4312 1842
1331A842P244J703p030j2273q798P41R738J1156N026m742r281o493L27P100R260
$$ 1842 9086 10789 3759 -8514 -17312 -16571 -6833 4323 9349 4607 -4674 -11167 -10840 -3740 5520
1346E520N834k66m599n345l389m46K715M383M313Q90m490q321p543j672M983Q633
$$ 5520 11354 11088 6489 1144 -2245 -2691 24 4407 8720 9610 5120 -3201 -10744 -12416 -7433 1200
1362A200N630j511p345q198j939N958R170M876k798o752m434K946P690O686O47
$$ 1200 6830 5319 -2026 -10224 -12163 -6205 2965 7841 5043 -1709 -6143 -3197 4493 11179 11826
1377A1826n498p044m154m5L202K689J950J923L43m041q196q287o19R382J4548
$$ 11826 6328 -716 -4870 -4915 -1713 976 2926 4849 5192 1151 -7045 -15332 -15951 -6569 7979
1392G979P866m405j3943j2305r13J0914J3912N658m627q782m858J465L878N75
$$ 7979 15845 11440 -2503 -14808 -15721 -4807 9105 14763 10136 1354 -3504 -2039 1839 2414
1406B414k068q37K759K478j807o955o170Q04Q022P610J18q694q552R71J0540J1265
$$ 2414 346 -491 2268 4746 2939 -4016 -10186 -9382 -1360 6250 6368 -2326 -10878 -9907 633 11898
1422A1898Q64j0290j2238k440Q687J2384N223m399q832n418j80J703Q9n48K632
$$ 11898 12762 2472 -9766 -12206 -3519 8865 14088 9689 857 -4561 -4741 -3038 -2949 -3497 -865
1437h65O429M508l826j1743j1087m39J2004J5371N523p446j3009p418L967J0258
$$ -865 5564 10072 6246 -5497 -16584 -17023 -5019 10352 15875 8429 -4580 -11998 -8031 2227
1451B227O678o86n761l763M78K509m13l247j323K584M993Q10n229p209k037N658
$$ 2227 8905 8219 2458 -1305 -827 1682 1269 -1978 -3301 -717 4276 5086 -143 -7352 -9389 -3731
1467c731Q333L206n229q730l917N207R786N788l685r668p004P81Q419P858K531
$$ -3731 4602 7808 2579 -6151 -10068 -4861 4925 10713 7028 -2640 -9644 -8863 -444 7414 9945
1482I945k822m436m625k700k109k13L823O842O620K22q044j1849o303L743J2010
$$ 9945 7123 2687 -1938 -4638 -6747 -6960 -3137 3705 10325 10547 2503 -9346 -15649 -11906 104
1497A04J1212K238p445j0262n217K502O540M456m61k675j889O03J184k26j464
$$ 104 11316 13554 6109 -4153 -9370 -6868 -328 4128 3667 992 -897 -294 890 664 -800
1512h00l16K070J742j127l287k546J702N210L409j699p366o185O75Q666R774L319
$$ -800 -1116 954 2696 1569 -1718 -4264 -2562 2648 6057 4358 -3008 -9193 -8518 148 9922 13241
1528A3241o555j1494p643J479Q269P759L413j503m044m291l744k838N20M800Q049
$$ 13241 6686 -4808 -12451 -10972 -2703 5056 8469 6966 2922 -1369 -5113 -7951 -7431 -2631 5418
1543E418O132r15q838j1255l793N658J0935P107j789p379n849j32M221L432o81
$$ 5418 11550 10635 1797 -9458 -13251 -7593 3342 10449 8660 1281 -4568 -4700 -479 2953 2272
1558B272l577j908J035L262J483r66j376k16P74o35l708k329J826P200O368K5
$$ 2272 -1305 -3213 -2178 1084 2567 1601 225 9 783 148 -3560 -5889 -4063 3137 9505 9530
1574I530p737j0001m020M451J0283P914M01o078p572l575L09K795K783K439K948
$$ 9530 1793 -8208 -12228 -7777 2506 10420 10821 4743 -2829 -6404 -6095 -3300 -517 1922 4870
1589D870J032k524n574m617Q8N855O215J833m129p060l739K891O180M442m52m158
$$ 4870 5902 3378 -2196 -6813 -6725 -870 5345 7178 3049 -4011 -7750 -4859 1321 5763 5311 1153
1605A153m188j113J396J808J603J135P60m35j445k711j168J312L226K327q98l986
$$ 1153 -3035 -4148 -2752 -944 659 1794 2554 2119 674 -2037 -3205 -1893 1333 3660 2762 -1224
1621a224l430P78M968M827Q23m205o453l961K11M861N821M150Q35l119n347n939
$$ -1224 -4654 -3876 1092 5919 6742 2537 -3916 -7877 -7666 -2805 3016 7166 8001 4882 -465 -6404
1637f404l116J781O644P124L326k326o546n737j442L347M388K043n33k120j164
$$ -6404 -9520 -7739 -1095 6029 9355 7029 483 -5254 -6696 -3349 1039 3082 2549 429 -735
1652g35P2J062P84M98p00j424j603j200J80K870L887K222j661n100m996j596M036
$$ -735 -663 399 1183 1681 981 -443 -2046 -3246 -3066 -196 3691 5913 4252 -848 -5844 -7440 -3404
1669c404O406L614r26m918m589j492K194M224K840J49j645l620k312j039J332
$$ -3404 3002 6616 5690 772 -3817 -5309 -3115 1109 3949 4098 2453 -1167 -3479 -4518 -3186
1684c186L736M236K077k348n735n697j362L824O523M762K56m376n593k156J797
$$ -3186 550 4786 6863 4515 -1220 -6917 -8279 -4455 2068 6830 7086 2710 -2883 -5039 -3242
1699c242L732K076k95k192j735K51J470J507M67m62j432j931j856n07J507L593
$$ -3242 490 2566 2271 79 -1656 -1405 65 1572 2039 1577 145 -1786 -3642 -4149 -2642 951
1715I51M206J521k883n803n287o38M966O943M331j608n492n060j242K387L940
$$ 951 5157 6678 3795 -2008 -7295 -7933 -2967 3976 8307 6699 1207 -3853 -5095 -2708 1232
1730A232K103j039k279j666o88L85P55Q44J918J304q91l388l805o11L797O109
$$ 1232 3335 2296 17 -1649 -2337 -1952 -1197 -353 1565 2869 1978 -1410 -5215 -5826 -2029 4080
1746D080L857j470n838n970r19M287N624K417k328m525k832R15K345J633O3j307
$$ 4080 7937 6467 629 -5341 -6260 -1973 3651 6068 3740 -785 -3617 -2702 -357 1276 1339 32
1762C2q14m03o87o75l82K135L502K572j240n052m869n75N121O952L342k923o579
$$ 32 -782 -1185 -1872 -2547 -2929 -794 2708 5280 4040 -1012 -5881 -6456 -1335 5617 8959 6036 -543
1779e43m980J70M249M539R39k557l324j617M75R13Q65J30R53J072L14k060k719
$$ -543 -5523 -5353 -1104 3435 4374 1817 -1507 -3124 -2649 -1736 -871 -741 212 1284 1598 -462 -3181
1796c181j326K982N594L388j498n458n380p20M864N566K369l490n722l071J125
$$ -3181 -4507 -1525 4069 7457 5959 501 -4879 -5599 -735 4831 7200 3710 -2012 -5083 -3958
1811c958L572K592n34k740j646L3R47P41l01N70J965K174J16l284m031o24L791
$$ -3958 -386 2206 1672 -1068 -2714 -2681 -1734 -993 -1294 -724 1241 3415 3531 247 -3784 -4408 -617
1828f17O319L312k963p225n268L35M893N521Q33l873n219j395K330K738J236j328
$$ -617 5702 9014 6051 -1174 -6442 -6107 -1214 4307 5140 1267 -3952 -5347 -3017 -279 957 -371
1844c71j572N29J743N81j123j311J301L292L171r87n145m742o41N212O509J740
$$ -371 -1943 -1414 329 910 -213 -1524 -223 3069 6240 5253 108 -4634 -5275 -63 6446 8186
1860H186m504p371m175J624N222L905p04l006k471O04K222J057j277j113J362
$$ 8186 3682 -3689 -7864 -6240 -1018 2887 2183 -823 -3294 -2690 -468 589 -688 -1801 -439
1875d39K578J983j330l383j752K269M750K754k983o760m845J071O313N445J71
$$ -439 2139 4122 2792 -591 -2343 -74 4676 7430 4447 -2313 -7158 -6087 226 5671 5842
1890E842n489o316j800K996M849J956r77j566p3J233J002j615j657O21L351L489
$$ 5842 353 -5963 -7763 -4767 82 2038 1061 -505 -578 655 1657 42 -1615 -994 2357 5846
1906E846k96m187m792j356M039N620J515m388o646l417K281N800M010r72m140
$$ 5846 5550 1363 -3429 -4785 -746 4874 6389 2001 -4645 -8062 -5781 19 4029 3057 -1083
1921a083l570K70K994K781N7r88L29J876J285j880l220j918K459M653K509k662
$$ -1083 -4653 -4383 -1389 1392 1449 461 790 2666 3951 2071 -1149 -3067 -608 4045 6554 3892
1937C892n823m530R05N150N064m37n053n055j043M069M620J817j493k582j050
$$ 3892 -1931 -6461 -5556 -406 4658 4221 -832 -5887 -6930 -2861 1759 3576 2083 -499 -1549
1952a549J005J126L1n56Q74K428J999j250m061m195n13L727M437J177l423n280
$$ -1549 -544 582 613 57 931 3359 5358 4108 47 -4148 -4661 -934 3503 4680 1257 -4023
1968d023k267K051M892K774j016l803k689M26K942K910Q80n48j031m52k85q63
$$ -4023 -6290 -4239 653 3427 2411 -1392 -4081 -3655 -713 2197 3077 2529 1498 1046 761 -102
1984a02j309P6K654K241R84k383m110l181M48L534L142K36k894l101m55K787L569
$$ -102 -1411 -1335 1319 3560 4544 2161 -1949 -5130 -4682 -1148 1994 2230 -664 -3765 -4220 -1433 2136
2001B136J410j165k565k359J80J512K230J503N95n58q36j659k337j688N59K753
$$ 2136 3546 2381 -184 -2543 -2363 -851 1379 2882 3477 2919 2083 424 -1913 -3601 -3042 -289
2017b89L152J129j769l828k560qK537K734Q23j668j929m29J801K752J309q53k694
$$ -289 2863 3992 2223 -1605 -4165 -4173 -1636 1098 1921 253 -1676 -2105 -304 2448 3757 2904 210
2034B10j973l57O73J346J301P82N71n50j762k570j691K79K346L403J626j622l158
$$ 210 -1763 -2120 -1447 -101 1200 1982 2553 2003 241 -2329 -4020 -3741 -1395 2008 3634 2012 -1146
2051a146k205P09K640K490r6k004k309n54J702K867J807p35j901j905j523m07
$$ -1146 -3351 -2642 -2 2488 2392 388 -1921 -2475 -773 2094 3901 3166 1265 -640 -2163 -2570
2067b570M34R19J733K219J21j252k988k402j13K417K994J594q96k488j875N76
$$ -2570 -2136 -1217 516 2735 2856 1604 -1384 -3786 -3899 -1482 1512 3106 2210 -278 -2153 -1577
2083a577K048J991l77k187k068k66J420K356J123L19j553j199j607o67n80J020
$$ -1577 471 2462 2085 -102 -2170 -2436 -1016 1340 2463 2782 1229 30 -1577 -2244 -2824 -1804
2099a804J692K264R58j242k987j994M32K351K874O38j762l255j504J581K794K059
$$ -1804 -112 2152 3110 1868 -1119 -3113 -2681 -330 2544 3182 1420 -1835 -3339 -1758 1036 3095
2115C095j54k100k578o41M62J460J226L13N78J9o85j973j422n66J826K386J690
$$ 3095 2941 841 -1737 -2378 -1916 -456 770 1083 1661 1680 995 -978 -2400 -2966 -1140 1246 2936
2132B936j193k478j583N33K743K063p35k756k562j8J844K940Q87n73j395j801
$$ 2936 1743 -735 -2318 -1785 958 3021 2286 -470 -3032 -3050 -1206 1734 2621 2048 653 -1148
2148a148l30K2M0R59Q94J900M91j130k888j927L10K510K413M70j919k462o98J522
$$ -1148 -1478 -1456 -1416 -457 437 2337 2828 1698 -1190 -3117 -2807 -297 2116 2586 667 -1795 -2493 -971
2166i71K599R42r19k082j574L34P71R48O28L60M39k92j155j411j155R38K251J703
$$ -971 1628 2570 1651 -431 -2005 -1671 -900 48 676 1036 1475 1183 28 -1383 -2538 -1600 651 2354
2184B354P5j533k420r36J561K172Q04p92k233j001L68J529J641K15j51j128j099
$$ 2354 2429 896 -1524 -2460 -899 1273 2077 1285 -948 -1949 -1581 -52 1589 1804 1653 525 -574
2201e74r24m30M38J433J677R32p47k013k007l78J295K320J110o04j439j681R5
$$ -574 -1498 -1928 -1490 -57 1620 2552 1805 -208 -2215 -2593 -1298 1022 2132 1528 89 -1592 -1497
2218a497R22J268O92m64r88p16l42J05J132Q05Q21j51j278j403j053L80J601J777
$$ -1497 -575 693 1385 921 -67 -783 -1125 -1020 112 917 1738 1587 309 -1094 -2147 -1767 -166 1611
2236A611L06q14j481j191J95J162J206N73n88j453j061N5P36J368P21M37j218
$$ 1611 1917 1103 -378 -1569 -1374 -212 994 1567 979 -474 -1535 -1480 -744 624 1345 1782 564
2253E64j351j171N2J326J519R60J12j072j869j238L98J371J406Q86n90q71j657
$$ 564 -787 -1958 -1906 -580 939 1899 2011 939 -930 -2168 -1770 -399 1007 1893 1303 432 -1225
2270a225j69L96J137Q10J27p21j078m71L67J006J010J87q96j072j065J04J139
$$ -1225 -1394 -998 139 949 1076 355 -723 -1194 -827 179 1189 1376 480 -592 -1657 -1553 -414
2287d14J342J077j57j253j512q59k32J622J160J103k27j493j167o52O65J108J393
$$ -414 928 2005 1848 595 -917 -1776 -2008 -386 774 1877 1650 157 -1010 -1662 -997 111 1504
2304A504J33j101j207n30J41J038J144J91m75j255p05k30M56J311Q16L15q19j345
$$ 1504 1637 536 -671 -1201 -1060 -22 1122 1313 838 -417 -1122 -1352 -896 415 1231 1546 727 -618
2322f18j370J27R69J771Q83j99o58k056k70L32J293J084K01r95j407l49K68J172
$$ -618 -1988 -1861 -892 879 1762 1563 905 -1151 -1421 -1089 204 1288 1489 494 -913 -1262 -994 178
2340A78L81J39l61n70p16l42K09R26P63R03n14j216j188n16J051J719J326k43
$$ 178 559 698 337 -233 -949 -1291 -1082 -156 607 1510 996 -220 -1408 -1924 -873 846 2172 1929
2358A929j696j615k08Q08J636O99m81r16j236K34J66L98J25O55L07j74q64q33
$$ 1929 233 -1382 -1590 -782 854 1553 1072 156 -1080 -846 -680 -282 -157 498 805 631 -233 -1066
2376a066m06L43J974J409k97j754j402r52J633J781J194j084j691j138N4J373
$$ -1066 -1472 -1129 845 2254 1957 203 -1199 -2151 -518 1263 2457 1373 -318 -1456 -1402 -29
2392b9Q33J47p42m34n84J00l50k1N74R53J243j88j242j654o68J214K142J142m04
$$ -29 804 951 209 -225 -809 -709 -1059 -1080 -506 447 1690 1502 260 -1394 -2062 -848 1294 2436 2032
2411B032k063j654o1J553J814k00o88j822k73K67O44L38M71k55o4K44o45q75k91
$$ 2032 -31 -1685 -1746 -193 1621 1421 733 -1089 -1362 -1095 -451 -113 358 103 39 283 -362 -1237 -1528
2430a528R30J589J343k42j919j797j33J486K106M88r63k044r80J71J229R19l7
$$ -1528 -598 991 2334 2092 173 -1624 -1757 -271 1835 2323 1360 -684 -1664 -1493 -264 655 618
2447F18j066n94K79N7M29k93J38M71Q43K56p03j189p18J248J525J389q70k068
$$ 618 -448 -1042 -763 -706 -277 -570 -432 39 882 1138 435 -754 -1472 -224 1301 2690 1820 -248
2465b48j368j08J373J717M10j360j428r95N07J308M78l49l14M55J17o1l24o57
$$ -248 -1616 -1724 -351 1366 1776 416 -1012 -2007 -1500 -192 286 -63 -377 78 195 134 -190 -847
2483h47L38J093J409J60j464j806l70J012K043P77j125k222j251N33J517J307
$$ -847 -509 584 1993 2153 689 -1117 -1487 -475 1568 2345 1220 -1002 -2253 -1720 -203 1104
2499A104Q7j446j155R0O28M02M58j97L98M62K35n29q93q37N74J628J214k62j675
$$ 1104 1191 -255 -1410 -1320 -692 -290 168 -29 369 831 1066 537 -356 -1193 -619 1009 2223 1961 286
2518B86k078l2J415J432N39j108j805r27Q30J596Q66j82r57m93M4L30L73l72o3
$$ 286 -1792 -1824 -409 1023 1562 454 -1351 -2278 -1448 148 1014 832 -125 -618 -574 -244 129 -243 -306
2537c06Q93J071J58j279j576l88Q68J588R17o81j965j341r7J719J512j0j048j593
$$ -306 587 1658 1816 537 -1039 -1427 -559 1029 1946 1265 -700 -2041 -2138 -419 1093 1083 35 -1558
2555a558j26P21J214Q52n77l44J31K68K3m12p44K00J247J000k60j662j561j97
$$ -1558 -1684 -963 251 1103 526 182 313 581 604 192 -552 -352 895 1895 1635 -27 -1588 -1785
2573a785R28J932N35j198j682r77N59J860R80k03q06j048K35O92N41k16N2J22
$$ -1785 -857 1075 1610 412 -1270 -2247 -1688 172 1152 949 143 -905 -670 22 563 347 399 521
2591E21O47L2q13r78o50M46J564P58m49j831j282J57J753J217K50j358j288l73
$$ 521 1168 1200 387 -591 -1241 -795 769 1527 1078 -753 -2035 -1878 -125 1092 1342 -16 -1304 -1677
2609a677O23J598P75n56l80k06m75O10l52j82P4O52N16J57j357j173l17Q32J313
$$ -1677 -1054 544 1319 763 383 177 -298 312 -40 -222 -148 504 1020 1177 -180 -1353 -1670 -838 475
2628D75N45n31j324p98M55J475O44J19j079p74J13M85P00lJ35j15m1j77n70m50
$$ 475 1020 489 -835 -1633 -1178 297 941 1060 -19 -793 -680 -195 505 502 637 522 481 304 -266 -716
2648g16M2M16Q81O84n52j299j002K20Q49J257L70n48j475P5K81P89Q35m45l12
$$ -716 -674 -258 623 1307 755 -544 -1546 -1326 -477 780 1150 602 -873 -798 -517 272 1107 662 350
2667C50n96j08jL82J10j26M26K03j67j098m20M4P01J036P8m36j191m74M28Q25
$$ 350 -246 -354 -355 27 137 11 437 640 473 -625 -1045 -1001 -300 736 814 378 -813 -1287 -859 -34
2687c4O62M80j030k88l06Q2O20K86L17m26k61m36l04o8O20L82K65l3o56l68p48
$$ -34 628 1108 78 -210 -516 -434 186 472 789 363 102 -334 -638 -706 -86 296 561 528 -128 -496 -1244
2708a244P05P55L61K22n20r35m57J82J163M68L81m22n97n73o5K53O72L19j68r3
$$ -1244 -539 216 577 799 279 -656 -1113 -931 232 700 1081 659 62 -511 -576 -323 349 668 500 407
2728D07n07m37k91L81O06J72L45l24o51j76j21L85R15k2j03p30n51L3N24J153
$$ 407 -100 -537 -828 -447 159 331 676 352 -299 -475 -596 -211 704 682 579 -151 -702 -669 -145 1008
2748A008j7m53o64o23NK48Q41L93Q6k85q32m03Q4K9O44O34L09o39k96p40j86L23
$$ 1008 991 538 -126 -749 -744 -496 345 738 824 539 -293 -696 -612 -583 61 695 1004 365 69 -671 -857 -534
2770e34P53Q29l46r33m88J9M67O84J61l49n01k67pM11L01K09R2j92j61o75k96
$$ -534 219 1048 702 -231 -719 -700 -233 451 612 263 -238 -505 -512 -101 200 409 501 309 148 -527 -823
2791h23N23K70R26j4k78o72p04J1O76N85N26l81o77p50J05K88P28J32J01n76m74
$$ -823 -300 -30 896 882 604 -68 -772 -761 -85 500 1026 645 -32 -782 -677 -389 339 471 572 -4 -478
2812d78j47K34K71l0M23P21p68m45o80K76L63O37M72l46o87m22M1L28O84K46k03
$$ -478 -625 -391 -120 -150 273 994 226 -219 -899 -623 -260 377 849 503 -184 -606 -565 -237 447 693 490
2833D90n69j08j04J91K61K72o5m23k11m42K75N05J93L91j90m08o47K4m3L71O39
$$ 490 -79 -187 -291 -100 161 433 368 -55 -266 -708 -433 72 265 656 466 58 -589 -565 -608 -237 402
2854D02N05n16o56l41n3N88L49K74l9n83k67j28M9K79J57M79j24m00k44l92K42
$$ 402 907 391 -265 -606 -659 -71 278 552 513 -70 -337 -465 -416 -137 20 499 375 -25 -269 -661 -419
2875d19M91O15k8l14m95k00j23L02O35L8m03k76j12K2J68L42J20k09l35k59j21
$$ -419 72 687 659 345 -150 -350 -473 -171 464 502 99 -177 -289 -267 -99 243 363 154 -181 -440 -561
2896e61Q7M51P11R9O4o99j083n2N77M38P08K1l91n92l51Q7K21K79K52k6n8k31
$$ -561 -474 -23 688 787 851 152 -931 -983 -406 32 740 761 370 -222 -573 -486 -265 14 266 240 182 -49
2918d9l55K88K62R0l9j60m7n01J64Q7N53J88jm31n65q0J92O30J41M14n83k56k47
$$ -49 -404 -116 146 236 197 37 -10 -511 -347 -260 293 481 480 49 -516 -596 -404 226 367 781 198 -58 -305
2941c05j83L96M91m1l3n0m23m69J64L39L73K22Rn64l72j73K07N17M32m0k72m20
$$ -305 -488 -92 399 358 325 275 -148 -617 -453 -114 259 481 490 -74 -446 -619 -412 105 537 497 225 -195
2963a95k89M99Q9M35k46l1l30j91j22K01J96OK82k40n8m55k8K06L66pK39l20l75
$$ -195 -484 15 104 539 293 262 -68 -259 -381 -180 16 22 304 64 6 -449 -477 -271 95 88 327 7 -368
2986c68q4J91N99J75J03m03q19J90J63L98N60l02q8n63l03K43j07K10L63L85k56
$$ -368 -452 -261 338 513 616 213 -606 -416 -253 145 705 403 315 -248 -551 -308 -415 -205 158 543 287
3007B87k78m08k47L36O68J04J67k86o43K5L55J40L60P9m98n37q4L73L24J4k32
$$ 287 9 -399 -646 -310 358 462 629 343 -300 -275 80 220 580 659 161 -376 -460 -87 237 251 19
3028A9M8j62j53L8q9R8L61j60M64m70k48j97L97M61M65l5q70o18KN86M71K56k36
$$ 19 67 -95 -248 -210 -299 -201 160 0 464 -6 -254 -451 -54 407 872 837 -33 -651 -649 -63 408 664 428
3051D28n12k33j16J57J68j17O3O05l36N8j56m66J98J12N98N2j35q04m3M30N67
$$ 428 -84 -317 -433 -276 -108 -225 -162 443 107 165 9 -457 -259 -147 451 503 368 -436 -479 -49 518
3072E18K34j54n75p13J40M16M62J17k66l78r1J10j12K2J31M5K31K04m3n92k1R9
$$ 518 752 598 23 -690 -550 -134 328 445 179 -199 -290 -180 -292 -270 -139 -94 137 341 298 -294 -315 -216
3094b16K02P55P4l76o60l63L16P32M28l28r43l40j4N54N9J35K34r0j2o8j04k22
$$ -216 -14 741 815 439 -221 -584 -268 464 892 564 -379 -719 -733 -179 -120 15 249 159 147 79 -25 -247
3116b47j03J51N35L76r4n67o63K69O10N35l92o14n00J4O03M13L23n87m68p7l18
$$ -247 -350 -199 336 712 618 51 -612 -343 267 802 410 -204 -704 -690 -87 326 649 62 -406 -483 -801
3137h01N12J66J09j05J35L67J75p42j36m1O73Q2L10l40n17k51k2R71K82k83r48
$$ -801 -289 -123 -14 -119 16 383 558 -184 -320 -361 312 394 704 364 -153 -404 -426 545 827 544 -404
3158d04m71P3N78M33k01r5O6J00j14j4k63n7M44J74N84m47m46k35l8M59N80l97
$$ -404 -875 -802 -224 209 8 -87 -21 79 -35 -49 -312 -369 75 249 833 386 -60 -295 -333 126 706 309
3180C09m24k09l16L42N38M67l52j96r69J40L65N75J9j96K14k82P7j18r7n7K08
$$ 309 -115 -324 -640 -298 240 707 355 159 -810 -670 -305 270 289 93 307 25 102 -16 -113 -170 38
3201C8M08L71l77q79l6K93L79L1N8o02m09j4K90N84J22m7m88PK1P7K70j7j68M82
$$ 38 446 817 440 -439 -475 -182 197 228 286 -316 -725 -739 -449 135 257 210 -278 -271 -250 -173 97 80 -88 394
3225C94m5q4j69o59J30K80P73nl35o65j28n1N97L36K04n52k95MJ59J21M70j7l94
$$ 394 349 265 96 -563 -433 -153 620 615 280 -385 -513 -564 33 369 573 21 -274 -270 -111 10 480 463 69
3248F9k18L93l91N5K99Q1O0M6j79m25l82M8N40N21K20o94m09l47K07J004j60r0
$$ 69 -149 244 -147 -92 207 288 348 394 215 -210 -592 -544 -4 517 737 43 -366 -713 -506 498 338 248
3270B48k09m37J99K26J33j9P8k66K02l3Q9m49m8L34J96J28k30m13k62K89J78P20
$$ 248 39 -398 -199 27 160 141 219 -47 155 122 211 -238 -286 48 244 372 142 -271 -533 -244 -66 654
3292F54m06l68l94P5K77J70K97kl34k92L57r0O8M8J34j75L88m33l23k31J46N24
$$ 654 248 -120 -514 -439 -162 8 305 303 -31 -323 34 -56 12 60 194 19 407 -26 -349 -580 -434 90
3314I0L70k6n11l77q5L52K40L59k41l50j19O9J9J96J71P1p4p4n6j19P6R3J54J44
$$ 90 460 434 -77 -454 -539 -187 53 412 171 -179 -298 -229 -210 -14 157 228 154 80 24 -95 -19 74 228 372
3338C72N6l40m72R4l07O02L22n9m7l94k15O6L14M73k48j74k81K40p6j77J20K43
$$ 372 428 88 -384 -290 -597 5 327 268 221 -173 -388 -322 -8 465 217 43 -238 2 -74 -251 -131 112
3360A12J56j22n14J99j21L67J02J60J2m90l05K93r5L68M62k23k75k16j20j57N05
$$ 112 268 146 -368 -169 -290 77 179 339 351 -139 -444 -151 -246 122 584 361 86 -130 -250 -407 98
3381I8O8J18j55Mj75j41R7K57j05K92l16Q6m27K8J90K89k27J69J31m84k15N24
$$ 98 166 284 129 133 -42 -183 -86 171 66 358 42 128 -299 -271 -81 208 -19 150 281 -203 -418 106
3403A06p9L13q5l10k64l6oJ10N17m2L03k89m48j43L7L62l2J54J67o95K42n2J39
$$ 106 27 340 255 -55 -319 -355 -361 -251 266 224 527 238 -210 -353 -316 46 14 168 335 -360 -118 -170 -31
3426c1J15O7L34n93j27N9L6L51K8J69J86o77k57j67K80N84J98k6m81k91k08K52
$$ -31 84 151 485 -108 -235 -176 -140 211 239 408 594 -83 -340 -507 -227 357 555 529 48 -243 -451 -199
3448a99j1L52K1L34m72j54P9NK8L28N4j28o29k57M82K23J19L31j63j95n26N0K99
$$ -199 -210 142 163 497 25 -129 -50 -45 -17 311 365 237 -392 -649 -167 56 175 506 343 148 -378 -328 -29
3471b9K08K44N4l91l76J12j57L44m6L08M3k40j96l15J89O9N37L5l48m11j22K27
$$ -29 179 423 477 86 -290 -178 -335 9 -37 271 314 74 -122 -437 -248 -179 358 393 45 -366 -488 -261
3493b61J53K38K10j27L3m20j52R0K49K5L46k71L6m26k3J8L91J64J57p7n64K8k22
$$ -261 -108 130 340 213 246 -174 -326 -236 13 38 384 113 149 -277 -300 -282 109 273 430 353 -211 -183 -405
3516d05M56N00k98l6l62k58J37K02K36lk37L05m48j02KL97R7K98p1n81o3l20K45
$$ -405 51 551 253 217 -145 -403 -266 -64 172 169 -68 237 -211 -313 -311 86 183 481 410 -171 -234 -554 -309
3539c09O45N8M1l91m33m0M87j17L34k31N6l05k9k5n4K60J87K21q6m95j49k29M57
$$ -309 336 394 435 44 -389 -429 58 -59 275 44 100 -205 -234 -259 -313 -53 134 355 269 -226 -375 -604 -147
3562a47K30L09L0l40o67J30K45M98j27k04J68j87Mp9K43K42j77o5k10r0j01R3
$$ -147 83 392 422 82 -585 -455 -210 288 161 -43 125 -62 -58 -137 106 348 171 106 -104 -194 -295 -202
3584b02J37L41J68k64j07m29k31L27M67M14j81l62j94L2J52L14j46q4r4k80J03
$$ -202 -65 276 444 180 73 -356 -587 -260 207 621 440 78 -116 -84 68 382 236 152 58 -222 -119
3605a19Q8p6k53N48L2J9k71k59M2jN64L8k31k73j53j6J03M10L44j23l83m00nK78
$$ -119 -31 -107 -360 188 220 239 -32 -291 -249 -250 314 352 121 -152 -305 -321 -218 192 536 413 30 -370 -375 -97
3629i7O47k86o9l44L0r9NP0L67k99L28j49j5m61l22M59N79J13j39n55k83r6O45
$$ -97 550 264 195 -149 -119 -218 -213 -143 224 -75 253 104 89 -372 -694 -235 344 457 318 -237 -520 -616 29
3652B9L92r8j80k58k5q3K84J09L5k11J68j03o9k53Rj83O39K33P9n89k38k55N56
$$ 29 421 323 143 -115 -140 -223 61 170 205 -6 162 59 -10 -263 -254 -437 202 435 514 -75 -313 -568 -12
3675a2K66O6j18m38k67L53M24J75j15l64k28jJ53j77K87J34j98k3K07j75l83j44
$$ -12 254 320 202 -236 -503 -150 274 449 334 -30 -258 -259 -106 -283 4 138 -60 -83 124 -51 -434 -578
3697e78N00K73M76j4m36n67j24L95M67K92l55o11r8J27O03K59l74m20mK70j38
$$ -578 -78 195 671 657 221 -346 -470 -75 392 684 329 -282 -380 -253 350 609 235 -185 -189 81 -57
3718e7J30k35P3l8N60j37k09l99j70K71P10nqn75l43j03P29L70q2j40p02k57O19
$$ -57 73 -162 -89 -127 433 296 87 -312 -482 -211 499 494 486 -89 -432 -535 194 564 482 342 -360 -617 2
3741BK22k84n5K04l88K51L5l65M4O7L98K7J17j26n91J03N17L88K4k21n75n82L54
$$ 2 224 -60 -115 89 -299 -48 -13 -378 -334 -267 131 158 275 149 -442 -339 178 566 590 369 -206 -788 -434
3764d34N25J58Mk90j70m28L98K27O5l0k67K75K61j53k81k71J76R45M8j70o00m34
$$ -434 91 249 253 -37 -207 -635 -237 -10 55 25 -242 33 294 141 -140 -411 -235 710 758 588 -12 -446
3786d46J43L14N44j5n55o93K45PN64NO6l06J52k64K60R3j01q5M62K96l77J9o86
$$ -446 -303 11 555 540 -15 -708 -463 -456 108 113 179 -127 25 -239 21 114 13 -72 390 686 309 328 -358
3809c58q2K28M79K97k84n54l62m5O17J67J17n20j01J41L25j61m1L05l12O0j8k29
$$ -358 -440 -212 267 564 280 -274 -636 -681 -64 103 220 -300 -401 -260 65 -96 -137 168 -144 -84 -102 -331
3831c31N04m60K84M60K06j35n66l50j11K48N30J93l57m71r9J02L37J57m0k81m5
$$ -331 173 -287 -3 457 663 528 -38 -388 -499 -251 279 472 115 -356 -455 -353 -16 141 101 -180 -225
3852b25J26J21k9M2p0Q4N13l39k37k25j20K54M28L11l98n72m56L40J34P89k24
$$ -225 -99 22 -7 35 -35 49 562 223 -14 -239 -359 -105 323 634 236 -336 -792 -452 -318 471 247
3873B47K4n29m0p0O68k54r4k2nR6M2p2j02O7J63K57k55j14o34L79J91L27L34m44
$$ 247 271 -258 -298 -368 300 46 -48 -70 -75 21 63 -9 -111 -44 119 376 121 7 -627 -248 -57 270 604 160
3897A60p33k07K99O34K49j88j59l6m03J81K04J29Pj3m9j65k32J39j9K31M00J7
$$ 160 -573 -780 -481 153 402 214 55 19 -384 -203 1 130 137 124 75 -90 -322 -183 -202 29 429 446
3919D46m40k7p25J18M45P65k97ln14j43L6L61J16L21l40j76J29j28J07n6J60m0
$$ 446 6 -21 -746 -628 -183 582 285 282 -232 -375 -339 22 138 459 119 -57 72 -56 51 -5 155 115
3941A15j05k11j16J34k07J95O95j3n29k62k71K17K80L29J97k62l08o8j8P9K96
$$ 115 10 -201 -317 -183 -390 -195 500 487 -42 -304 -575 -358 -78 251 448 186 -122 -190 -208 -129 167
3962A67p4k9j25l34L04K5j29L51M4q9o1l19k31R6M89M42l88%l26j29j02M21K62
$$ 167 93 64 -61 -395 -91 -66 -195 156 200 111 50 -269 -500 -404 85 527 139 139 -187 -316 -418 3 265
3985B65j6j55l68L39k41J06j15N69l52L6l0m74RK98M25l0J71m39j36j05qM05N08
$$ 265 249 94 -274 65 -176 -70 -185 384 32 68 38 -436 -427 -129 296 266 437 -2 -138 -243 -251 154 662
4008F62l75j98j77l79L64J9P8J18J33l64k23K05K8K66N5j6rk38k77K2J78J47L13
$$ 662 287 89 -88 -467 -103 -84 -6 112 245 -119 -342 -137 -109 157 212 196 187 -51 -328 -306 -128 19 332
4031C32l8k61k36j93M52R2J24P1j81l64j9k26L76M61n5k3k44k16p0j01N51JJ87
$$ 332 294 33 -203 -396 56 148 272 343 162 -202 -221 -447 -71 390 335 312 68 -148 -218 -319 232 233 420
4054D20k39k83n03M22mL16K84k93r6r5k80J05L04K23j42j01k8j18k04J74K68J11
$$ 420 181 -102 -605 -183 -187 129 413 120 24 -71 -351 -246 58 281 139 38 10 -108 -312 -138 130 241
4076B41J40m66L59o70J85K20M26k08J24k80m84K16J05J78L29l9r9o75O8J07L5
$$ 241 381 -85 274 -396 -211 9 435 227 351 71 -413 -197 -92 86 415 376 277 -398 -330 -223 -188
4097a88L03J00J34m09l17O2J36L85J99r6k04l55j42K18L35N4J69l45j62j23k34
$$ -188 115 215 349 -60 -377 -315 -179 206 405 309 105 -250 -392 -174 161 215 384 39 -123 -246 -480
4118d80M95j09L52K9l23k42L8m8M89k3L3P2j59j13j37n8K78P7M7q3l11J3p5J0
$$ -480 15 -94 258 287 -36 -278 -240 -288 201 178 211 283 124 11 -126 -184 94 171 218 135 -176 -163 -238 -228
4142b28L93L7K87n69j54m3J05L64%O8m23R3j87K36ON8q3J68R3m22O1R2O9J83m0
$$ -228 165 202 489 -80 -234 -277 -172 192 192 260 -163 -70 -257 -21 -15 43 -40 128 221 -201 -140 -48 21 204 164
4167A64L7k38p1l55K54M09J78J5l17n28NL09K19K56k65m1p2j58M2M22j22K32r8
$$ 164 201 -37 -108 -463 -209 200 378 393 76 -452 -447 -138 81 337 72 31 -41 -199 -157 265 143 375 277
4190B77k4j00l19m1o0N22J38K3n11m54K1L22J94L98j01j18l22j27J95JM46m84
$$ 277 253 153 -166 -207 -267 255 393 416 -95 -549 -528 -206 -12 386 285 167 -155 -282 -87 -86 360 -124
4212a24QQ8k4N0n7k1J68L5Q7m18k71J12J09L96K99j94j82l87O9K31L44K9j37r8
$$ -124 -116 -28 -52 -2 -59 -80 88 123 210 -208 -479 -367 -258 138 437 243 61 -326 -257 -26 318 347 210 112
4236A12j38j45J60k8Q3n0J11K1j53k28j36K3M15N03n93R5o00J34L76L69L40l43
$$ 112 -26 -171 -11 -39 44 -6 105 126 -27 -255 -391 -368 47 550 -43 52 -548 -414 -38 331 671 328
4258C28n64l22L15K39L64M3k19k82L9J25k42p9J04J61O3L29n58j79o9K76L40O7
$$ 328 -236 -558 -243 -4 360 403 184 -98 -59 66 -176 -255 -151 10 73 402 -156 -335 -404 -128 212 279
4280B79j14j56l80J53L44L30M0l64l82k75K18M73K71l83k56k7J83L1k59l2j01
$$ 279 165 9 -371 -218 126 456 496 132 -250 -525 -307 166 437 54 -202 -229 -46 -15 -274 -306 -407
4301d07L84L55N2m26k31o8K86L31K66j04p83j24J43M64K36Jl96m36K38n9L63j54
$$ -407 -23 332 384 -42 -273 -341 -55 276 542 438 -345 -469 -326 138 374 375 -21 -457 -219 -278 85 -69
4323f9k1O5L1K37k95L1n78N10L16L95P6p06m57J45K93P19r2m94n14J47J10pO02
$$ -69 -90 -25 6 243 -52 -21 -599 -89 227 622 698 -8 -465 -320 -27 692 600 106 -408 -261 -151 -158 444
4346D44m02k86L7j47L41l0j86O0j6M91R8k34n01k01L91N03K5J92o69m47J1N62
$$ 444 42 -244 -207 -354 -13 -43 -229 -169 -185 306 404 170 -331 -532 -141 362 387 579 -90 -537 -526 36
4368C6N75l89k67l50n0L69J87K0k02P2r9M84m09k90O3K6L94L94j46m12m56K0N19
$$ 36 611 222 -45 -395 -445 -76 111 131 -71 1 -98 386 -23 -313 -250 -224 170 564 418 6 -450 -430 89
4391H9L26J63m10o42k55N98J97M78k42n07l85K59K38j17J58p2L20l6L0j85m06
$$ 89 415 578 168 -474 -729 -131 66 544 302 -205 -590 -331 -93 -210 -52 -124 196 160 190 5 -401
4412d01K1O42K62K15m47l69m75J17M76L31m2l85l37R7r2L79L48j74j64l74J84
$$ -401 -380 262 524 739 292 -77 -552 -435 41 372 330 -55 -392 -295 -387 -8 340 166 2 -372 -188
4433a88m0K11l3R6J73J85J26o79j54j11L14N23J35j41o25o50M07L74L08K81o67
$$ -188 -228 -17 -50 46 219 404 530 -149 -303 -414 -100 423 558 417 -208 -858 -451 -77 231 512 -155
4454a55k93JM39K95n3J54l98m6L72k52m09K20K71K23k0M2n80k63k4M47N14j27
$$ -155 -448 -447 -8 287 234 388 -10 -56 316 64 -345 -125 146 369 349 391 -189 -452 -476 -29 485 358
4476C58k96m77k70N29L64J39n0k98r3l9Q6p5K23n6J33J35k4k75j22l3K65K06J64
$$ 358 62 -415 -685 -156 208 347 297 -1 -94 -133 -47 -122 101 45 178 313 289 14 -108 -141 124 330 494
4499D94m01j84m26J62L96M50j67n49J0k58N50m6J07l1j64J71j93j31K4M3K2L96
$$ 494 93 -91 -517 -355 41 491 324 -225 -215 -473 77 31 138 107 -57 114 -79 -210 -186 -143 -121 275
4521B75J72l77j95j36K4J95N22J38n83k72k32L63K77K27j69l85O4n0K72oQ6m1
$$ 275 447 70 -125 -261 -237 -42 480 618 35 -237 -469 -106 171 398 229 -156 -92 -142 130 124 210 169
4543A69k74q5K25r6k75K26K14K63j18k18l02j40L0L50K29L6k53p9o7j72O74R6
$$ 169 -105 -190 35 -61 -336 -110 104 367 249 31 -271 -411 -381 -31 198 234 -19 -98 -165 -337 337 433
4565D33j90j40m58K11j10K23O0L79j94q1n19O5RK26J36J44o4l47K3j91L10J38
$$ 433 243 103 -355 -144 -254 -31 29 408 214 133 -386 -321 -312 -86 50 194 130 -217 -194 -385 -75 63
4587F3N39k51k68j61p2K67J10N7n3j79j24n6j2j01L38M8LJ11k74kl20J31L28M2
$$ 63 602 351 83 -78 -150 117 227 284 231 52 -72 -128 -140 -241 97 145 148 259 -15 -17 -337 -206 122 164
4611A64O7j58k18k02M28o8K38J60l37l24j12j48J99L04L13j68Q8m41Q3J10j85
$$ 164 231 73 -145 -347 81 13 251 411 74 -250 -362 -510 -311 -7 306 138 226 -215 -132 -22 -207
4632b07J40K54K10m10l39J86J72M31l91J4J9l13m5N8K02K94j89j38N5j98k91L94
$$ -207 -67 187 397 -13 -352 -166 6 437 46 60 79 -234 -279 -221 -19 275 86 -52 3 -195 -486 -92
4654i2L5L69q5j60j50l45O9N19j38K36j15k36k9m5r8O88q5n9n12j13J37J30K49
$$ -92 -57 312 227 67 -83 -428 -359 160 22 258 143 -93 -122 -167 -265 423 338 279 -233 -346 -209 -79 170
4677A70O5k75P7P2m20L30l4P1J92L3j97j72k92K05K32K28j50k8l33j68O7J75L58
$$ 170 235 -40 37 109 -311 19 -15 56 248 281 84 -88 -380 -175 57 285 135 107 -226 -394 -327 -152 206
4700B06K17j53k11l30j65K44N59j19k07K21l48m44N30k39M86m6n1j93n5j93N1
$$ 206 423 270 59 -271 -436 -192 367 248 41 262 -86 -530 0 -239 247 201 150 -43 -98 -291 -240
4721b40J66K86J38j71l50Nk48L50J57J60n7p8m49K51j42L37k8K1o3lK0o00L21
$$ -240 -74 212 350 179 -171 -166 -414 -64 93 253 196 118 -331 -80 -222 115 87 108 45 42 62 -538 -217
4744b17L47J67J5j96Ql01k66N46L94k95k48Lj90l3L33J23J12J12l34m3n75L74
$$ -217 130 297 312 116 124 -177 -443 103 497 202 -46 -43 -233 -266 67 190 302 414 80 37 -538 -164
4766a64l8J13J60L03k79j02j46k48J47K71L14l12n8j04M0j33K68L86l71m7j47
$$ -164 -202 -89 71 374 95 -7 -153 -401 -254 17 331 19 -39 -143 -103 -236 32 418 47 0 -147
4787a47J07J48j37J70l7j18K47q82L87J90j33P34j49k25R1o39Q9L38L62l67J72
$$ -147 -40 108 -29 141 104 -14 233 -649 -262 -72 -205 529 380 155 246 -393 -304 34 396 29 201
4808B01k44k03j16J98M58j89K12m38q6M8mO2L44M5j75j7k68k80J09L8M45L60m63
$$ 201 -43 -246 -362 -164 294 105 317 -121 -207 -159 -163 -101 243 288 113 96 -172 -452 -343 -305 140 500 37
4831C7l60j83j45Q94K38k78j87m01J56K8M40Jo7k19kj00K6K14l45K31K7M35k99
$$ 37 -323 -506 -651 243 481 203 16 -385 -229 -201 239 240 173 -46 -48 -148 -122 92 -253 -22 5 440 141
4854A41k33l98K40J57N10j99J06m53m55L62L29J32M4k19j98j18q8N23n1j71N3
$$ 141 -92 -490 -250 -93 417 218 324 -129 -584 -222 107 239 283 64 -134 -252 -340 183 132 -39 14
4875A4RK47m38k70J29P1N13R1j26l97j93J67M28Q9J09m01n11L1L09O97j22j49
$$ 14 23 270 -168 -438 -309 -238 275 366 240 -157 -350 -183 245 334 443 42 -469 -438 -129 568 446 297
4897B97k52m29L81K6K8l67K59J96O3j32j68m16q6K54R74J68o34m77M4j88O77K83
$$ 297 45 -384 -3 23 51 -316 -57 139 202 70 -98 -514 -600 -346 628 796 162 -315 -271 -459 218 501
4919E01k90k08k55j7J41K30j45O9k32oL29J41m83k43K32M90Q5n6k44o16M16J33
$$ 501 211 3 -252 -269 -128 102 -43 26 -206 -212 117 258 -225 -468 -236 254 339 283 39 -577 -161 -28
4941b8N35J67l70o81R9K07L99J41q1n11L8l50J07K55Q5J37j27L5n7j26j23k49
$$ -28 507 674 304 -377 -278 -71 328 469 388 -123 -85 -435 -328 -73 12 149 22 57 0 -126 -249 -498
4963d98K88P26K1n48j01m04K11N56M35k3o77m74K3M64J47P0k16R3n35M40k83J71
$$ -498 -210 516 537 -11 -112 -516 -305 251 686 663 -14 -488 -465 -1 146 216 0 93 -442 -2 -285 -114
4985a14j15j53O82J35l26o9m19P4L29M53j0n76l94J24j7Q06J83k95o45m30M96
$$ -114 -229 -382 300 435 109 40 -379 -305 24 477 467 -109 -503 -379 -396 410 593 298 -347 -777 -281
5006b81J17M19l2l05k46N27k61J08l45K88M3L15K5k83Mo13N3Q02K67k18m31l61
$$ -281 -164 255 223 -82 -328 199 -62 46 -299 -11 32 347 372 89 93 -520 -467 335 602 384 -47 -408
5028d08l8M11L22K96o72n1k97J63M40J13j37j99Q4R0L2k19J35l19N38K4L4j22
$$ -408 -446 -35 287 583 -89 -140 -437 -274 166 279 142 -57 27 117 149 -70 65 -254 284 308 342 220
$$ [...]
8191d3
##END NTUPLES=NMR FID
##END=
