##TITLE=1H ikalashn
3752-H
17.10.2024
##JCAMPDX= 6.0         $$ Bruker NMR JCAMP-DX V2.0
##DATA TYPE= NMR FID
##DATA CLASS= NTUPLES
##ORIGIN= UXNMR, Bruker Analytische Messtechnik GmbH
##OWNER= root
$$ TOPSPIN		Version 1.3
$$ 2024-10-17 16:10:25.578 +0400  Irina@DPX200
$$ Compression mode = diff/dup
##.OBSERVE FREQUENCY= 200.131392401
##.OBSERVE NUCLEUS= ^1H
##.DELAY= (6, 6)
##.ACQUISITION MODE= SIMULTANEOUS
##.ACQUISITION SCHEME= undefined
##.AVERAGES= 64
##.DIGITISER RES= 18
##SPECTROMETER/DATA SYSTEM= spect
##.PULSE SEQUENCE= zg
##.SOLVENT NAME= CDCl3
##.SHIFT REFERENCE= INTERNAL, CDCl3, 1, 17.95386
##AUDIT TRAIL= $$ (NUMBER, WHEN, WHO, WHERE, WHAT)
$$ ##TITLE= Audit trail, TOPSPIN		Version 1.3
$$ ##JCAMPDX= 5.01
$$ ##ORIGIN= Bruker BioSpin GmbH
$$ ##OWNER= Irina
$$ $$ F:/spectra/data/iren/nmr/1H/4/audita.txt
$$ ##AUDIT TRAIL=  $$ (NUMBER, WHEN, WHO, WHERE, VERSION, WHAT)
(   1,<2024-10-17 16:09:28.812 +0400>,<Irina>,<DPX200>,<TOPSPIN 1.3>,
      <created by zg
	started at 2024-10-17 16:05:15.906 +0400,
	POWCHK disabled, PULCHK disabled
       configuration hash MD5:
       BE 6D 3F 07 2A EA 11 49 91 17 2B D3 AF B3 58 0D
       data hash MD5: 16K
       B8 00 48 18 54 82 46 F2 D6 AF F5 97 7C 2B 37 01>)
$$ ##END=
$$ 
$$ $$ hash MD5
$$ $$ 70 06 83 33 C4 18 36 75 ED F4 02 91 87 4B 6C CD
##$RELAX= 
##$RELAX= 
##$RELAX= 
##$RELAX= 
##$RELAX= 
##$RELAX= 
##$RELAX= 
##$RELAX= 
##$RELAX= 
$$ Bruker specific parameters
$$ --------------------------
##$DU= <F:/spectra>
##$EXPNO= 4
##$NAME= <1H>
##$PROCNO= 1
##$TYPE= <nmr>
##$USER= <iren>
##$AMP= (0..31)
100 100 100 100 100 100 100 100 100 100 100 100 100 100 100 100 100 100 
100 100 100 100 100 100 100 100 100 100 100 100 100 100 
##$ANAVPT= -1
##$AQSEQ= 0
##$AQ_mod= 1
##$AUNM= <au_zg>
##$AUTOPOS= <>
##$BF1= 200.13
##$BF2= 200.13
##$BF3= 200.13
##$BF4= 200.13
##$BF5= 200.13
##$BF6= 200.13
##$BF7= 200.13
##$BF8= 200.13
##$BYTORDA= 1
##$CFDGTYP= 0
##$CFRGTYP= 5
##$CHEMSTR= <none>
##$CNST= (0..63)
1 1 145 1 1 1 1 1 1 1 1 1 1 1 1 1 1 1 1 1 1 1 1 1 1 1 1 1 1 1 1 1 1 1 
1 1 1 1 1 1 1 1 1 1 1 1 1 1 1 1 1 1 1 1 1 1 1 1 1 1 1 1 1 1 
##$CPDPRG= <>
##$CPDPRG1= <>
##$CPDPRG2= <>
##$CPDPRG3= <>
##$CPDPRG4= <mlev>
##$CPDPRG5= <mlev>
##$CPDPRG6= <mlev>
##$CPDPRG7= <mlev>
##$CPDPRG8= <mlev>
##$CPDPRGB= <>
##$CPDPRGT= <>
##$D= (0..63)
0 2 0 0 0 0 0 0 0 0.06 0 0.03 0 0 0 0 0.0002 0 0 0 0 0 0 0 0 0 0 0 0 0 
0 0 0 0 0 0 0 0 0 0 0 0 0 0 0 0 0 0 0 0 0 0 0 0 0 0 0 0 0 0 0 0 0 0 
##$DATE= 1729166967
##$DBL= (0..7)
120 120 120 120 120 120 120 120 
##$DBP= (0..7)
150 150 150 150 150 150 150 150 
##$DBP07= 0
##$DBPNAM0= <>
##$DBPNAM1= <>
##$DBPNAM2= <>
##$DBPNAM3= <>
##$DBPNAM4= <>
##$DBPNAM5= <>
##$DBPNAM6= <>
##$DBPNAM7= <>
##$DBPOAL= (0..7)
0.5 0.5 0.5 0.5 0.5 0.5 0.5 0.5 
##$DBPOFFS= (0..7)
0 0 0 0 0 0 0 0 
##$DE= 6
##$DECBNUC= <off>
##$DECIM= 32
##$DECNUC= <off>
##$DECSTAT= 4
##$DIGMOD= 1
##$DIGTYP= 9
##$DL= (0..7)
0 120 120 120 120 120 120 120 
##$DP= (0..7)
150 150 150 150 150 150 150 150 
##$DP07= 0
##$DPNAME0= <>
$$ [...]
##$SW= 21.9925939549014
##$SWIBOX= (0..15)
0 0 2 0 0 0 0 0 0 0 0 0 0 0 0 0 
##$SW_h= 4401.40845070422
##$TD= 16384
##$TD0= 1
##$TE= 300
##$TE2= 300
##$TE3= 300
##$TEG= 300
##$TL= (0..7)
0 120 120 120 120 120 120 120 
##$TP= (0..7)
150 150 150 150 150 150 150 150 
##$TP07= 0
##$TPNAME0= <>
##$TPNAME1= <>
##$TPNAME2= <>
##$TPNAME3= <>
##$TPNAME4= <>
##$TPNAME5= <>
##$TPNAME6= <>
##$TPNAME7= <>
##$TPOAL= (0..7)
0.5 0.5 0.5 0.5 0.5 0.5 0.5 0.5 
##$TPOFFS= (0..7)
0 0 0 0 0 0 0 0 
##$TUNHIN= 0
##$TUNHOUT= 0
##$TUNXOUT= 0
##$USERA1= <user>
##$USERA2= <user>
##$USERA3= <user>
##$USERA4= <user>
##$USERA5= <user>
##$V9= 5
##$VALIST= <valist>
##$VCLIST= <CCCCCCCCCCCCCCC>
##$VD= 0
##$VDLIST= <DDDDDDDDDDDDDDD>
##$VPLIST= <PPPPPPPPPPPPPPP>
##$VTLIST= <TTTTTTTTTTTTTTT>
##$WBST= 1024
##$WBSW= 25
##$XGAIN= (0..3)
0 0 0 0 
##$XL= 0
##$YL= 0
##$YMAX_a= 491258
##$YMIN_a= -220760
##$ZGOPTNS= <>
##$ZL1= 120
##$ZL2= 120
##$ZL3= 120
##$ZL4= 120
##$ABSF1= 10
##$ABSF2= 0
##$ABSG= 5
##$ABSL= 3
##$ALPHA= 0
##$AQORDER= 0
##$ASSFAC= 0
##$ASSFACI= 0
##$ASSFACX= 0
##$ASSWID= 0
##$AUNMP= <proc_1d>
##$AXLEFT= 0
##$AXRIGHT= 0
##$AXTYPE= 0
##$AXUNIT= <>
##$AZFE= 0.1
##$AZFW= 0.1
##$BCFW= 1
##$BC_mod= 2
##$BYTORDP= 1
##$COROFFS= 0
##$CY= 7568.61572265625
##$DATMOD= 1
##$DC= 2
##$DFILT= <>
##$DTYPP= 0
##$F1P= 17.9538593292236
##$F2P= -4.03888763876832
##$FCOR= 0.5
##$FTSIZE= 32768
##$FT_mod= 4
##$GAMMA= 1
##$GB= 1
##$INTBC= 1
##$INTSCL= 1
##$ISEN= 128
##$LB= 0.05
##$LEV0= 0
##$LPBIN= 0
##$MAXI= 945.577
##$MC2= 0
##$MEAN= 0
##$ME_mod= 0
##$MI= -402.1523
##$NCOEF= 0
##$NC_proc= 0
##$NLEV= 6
##$NOISF1= 8.587773
##$NOISF2= 6.764455
##$NSP= 1
##$NTH_PI= 0
##$NZP= 0
##$OFFSET= 17.95386
##$PC= 1
##$PHC0= 103.8349
##$PHC1= 27.31372
##$PH_mod= 0
##$PKNL= yes
##$PPARMOD= 0
##$PPDIAG= 0
##$PPIPTYP= 0
##$PPMPNUM= 100
##$PPRESOL= 1
##$PSCAL= 0
##$PSIGN= 0
##$REVERSE= no
##$SF= 200.13
##$SI= 32768
##$SIGF1= 18.5376
##$SIGF2= -6.396296
##$SINO= 400
##$SIOLD= 32768
##$SREGLST= <1H.CDCl3>
##$SSB= 3
##$STSI= 0
##$STSR= 0
##$SW_p= 4401.40845070423
##$SYMM= 0
##$S_DEV= 0
##$TDeff= 0
##$TDoff= 0
##$TI= <>
##$TILT= no
##$TM1= 0
##$TM2= 0
##$TOPLEV= 0
##$USERP1= <user>
##$USERP2= <user>
##$USERP3= <user>
##$USERP4= <user>
##$USERP5= <user>
##$WDW= 1
##$XDIM= 8192
##$YMAX_p= 0
##$YMIN_p= 0
$$ End of Bruker specific parameters
$$ ---------------------------------
##NTUPLES= NMR FID
##VAR_NAME=  TIME,          FID/REAL,        FID/IMAG
##SYMBOL=    X,             R,               I
##VAR_TYPE=  INDEPENDENT,   DEPENDENT,       DEPENDENT
##VAR_FORM=  AFFN,          ASDF,            ASDF
##VAR_DIM=   8192,          8192,            8192
##UNITS=     SECONDS,       ARBITRARY UNITS, ARBITRARY UNITS
##FACTOR=    0.0002272,     1,               1
##FIRST=     0,             0,               0
##LAST=      1.8609952,     221,             501
##MIN=       0,             -220760,         -220760
##MAX=       1.8609952,     491258,          491258
$$ Real data points
##PAGE= N=1
##DATA TABLE= (X++(R..R)), XYDATA
$$ plain form
0 0 0 0 0 0 0 0 0 0 0 0 0 0 0 0 0 0 0 0 0 0 20 -64 64 -64 64 -64 65 -113 128 -128 129 -189 192 -212 256 -271
36 -271 321 -354 388 -445 496 -550 608 -673 745 -824 907 -1002 1102 -1216 1340 -1473 1623
53 1623 -1792 1978 -2190 2428 -2704 3017 -3392 3839 -4376 5058 -5926 7100 -8774 11357
67 11357 -15981 26671 -113698 119553 316274 9508 -186505 -203198 -125372 -64027 58258
78 58258 92753 -24550 -204067 -220760 -101160 23525 66853 46423 -79253 -204311 -161586
89 -161586 11959 82199 33237 -24635 -80569 -150688 -111185 67722 201847 109335 -100881
100 -100881 -172606 -45384 83656 108185 85117 27131 -83222 -126769 -11504 143371 171437
111 171437 65962 -66259 -113837 -41325 82568 146614 87816 -36138 -98872 -49404 31533
$$ packed form
0@%%%%%%%%%%%%%%%%%%%%K0q4J28j28J28j28J29j78K41k56K57l18L81m04M68n27
36b71N92o75P42q33R41j046J158j281J418j569J731j909K104k318K556k813L096
53A623l415L770m168M618n132N721o409P231q215R434j0984J3026j5874K0131
67A1357k7338M2652j40369K33251J96721l06766j96013j6693P7826O1345J22285
78E8258L4495j17303j79517j6693J19600J24685M3328k0430j25676j25058M2725
89a61586J73545P0240m8962n7872n5934p0119L9503J78907J34125r2512k10216
100a00881p1725J27222J29040K4529k3068n7986j10353m3547J15265J54875K8066
111A71437j05475j32221m7578P2512J23893O4046n8798j23954o2734M9468Q0937
$$ plain form
122 31533 85957 122370 84488 -60115 -152133 -50346 116312 144014 38582 -61075 -81482
133 -81482 -44609 18731 95008 121823 34888 -95796 -119460 -20182 88384 118959 49887 -68532
145 -68532 -116563 -42087 62435 99727 65430 -8942 -82780 -100824 -35720 69329 113254 29396
157 29396 -99427 -121588 -25642 64706 79821 36987 -33016 -91364 -90778 -22453 65515 88904
169 88904 6254 -98634 -108059 -21547 66743 88063 30037 -58001 -96472 -60220 8121 64541
181 64541 74996 10715 -79655 -97582 -15246 84999 100293 16418 -74094 -84129 -33201 23582
193 23582 64639 63384 -1415 -76018 -81293 -6191 78727 88220 3119 -86312 -89824 -23766 41570
206 41570 65606 39500 -21059 -68247 -62288 265 74685 80310 -1283 -83595 -80606 -6986 63277
$$ packed form
122C1533N4424L6413l7882j44603r2018J01787J66658K7702j05432r9657k0407
133h1482L6873O3340P6277K6815q6935j30684k3664R9278J08566L0575o9072j18419
145f8532m8031P4476J04522L7292l4297p4372p3838j8044O5104J05049M3925q3858
157B9396j28823k2161R5946R0348J5115m2834p0003n8348N86O8325Q7968K3389
169H8904q2650j04888r425Q6512Q8290K1320n8026q8038l8471L6252O8341N6420
181F4541J0455o4281r0370j7927Q2336J00245J5294q3875r0512j0035N0928N6783
193B3582M1057j255o4799p4603n275P5102Q4918R493q5101q9431l512O6058O5336
206D1570K4036k6106o0559m7188N959O2553P4420N625q1593q2312K989P3620P0263
$$ plain form
219 63277 76944 30991 -26714 -48709 -30733 18691 75938 80215 7349 -68078 -63770 13566
231 13566 87336 88415 25401 -30716 -39227 -13315 34259 77453 65618 -4191 -65012 -57615 14826
244 14826 85384 79834 4605 -57003 -54349 -9859 35354 52677 26262 -27474 -70003 -64422 733
257 733 69155 58228 -22602 -80856 -67154 -13090 30436 35865 1944 -43861 -72812 -58129 3815
270 3815 60082 46759 -25532 -80135 -67665 -3802 50218 41592 -10807 -48414 -51871 -28706 18266
283 18266 60815 48450 -17490 -69373 -52239 19920 67319 43387 -10888 -38223 -34539 -7212
295 -7212 37775 64911 42214 -12890 -53116 -40308 23962 73302 53067 -10825 -47905 -31575
307 -31575 14520 50868 53605 27350 -14950 -51791 -39176 28335 74951 42933 -24913 -55282
$$ packed form
219F3277J3667m5953n7705k1995J7976M9424N7247M277p2866p5427M308P7336
231A3566P3770J079o3014n6117q511K5912M7574M3194j1835o9809o0821P397P2441
244A4826P0558n550p5229o1608K654M4490M5213J7323k6415n3736m2529N581O5155
257G33O8422j0927q0830n8254J3702N4064M3526N429l3921m5805k8951J4683O1944
270C815N6267j3323p2291n4603J2470O3863N4020q626n2399l7607l457K3165M6972
283A8266M2549j2365o5940n1883J7134P2159M7399k3932n4275k7335L684K7327
295g212M4987K7136k2697n5104m0226J2808O4270M9340k0235o3892l7080J6330
307c1575M6095L6348K737k6255m2300l6841J2615O7511M6616l2018o7846l0369
$$ plain form
319 -55282 -29832 19927 50017 41082 6708 -32333 -52916 -31347 23423 54440 29239 -27745
331 -27745 -62720 -40342 19839 51239 27122 -16969 -42651 -47165 -25600 17948 46165 25504
343 25504 -30572 -66031 -35997 29447 53868 20976 -23007 -44627 -39941 -7214 31650 44403
355 44403 18819 -26177 -50874 -23072 35114 59592 27743 -23504 -47447 -25861 17639 41838
367 41838 37084 16085 -18614 -43065 -18033 38633 61549 24655 -31124 -51051 -20870 24392
379 24392 42192 31384 3007 -31247 -43147 -11250 34344 45896 13150 -36263 -57119 -25792
391 -25792 25883 42942 18625 -17027 -38874 -34793 -6796 24284 34539 9661 -39304 -59653
403 -59653 -21279 33246 44591 13680 -23082 -38820 -25701 5155 30303 33612 5607 -35695
$$ packed form
319e5282K5450M9759L0090q935l4374l9041k0583K1569N4770L1017k5201n6984
331b7745l4975K2378O0181L1400k4117m4091k5682m514K1565M3548K8217k0661
343B5504n6076l5459L0034O5444K4421l2892m3983k1620M686L2727L8864J2753
355D4403k5584m4996k4697K7802N8186K4478l1849n1247k3943K1586M3500K4199
367D1838m754k0999l4699k4451K5032N6666K2916l6894n5779j9927L0181M5262
379B4392J7800j0808k8377l4254j1900L1897M5594J1552l2746m9413k0856L1327
391b5792N1675J7059k4317l5652k1847M081K7997L1080J0255k4878m8965k0349
403e9653L8374N4525J1345l0911l6762j5738J3119L0856K5148L309k8005m1302
$$ plain form
415 -35695 -46954 -9565 38121 49739 18793 -24261 -39235 -14156 22734 36554 26924 2627
427 2627 -27053 -34519 -2404 41395 52817 19549 -30074 -40798 -6283 29608 36354 20896 -6682
440 -6682 -31306 -29453 3743 39352 43875 9218 -35890 -43884 -9393 27586 34429 10596 -23059
453 -23059 -37573 -22341 6283 28781 31287 1906 -39436 -48491 -12352 28591 33694 1294 -32761
466 -32761 -37392 -14963 10450 26632 25611 -4108 -40078 -40914 -3580 32091 34119 2247 -31641
479 -31641 -33057 -5060 23847 32723 20073 -9541 -30773 -26742 1368 34214 40651 6782 -32832
492 -32832 -30847 5282 32980 33099 12939 -13724 -28233 -21648 5754 35411 35381 -1150 -35614
505 -35614 -30261 4024 31878 30683 3330 -27263 -32864 -14632 9934 26717 22974 -5998 -35497
$$ packed form
415c5695j1259L7389M7686J1618l0946m3054j4974K5079L6890J3820r630k4297
427B627k9680p466L2115M3799J1422l3268m9623j0724L4515L5891O746j5458k7578
440f682k4624J853L3196L5609M523l4657m5108p994L4491L6979O843k3833l3655
453b3059j4514J5232K8624K2498K506k9381m1342r055L6139M0943N103l2400l4055
466c2761m631K2429K5413J6182j021k9719l5970q36L7334L5671K028l1872l3888
479c1641j416K7997K8907Q876j2650k9614k1232M031K8110L2846O437l3869l9614
492c2832J985L6129K7698J19k0160k6663j4509O585K7402K9657l0l6531l4464
505c5614N353L4285K7854j195k7353l0593n601J8232K4566J6783l743k8972k9499
$$ plain form
518 -35497 -33413 267 33371 29351 -7921 -35315 -29276 -7659 11988 24791 19510 -9518 -33877
531 -33877 -27570 6078 34430 28017 -7171 -32993 -26034 491 25143 29883 12442 -11577 -23060
544 -23060 -15726 9044 35510 31516 -6244 -34350 -23144 11249 33069 27620 6565 -12738 -20114
557 -20114 -13081 12553 35731 25293 -12273 -34683 -21272 10774 32922 26205 -1897 -23172
569 -23172 -22923 -7173 14785 25327 12696 -15144 -34557 -25905 7778 33822 20879 -14474 -31319
582 -31319 -22434 -5126 11101 17591 6086 -19179 -36346 -24244 10665 31848 15289 -17881
594 -17881 -33734 -23871 375 19436 16603 -2509 -20482 -25807 -13221 13056 33001 19230 -14299
607 -14299 -31866 -16650 13734 27674 17359 -587 -12648 -16574 -4394 23086 37245 19805
$$ packed form
518c5497K084L3680L3104m020l7272k7394O039K1617J9647J2803n281k9028k4359
531c3877O307L3648K8352o413l5188k5822O959K6525K4652M740j7441k4019j1483
544b3060P334K4770K6466l994l7760k8106J1206L4393K1820n449k1055j9303p376
557b0114P033K5634K3178j0438l7566k2410J3411L2046K2148o717k8102k1275
569b3172K49J5750K1958J0542j2631k7840j9413Q652L3683K6044j2943l5353j6845
582c1319Q885J7308J6227O490j1505k5265j7167J2102L4909K1183j6559l3170
594a7881j5853R863K4246J9061k833j9112j7973n325J2586K6277J9945j3771l3529
607a4299j7567J5216L0384J3940j0315j7946j2061l926J2180K7480J4159j7440
$$ plain form
619 19805 -11505 -25480 -10705 18991 35369 21661 -3279 -17039 -12139 6901 25963 29540
631 29540 13332 -12086 -27773 -13188 20244 34051 13033 -14329 -22359 -12720 5676 19722
643 19722 18785 1675 -21317 -31425 -14825 15334 24960 6188 -19823 -30775 -17148 7874 18216
656 18216 8671 -9601 -22672 -27079 -12605 13210 23661 6324 -21009 -30188 -11476 14855 21499
669 21499 8453 -8876 -20859 -21022 -2219 20573 23396 6371 -17512 -25595 -6641 20972 27521
682 27521 9405 -13083 -20952 -10497 8168 20049 20374 5921 -15935 -24102 -3282 23424 25961
695 25961 5841 -15157 -21517 -9464 10069 21369 16337 -99 -17659 -20880 -2193 19963 23245
708 23245 4826 -20742 -26192 -5815 17031 20065 8454 -5632 -16690 -16052 758 19800 20580
$$ packed form
619A9805l1310j3975J4775K9696J6378j3708k4940j3760M900J9040J9062L577
631B9540j6208k5418j5687J4585L3432J3807k1018k7362q030R639J8396J4046
643A9722r37j7110k2992j0108J6600L0159R626j8772k6011j0952J3627K5022J0342
656A8216r545j8272j3071m407J4474K5815J0451j7337k7333r179J8712K6331O644
669B1499j3046j7329j1983j63J8803K2792K823j7025k3883q083J8954K7613O549
682B7521j8116k2488p869J0455J8665J1881L25j4453k1856q167K0820K6706K537
695B5961k0120k0998o360J2053J9533J1300n032j6436j7560l221J8687K2156L282
708B3245j8419k5568n450K0377K2846L034j1611j4086j1058O38J6810J9042P80
$$ plain form
721 20580 608 -21598 -23134 -1215 18598 19744 7654 -8893 -17717 -11902 5203 18161 16587
734 16587 1088 -19611 -21693 -200 22101 23522 4504 -14508 -17278 -4881 9411 16689 13748
747 13748 -1249 -19787 -18843 4089 23288 21417 1960 -17068 -18788 -3356 12427 15934 8105
760 8105 -6912 -18678 -14818 2676 19428 18741 -1527 -23723 -22576 -1108 13720 11742 1359
773 1359 -11450 -19552 -13801 2929 16741 14119 -7012 -24646 -20413 -1142 13631 12466 -1202
786 -1202 -15909 -17692 -7044 6623 15145 11928 -4543 -20974 -18042 3933 20955 16990 -1616
799 -1616 -14527 -11134 2217 12289 18365 13804 -3359 -17289 -9699 10638 24009 18789 -73
812 -73 -13277 -9023 6523 18253 18256 7023 -6656 -12694 -7200 7464 21289 17714 -4317 -19520
$$ packed form
721B0580j9972k2206j536K1919J9813J146j2090j6547q824N815J7105J2958j574
734A6587j5499k0699k082K1493K2301J421j9018j9012k770J2397J4292P278k941
747A3748j4997j8538R44K2932J9199j871j9457j9028j720J5432J5783L507p829
760H105j5017j1766L860J7494J6752o87k0268k2196J147K1468J4828j978j0383
773A359j2809q102N751J6730J3812k622k1131j7634M233J9271J4773j165j3668
786a202j4707j783J0648J3667Q522l217j6471j6431K932K1975J7022l965j8606
799a616j2911L393J3351J0072O076m561j7163j3930P590K0337J3371n220j8862
812g3j3204M254J5546J1730Lj1233j3679o038N494J4664J3825l575k2031j5203
$$ plain form
826 -19520 -10864 7521 15436 10897 539 -11896 -16511 -10083 5868 17008 9585 -11058 -21644
839 -21644 -13571 3234 13412 9034 -7137 -18997 -16017 -5367 5545 11377 5573 -9569 -20697
852 -20697 -13929 5764 16845 7483 -10869 -16804 -10704 -978 8590 13888 6432 -10023 -16671 -7084
866 -7084 9736 18172 9928 -7385 -15657 -8608 6012 16508 13971 2039 -8368 -10363 -4193 9711
880 9711 19733 10619 -10088 -16940 -5281 10200 16601 10073 -1278 -9263 -10567 -3198 10611 17207
894 17207 5332 -11169 -15606 -6319 8642 16390 8949 -6543 -14118 -10036 -707 9135 11318 2219
908 2219 -11552 -16665 -7443 9683 16992 4786 -11089 -14311 -8227 1356 8941 9082 -293 -11466
922 -11466 -14572 -4163 11799 15960 4565 -10857 -14304 -6452 6527 13378 8266 -2142 -9561
$$ packed form
826a9520Q656J8385P915m539j0358j2435m615O428J5951J1140p423k0643j0586
839b1644Q073J6805J0178m378j6171j1860K980J0650J0912N832n804j5142j1128
852b0697O768J9693J1081r362j8352n935O100R726R568N298p456j6455o648R587
866g084J6820Q436q244j7313q272P049J4620J0496k537j1932j0407j995O170J3904
880I711J0022r114k0707o852J1659J5481O401o528j1351p985j304P369J3809O596
894A7207j1875j6501m437R287J4961P748p441j5492p575M082R329R842K183r099
908B219j3771n113R222J7126P309j2206j5875l222O084R583P585J41r375j1173
922a1466l106J0409J5962M161j1395j5422l447P852J2979O851n112j0408p419
$$ plain form
935 -9561 -10286 -1031 13156 16981 4921 -10619 -14584 -2953 11182 14872 5755 -4124 -8887 -7680
949 -7680 1758 12793 13718 2227 -11275 -14477 -3395 10724 13390 3006 -8648 -11805 -6676 2634
963 2634 10197 8947 -1672 -12788 -16056 -4985 10375 12006 -174 -11803 -13644 -5559 5249
976 5249 9535 5141 -3112 -12078 -13474 -2321 11031 11953 1049 -11545 -12770 -2103 9371 11855
990 11855 4654 -3590 -10084 -8264 2470 13626 13977 2094 -9684 -10589 1463 13681 13290 3555
1004 3555 -4896 -8371 -4980 4768 13089 11356 1651 -10004 -10970 1874 12967 11995 17 -9358
1018 -9358 -10590 -3647 5668 9934 6913 -2166 -12266 -11895 1095 11172 8352 -2854 -12449 -12169
1032 -12169 -3040 6015 7395 3014 -4561 -12172 -11023 393 10175 8328 -2312 -13075 -12107 389
$$ packed form
935i561p25R255J4187L825j2060j5540l965J1631J4135L690r117r879m763J207
949g680R438J1035R25j1491j3502l202J1082J4119K666j0384j1654l157N129R310
963B634P563j250j0619j1116l268J1071J5360J631j2180j1629j841Q085J0808
976E249M286m394q253q966j396J1153J3352R22j0904j2594j225J0667J1474K484
990A1855p201q244o494J820J0734J1156L51j1883j1778r05J2052J2218l91r735
1004C555q451l475L391R748Q321j733r705j1655r66J2844J1093r72j1978r375
1018i358j232O943R315M266l021r079j0100L71J2990J0077k820j1206r595K80
1032a2169R129R055J380m381p575p611J149J1416R782j847j0640j0763R68J2496
$$ plain form
1046 389 8912 7975 1929 -5736 -10874 -7191 4020 11379 8668 -2261 -12291 -8498 4457 12202
1060 12202 10113 993 -6321 -7564 -2162 6018 11159 8664 -957 -10480 -6988 6084 13599 9742
1074 9742 -309 -8332 -7821 -68 6934 9891 5855 -3442 -11252 -7081 4811 11940 7647 -3902
1088 -3902 -11588 -8929 812 6582 5961 1093 -6268 -11304 -6988 3037 9751 5878 -5460 -13589 -8851
1103 -8851 1389 6722 5631 -757 -7430 -9946 -4276 4070 9924 6215 -5721 -12582 -6815 4689
1117 4689 9902 6907 -1851 -7393 -5687 184 6890 10377 6084 -4398 -10353 -4380 6689 12195
1131 12195 7564 -2234 -7238 -4085 2751 8146 9742 4000 -5338 -9196 -3235 6748 11750 6063 -4394
1146 -4394 -9455 -4091 3787 7637 6278 -56 -7676 -9536 -3469 4791 9156 3178 -7394 -11188 -4852
$$ packed form
1046C89Q523r37o046p665n138L683J1211P359k711j0929j0030L793J2955P745
1060A2202k089r120p314j243N402Q180N141k495r621r523L492J3072P515l857
1074I742j0051q023N11P753P002K957m036r297p810M171J1892P129m293j1549
1088c902p686K659R741N770o21m868p361n036M316J0025O714l873j1338q129M738
1103h851J0240N333j091o388o673k516N670Q346N854l709j1936o861N767J1504
1117D689N213k995q758n542J706N871O706L487m293j0482n955N973J1069N506
1131A2195m631r798n004L153O836N395J596n742r338l858N961R983N002n687j0457
1146d394n061N364P878L850j359o334p620j860O067Q260M365n978j0572l794O336
$$ plain form
1161 -4852 2849 6460 3564 -3427 -8612 -8610 -3356 4064 8363 2605 -8094 -11622 -4672 4476 8019
1176 8019 3234 -4887 -9094 -5568 446 6681 8776 2303 -7213 -8516 -2434 7307 11347 4016 -4738
1191 -4738 -7576 -2414 3818 8600 8067 1490 -4959 -7121 -988 8464 10828 3141 -5817 -6768 -1820
1206 -1820 4847 8340 5944 -1118 -6274 -6247 -1107 6384 8642 1409 -7921 -8861 -2945 5500 7698 2119
1222 2119 -4099 -7162 -5963 -1260 5173 6907 -384 -8720 -9626 -1939 5830 7301 885 -6122 -7273
1237 -7273 -5176 1126 6842 5923 -631 -6837 -7870 -922 7771 8878 1170 -6488 -7041 -1678 4315
1252 4315 7549 4910 -158 -4665 -6902 962 9760 9369 827 -6445 -5818 -79 6444 7720 3011
1267 3011 -2310 -5962 -5001 1407 8091 6840 -339 -7555 -7729 -697 6824 6200 250 -4956 -6022 -4392
$$ packed form
1161d852P701L611k896o991n185KN254P420M299n758j0699l528O950R148L543
1176H019m785q121m207L526O014O235K095o473r516j303O082R741M040p331q754
1191d738k838N162O232M782n33o577o449k162O133R452K364p687q958r51M948
1206a820O667L493k396p062n156K7N140P491K258p233r330r40N916Q445K198n579
1222B119o218l063J199M703O433J734p291q336r06P687P769J471o416p007j151
1237g273K097O302N716r19o554o206j033O948Q693J107p708p658n53N363N993
1252D315L234k639n068m507k237P864Q798l91q542p272O27N739O523J276m709
1267C011n321l652R61O408O684j251p179p216j74P032P521o24n950n206j066J630
$$ plain form
1283 -4392 1199 6434 5353 -1931 -8812 -8744 -371 6544 4817 -1581 -5907 -6941 -3737 2712 5728
1298 5728 3091 -2870 -7885 -7028 611 7400 6575 -704 -6376 -4901 -188 5473 5622 3145 -1453 -6176
1314 -6176 -5453 2813 9302 6620 -637 -5659 -4607 1356 7312 6584 2291 -2812 -5076 -2927 3767
1329 3767 7674 6121 -1230 -6389 -5455 2884 7363 4249 -382 -3889 -4879 -2740 3094 5748 3275
1344 3275 -3037 -8198 -5713 1877 6236 3098 -2276 -6268 -6980 -1722 3462 4280 2050 -3847 -8056
1359 -8056 -5689 1982 6474 3481 -3344 -7611 -5018 922 4132 3844 660 -3274 -7052 -3506 4143
1374 4143 7120 3608 -2837 -6236 -3495 2375 6495 4961 1505 -3172 -4207 -766 4707 6902 4647
1389 4647 -2008 -6663 -2730 4159 7152 4267 -667 -3767 -3946 12 4070 6228 2980 -3413 -6749
$$ packed form
1283d392N591N235j081p284o881O8Q373O915j727o398m326j034L204O449L016
1298E728k637n961n015Q57P639O789q25p279n672J475M713N661J49k477m598m723
1314f176P23Q266O489k682p257n022J052N963N956p28m293n103k264K149O694
1329C767L907j553p351n159R34Q339M479l114m631l507r90K139N834K654k473
1344C275o312n161K485P590M359l138n374l992p12N258N184Q18k230n897m209
1359h056K367P671M492k993o825m267K593N940L210k88l184l934l778L546P649
1374D143K977l512o445l399K741N870M120j534l456m677j035L441N473K195k255
1389D647o655m655L933O889K993k885m934l100j79L958M058K158l248o393l336
$$ plain form
1404 -6749 -2507 4085 5857 3330 -2193 -6289 -4486 1039 3711 3313 473 -4151 -6771 -3059 3598
1419 3598 5438 1615 -4944 -7049 -3183 996 2965 2736 201 -5399 -6322 -1524 4162 5714 1659
1434 1659 -4454 -6222 -2266 2877 5287 3614 -1043 -4391 -3662 792 4468 6654 2982 -4049 -6302
1449 -6302 -758 5103 6000 3155 -1194 -3557 -2322 1419 5201 5983 1201 -4597 -5137 -50 4303 5840
1465 5840 2428 -3813 -5060 -2234 1830 4044 3341 -730 -4999 -5710 -1951 4161 5282 825 -5194
1480 -5194 -5969 -1872 1328 3375 2069 -1977 -5554 -4784 -450 3736 4316 5 -5418 -5850 -829 3081
1496 3081 4749 1498 -2733 -4471 -2826 973 4570 5404 339 -4487 -4535 391 4945 5564 1383 -2383
1512 -2383 -3361 -1313 2422 4973 4349 -440 -4058 -3684 679 5574 5412 1020 -4031 -3223 -192 2875
$$ packed form
1404f749M242O592J772k527n523m096J803N525K672l98k840m624k620L712O657
1419C598J840l823o559k105L866M179J969k29k535n600r23M798N686J552m055
1434A659o113j768L956N143K410j673m657l348P29M454L676K186l672p031k253
1449f302N544N861Q97k845m349k363J235L741L782P82m782n798n40N087M353J537
1465E840l412o241j247K826M064K214p03m071m269p11L759O112J121m457o019
1480e194p75M097L200K047j306m046l577P70M334M186N80m311n423m32N021L910
1496C081J668l251m231j738J645L799L597Q34n065m826m8M926M554O19m181l766
1512b383r78K048L735K551o24m789l618L74M363M895j62m392n051Q08L031L067
$$ plain form
1528 2875 4252 2872 -1079 -4534 -4230 49 4294 4717 -775 -5230 -4022 -1002 2400 3746 1305
1543 1305 -2973 -4958 -3675 321 3898 3495 -1667 -5668 -4859 -427 3816 3252 -169 -3572 -3946 -1996
1559 -1996 1247 3879 3068 -1537 -5203 -4498 1423 4634 3941 -56 -3168 -3018 -1151 2427 5236 3090
1575 3090 -1055 -3134 -2952 1968 5753 4568 -278 -3653 -2727 661 3592 4457 2114 -1119 -3873 -2966
1591 -2966 2148 5142 3374 -1959 -4354 -3357 -539 3297 3499 339 -3054 -4312 -2745 1745 3776
1606 3776 1842 -2688 -5769 -4592 -22 3605 2044 -1630 -3499 -4367 -2032 1712 3956 1318 -2196
1621 -2196 -5709 -3435 1475 4386 2476 -946 -3383 -3301 -126 2970 3837 1578 -1408 -3793 -2400 2990
1637 2990 5469 3292 -1017 -3314 -1518 1381 3856 3558 1541 -1837 -3525 -1342 3518 5291 2290
$$ packed form
1528B875J377j380l951l455L04M279M245M23n492m455J208L020L402J346k441
1543A305m278j985J283L996L577m03n162m001Q09M432M243n64l421l403l74J950
1559a996L243K632q11m605l666P05N921L211o93l997l112J50J867L578K809k146
1575C090m145k079J82M920L785j185m846l375R26L388K931Q65k343l233k754R07
1591b966N114K994j768n333k395R97K818L836K02l160l393j258J567M490K031
1606C776j934m530l081J177M570L627j561l674j869q68K335L744K244k638l514
1621b196l513K274M910K911j910l422k437Q2L175L096Q67k259k986k385J393N390
1637B990K479k177m309k297J796K899K475k98k017l378j688K183M860J773l001
$$ plain form
1652 2290 -1357 -3521 -2147 1394 3545 2852 -333 -2607 -3664 -925 2328 4149 1510 -2393 -5253
1667 -5253 -2105 1891 3492 1290 -2049 -3707 -3884 -964 2039 3189 1008 -3359 -5031 -2302 2463
1682 2463 3128 1378 -2005 -3864 -2869 157 2830 2545 910 -2838 -3890 -1203 2603 3949 1855 -1754
1698 -1754 -3569 -1417 1911 3620 2687 1047 -2032 -2753 -14 3629 4580 1931 -2535 -3037 -587 2089
1714 2089 3529 2441 -144 -2799 -2214 273 3116 3120 1099 -2651 -3869 -1305 2142 3213 752 -1551
1730 -1551 -3626 -1900 82 2478 2179 234 -3274 -4522 -1158 2012 2932 347 -2632 -4113 -1661
1745 -1661 856 2435 2021 -385 -3147 -3428 -54 2859 3048 701 -2864 -3133 -700 2003 3367 1998
1761 1998 -529 -2395 -2150 256 3326 3776 250 -2618 -3186 27 2532 3313 1762 -1287 -2685 -1668
$$ packed form
1652B290l647k164J374L541K151o93l185k274j057K739L253J821k639l903k860
1667e253L148L996J601k202l339j658j77K920L003J150k181m367j672K729M765
1682B463O65j750l383j859R95L026K673k85j635l748j052K687L806J346k094l609
1698a754j815K152L328J709r33j640l079p21K739L643R51k649m466n02K450K676
1714B089J440j088k585k655N85K487K843Mk021l750j218K564L447J071k461k303
1730a551k075J726J982K396k99j945l508j248L364L170R20k585k979j481K452
1745a661K517J579m14k406k762k81L374K913J89k347l565k69K433K703J364j369
1761A998k527j866K45K406L070M50l526k868n68L213K505P81j551l049j398J017
$$ plain form
1777 -1668 970 3090 3234 -46 -3376 -3359 -58 2310 2540 -33 -2391 -2660 -1345 813 2299 1538
1793 1538 -854 -3642 -3450 -287 2348 2209 -421 -3250 -2998 -1694 519 1796 1262 -1241 -3939 -2054
1809 -2054 -263 2821 2637 -295 -2920 -2709 -285 1750 2431 1175 -1193 -2739 -1844 667 3220 2924
1825 2924 -818 -2685 -2034 614 2992 2958 1061 -1548 -1891 -821 1966 3582 2834 -463 -2590 -1702
1841 -1702 976 3324 2763 -122 -2325 -1771 -310 1547 2847 1344 -2004 -3067 -2502 369 2404 2033
1857 2033 -880 -2950 -2540 -852 1450 1554 435 -1892 -3219 -2173 38 2320 1489 -2035 -3623 -2102
1873 -2102 -119 1734 1653 -151 -1715 -2800 -1617 1053 3041 1619 -1702 -2903 -1708 608 2453
1888 2453 2327 206 -1834 -1574 233 2270 3266 1701 -588 -1984 -1040 1923 3088 2356 -58 -1741
$$ packed form
1777a668K638K120J44l280l330J7L301K368K30k573k358k69J315K158J486p61
1793A538k392k788J92L163K635j39k630k829K52J304K213J277n34k503k698J885
1809b054J791L084j84k932k625K11K424K035O81j256k368j546Q95K511K553k96
1825B924l742j867O51K648K378l4j897k609l43J070K787J616p48l297k127Q88
1841a702K678K348n61k885k203N54J461J857J300j503l348j063N65K871K035l71
1857B033k913k070M10J688K302J04j119k327j327J046K211K282q31l524j588J521
1873b102J983J853q1j804j564j085J183K670J988j422l321j201J195K316J845
1888B453j26k121k040K60J807K037R96j565k289j396R44K963J165p32k414j683
$$ plain form
1904 -1741 -1475 82 1739 2578 1310 -1285 -2309 -633 1620 2700 1151 -948 -2515 -2113 5 1750
1920 1750 1373 8 -2019 -2814 -1275 553 2380 813 -1790 -2636 -1769 332 2012 1126 -1139 -2117
1936 -2117 -2652 -1217 1518 2357 577 -1654 -2971 -875 803 2343 1260 -1062 -1523 -1716 187 2277
1952 2277 2540 986 -1199 -2082 -823 1980 2455 1152 -248 -1524 -1200 583 2392 1958 728 -1114
1968 -1114 -2154 -544 2266 2605 627 -798 -1902 -1198 856 2595 1008 -260 -2092 -2659 -454 1674
1984 1674 1908 691 -1687 -2716 -986 1014 1613 797 -563 -2473 -2270 -280 1707 1124 -458 -1960
2000 -1960 -2324 -768 1305 2102 492 -1074 -1768 -1696 332 1496 1479 445 -1863 -1971 -124 2238 1765
2017 1765 494 -824 -1543 -255 1211 2634 1887 53 -1539 -1270 497 2625 2404 652 -898 -2075
$$ packed form
1904a741K66J557J657Q39j268k595j024J676K253J080j549k099j567M02K118J745
1920A750l77j365k027p95J539J828J827j567k603q46Q67K101J680q86k265r78
1936b117n35J435K735Q39j780k231j317K096J678J540j083k322m61j93J903K090
1952B277K63j554k185q83J259K803M75j303j400j276L24J783J809m34j230j842
1968a114j040J610K810L39j978j425j104P04K054J739j587j268j832n67K205K128
1984A674K34j217k378j029J730K000N99q16j360j910K03J990J987n83j582j502
2000a960l64J556K073P97j610j566o94P2K028J164j7j034k308j08J847K362m73
2017A765j271j318p19J288J466J423p47j834j592K69J767K128k21j752j550j177
$$ plain form
2033 -2075 -413 1571 1420 843 -533 -1400 -1720 343 1718 2242 433 -2061 -1704 -238 1485 1470 322
2050 322 -825 -2317 -1191 336 1681 1390 -458 -2161 -2411 -689 1162 1610 140 -1815 -2213 -921
2066 -921 18 1444 1398 -787 -2180 -2004 118 1900 1562 170 -1645 -1340 -280 880 2032 1832 -798
2083 -798 -1600 -1036 775 1955 1741 435 -1590 -1317 13 1522 1639 429 -878 -1570 -858 848 2579
2100 2579 1447 -298 -1643 -1330 37 869 1338 572 -1315 -1762 -712 111 1243 638 -1134 -2223 -1806
2117 -1806 -278 1266 1286 -570 -1726 -1467 -780 674 1066 467 -1048 -2370 -1268 582 1388 1605 -960
2134 -960 -1506 -1452 311 1603 1793 598 -952 -1691 107 1288 2112 1265 -504 -1081 -824 306 1480
2151 1480 2130 284 -648 -842 -463 937 2237 1157 -338 -1567 -798 926 1427 1402 -60 -1140 -1568
$$ packed form
2033b075J662J984j51n77j376q67l20K063J375N24j809k494L57J466J723j5j148
2050C22j147j492J126J527J345k91j848j703k50J722J851M48j470j955l98J292
2066i21R39J426m6k185j393J76K122J782l38j392j815L05J060J160J152k00k630
2083g98q02N64J811J180k14j306k025K73J330J509J17j210j307o92P12J706J731
2100B579j132j745j345L13J367Q32M69p66j887m47J050Q23J132o05j772j089M17
2117a806J528J544K0j856j156K59O87J454L92n99j515j322J102J850Q06K17k565
2134i60n46N4J763J292J90j195j550p39J798J181Q24q47j769n77K57J130J174
2151A480O50j846r32j94L79J400J300j080j495j229P69J724N01k5j462j080m28
$$ plain form
2168 -1568 147 632 1748 440 -1062 -1616 -903 674 1453 639 -1168 -1992 -1708 -981 561 1228 -142
2185 -142 -1364 -2308 -1353 354 1497 78 -808 -1534 -1598 -630 1406 1179 317 -1518 -1364 -567 667 1629
2203 1629 576 -289 -2026 -816 695 1579 1501 109 -598 -1209 65 1368 1686 816 -671 -1149 -696
2220 -696 1119 1791 1425 -127 -597 -1029 639 1501 1714 -93 -1135 -1540 -174 1061 1814 200 -891
2237 -891 -1388 -934 -101 1216 1320 -368 -1271 -1198 -341 620 1188 227 -1118 -1762 -1266 233 933 796 -598
2256 -598 -1217 -1736 111 1284 1619 334 -1218 -1747 -108 656 1175 350 -67 -873 -1433 357 784 1254
2274 1254 -94 -803 -1316 -239 1165 1599 229 -292 -1183 -972 561 1267 838 222 -920 -1858 -140
2291 -140 1092 1453 457 -1024 -1079 -1082 768 1103 437 -763 -1654 -1399 -287 1324 1176 231 -1394 -1460 -805
$$ packed form
2168a568J715M85J116j308j502n54P13J577P79q14j807q24K84P27J542O67j370
2185a42j222r44R55J707J143j419q86p26o4R68K036k27q62j835J54P97J234R62
2203A629j053q65j737J210J511Q84p8j392p07o11J274J303L18q70j487m78M53
2220f96J815O72l66j552m70m32J668Q62K13j807j042m05J366J235P53j614j091
2237h91m97M54Q33J317J04j688r03P3Q57R61N68r61j345o44M96J499P00j37j394
2256e98o19n19J847J173L35j285j552n29J639P64N19q25m17q06n60J790M27M70
2274A254j348p09n13J077J404M34j370n21q91K11J533P06m29o16j142r38J718
2291a40J232L61r96j481n5lJ850L35o66j200q91K55J112J611j48r45j625o6O55
$$ plain form
2310 -805 668 1011 498 -952 -1621 -1277 181 1607 616 -33 -925 -985 -330 633 1208 442 -738 -1173 -865
2329 -865 406 1288 1337 -259 -857 -712 421 1618 1261 790 -557 -1027 30 592 1700 1351 -86 -685
2347 -685 -1044 -73 1043 1179 311 -533 -860 -148 355 576 844 -626 -1094 -630 -308 649 109 -16 -1391
2366 -1391 -1208 -402 -38 640 -8 -985 -1494 -1121 -126 435 440 -705 -1542 -837 -104 545 737 -163 -775 -1771
2386 -1771 -63 698 774 491 -859 -1304 -716 379 1550 534 -135 -730 -811 381 1303 1188 643 -115
2404 -115 -864 -175 707 1391 1464 -1 -635 -609 311 1028 1376 218 -256 -3 139 1031 857 891 -337 -800
2424 -800 -821 386 1075 874 -40 -706 -1032 -333 613 949 176 -593 -1680 20 118 431 641 -449 -1288
2443 -1288 -785 -474 242 1284 -313 -834 -1672 -710 280 1005 16 -384 -884 -1122 -249 944 823 414 -891
$$ packed form
2310h05J473L43n13j450o69L44J458J426r91o49q92o0O55R63N75p66j180m35L08
2329h65J271Q82M9j596n98J45J133J197l57m71j347m70J057N62J108l49j437n99
2347f85l59R71J116J36q68q44l27P12N03K21K68j470m68M64L22R57n40j25j375
2366a391J83Q06L64O78o48r77n09L73R95N61Nj145q37P05P33O49J92r00o12r96
2386a771J708P61P6k83j350m45N88J095J171j016o69n95q1J192R22j15n45p58
2404a15p49O89Q82O84P3j465o34K6R20P17L48j158m74K53J42Q92j74L4j228m63
2424h00k1J207O89k01r14o66l26O99R46L36p73p69j087J700R8L13K10j090q39
2443a288N03L11P16J042j597n21q38R62R90P25r89m00n00k38Q73J193j21m09j305
$$ plain form
2462 -891 -730 -441 919 993 604 -972 -819 -202 346 793 1222 -113 -146 -443 -438 1171 1631 464 -602
2481 -602 -1031 -396 454 812 761 -210 -821 -648 -200 834 1293 357 -940 -1510 -471 394 1061 330 -462
2500 -462 -858 -701 -3 557 628 -59 -1528 -1219 -706 960 772 530 -578 -816 -662 219 763 704 -333
2519 -333 -385 -623 496 684 551 447 -267 -681 -378 465 1119 1095 126 -136 -657 94 940 1390 353 -674
2539 -674 -597 -272 1177 1012 365 210 -108 -457 -119 995 884 -74 -904 -833 -703 1285 1142 73 -507
2558 -507 -1018 -752 -636 1237 185 -376 -996 -928 -544 22 79 -202 -1032 -1100 -760 -212 395 333 8 -1123
2578 -1123 -1012 -86 654 252 212 -655 -839 -162 660 785 436 -31 -875 -831 -72 875 871 223 -517 -622 -58
2599 -58 937 990 226 -323 -664 -761 545 899 322 -116 -220 -141 -26 918 465 225 -247 -536 -143 835 769
$$ packed form
2462h91J61K89J360P4l89j576J53O17N48M47M29j335l3k97NJ609M60j167j066
2481f02m29O35Q50L58n1r71o11J73M48J034M59r36j297n70J039Q65O67p31p92
2500d62l96J57O98N60P1o87j469L09N13J666j88k42j108k38J54Q81N44n9j037
2519c33n2k38J119J88j33j04p14m14L03Q43O54k4r69k62n21P51Q46M50j037j027
2539f74P7L25J449j65o47j55l18l49L38J114j11r58q30P1J30J988j43j069n80
2558e07n11K66J16J873j052n61o20O8L84N66N7k81q30o8L40N48O07o2l25j131
2578a123J11R26P40m02m0q67j84O77Q22J25l49m67q44M4P59R47mo48p40j05N64
2599e8R95N3p64n49l41r7J306L54n77m38j04P9J15R44m53k40m72k89L93R78o6
$$ plain form
2620 769 173 -430 -1131 -568 169 348 568 129 -684 -785 -500 -3 320 -2 -71 -1014 -539 -32 454 286
2640 286 -351 -1068 -805 -229 1048 460 150 -593 -1039 -321 586 855 659 -195 -725 -787 247 920 803 -119
2660 -119 -276 -660 -415 750 856 749 -121 -573 -545 266 323 428 -281 -170 -577 -196 786 513 276 -62
2680 -62 -798 -174 49 738 590 -37 -764 -771 -274 644 -79 -83 -360 -905 -443 26 326 -8 -826 -846 -360 64
2702 64 229 242 -304 -385 -767 -122 565 382 92 -458 -1203 -836 217 638 509 1 -573 -673 66 218 688
2723 688 14 340 -723 -13 205 506 356 190 -170 -76 -128 1342 353 342 -392 -798 -405 519 750 -77
2743 -77 -237 -669 -629 103 770 692 17 -575 -434 -614 168 -14 181 -1010 -698 -493 64 577 -166 -258 -414
2764 -414 -423 -134 275 402 31 -939 -614 -423 473 222 192 -662 -730 103 61 98 683 307 -489 -215 -61 267
$$ packed form
2620G69n96o03p01N63P37J79K20m39q13j01K85M97L23l22o9r43M75N07M86j68
2640B86o37p17K63N76J277n88l10p43m46P18R07K69j96q54n30o2J034O73j17r22
2660a19j57l84K45J165J06j07q70m52K8Q11N7J05p09J11m07L81R82k73k37l38
2680f2p36O24K23O89j48o27p27pM97R18p23mk77n45M62M69L00l34q18k0M86M24
2702F4J65J3n46q1l82O45O87j83k90n50p45L67J053M21j29n08n74j00P39J52M70
2723F88o74L26j063P10K18L01j50j66l60R4n2J470r89j1p34m06L93R24K31q27
2743g7j60m32M0P32O67p8o75n92J41j80P82j82J95j191L12K05N57N13p43r2j56
2764d14rK89M09J27l71r70L25J91Q96k51l0q54o8Q33m2L7N85l76p96K74J54L28
$$ plain form
2786 267 573 655 -405 -909 -440 288 797 525 212 -500 -329 -80 552 652 352 -298 -372 177 331 713
2806 713 651 -365 -258 -504 133 191 669 153 -552 -621 -593 -101 1249 201 -345 -444 -528 79 561 437 -227
2827 -227 -845 -883 -131 631 492 -18 -32 -872 -511 248 888 608 -813 -805 -833 -271 587 68 55 -158 -251 145
2849 145 369 506 92 -258 -616 -558 388 603 431 -488 -837 -202 -532 508 444 56 -275 -474 -790 379
2869 379 806 196 -234 -458 -596 -346 459 618 -197 -172 -314 -258 -6 381 79 -433 32 -554 255 738 260
2890 260 -80 -514 -198 135 -36 566 164 -289 -507 238 395 602 497 6 -229 -610 -68 491 348 631
2910 631 -223 -146 -411 464 825 537 -342 -122 -170 349 757 505 -79 -104 317 -486 566 565 268 -764 55
2931 55 81 -55 21 472 440 -168 -508 -270 5 356 22 -596 -580 -581 381 434 -158 -566 -1042 -208 -176 197 162
$$ packed form
2786B67L06Q2j060n04M69P28N09k72l13p12J71K49O32J00l00o50p4N49J54L82
2806G13o2j016J07k46O37N8M78n16p05o9K8M92J350j048n46r9q4O07M82j24o64
2827b27o18l8P52P62j39n10j4q40L61P59O40k80j421Qk8N62Q58n19j3k13r3L96
2849A45K24J37m14l50l58N8R46K15j72r19l49O35l30J040o4l88l31j99l16J169
2869C79M27o10m30k24j38K50Q05J59q15K5j42N6K52L87l02n12M65n86Q09M83m78
2890B60l40m34L16L33j71O02m02m53k18P45J57K07j05m91k35l81N42N59j43K83
2910F31q54P7k65Q75L61k88q79K20m8N19M08k52n84k5M21q03J052jk97j032Q19
2931E5K6j36P6M51l2o08l40K38K75L51l34o18J6jR62N3n92m08m76Q34L2L73l5
$$ plain form
2954 162 -372 -393 -533 -726 -295 -302 7 390 -663 -465 -169 431 182 -197 -201 -320 -88 113 586 688 145
2975 145 -415 1 25 219 771 416 -369 -389 284 669 692 -11 86 -539 -116 159 929 288 -5 94 -151 6
2997 6 -28 275 -191 -379 -329 -106 285 -17 532 46 -421 -476 169 854 249 -263 -947 -571 12 -114 194 324
3019 324 -500 -871 -337 27 148 30 -42 -460 -235 158 125 325 43 -445 -666 -98 115 501 268 -100 -130
3040 -130 65 -94 225 574 179 -88 10 -79 147 621 162 188 91 -475 -270 -42 98 -83 -264 95 -525
3061 -525 548 633 -38 -301 -369 -482 -369 268 26 -516 -643 -235 -141 234 272 459 -274 -555 155 -40 283
3082 283 180 -13 -755 21 0 -153 401 -281 -807 -764 -27 352 325 -41 136 -526 -47 179 586 448 -174
3103 -174 -456 -82 163 -122 418 350 -284 -334 -80 388 331 242 101 124 -326 324 42 436 40 -69 98 -362
$$ packed form
2954A62n34k1j40j93M31pL09L83j053J98K96O00k49l79mj19K32K01M73J02n43
2975A45n60M16K4J94N52l55p85k0O73L85K3p03R7o25M23K75P70o41k93R9k45J57
2997Fl4L03m66j88N0K23L91l02N49m86m67n5O45O85o05n12o84L76N83j26L08J30
3019C24q24l71N34L64J21j18p2m18K25L93l3K00k82m88k21N68K13L86k33l68l0
3040a30J95j59L19L49l95k67R8q9K26M74m59K6r7n66K05K28J40j81j81L59o20
3061e25J073Q5o71k63o8j13J13O37k42n42j27M08R4L75L8J87p33k81P10j95L23
3082B83j03j93p42P76k1j53N54o82n26M3P37L79k7l66J77o62M79K26M07j38o22
3103a74k82L74K45k85N40o8o34n0K54M68n7q9j41K3m50O50k82L94l96j09J67m60
$$ plain form
3125 -362 216 433 -184 -166 -756 -428 -41 504 -120 -80 -359 -149 37 -175 356 -239 -475 -728 -428 -9 143
3146 143 -59 -46 -572 -258 83 -221 493 321 -357 -441 -172 -31 344 374 133 -438 -361 -54 270 874 -27
3167 -27 -144 174 149 88 605 516 -445 -654 -325 119 147 235 95 -343 -410 -58 453 236 -46 -225 41 -20 -155
3190 -155 438 116 -118 -190 -339 -155 -156 634 -567 -461 -936 -258 181 912 271 -89 -379 -625 74 381 -192
3211 -192 61 -316 -744 46 -259 473 36 95 -270 -376 -59 -43 195 -27 36 -432 283 549 592 64 -521
3232 -521 108 -336 596 97 197 -199 -68 -447 -381 -56 542 55 -244 33 -304 -88 781 222 248 -4 -162
3253 -162 -70 709 245 265 -345 -383 334 -55 206 -200 132 -405 -976 -276 302 -10 39 -489 -465 -509 298 -84
3275 -84 -203 -603 -400 -237 374 223 228 241 -12 -391 -115 23 172 461 170 -68 4 91 557 430 48 -212
$$ packed form
3125c62N78K17o17J8n90L28L87N45o24M0k79K10J86k12N31n95k36k53L00M19J52
3146A43k02J3n26L14L41l04P14j72o78q4K69J41L75L0k41n71P7L07L24O04r01
3167b7j17L18k5o1N17q9r61k09L29M44K8Q8j40m38o7L52N11k17k82j79K66o1j35
3190a55N93l22k34p2j49J84jP90j201J06m75O78M39P31o41l60k90k46O99L07n73
3211a92K53l77m28P90l05P32m37N9l65j06L17J6K38k22O3m68P15K66M3n28n85
3232e21O29m44R32m99J00l96J31l79O6L25N98m87k99K77l37K16Q69n59K6k52j58
3253a62R2P79m64K0o10l8P17l89K61m06L32n37n71P00N78l12M9n28K4m4Q07l82
3275h4j19m00K03J63O11j51NJ3k53l79K76J38J49K89k91k38P2Q7M66j27l82k60
$$ plain form
3297 -212 28 59 154 361 191 -42 -490 201 206 301 -49 -209 -76 30 122 493 699 -120 -340 -283 79 340
3319 340 261 673 -454 -150 -146 -363 282 -303 90 86 -414 212 -18 240 -80 -374 -157 -451 444 698 256
3340 256 -664 -512 -2 143 59 567 -105 -419 -483 -167 613 7 -95 83 -206 258 68 132 412 -4 -106
3361 -106 -511 -267 162 329 115 -387 -570 -310 -356 250 261 -549 -366 125 -172 56 256 -338 -429 48 -171
3382 -171 467 10 128 151 -425 185 150 522 198 -206 -519 -398 -181 181 118 65 9 -202 -81 -41 173 -108
3404 -108 108 -477 -135 302 -56 -27 -155 -233 -312 -35 259 263 225 -308 -651 -301 172 529 -93 -166 -188 -50 -253
3427 -253 -73 402 498 -152 -115 -153 -319 295 336 -78 -75 -419 -87 265 38 300 -143 -323 -221 -21 194 558
3449 558 -343 -733 357 167 -158 -318 -503 -253 -575 -43 416 297 -372 -297 124 -84 -99 173 -231 120
$$ packed form
3297b12K40L1R5K07j70k33m48O91NR5l50j60J33J06R2L71K06q19k20N7L62K61
3319C40p9M12j127L04Mk17O45n85L93mn00O26k30K58l20k94K17k94Q95K54m42
3340B56r20J52N10J45q4N08o72l14o4L16P80o06j02J78k89M64j90O4K80m16j02
3361a06m05K44M29J67k14n02j83K60m6O06J1q10J83M91k97K28K00n94r1M77k19
3382a71O38m57J18K3n76O10l5L72l24m04l13J21K17L62o3n3n6k11J21M0K14k81
3404a08K16n85L42M37l58K9j28p8p9K77K94Ml8n33l43L50M73L57o22p3k2J38k03
3427b53J80M75R6o50L7l8j66O14M1m14Ll44L32L52k27K62m43j80J02K00K15L64
3449E58r01l90J090j90l25j60j85K50l22N32M59j19o69P5M21k08j5K72m04L51
$$ plain form
3469 120 -93 -176 -257 204 257 -299 -60 -299 26 237 621 201 213 -773 -164 6 368 566 138 -7 -335
3490 -335 -161 394 856 -337 127 -67 -88 1 130 -162 29 -203 -166 -215 248 544 -32 224 336 -282 141
3511 141 252 475 -293 -485 -111 75 246 -94 302 -140 -436 -45 456 170 -161 -458 -149 81 445 204
3531 204 294 -140 -135 55 -579 -266 -174 -46 -181 203 -216 63 263 -401 -316 -31 -275 -151 262 -329 71 -23
3553 -23 -449 -57 290 -10 335 -125 -295 58 164 132 283 2 -252 -609 133 451 428 274 -302 -358 -397 157
3575 157 171 -169 -382 -440 -341 -50 194 339 486 -366 -329 -346 130 -3 -84 117 96 -47 -127 376 -285 239 -32
3598 -32 4 279 21 -54 498 71 -383 -217 -49 341 63 108 -285 -134 -260 164 147 74 80 228 -656 376
3620 376 323 -152 144 -520 -510 2 -159 135 188 -438 -530 -521 284 -95 220 -60 -113 381 168 58 -103 26
$$ packed form
3469A20k13q3q1M61N3n56K39k39L25K11L84m20J2r86O09J70L62J98m28j45l28
3490c35J74N55M62j193M64j94k1Q9J29k92J91k32L7m9M63K96n76K56J12o18M23
3511A41J11K23p68j92L74J86J71l40L96m42k96L91N01k86l31k97L09K30L64k41
3531B04R0m34NJ90o34L13R2J28j35L84m19K79K00o64Q5K85k44J24M13n91M00r4
3553b3m26L92L47l00L45m60j70L53J06l2J51k81k54l57P42L18k3j54n76n6l9N54
3575A57J4l40k13n8R9K91K44J45J47q52L7j7M76j33q1K01k1j43q0N03o61N24k71
3598c2L6K75k58p5N52m27m54J66J68L90k78M5l93J51j26M24j7p3OJ48q84J032
3620C76n3m75K96o64J0N12j61K94N3o26r2RQ05l79L15k80n3M94k13j10j61J29
$$ plain form
3642 26 -178 -298 75 -260 20 349 -46 -376 -131 22 -316 83 287 -64 64 124 34 2 -314 -165 379
3663 379 -80 181 -102 99 -366 -359 -48 -120 713 -94 -33 -252 -506 -105 41 -195 578 137 -471 48 -149
3684 -149 206 -72 231 -367 -108 -540 180 314 293 -53 146 -226 -38 77 176 -195 -467 -132 -357 -297 -24
3705 -24 244 -98 25 -81 -123 19 -176 276 -108 -351 -327 214 -113 -148 -215 -415 -190 422 524 -83 -258 -240
3727 -240 -43 298 27 160 538 -99 -349 139 76 -23 113 47 0 -189 -296 344 375 -1 179 103 49 -53
3749 -53 -208 -6 -83 -143 284 -345 530 -199 -22 -382 190 -353 -74 365 -16 69 -221 34 -150 305 -152
3770 -152 396 -448 430 -179 -211 -345 -93 -260 -40 -206 -107 284 176 -124 234 -256 199 275 216 -232 222
3791 222 -225 -344 -312 -72 -21 213 -333 284 528 -142 226 399 483 262 96 -154 169 -221 88 138 -66
$$ packed form
3642B6k04j20L73l35K80L29l95l30K45J53l38L99K04l51J28O0r0l2l16J49N44
3663C79m59K61k83K01m65PL11p2Q33q07O1k19k54M01J46k36P73m41o08N19j97
3684a49L55k78L03n98K59m32P20J34k1l46J99l72J88J15R9l71k72L35k25O0K73
3705b4K68l42J23j06m2J42j95M52l84k43K4N41l27l5o7k00K25O12J02o07j75J8
3727b40J97L41k71J33L78o37k50M88o3r9J36o6m7j89j07O40L1l76J80p6n4j02
3749e3j55K02p7o0M27o29Q75p29J77l60N72n43K79M39l81Q5k90K55j84M55m57
3770a52N48q44Q78o09l2j34K52j67K20j66R9L91j08l00L58m90M55P6n9m48M54
3791B22m47j19L2K40N1K34n46O17K44o70L68J73Q4k21j66k50L23l90L09N0k04
$$ plain form
3812 -66 -350 556 232 -87 -71 237 133 226 -192 201 42 -51 -39 24 83 -101 -470 -325 -20 -176 293 -370
3834 -370 545 -275 -391 -259 182 446 181 -141 -261 446 -20 -216 -244 100 -541 -157 452 531 -167 -296 -264
3855 -264 -417 -220 65 137 377 94 -651 -193 -12 355 200 37 363 -266 -333 -170 44 70 241 375 86
3876 86 246 403 331 356 -576 -548 380 -61 234 52 457 176 -137 123 -139 -269 85 -582 -172 239 -157
3897 -157 -402 -236 80 -11 -271 33 -249 -579 224 -299 69 -212 203 -251 -175 -96 -231 -162 173 21 -12 -3
3919 -3 -204 69 -212 -91 572 -140 173 -300 -119 279 -119 159 220 357 -159 -47 239 582 62 -288 -635
3940 -635 176 -421 330 6 -31 -112 -370 28 467 -365 -11 -191 -216 -551 -206 513 -308 -9 399 -366 149
3961 149 76 234 293 -138 -204 323 63 -460 -39 -230 515 -68 109 -394 -216 -222 -297 122 -132 -26 27 571
$$ packed form
3812f6k84R06l24l19J6L08j04R3m18L93j59r3J2O3N9j84l69J45L05j56M69o63
3834c70R15q20j16J32M41K64k65l22j20P07m66j96k8L44o41L84O09P9o98j29L2
3855b64j53J97K85P2K40k83p45M58J81L67j55j63L26o29o7J63K14K6J71J34k89
3876H6J60J57p2K5r32K8R28m41K95j82M05k81l13K60k62j30L54o67M10M11l96
3897a57k45J66L16r1k60L04k82l30Q03n23L68k81M15m54P6P9j35O9L35j52l3R
3919ck01K73k81J21O63p12L13m73J81L98l98K78O1J37n16J12K86L43n20l50l47
3940f35Q11n97P51l24l7q1k58L98M39q32L54j80k5l35L45P19q21K99M08p65N15
3961A49p3J58N9m31o6N27k60n23M21j91P45n83J77n03J78op5M19k54J06N3N44
$$ plain form
3983 571 -433 74 -169 117 -63 -157 -54 -186 346 -182 -186 78 33 -30 -408 -132 47 331 3 -112 -386
4004 -386 -7 -258 3 102 -302 25 -247 91 489 -126 -162 -141 6 -542 147 281 285 -123 8 -426 73 212
4026 212 84 191 -84 -295 265 59 -139 331 -202 -325 -113 -135 252 -143 -62 471 -447 -150 18 227 98
4047 98 -98 -369 165 45 58 17 51 -145 -383 -332 -234 450 -40 36 -64 285 -348 94 344 -186 -262 282 -103
4070 -103 129 -197 -140 97 -70 -224 -221 -381 51 -384 -127 162 425 -388 90 -234 -156 293 135 182 -12 61
4092 61 -134 265 -165 116 172 -28 38 147 -99 97 180 -86 -42 55 -391 218 -387 -215 -295 -225 15 318 134
4115 134 -2 206 -248 -133 254 -270 -219 -195 -30 768 202 -22 -328 -226 282 364 -369 391 105 -14 -285
4136 -285 -4 226 -345 -48 147 163 -302 -154 -202 -224 203 181 -355 -208 38 -399 -185 -302 -233 27 -352 -161
$$ packed form
3983E71j004N07k43K86j80r4J03j32N32n28mK64m5o3l78K76J79K84l28j15k74
4004c86L79k51K61R9m04L27k72L38L98o15l6K1J47n48O89J34Mm08J31m34M99J39
4026B12j28J07k75k11N60k06j98M70n33j23K12k2L87l95Q1N33r18K97J68K09j29
4047I8j96k71N34j20J3m1L4j96k38N1R8O84m90P6j00L49o33M42K50n30p6N44l85
4070a03K32l26N7K37j67j54Lj60M32m35K57K89K63q13M78l24P8M49j58M7j94P3
4092F1j95L99m30K81N6k00O6J09k46J96Q3k66M4R7m46O09o05J72q0P0K40L03j84
4115A34j36K08m54J15L87n24N1K4J65P98n66k24l06J02N08Q2p33P60k86j19k71
4136b85K81K30n71K97J95J6m65J48m8k2M27k2n36J47K46m37K14j17O9K60l79J91
$$ plain form
4158 -161 -91 103 300 -165 -71 -222 -37 251 412 -269 325 -157 -195 64 -487 -71 94 -285 110 337 313
4179 313 -126 77 209 -458 291 372 -54 285 231 -493 187 -260 244 -102 285 29 -107 156 23 492 331
4200 331 -215 -69 213 -14 627 -446 253 -341 171 -270 51 232 -245 -142 238 -259 36 -134 243 108
4220 108 -242 176 -12 -323 -264 36 320 -332 -230 -97 -112 243 -3 -170 -195 -584 -60 175 -99 -332 -231
4241 -231 -261 37 64 -295 -180 -77 -187 -81 -118 -186 331 116 -48 147 187 41 269 190 -531 -172 263 -212
4263 -212 125 37 -135 -161 57 94 137 223 -163 -135 62 239 -292 353 -51 58 -21 -98 523 234 -187 127 -304
4286 -304 -6 205 -362 388 -345 136 -79 138 133 22 -37 -228 -190 177 -468 -423 -33 -316 -482 115 48 173
4308 173 160 529 -188 94 178 302 -268 -10 -137 13 -396 170 233 115 -49 -238 25 -9 616 128 97 -307
$$ packed form
4158a61P0J94J97m65R4j51J85K88J61o81N94m82l8K59n51M16J65l79L95K27k4
4179C13m39K03J32o67P49Q1m26L39n4p24O80m47N04l46L87k56j36K63j33M69j61
4200C31n46J46K82k27O41j073O99n94N12m41L21J81m77J03L80m97K95j70L77j35
4220A08l50M18j88l11N9L00K84o52J02J33j5L55k46j67k5l89N24K35k74k33J01
4241b31l0K98K7l59J15J03j10J06l7o8N17k15j64J95M0j46K28p9p21L59M35m75
4263b12L37q8j72k6K18L7M3Q6l86K8J97J77n31O45m04J09p9p7O21k89m21L14m31
4286c04K98K11n67P50p33M81k15K17nj11n9j91L8L67o45M5L90k83j66N97o7J25
4308A73j3L69p17K82Q4J24n70K58j27J50m09N66O3j18j64j89K63l4O25m88l1m04
$$ plain form
4330 -307 -136 209 -352 -198 369 -149 127 -11 -401 317 -82 174 -259 -54 89 -1 83 -300 -327 -392 -116
4351 -116 -610 96 136 144 -245 -168 459 212 294 464 -43 360 228 -350 468 194 33 -60 -41 -180 3 272
4373 272 111 -288 200 -57 -38 -221 -589 105 -42 394 67 -246 -106 175 -313 76 -70 -331 311 -81
4393 -81 -17 -41 -462 -126 33 155 -51 -201 -426 -223 406 211 299 -413 146 305 -183 -109 58 -251 -258 -293 238
4416 238 277 98 -294 265 334 198 -267 332 62 -275 -3 -73 -36 -70 -415 318 -61 -176 213 -102 325 -566
4438 -566 6 -19 -190 93 302 -29 -24 -306 41 -130 -13 -352 222 178 368 39 243 110 76 -28 -180 241
4460 241 196 380 -77 225 320 13 -152 -29 123 -3 -203 -56 -254 205 256 340 125 -75 -235 -79 114
4481 114 114 26 -438 -285 229 509 97 456 90 -47 384 -109 -114 -318 275 238 -467 -100 12 -406 247 89
$$ packed form
4330c07J71L45n61J54N67n18K76j38l90P18l99K56m33K05J43r0Q4l83k7o5K76
4351a16m94P06M0Ql89P7O27k47Q2J70n07M03j32n78Q18k74j61r3J9j39J83K69
4373B72j61l99M88k57J9j83l68O94j47M36l27l13J40K81m88L89j46k61O42l92
4393h1O4k4m21L36J59J22k06j50k25K03O29j95Q8p12N59J59m88P4J67l09pl5N31
4416B38L9j79l92N59O9j36m65N99k70l37K72p0L7l4l45P33l79j15L89l15M27q91
4438e66N72k5j71K83K09l31Nk82L47j71J17l39N74m4J90l29K04j33l4j04j52M21
4460B41m5J84m57L02R5l07j65J23J52j26k00J47j98M59N1Q4k15k00j60J56J93
4481A14%q8m64J53N14K80m12L59l66j37M31m93nk04N93l7p05L67J12m18O53j58
$$ plain form
4503 89 159 253 -425 350 140 -386 -199 241 335 480 -301 54 -284 244 -326 384 -216 372 -9 -11 145 408
4525 408 268 271 -274 -468 190 -116 -193 -15 7 248 340 118 -509 224 -13 -5 21 -503 148 55 39 -238 276
4548 276 -320 306 568 -448 -86 -103 -35 246 -15 -146 58 145 166 -118 86 -38 -78 -135 -355 -336 -8 -13 62
4571 62 85 545 101 132 166 87 234 41 -154 -99 38 26 -133 283 -339 -90 -62 108 355 221 -138 113 -353
4594 -353 344 -92 -105 13 -250 244 -229 -433 -399 122 -37 5 -429 -5 361 234 -308 404 -238 -54 235
4615 235 45 -36 147 -64 -151 120 6 -274 145 -429 668 112 -557 159 512 366 -204 193 -19 446
4635 446 52 217 221 303 -108 199 -43 395 322 291 -307 231 -125 -583 482 192 295 -98 -382 -179 122
4656 122 140 -398 99 -261 199 72 -68 -169 -261 -323 136 -415 146 242 -214 82 -271 307 141 43 47 173
$$ packed form
4503H9P0R4o78P75k10n26J87M40R4J45p81L55l38N28n70P10o00N88l81kJ56K63
4525D08j40Ln45j94O58l06p7J78K2K41R2k22o27P33k37QK6n24O51r3j6k77N14
4548B76n96O26K62j016L62j7O8K81k61j31K04Q7K1k84K04j24m0n7k20J9L28nP5
4571F2K3M60m44L1L4p9J47j93j95N5J37j2j59M16o22K49K8J70K47j34l59K51m66
4594c53O97m36j3J18k63M94m73k04L4N21j59M2m34M24L66j27n42P12o42J84K89
4615B35j90q1J83k11q7K71j14k80M19n74J097n56o69P16L53j46n70L97k12M65
4635D46l94J65MQ2m11L07k42M38p3l1n98N38l56m58J065k90J03l93k84K03L01
4656A22J8n38M97l60M60j27j40j01r2o2M59n51N61R6m56K96l53N78j66r8MJ26
$$ plain form
4678 173 14 -85 130 636 2 183 -19 305 -137 100 -534 -210 -455 -42 713 -340 168 -448 57 -582
4698 -582 129 55 -230 -309 47 140 -321 -81 69 277 327 -188 161 283 -288 181 -21 87 -421 -101 -28 89
4720 89 -74 28 -197 358 216 11 31 -436 85 -195 0 142 313 319 296 98 101 -16 69 215 -99 218 368
4743 368 95 -173 53 149 -102 -169 180 -83 154 -245 70 307 316 349 561 277 43 -106 370 -61 -209 79
4765 79 -5 -51 -257 155 -183 -234 -94 -532 -199 -2 -203 331 275 -36 256 244 -365 144 -187 -41 -59 -128 25
4788 25 -429 150 -28 -54 -253 -257 -89 280 18 -26 54 -181 220 116 222 349 24 65 216 119 -94 -232 -316
4811 -316 -175 -206 214 124 -200 48 -130 421 -27 -40 364 -291 -125 9 -24 -212 440 441 15 -14 -70 172 14
4834 14 194 138 438 -250 148 4 -8 329 330 107 -254 156 -175 74 199 491 -174 268 -141 30 -12 -728
$$ packed form
4678A73j59r9K15N06o34J81k02L24m42K37o34L24k45M13P55j053N08o16N05o39
4698e82P11p4k85p9L56R3m61K40J50K08N0n15L49J22n71M69k02J08n08L20P3J17
4720H9j63J02k25N55j42k05K0m67N21k80J95J42J71Ok3j98Lj17Q5J46l14L17J50
4743C68k73k68K26R6k51o7L49k63K37l99L15K37RL3K12k84k34j49M76m31j48K88
4765G9q4m6k06M12l38n1J40m38L33J97k01N34n6l11K92j2o09N09l31J46j8o9J53
4788B5m54N79j78k6j99mJ68L69k62m4Q0k35M01j04J06J27l25M1J51r7k13j38q4
4811c16J41l1M20r0l24K48j78N51m48j3M04o55J66J34l3j88O52Jm26k9n6K42j58
4834A4J80n6L00o88L98j44j2L37Jk23l61M10l31K49J25K92o65M42m09J71m2p16
$$ plain form
4856 -728 -299 -204 -335 -284 -32 198 -218 -372 160 -13 286 -358 413 -183 144 31 407 51 -396 24 -355
4877 -355 53 -259 571 -53 374 -54 -273 -351 126 -78 -289 598 25 -233 365 -209 -10 -292 -29 -21 416
4898 416 -136 492 274 -155 253 -490 252 426 -68 38 -224 29 120 95 -57 -249 79 -104 -47 -49 205 -175
4920 -175 -462 -344 -48 -331 434 -130 221 293 181 37 -203 343 -399 -39 62 277 -71 -53 -432 375 -31
4941 -31 -179 -50 303 -71 34 19 96 574 -113 157 -171 -377 -368 213 -525 -375 137 209 37 -26 -122 231 707
4964 707 -430 145 32 -551 2 414 299 -236 -118 67 179 -309 -281 -249 -251 -470 288 -60 -320 382 80
4985 80 -679 -178 -207 188 86 181 -146 -357 331 -548 -445 -45 -250 32 112 -127 -285 -189 -127 200 93 -135
5007 -135 273 -222 -532 -172 -350 19 -214 57 460 -536 -327 293 -21 403 76 75 329 -246 -302 -11 -220
$$ packed form
4856g28M29R5j31N1K52K30m16j54N32j73K99o44P71n96L27j13L76l56m47M20l79
4877c55M08l12Q30o24M27m28k19p8M77k04k11Q87n73k58N98n74J99k82K63QM37
4898D16n52O28k18m29M08p43P42J74m94J06k62K53R1k5j52j92L28j83N7kK54l80
4920a75k87J18K96k83P65n64L51P2j12j44k40N46p42L60J01K15l48J8l79Q07m06
4941c1j48J29L53l74J05j5P7M78o87K70l28k06RN81p38J50N12P2j72o3r6L53M76
4964G07j137N75j13n83N53M12j15n35J18J85J12m88K8L2kk19P58l48k60P02l02
4985H0p59N01k9L95j02R5l27k11O88q79J03M00k05K82Q0k39j58R6O2L27j07k28
5007a35M08m95l10L60j78L69k33K71M03r96K09O20l14M24l27jK54n75n6K91k09
$$ plain form
5028 -220 -201 -197 16 -29 -291 -336 -483 -271 -39 16 -87 -26 -237 -126 -313 392 44 -7 -227 -384 225 -74 97
5051 97 111 -72 -111 121 -268 -177 -357 -248 88 -39 -267 -17 -379 94 -32 33 -34 -160 214 -4 102 219
5073 219 -67 -135 -557 -204 -29 624 -111 -99 168 -53 237 -90 457 105 420 12 15 -264 444 364 437 224
5095 224 -431 135 220 -365 287 -37 81 462 146 -140 -146 -280 -876 114 -368 465 35 -294 225 548 -109
5116 -109 -195 109 -19 407 -414 -284 390 103 566 107 281 108 23 -155 -145 -211 52 -89 -450 144 108 -124
5138 -124 753 171 273 44 -13 667 -200 -148 -465 -73 314 -95 -240 37 -94 -116 498 133 117 175 224 -289
5160 -289 -300 -5 -46 312 -1 -20 -199 375 195 79 45 -62 -18 239 354 -251 30 -355 95 -260 -71 140
5182 140 -77 398 34 320 -9 -141 34 389 92 -22 237 357 65 106 -280 -321 -60 201 154 -12 158
$$ packed form
5028b20J9MK13m5k62m5j47K12K32N5j03O1k11J11j87P05l48n1k20j57O09k99J71
5051I7J4j83l9K32l89R1j80J09L36j27k28K50l62M73j26O5o7j26L74k18J06J17
5073B19k86o8m22L53J75O53p35J2K67k21K90l27N47l52L15m08Lk79P08q0P3k13
5095B24o55N66Q5n85O52l24J18L81l16k86oj34n96R90m82Q33m30l29N19L23o57
5116a09q6L04j28M26q21J30O74k87M63m59J74j73q5j78J0o6K63j41l61N94l6k32
5138a24Q77n82J02k29n7O80q67N2l17L92L87m09j45K77j31k2O14l65j6N8M9n13
5160b89j1K95m1L58l13j9j79N74j80j16l4j07M4K57J15o05K81l85M50l55J89K11
5182A40k17M75l64K86l29j32J75L55k97j14K59J20k92M1l86m1K61K61m7j66J70
$$ plain form
5203 158 124 76 248 -177 -370 -17 381 136 260 -194 224 4 389 150 -28 -85 161 -173 -329 -110 -220
5224 -220 6 536 18 215 -5 -281 -9 -238 -373 -313 50 -103 -231 -4 365 -225 276 -268 -318 277 314
5245 314 6 331 268 -57 75 222 -218 -360 -82 -132 -181 201 -39 173 152 -3 -52 420 414 -89 -166 224 12
5268 12 408 -97 -60 103 164 -61 -314 187 -490 -31 122 487 165 458 -232 -154 -239 43 -56 90 78 106 -172
5291 -172 80 157 366 176 -211 -31 250 -268 32 -285 4 -437 -184 -11 -261 320 -30 156 49 404
5311 404 194 45 -153 -96 -499 -134 211 224 -180 -329 -156 -106 -194 -209 -188 -468 -257 -129 141 217 -216 67
5333 67 317 -373 85 144 4 238 49 -298 -120 171 -57 126 -185 361 124 67 215 82 -152 -142 66
5354 66 248 319 145 39 -218 335 224 377 136 -107 169 -201 22 236 228 -79 -169 -184 35 254 -239 19
$$ packed form
5203A58l4m8J72m25j93L53L98k45J24m54M18k20L85k39j78n7K46l34j56K19j10
5224b20K26N30n18J97k20k76K72k29j35O0L63j53j28K27L69n90N01n44n0N95L7
5245C14l08L25o3l25J32J47m40j42K78n0m9L82k40K12k1j55m9M72on03p7L90k12
5268A2L96n05L7J63O1k25k53N01o77M59J53L65l22K93o90P8q5K82r9J46j2K8k78
5291a72K52P7K09j90l87J80K81n18L00l17K89m41K53J73k50N81l50J86j07L55
5311D04k10j49j98N7m03L65L45J3m04j49J73N0q8j5K1k80K11J28K70P6m33K83
5333F7K50o90M58N9j40K34j89l47J78K91k28J83l11N46k37n7J48j33k34J0K08
5354F6J82P1j74j06k57N53j11J53k41k43K76l70K23K14ql07r0j5K19K19m93K58
$$ plain form
5376 19 -98 -402 -517 -129 -173 -268 92 95 76 -373 329 -254 116 -90 -137 60 81 -118 -30 -105 262 408 -425
5399 -425 -174 -100 -188 -187 -43 -360 102 84 8 -373 -51 231 66 314 11 -370 611 -293 192 18 -76 187
5421 187 62 3 -548 186 -273 -381 -126 -594 -43 -23 -153 327 31 2 -148 -578 531 476 -214 -34 18
5442 18 307 -137 382 -17 123 -27 466 -31 195 -156 -67 -145 76 -208 -184 23 7 -190 -438 157 -314 214
5464 214 -273 -385 219 -66 -110 -463 -98 468 -51 -235 51 -284 -167 246 -209 320 14 -375 -48 -38 -45
5485 -45 75 -146 175 140 -51 -365 -516 121 -531 546 197 359 -104 222 -241 7 -494 -41 4 -14 -175
5506 -175 -224 223 566 52 191 -375 22 350 36 -631 -236 -168 -298 147 -178 -304 -312 -136 -412 226 -332
5527 -332 -168 -25 -110 -129 -23 -273 -140 -9 168 -69 178 -39 298 16 -212 327 148 144 -360 -493 -209
$$ packed form
5376A9j17l04j15L88m4r5L60Lj9m49P02n83L70k06m7J97K1j99Q8p5L67J46q33
5399d25K51P4q8JJ44l17M62j8p6l81L22K82j65K48l03l81R81r04M85j74r4K63
5421A87j25n9n51P34m59j08K55m68N51K0j30M80k96k9j50m30J109n5o90J80N2
5442A8K89m44N19l99J40j50M93m97K26l51Q9p8K21k84K4K07j6j97k48N95m71N28
5464B14m87j12O04k85m4l53L65N66n19j84K86l35J17M13m55N29l06l89L27J0p
5485d5J20k21L21l5j91l14j51O37o52J077l49J62m63L26m63K48n01M53M5j8j61
5506a75m9M47L43n14J39n66L97L28l14o67L95O8j30M45l25j26qJ76k76O38n58
5527c32J64J43q5j9J06k50J33J31J77k37K47k17L37k82k28N39j79mn04j33K84
$$ plain form
5548 -209 166 -4 38 40 -462 191 -282 148 53 79 -107 -255 -485 152 156 234 115 -75 50 -414 -178 350 -197
5571 -197 173 231 -157 326 280 -248 158 234 -113 225 -41 -40 -196 -240 37 -235 367 -70 -459 30 86 58 162
5594 162 272 210 221 164 78 -208 384 45 260 -111 27 482 -164 -178 539 19 41 -36 184 -332 -86 26
5616 26 -83 1 322 367 387 -220 -337 -163 156 -53 314 116 -177 -436 46 -157 -322 30 -378 77 483
5637 483 -426 7 -346 -172 182 -350 -417 174 -128 290 90 -375 -153 59 207 -16 68 286 -183 5 353
5658 353 183 -39 63 -226 -4 346 113 -170 77 -99 -247 207 -314 196 186 25 46 13 141 -252 142
5679 142 -60 76 -473 6 266 489 -25 -185 295 -199 58 379 42 143 -433 -80 -225 104 -270 -603
5699 -603 -137 -93 -82 -65 -266 238 -52 438 615 109 -379 -333 41 -297 361 -191 583 -14 413 -170 278
$$ packed form
5548b09L75j70M2Kn02O53m73M30r5K6j86j48k30O37MP8j19j90J25m64K36N28n47
5571a97L70N8l88M83m6n28M06P6l47L38k66Jj56m4K77k72O02m37l89M89N6k8J04
5594A62J10o2J1n7q6k86N92l39K15l71J38M55o46j4P17n20K2p7K20n16K46J12
5616B6j09Q4L21M5K0o07j17J74L19k09L67j98k93k59M82k03j65L52m08M55M06
5637D83r09M33l53J74L54n32o7N91l02M18k00m65K22K12J48k23Q4K18m69J88L48
5658C53j70k22J02k89K22L50k33k83K47j76j48M54n21N10j0j61K1l3J28l93L94
5679A42k02J36n49M79K60K23n14j60M80m94K57L21l37J01n76L53j45L29l74l33
5699f03M66M4J1J7k01N04k90M90J77n06m88M6L74l38O58n52P74n97M27n83M48
$$ plain form
5720 278 96 93 -191 -160 -29 -129 114 -159 -94 -266 158 196 -77 -159 -91 229 190 3 371 -114 -519 -40 18
5743 18 78 -148 -445 119 -386 -408 25 -97 63 -28 -24 -15 3 123 -50 78 618 208 32 -63 -92 -63 -295 124
5767 124 53 -97 41 75 -498 -98 295 73 354 57 -273 298 358 -147 -261 -270 -148 -341 -168 121 -435 -195
5789 -195 -100 -100 -111 192 74 163 -140 -119 171 -297 -205 -255 51 -13 374 393 78 -39 -356 35 -342 -441 -21 -46
5813 -46 -343 -537 155 -296 -113 -107 48 -362 399 -10 106 227 241 -278 -496 388 -273 200 125 -349 25 176
5835 176 -366 173 -302 -371 -683 203 -571 -144 46 -167 104 -525 386 -232 171 317 63 -318 141 -100
5855 -100 113 138 72 126 -332 -149 350 -413 -331 -565 -106 -331 -182 -255 -259 -84 265 -138 -58 164 -369 -95 154
5878 154 -297 226 149 228 515 -192 130 -331 -163 226 -116 -421 244 -298 -5 71 16 58 -153 -278 118 -167
$$ packed form
5720B78j82lk84L1J31j00K43k73O5j72M24L8k73q2O8L20l9j87L68m85m05M79N8
5743A8O0k26k97N64n05k2M33j22J60r1MRJ8J20j73J28N40m10j76r5k9K9k32M19
5767A24p1j50J38L4n73M00L93k22K81k97l30N71O0n05j14rJ22j93J73K89n56K40
5789a95R5%j1L03j18Q9l03K1K90m68R2n0L06o4L87J9l15j17l17L91l77r9M20k5
5813d6k97j94O92m51J83OJ55m10P61m09J16J21J4n19k18Q84o61M73p5m74L74J51
5835A76n42N39m75o9l12Q86p74M27J90k13K71o29R11o18M03J46k54l81M59k41
5855a00K13K5o6N4m58J83M99p63Q2k34M59k25J49p3mJ75L49m03Q0K22n33K74K49
5878A54m51N23p7P9K87p07L22m61J68L89l42l05O65n42K93P6n5M2k11j25L96k85
$$ plain form
5900 -167 98 -524 16 -442 96 123 472 199 196 -214 -149 111 -2 109 114 76 251 -224 -124 -89 427 -137 16
5923 16 -316 346 106 93 118 247 -170 -11 51 -45 -140 120 223 -346 -147 5 -147 -121 227 256 350 -53 37
5946 37 -119 66 -402 -205 -327 151 -373 297 14 -24 314 -474 -25 34 -59 -148 -25 -145 73 59 -148 27
5968 27 -202 -271 -115 130 513 25 149 409 303 -247 -345 254 245 188 440 -67 -165 160 561 93 -43 351
5990 351 -186 -83 -95 -78 -14 -271 -122 186 -168 -451 65 30 427 143 -136 -287 73 89 -255 -73 352 -246
6012 -246 296 110 150 -41 -263 121 175 100 261 -107 -272 -178 -97 333 34 -215 83 -250 -171 29 -45 25 -60
6035 -60 -365 183 -349 52 11 -238 -108 -257 143 -313 -16 -15 -305 -387 -19 -161 -7 -349 228 15 61 285
6057 285 47 -128 -192 250 351 -230 186 14 -170 -78 22 284 -266 138 -190 134 60 397 186 -227 164
$$ packed form
5900a67K65o22N40m58N38K7L49k73lm10O5K60j13J11Nl8J75m75J00L5N16n64J53
5923A6l32O62k40j3K5J29m17J59O2r6r5K60J03n69J99J52j52K6L48K9R4m03R0
5946C7j56J85m68J97j22M78n24O70k83l8L38p88M49N9r3q9J23j20K18j4k07J75
5968B7k29o9J56K45L83m88J24K60j06n50r8N99rn7K52n07r8L25M01m68j36L94
5990C51n37J03j2J7O4k57J49L08l54k83N16l5L97k84k79j51L60J6l44J82M25n98
6012b46N42j86M0j91k22L84N4p5J61l68j65R4Q1M30k99k49K98l33P9K00p4P0q5
6035f0l05N48n32M01m1k49J30j49M00m56K97Jk90q2L68j42J54l42N77k13M6K24
6057B85k38j75o4M42J01n81M16j72j84R2J00K62n50M04l28L24p4L37k11m13L91
$$ plain form
6078 164 258 9 -185 -89 -190 -402 -286 58 109 588 -292 -24 -19 -172 207 -157 -138 177 -268 -358 -21 -74 -153
6101 -153 189 420 -220 -428 344 490 -202 262 -110 25 3 -7 957 34 -11 163 168 -452 -210 -145 -218 -377
6123 -377 -35 -15 103 192 -264 -118 203 265 44 -493 110 -310 -152 154 -37 -6 198 546 9 -370 63
6144 63 403 -130 -676 104 14 43 -118 -230 -77 61 77 -21 -173 -52 151 192 -171 -50 308 -283 178 288
6166 288 -384 37 -18 88 665 -501 389 12 98 -621 214 -282 -304 35 -240 166 0 -20 387 124 356
6187 356 -140 234 -24 -619 -309 -81 -254 -334 -55 -226 -269 434 652 -45 -220 -549 -239 49 1 -165 -29
6208 -29 -117 -127 81 -69 184 -131 -241 272 171 172 -223 139 -60 -640 115 156 -194 -168 502 308 69 8 3
6231 3 37 -56 268 86 25 399 -165 359 -153 368 170 -258 -78 221 -218 322 190 -236 -11 -149 22 24
$$ packed form
6078A64R4k49j94R6j01k12J16L44N1M79q80K68Nj53L79l64J9L15m45r0L37n3p9
6101a53L42K31o40k08P72J46o92M64l72J35k2j0R64r23m5J74No20K42O5p3j59
6123c77L42K0J18Q9m56J46L21O2k21n37O03m20J58L06j91L1K04L48n37l79M33
6144F3L40n33n46P80r0K9j61j12J53J38J6r8j52J21K03M1l63J21L58n91M61J10
6166B88o72M21n5J06N77j166Q90l77Q6p19Q35m96k2L39k75M06j66k0M07k63K32
6187C56m96L74k58n95L10K28j73q0K79j71m3P03K18o97j75l29L10K88m8j66J36
6208b9q8j0K08j50K53l15j10N13j01Jl95L62j99n80P55M1l50K6O70j94k39o1n
6231CL4r3L24j82o1L74n64N24n12N21j98m28J80K99m39N40j32m26K25j38J71K
$$ plain form
6253 24 173 306 517 -169 85 300 179 18 -447 201 -200 108 -490 -130 137 -5 -36 -164 118 353 19
6274 19 -112 -202 -316 -17 82 -34 -98 -221 -231 126 -172 -150 -593 35 -497 -65 165 378 -250 -339 -71 -188
6296 -188 247 66 350 114 -460 -130 420 -261 -526 1 276 46 184 -250 -409 -287 -14 167 -35 93
6316 93 -78 -271 214 -18 -239 352 -1 -169 244 39 160 -289 332 93 -149 46 -51 55 307 -85 -273
6337 -273 -236 -419 4 -175 -211 462 -249 124 120 -39 372 -316 247 81 -16 -571 -55 190 147 -141 129 29
6359 29 83 -428 24 -48 20 48 -617 -53 -296 140 238 62 43 58 476 167 -545 -300 -291 -218 -819 105 334 -343
6383 -343 -84 -224 -297 -279 490 183 285 -266 -176 498 -110 316 -276 -32 176 273 -90 -49 -280 12 -302 317
6405 317 144 -372 -313 215 176 -89 290 -94 62 -556 20 -102 234 31 -43 123 -444 -96 145 -221 -119
$$ packed form
6253B4J49J33K11o86K54K15j21j61m65O48m01L08n98L60K67j42l1j28K82K35l34
6274A9j31r0j14K99R9j16o4j23j0L57k98K2m43O28n32M32K30K13o28q9K68j17
6296a88M35j81K84k36n74L30N50o81k65N27K75k30J38m34j59J22K73J81k02J28
6316I3j71j93M85k32k21N91l53j68M13k05J21m49O21k39k42J95r7J06K52l92j88
6337b73L7j83M23j79l6O73p11L73mj59M11o88N63j66r7n55N16K45m3k88K70j00
6359B9N4n11M52p2O8K8o65N64k43M36R8j76j9J5M18l09p12K45RP3o01R24K29o77
6383c43K59j40p3J8P69l07J02n51R0O74o08M26n92K44K08R7l63M1k31K92l14O19
6405C17j73n16N9N28l9k65L79l84J56o18N76j22L36k03p4J66n67L48K41l66J02
$$ plain form
6426 -119 -85 -95 -124 -254 155 300 -458 -59 124 -13 -66 179 321 -243 -15 -89 357 43 -52 -38 103 109 -39
6449 -39 217 -400 -328 -251 15 -211 368 321 127 95 -248 473 -312 80 -93 181 -398 -258 84 -5 34 -97
6471 -97 88 -281 -110 -155 -133 -115 177 -650 55 225 -107 -221 -154 -70 355 97 -40 -261 203 -111 258 127
6493 127 411 -380 -547 -162 205 112 -90 -181 -141 321 6 -128 141 85 22 -552 -221 -352 -262 -19 -14 -374 15
6516 15 291 -44 -246 -192 -260 -320 -420 495 204 36 -44 99 -103 278 -264 29 62 -329 568 36 230 69
6538 69 -207 -111 -381 -109 -200 189 49 65 -146 122 305 96 -115 575 -68 -91 508 89 -4 472 -18 178
6560 178 32 -131 139 -159 37 125 345 -289 7 301 -785 519 -6 -149 -102 -139 183 -171 227 -168
6580 -168 -394 -464 -275 74 205 -48 460 226 155 -60 407 54 67 -85 34 -4 -310 -114 -382 72 298
$$ packed form
6426a19L4j0k9j30M09J45p58L99J83j37n3K45J42n64K28p4M46l14r5J4J41Oj48
6449c9K56o17P2P7K66k26N79m7j94l2l43P21p85L92j73K74n79J40L42q9L9j31
6471i7J85l69J71m5K2J8K92q27P05J70l32j14O7Q4M25k58j37k21M64l14L69j31
6493A27K84p91j67L85L67r3k02r1M0M62l15j34K69n6o3n74L31j31R0K43Nl60L89
6516A5K76l35k02N4o8o0j00R15k91j68q0J43k02L81n42K93L3l91Q97n32J94j61
6538F9k76R6k70K72r1L89j40J6k11K68J83k09k11O90o43k3N99m19r3M76m90J96
6560A78j46j63K70k98J96Q8K20o34K96K94j086J304n25j43M7l7L22l54L98l95
6580a68k26p0J89L49J31k53N08k34p1k15M67l53J3j52J19l8l06J96k68M54K26
$$ plain form
6601 298 -61 -99 178 65 251 -122 177 -440 -313 -302 381 -134 28 82 -10 -456 107 282 -163 232 -90
6622 -90 538 -548 -111 255 196 -375 296 -157 432 149 272 -315 155 -108 -123 165 731 99 -359 200 -327
6643 -327 -116 71 113 -38 0 -124 -162 -156 130 189 -308 118 -176 205 242 279 197 -279 259 -752 -627 -41 -58
6666 -58 159 -49 239 -292 23 -276 2 2 124 505 -215 -293 -133 78 -209 -340 239 221 39 139 -94 -404
6688 -404 -376 -64 388 154 166 -136 94 536 -171 283 53 41 8 545 79 114 16 -7 4 19 -129 151 -180
6711 -180 -409 36 272 455 -41 290 235 27 11 245 -305 -157 -363 -178 240 189 -110 592 -524 -470 183
6732 183 -92 346 -116 44 -223 -310 -70 -249 271 206 12 -671 -195 -30 -440 -21 33 -62 51 -81 56
6753 56 -118 -175 -16 87 -55 77 -199 256 -364 -16 76 -16 182 -9 -181 -221 -17 54 172 -128 -270 149
$$ packed form
6601B98l59l8K77j13J86l73K99o17J27J1O83n15J62N4r2m46N63J75m45L95l22
6622i0O28j086M37L66n9n71O71m53N89k83J23n87M70k63j5K88N66o32m58N59n27
6643c27K11J87M2j51L8j24l8OK86N9m97M26k94L81L7L7q2m76N38j011J25N86j7
6666e8K17k08K88n31L15k99K78%J22L81p20p8J60K11k87j31N79j8j82J00k33l10
6688d04K8L12M52k34J2l02K30M42p07M54k30j2l3N37m66L5r8k3J1J5j48K80l31
6711a80k29M45K36J83m96L31n5k08j6K34n50J48k06J85M18n1k99P02j116N4O53
6732A83k75M38m62J60k67q7K40j79N20o5j94o83M76J65m10M19N4r5J13j32J37
6753E6j74n7J59J03j42J32k76M55o20L48R2r2J98j91j72m0K04P1J18l00j42M19
$$ plain form
6775 149 578 -86 183 -111 -199 -470 233 62 221 157 -195 -214 26 108 170 -178 107 109 37 157 -72 -95 -32
6798 -32 305 -170 539 3 -6 -109 168 -51 -17 1 42 -31 -297 233 427 21 404 74 -511 -221 89 -16
6820 -16 -23 -146 -32 47 -661 111 15 1 482 -63 186 -149 -385 -15 165 46 112 48 -45 292 12 -252 -30
6843 -30 -224 -15 252 35 -42 -246 -16 -37 58 9 -172 -157 -390 32 115 -21 430 -198 -33 325 -333 74
6865 74 -271 -243 -77 371 -207 160 -318 -84 125 -280 51 104 -741 129 -161 -21 -480 373 326 -100 -54 226
6887 226 262 -137 295 138 -336 -95 19 163 224 -199 447 -122 -266 18 79 153 473 151 -4 -245 229
6908 229 -273 -25 236 -22 53 157 493 -37 27 -74 -305 -253 -722 -24 220 160 99 -51 399 -75 78 150
6930 150 -135 -244 237 -326 109 -368 -18 20 -14 214 76 -306 386 87 -138 -335 -207 34 -249 -175 -102
$$ packed form
6775A49M29o64K69k94q8k71P03j71J59o4l52j9K40Q2O2l48K85Kp2J20k29k3O3
6798c2L37m75P09n36rj03K77k19L4J8M1p3k66N30J94m06L83l30n85K90L10j05
6820a6pj23J14P9p08P72r6j4M81n45K49l35k36L70J80j19O6o4r3L37k80k64K22
6843c0j94K09K67k17p7k04K30k1R5m9j81J5k33M22Q3j36M51o28J65L58o58M07
6865G4l45K8J66M48n78L67m78K34K09m05L31N3q45Q70k90J40m59Q53m7m26M6K80
6887B26L6l99M32j57m74K41J14J44O1m23O46n69j44K84O1P4L20l22j55k41M74
6908B29n02K48K61k58P5J04L36n30O4j01k31N2m69O98K44o0o1j50M50m74J53P2
6930A50k85j09M81n63M35m77L50L8l4K28j38l82O92k99k25j97J28K41k83P4P3
$$ plain form
6951 -102 26 133 -444 342 -4 -232 -84 131 -230 -9 -391 -112 196 11 147 -407 -316 31 105 147 76
6972 76 179 -540 -204 -131 494 -117 -80 167 312 -201 2 62 -204 -211 -223 -61 -271 12 355 300 103 458 -357
6995 -357 139 -14 242 -526 15 -106 21 208 292 80 30 467 -314 387 44 156 -424 233 -38 240 53
7016 53 30 105 -190 396 339 612 239 139 -161 60 363 34 178 196 -295 407 38 -313 443 -284 183 36
7038 36 223 -39 -141 -304 38 129 112 391 145 -623 596 -191 -104 -193 -420 -116 -161 -141 -34 211 -311 -356
7060 -356 227 -68 -58 -334 -43 -450 -116 -15 297 196 -56 516 115 189 -152 -85 -332 -116 254 225 -141
7081 -141 436 -52 -305 216 -116 -271 472 -589 -15 56 -176 94 -187 -548 236 343 183 -173 -107 417
7101 417 -352 113 -196 99 201 -390 -117 -475 138 -272 -9 199 -517 439 -63 -124 222 162 310 -46 289
$$ packed form
6951a02J28J07n77P86l46k28J48K15l61K21l82K79L08j85J36n54R1L47P4M2p1
6972G6J03p19L36P3O25o11L7K47J45n13K03O0k66pj2J62k10K83L43n5j97L55q15
6995c57M96j53K56p68N41j21J27J87Q4k12n0M37p81P01l43J12n80O57k71K78j87
7016E3k3P5k95N86n7K73l73j00l00K21L03l29J44J8m91P02l69l51P56p27M67j47
7038C6J87k62j02j63L42R1j7K79k46p68J219p87Q7q9k27L04m5K0J07K45n22m5
7060c56N83k95J0k76K91m07L34J01L12j01k52N72m01P4l41O7k47K16L70k9l66
7081a41N77m88k53N21l32j55P43j061N74P1k32K70k81l61P84J07j60l56O6N24
7101D17p69M65l09K95J02n91K73l58O13m10K63K08p16R56n02o1L46o0J48l56L35
$$ plain form
7122 289 436 -203 415 -62 -242 -122 54 -317 206 -626 47 -467 -339 -271 343 45 -428 -112 -185 242 279
7143 279 135 -66 167 -337 -209 -32 332 274 64 -79 -440 -304 88 -344 158 -114 -101 85 52 -580 409
7164 409 -275 -147 -32 -209 -338 -289 -487 -54 269 -365 20 -251 -151 -419 53 303 -218 -79 -73 215 594
7185 594 112 591 58 -68 -128 -629 -244 -11 -424 -73 -138 -42 11 513 -215 -374 -38 53 388 -259 64 11
7207 11 -277 -34 -70 19 -262 -550 1 -61 17 -25 211 77 -115 -41 -207 118 -535 5 -538 -63 -116 130 -544
7230 -544 182 -167 209 94 8 107 -81 -402 157 -372 -392 -153 147 16 14 -56 15 160 -327 -477 74 -38
7252 -38 130 -353 4 1 309 -115 7 774 -419 -366 -209 273 -510 221 165 -338 45 -35 204 -134 310 -215
7274 -215 247 201 258 453 -143 -19 -1 -191 278 133 -470 -361 15 -196 -31 10 -337 -528 202 311 -1
$$ packed form
7122B89J47o39O18m77j80J20J76l71N23q32O73n14J28O8O14k98m73L16p3M27L7
7143B79j44k01K33n04J28J77L64n8k10j43l61J36L92m32N02k72J3J86l3o32R89
7164D09o84J28J15j77j29M9j98M33L23o34L85k71J00k68M72K50n21J39OK88L79
7185E94m82M79n33j26o0n01L85K33m13L51o5R6N3N02p28j59L36R1L35o47L23n3
7207A1k88K43l6Q9k81k88N51o2P8m2K36j34j92P4j66L25o53N40n43M75n3K46o74
7230e44P26l49L76j15q6R9j88l21N59n29k0K39L00j31kp0P1J45m87j50N51j12
7252c8J68m83L57lL08m24J22P67j193N3J57M82p83P31n6n03L83q0K39l38M44n25
7274b15M62m6N7J95n96J24J8j90M69j45o03J09L76k11J65M1l47j91P30J09l12
$$ plain form
7295 -1 -468 2 -191 -270 55 171 72 123 7 -52 -66 -119 -69 198 184 413 128 67 -165 -33 -436 667 44
7318 44 -597 -8 368 -202 -107 206 -230 -104 -18 -160 -8 -85 95 -86 355 -290 89 248 126 104 -81 -112
7340 -112 155 21 234 -214 -302 -103 -49 128 189 -79 -305 -317 -80 47 266 566 -240 -93 -58 176 -181 183
7362 183 78 136 118 -159 115 53 12 -154 174 60 -193 -185 172 -113 -174 -387 266 440 -68 -183 -100 125 -260
7385 -260 -392 303 136 -473 70 24 -241 -36 -108 -13 175 304 57 65 357 153 255 -521 122 -213 102 -17
7407 -17 -132 77 -67 -275 211 -116 -40 -197 -85 22 -211 387 320 -406 -225 25 -117 548 -120 93 -185
7428 -185 -415 -104 260 52 432 -144 -404 -12 -468 49 72 -279 -749 177 -184 -51 24 -124 -36 468 306
7449 306 -475 212 211 13 -245 -59 -263 -249 185 -261 153 473 -168 -74 79 -134 -161 -87 -188 91 124 171 -190
$$ packed form
7295am67M70j93p9L25J16r9N1j16n9j4n3N0K67j4K29k85o1k32J32m03J103o23
7318D4o41N89L76n70R5L13m36J26Q6j42J52p7J80j81M41o45L79J59j22k2j85l1
7340a12K67j34K13m48q8J99N4J77O1k68k26j2K37J27K19L00q06J47L5K34l57L64
7362A83j05N8j8k77K74o2m1j66L28j14k53QL57k85o1k13O53J74n08j15Q3K25l85
7385b60j32O95j67o09N43m6k65K05p2R5J88J29k47QK92k04J02p76O43l35L15j19
7407a7j15K09j44k08M86l27P6j57J12J07k33N98o7p26J81K50j42O65o68K13k78
7428a85k30L11L64k08L80n76k60L92m56N17K3l51m70R26l61J33P5j48Q8N04j62
7449C06p81O87jj98k58J86k04J4M34m46M14L20o41R4J53k13k7P4j01K79L3M7l61
$$ plain form
7472 -190 -196 -24 -79 -134 157 75 -130 229 -159 -18 -28 291 117 131 -287 346 191 -132 -181 34 -79 97 72
7495 72 -353 70 -101 -105 -381 -271 292 229 268 277 8 -591 -67 -377 -184 484 -38 -255 -402 -420 -202 -67 215
7518 215 177 136 -214 80 -216 262 125 -450 -45 23 516 -18 158 235 -303 -495 -240 78 20 260 201 326
7540 326 -51 320 64 -276 -41 127 -126 232 -27 -171 -265 329 -135 424 117 -124 482 156 29 507
7560 507 -140 398 -164 -415 42 124 -45 -195 -314 -2 383 132 127 -480 -69 -45 11 -301 68 19 55 5 -179
7583 -179 542 -128 47 244 -222 192 -130 55 62 171 -157 300 458 33 262 445 -176 -309 -132 148 -324
7604 -324 -106 56 -39 206 -221 -363 -189 -53 189 -90 -31 78 -77 238 -33 -75 -66 457 -335 87 -315 -103
7626 -103 -114 -169 76 -287 -470 392 -276 -11 -159 -77 105 14 -130 -39 118 205 226 362 -110 161 -174 152
$$ packed form
7472a90oJ72n5n5K91q2k05L59l88J41j0L19j74J4m18O33j55l23m9K15j13J76k5
7495G2m25M23j71mk76J10N63o3L9Rk69n99N24l10J93O68n22k17j47j8K18J35K82
7518B15l8m1l50K94k96M78j37n75M05O8M93n34J76P7n38j92K55L18n8K40n9J25
7540C26l77L71k56l40K35J68k53L58k59j44r4N94m64N59l07k41O06l26j27M78
7560E07o47N38n62k51M57Q2j69j50j19L12L85k51no07M11K4N6l12L69m9L6n0j84
7583a79P21o70J75J97m66M14l22J85PJ09l28M57J58m25K29J83o21j33J77K80m72
7604c24K18J62r5K45m27j42J74J36K42k79N9J09j55L15k71m2RN23p92M22m02K12
7626a03j1n5K45l63j83Q62o68K65j48Q2J82r1j44R1J57Q7K1J36m72K71l35L26
$$ plain form
7648 152 -274 196 89 -154 362 -331 919 33 -282 -169 -113 -237 81 -36 -90 -71 -215 344 125 -483 -153
7669 -153 136 -148 50 237 -564 -65 -96 -24 -167 -45 7 -238 182 -37 390 258 79 170 371 485 -6
7690 -6 -500 -181 -254 45 80 295 100 -256 -24 -380 -29 -322 -133 -402 66 -71 750 132 38 -266 334 282
7712 282 -26 -115 -140 -452 585 -183 463 352 -279 554 -321 -78 -246 117 62 25 -32 -11 323 381 178 16
7734 16 -583 -181 -21 -7 476 83 197 88 62 415 -447 215 51 477 106 -314 -81 -105 -6 456 174 -467
7756 -467 -82 180 -269 94 -29 135 -309 -47 -153 -48 55 660 -314 65 -105 -8 15 -155 -157 -452 124
7777 124 -222 129 19 -202 -46 176 -337 -89 -90 289 140 182 -519 535 -17 -139 35 -15 231 3 -383
7798 -383 263 -258 42 46 207 60 87 445 505 -541 389 34 -113 108 -135 10 465 814 -376 -262 -421
$$ packed form
7648A52m26M70j07k43N16o93J250q86l15J13N6j24L18j17n4J9j44N59k19o08L30
7669a53K89k84J98J87q01M99l1P2j43J22N2k45M20k19M27j32j79R1K01J14m91
7690fm94L19p3K99L5K15j95l56K32l56L51k93J89k69M68j37Q21o18r4l04O00n2
7712B82l08q9k5l12J037p68O46j11o31Q33q75K43j68L63n5l7n7K1L34N8k03j62
7734A6n99M02J60J4M83l93J14j09k6L53q62O62j64M26l71m20K33k4R9M62k82o41
7756d67L85K62m49L63j23J64m44K62j06J05J03O05r74L79j70R7K3j70kk95N76
7777A24l46L51j10k21J56K22n13K48jL79j49M2p01J054n52j22J74n0K46k28l86
7798c83O46n21L00MJ61j47K7L58O0j046R30l55j47K21k43J45M55L49j190J14j59
$$ plain form
7819 -421 -46 -94 -318 -254 39 -156 61 -609 140 -37 322 13 -235 -76 172 27 -279 -176 109 409 -129
7840 -129 684 212 89 -505 -41 -85 20 580 -193 385 -281 31 -320 -37 -416 -169 558 -104 6 335
7860 335 380 73 298 -336 91 -660 266 125 -287 -357 200 -39 406 -123 -231 -37 -139 -441 -364 -410 584
7881 584 241 94 322 272 39 126 -17 -179 -373 152 -406 115 276 41 -280 131 406 -163 -183 -95 -296
7902 -296 291 79 -320 158 499 -65 172 273 264 -188 -107 339 531 -465 -394 -298 344 -154 72 475 -432 434
7924 434 -238 -56 -487 464 -57 -13 -247 12 88 -11 399 -337 216 -103 2 -34 -201 -6 327 -423 -252
7945 -252 -325 198 130 117 -755 -156 78 414 88 -289 -26 -16 -58 224 176 -351 -12 174 57 -156 -16 -242
7967 -242 394 -167 109 182 -5 83 -298 -190 -371 93 68 210 175 275 -290 -316 -92 96 -23 -279 522 -163
$$ packed form
7819d21L75m8k24O4K93j95K17o70P49j77L59l09k48J59K48j45l06J03K85L00n38
7840a29Q13m72j23n94M64m4J05N60p73N78o66L12l51K83l79K47P27o62J10L29
7860C35M5l07K25o34M27p51R26j41m12p0N57k39M45n29j08J94j02l02P7m6R94
7881E84l43j47K28n0k33Q7j43j62j94N25n58N21J61k35l21M11K75n69k0Q8k01
7902b96N87k12l99M78L41n64K37J01rm52Q1M46J92r96P1R6O42m98K26M03r07Q66
7924D34o72J82m31R51n21M4k34K59P6r9M10p36N53l19J05l6j67J95L33p50J71
7945b52p3N23o8j3q72N99K34L36l26l77K63J0m2K82m8n27L39J86j17k13J40k26
7967b42O36n61K76P3j87Q8l81J08j81M64k5J42l5J00n65k6K24J88j19k56Q01o85
$$ plain form
7989 -163 -95 499 -236 263 180 658 41 71 26 -588 133 -362 -148 -71 -554 -481 -30 331 -85 214 54 -83
8011 -83 -501 -350 45 370 -554 21 -122 9 -330 -305 530 238 -329 335 202 350 -382 -324 17 -495 170
8032 170 -187 -48 -40 62 315 200 -415 -390 -163 427 -171 189 219 259 -388 103 323 -287 306 204 -298 199
8054 199 -113 131 -114 -93 -17 246 -90 311 -24 57 -134 -49 85 106 98 43 424 528 480 45 -158 288 251
8077 251 34 -186 86 -118 -626 158 -156 -119 70 194 390 -488 -547 -200 79 83 -62 166 -475 138 277
8098 277 -45 368 273 690 -237 -50 -121 17 -86 81 -159 -295 339 -238 -66 -205 131 341 -370 -144 8
8119 8 -248 -59 239 340 357 193 -184 -147 109 -12 265 406 -173 60 -21 -8 -85 -346 -244 -26 72 232 425
8142 425 -84 221 -186 -491 -440 -329 210 19 167 -213 -60 -235 -208 -584 432 172 331 79 241 10
$$ packed form
7989a63O8N94p35M99q3M78o17L0m5o14P21m95K14P7m83P3M51L61m16K99j60j37
8011h3m18J51L95L25r24N75j43J31l39K5Q35k92n67O64j33J48p32N8L41n12O65
8032A70l57J39QJ02K53j15o15K5K27N90n98L60L0M0o47M91K20o10N93j02n02M97
8054A99l12K44k45K1P6K63l36M01l35Q1j91Q5J34K1qn5L81J04m8m35k03M46l7
8077B51k17k20K72k04n08P84l14L7J89J24J96q78n9L47K79Mj45K28o41O13J39
8098B77l22M13r5M17r27J87p1J38j03J67k40j36O34n77J72j39L36K10p11K26J52
8119Hk56J89K98J01J7j64l77L7K56j21K77J41n79K33q1J3p7k61J02K18R8J60J93
8142D25n09L05m07l05N1J11N39j91J48l80J53j75K7l76J016k60J59k52J62k31
$$ plain form
8162 10 17 -14 -77 -148 -248 314 19 -565 -182 417 -426 180 -129 676 -158 -244 110 134 92 384 370 99 264
8185 264 -261 91 358 -223 355 221
$$ packed form
8162A0Pl1o3p1j00N62k95n84L83N99q43O06l09Q05q34q6L54K4m2K92j4k71J65
8185B64n25L52K67n81N78j34
8191B21
$$ Imaginary data points
##PAGE= N=2
##DATA TABLE= (X++(I..I)), XYDATA
$$ plain form
0 0 0 0 0 0 0 0 0 0 0 0 0 0 0 0 0 0 0 1 -64 64 -64 64 -64 65 -121 128 -129 131 -192 193 -253 257 -319 324
34 324 -385 446 -496 545 -610 683 -764 837 -931 1029 -1146 1260 -1390 1535 -1690 1863
50 1863 -2053 2260 -2489 2746 -3039 3364 -3736 4160 -4662 5253 -5966 6839 -7952 9405
64 9405 -11418 14379 -19160 28312 -51938 231985 491258 -1656 -179137 -96327 80657
75 80657 117556 160852 107084 -31658 -172541 -109179 50140 143551 91198 104 -118035
86 -118035 -175921 -84113 86808 100748 -20379 -108835 -120751 -120840 -46757 93009 138612 -21512
98 -21512 -213092 -205198 -16344 106327 63406 -26807 -85495 -135109 -112332 25275 139976
109 139976 90020 -59715 -154901 -120972 2262 108595 107113 3251 -106182 -110975 -8730
$$ packed form
0@%%%%%%%%%%%%%%%%%Jo5J28j28J28j28J29j86K49k57K60l23L85m46N10n76O43
34C24p09Q31r42J041j155J293j447J601j768J960k175K406k650K925l225L553
50A863l916M313m749N235n785O403p100P896q822R915j1219J2805j4791J7357
64I405k0823K5797l3539M7472q0250K83923K59273m92914j77481Q2810J76984
75H0657L6899M3296n3768j38742j40883O3362J59319R3411n2353r1094j18139
86a18035n7886R1808J70921J3940j21127q8456j1916q9P4083J39766M5603j60124
98b1512j91580P894J88854J22671m2921r0213n8688m9614K2777J37607J14701
109A39976m9956j49735r5186L3929J23234J06333j482j03862j09433m793J02245
$$ plain form
120 -8730 82772 92516 59719 -6627 -110646 -131947 11238 157427 118715 -32265 -110494 -67848
132 -67848 15775 75579 99675 67820 -32302 -121431 -81763 51928 132561 94153 -10005
143 -10005 -97252 -83931 28241 120675 102729 18211 -54322 -81126 -43355 44219 115205 97726
155 97726 -11822 -109470 -75962 51591 118991 75751 -5571 -63976 -76260 -30393 48433 98037
167 98037 67041 -33858 -107699 -66972 42683 100079 62278 -26775 -94574 -85387 -9211 59211
179 59211 74065 36823 -38173 -95929 -65154 35226 101701 62820 -44049 -108127 -67400 18250
191 18250 64623 62910 24448 -41260 -83309 -44299 42686 91735 52080 -47118 -105807 -59856
203 -59856 31870 76541 54434 -3431 -59024 -72346 -31172 34356 70959 34302 -56711 -108195
$$ packed form
120h730R1502R744l2797o6346j04019k1301J43185J46189l8712j50980p8229M2646
132f7848Q3623N9804K4096l1855j00122q9129L9668J33691Q0633l8408j04158
143a0005q7247J3321J12172R2434j7946q4518p2533k6804L7771Q7574P0986j7479
155I7726j09548r7648L3508J27553O7400m3240q1322n8405j2284M5867P8826M9604
167I8037l0996j00899p3841M0727J09655N7396l7801q9053o7799R187P6176O8422
179E9211J4854l7242p4996n7756L0775J00380O6475l8881j06869o4078M0727Q5650
191A8250M6373j713l8462o5708m2049L9010Q6985M9049l9655r9198n8689M5951
203e9856R1726M4671k2107n7865n5593j3322M1174O5528L6603l6657r1013n1484
$$ plain form
215 -108195 -58893 32438 74601 42441 -27960 -75031 -62706 -14788 31661 52895 23390 -52119
227 -52119 -94352 -46579 44575 86916 45016 -33581 -69974 -40131 12520 50921 60424 24047
239 24047 -40799 -65699 -17077 63282 100565 55605 -28625 -64123 -20284 43014 72138 56872
251 56872 11126 -32966 -41882 -2950 60380 94383 47453 -40362 -71186 -19990 45093 65394
263 65394 36563 -12655 -46832 -44049 -6259 47599 68616 20317 -56726 -81888 -34310 34479
275 34479 59384 18432 -45032 -66110 -38303 935 33526 42158 2824 -61703 -82875 -33355
287 -33355 38773 57863 4537 -54406 -59170 -25772 11415 39047 36358 -6721 -55097 -63227 -20302
300 -20302 41511 62939 15723 -49542 -59773 -13790 38484 53092 27987 -13018 -41091 -44299
$$ packed form
215a08195M9302R1331M2163l2160p0401m7071J2325M7918M6449K1234k9505p5509
227e2119m2233M7773R1154M2341m1900p8597l6393K9843N2651L8401R503l6377
239B4047o4846k4900M8622Q0359L7283m4960q4230l5498M3839O3298K9124j5266
251E6872m5746m4092q916L8932O3330L4003m6930q7815l0824N1196O5083K0301
263F5394k8831m9218l4177K783L7790N3858K1017m8299p7043k5162M7578O8789
275C4479K4905m0952o3464k1078K7807L9238L2591Q632l9334o4527k1172M9520
287c3355P2128J9090n3326n8943m764L3398L7187K7632k689m3079m8376q130M2925
300b0302O1813K1428m7216o5265j0231M5983N2274J4608k5105m1005k8073l208
$$ plain form
312 -44299 -7133 53275 71751 15390 -49853 -49643 3632 52212 56821 22126 -19796 -38805 -29860
325 -29860 8924 54459 58605 10445 -40874 -46614 -1463 53466 58920 9648 -38143 -42105 -19054
338 -19054 12709 42513 43254 2577 -46357 -54206 -4905 51337 48388 -8153 -50853 -47298 -17639
351 -17639 18314 39364 25781 -14487 -48200 -46961 -3250 44010 41527 -9998 -54228 -50429 -7167
364 -7167 35702 40929 12587 -17892 -35641 -33800 2371 49074 46828 -7239 -51945 -41475 8656
377 8656 49934 45284 11752 -18982 -33291 -21910 18025 50770 37942 -8495 -44321 -36302 11022
390 11022 53779 45521 1170 -33114 -33921 -10926 20674 36247 23491 -11273 -45571 -41601 8850
403 8850 51166 36198 -13140 -44310 -37844 -8993 21050 28618 10822 -22398 -46261 -35535 11191
$$ packed form
312d4299L7166O0408J8476n6361o5243K10N3275M8580M609l4695m1922j9009Q945
325b9860L8784M5535M146m8160n1319n740M5151N4929N454m9272m7791l962K3051
338a9054L1763K9804P41m0677m8934p849M9301N6242k949n6541m2700L555K9659
351a7639L5953K1050j3583m0268l3713J239M3711M7260k483n1525m4230L799M3262
364g167M2869N227k8342l0479j7749J841L6171M6703k246n4067m4706J0470N0131
377H656M1278m650l3532l0734j4309J1381L9935L2745j2828m6437l5826Q019M7324
390A1022M2757q258m4351l4284q07K2995L1600J5573j2756l4764l4298L970N0451
403H850M2316j4968m9338l1170O466K8851L0043P568j7796l3220k3863J0726M6726
$$ plain form
416 11191 44966 29885 -16012 -48065 -40406 -567 32754 27386 318 -23862 -35144 -22698
428 -22698 16065 45104 33286 -12643 -47763 -34506 13589 43232 29259 -671 -22895 -27899
440 -27899 -8586 28043 47340 28896 -12563 -41581 -26466 19848 47200 31970 -4208 -28973
452 -28973 -24080 5316 32369 36020 17742 -14389 -40046 -27572 18075 45902 27934 -14347
464 -14347 -38327 -23932 9299 28195 23988 5681 -23819 -43360 -25091 17606 38722 19115
476 19115 -21058 -43168 -25411 11161 30150 18858 -7138 -31435 -35365 -14133 17281 33359
488 33359 20563 -17539 -43788 -22870 21228 37906 17456 -11267 -28588 -24741 -2831 24558
500 24558 37553 20219 -18656 -38396 -13126 25930 39688 19631 -13957 -32469 -19013 10488
$$ packed form
416A1191L3775j5081m5897l2053P659L9839L3321n368k7068k4180j1282J2446
428b2698L8763K9039j1818m5929l5120J3257M8095K9643j3973k9930k2224n004
440b7899J9313L6629J9297j8444m1459k9018J5115M6314K7352j5230l6178k4765
452b8973M893K9396K7053L651j8278l2131k5657J2474M5647K7827j7968m2281
464a4347k3980J4395L3231J8896m207j8307k9500j9541J8269M2697K1116j9607
476A9115m0173k2110J7757L6572J8989j1292k5996k4297l930K1232L1414J6078
488C3359j2796l8102k6249K0918M4098J6678k0450k8723j7321L847K1910K7389
500B4558J2995j7334l8875j9740K5270L9056J3758k0057l3588j8512J3456K9501
$$ plain form
512 10488 29694 29260 10076 -18711 -33006 -14461 21650 38295 16415 -24855 -39308 -15291
524 -15291 14884 24223 19420 1358 -23832 -34535 -13863 20735 31920 8160 -29341 -40223
536 -40223 -16430 15611 27889 15569 -10593 -28966 -25561 -4593 18024 27616 9514 -26326
548 -26326 -39424 -10578 26310 33986 12390 -14556 -24165 -15150 2423 23033 30750 8492 -25753
561 -25753 -31420 -1121 30864 37241 13602 -15876 -25748 -9058 14228 27304 23391 2836 -20519
574 -20519 -23630 -1146 30431 39127 11838 -24715 -28613 -3812 17122 22708 15036 -3380 -22188
587 -22188 -24404 -1820 27264 31343 1370 -31148 -32138 -8198 15597 21716 6367 -18527 -28031
600 -28031 -19177 19 18937 21339 -3918 -34728 -36914 -9114 19189 20302 -2491 -23163 -24753
$$ packed form
512A0488J9206m34j9184k8787j4295J8545L6111J6645k1880m1270j4453K4017
524a5291L0175R339m803j8062k5190j0703K0672L4598J1185k3760l7501j0882
536d0223K3793L2041J2278j2320k6162j8373L405K0968K2617R592j8102l5840
548b6326j3098K8846L6888P676k1596k6946r609R015J7573K0610P717k2258l4245
561b5753n667L0299L1985O377k3639k9478r872J6690K3286J3076l913k0555k3355
574b0519l111K2484L1577Q696k7289l6553l898K4801K0934N586p672j8416j8808
587b2188k216K2584K9084M079k9973l2518r90K3940K3795O119j5349k4894r504
600b8031Q854J9196J8918K402k5257l0810k186K7800K8303J113k2793k0672j590
$$ plain form
613 -24753 -14864 1364 20441 19906 -7018 -32409 -29150 -1943 25045 26720 2033 -21613 -21956
626 -21956 -3495 17352 26644 17065 -4651 -21386 -18775 5006 33806 33581 3435 -20469 -14742
639 -14742 7225 23781 26832 14397 -5915 -18968 -13924 10092 32190 28096 116 -21911 -18369
652 -18369 3892 24564 22889 1610 -17496 -20416 -11511 6707 23168 19407 -6725 -28607 -24121
665 -24121 1544 22626 16353 -6963 -22521 -22034 -11319 7931 21739 12354 -11893 -28353 -21951
678 -21951 3016 23957 17794 -9411 -26880 -20700 -807 16188 18532 7225 -9396 -21900 -17685
691 -17685 7396 27261 17345 -10017 -23659 -15846 3669 20452 20258 4607 -12005 -19328 -11109
704 -11109 10233 24468 15346 -8381 -25225 -18450 8816 26285 17364 -3261 -15855 -16467 -7287
$$ packed form
613b4753R889J6228J9077n35k6924k5391L259K7207K6988J675k4687k3646l43
626b1956J8461K0847R292r579k1716j6735K611K3781K8800k25l0146k3904N727
639a4742K1967J6556L051j2435k0312j3053N044K4016K2098m094k7980k2027L542
652a8369K2261K0672j675k1279j9106k920Q905J8218J6461l761k6132k1882M486
665b4121K5665K1082o273k3316j5558M87J0715J9250J3808r385k4247j6460O402
678b1951K4967K0941o163k7205j7469O180J9893J6995K344j1307j6621j2504M215
691a7685K5081J9865r916k7362j3642P813J9515J6783j94j5651j6612p323Q219
704a1109K1342J4235r122k3727j6844O775K7266J7469q921k0625j2594o12R180
$$ plain form
717 -7287 11003 21119 11309 -12137 -25000 -14285 11271 24854 13734 -6451 -17993 -16873 -3151
730 -3151 14039 17562 5848 -11065 -21729 -13430 11684 26169 14625 -9645 -22722 -14135 4676
743 4676 16654 13921 2868 -11460 -19666 -8842 15297 26285 11623 -11228 -21265 -11314 9295
756 9295 20956 14086 117 -11933 -13771 -1922 16310 22868 11989 -10469 -23187 -10448 14622
769 14622 23063 10551 -4651 -13100 -11461 242 14920 18429 5984 -15189 -23919 -9715 12134
782 12134 18350 6668 -10408 -19317 -13065 2099 11670 8979 -1493 -16490 -24197 -12443 9914
795 9914 17940 3738 -16552 -22856 -10441 5804 10923 6414 -2920 -17374 -20846 -5733 14353
808 14353 18734 4834 -14055 -18905 -5122 12107 17265 8787 -4544 -13205 -9862 3413 16656
$$ packed form
717g287J8290J0116r810k3446j2863J0715K5556J3583j1120k0185j1542J120J3722
730c151J7190L523j1714j6913j0664Q299K5114J4485j1544k4270j3077Q587J8811
743D676J1978k733j1053j4328q206J0824K4139J0988j4662k2851j0037R951K0609
756I295J1661o870j3969j2050j838J1849J8232O558j0879k2458j2718J2739K5070
769A4622Q441j2512j5202q449J639J1703J4678L509j2445k1173q730J4204K1849
782A2134O216j1682j7076q909O252J5164R571k691j0472j4997p707J1754K2357
795I914Q026j4202k0290o304J2415J6245N119m509r334j4454l472J5113K0086
808A4353M381j3900j8889m850J3783J7229N158q478j3331q661L343J3275J3243
$$ plain form
821 16656 20830 9535 -10542 -17072 -15 19975 20144 7346 -5183 -10353 -5648 5622 18333
834 18333 20174 5685 -12932 -14789 1613 16950 17974 5241 -10998 -16669 -5294 8370 13607
847 13607 10459 -1248 -14332 -17351 -3822 13821 15571 -1191 -18919 -17755 -3632 7198 9636
860 9636 6135 -4864 -17327 -16563 -1561 12309 11354 -2691 -18138 -17413 -3192 11608 13687 3970
874 3970 -9809 -15171 -9375 2188 11712 13448 -612 -16878 -15738 2818 16697 14142 1264
887 1264 -9871 -10697 -5138 5147 14266 13110 -1822 -14426 -10611 4901 16378 15644 2021 -11721
901 -11721 -12579 -1159 9155 13448 8626 -3432 -12403 -10525 3109 17056 14749 -3307 -16244
914 -16244 -11932 465 9249 10412 4335 -7048 -13856 -8858 3623 13970 10657 -5499 -17324
$$ packed form
821A6656M174j1295k0077o530J7057J9990J69j2798j2529n170M705J1270J2711
834A8333J841j4489j8617j857J6402J5337J024j2733j6239n671J1375J3664N237
847A3607l148j1707j3084l019J3529J7643J750j6762j7728J164J4123J0830K438
860I636l501j0999j2463P64J5002J3870r55j4045j5447P25J4221J4800K079r717
874C970j3779n362N796J1563R524J736j4060j6266J140J8556J3879k555j2878
887A264j1135q26N559J0285R119j156j4932j2604L815J5512J1477p34j3623j3742
901a1721q58J1420J0314M293m822j2058q971J878J3634J3947k307j8056j2937
914a6244M312J2397Q784J163o077j1383o808M998J2481J0347l313j6156j1825
$$ plain form
927 -17324 -13473 83 10833 10773 337 -10985 -12438 -5905 4942 12933 9666 -5706 -16926 -11955
941 -11955 3869 14911 11389 -1527 -11126 -8031 -1084 7914 13911 8509 -5089 -13136 -7534 6321
955 6321 16565 12402 -2046 -10421 -7204 2222 11166 12288 4949 -6331 -11605 -7173 5812 15796
969 15796 10571 -5217 -14258 -8688 2746 10670 8293 -607 -9705 -12408 -6890 4750 13033 6678
983 6678 -8328 -16212 -9560 3068 11145 6056 -4845 -11964 -11003 -5000 6038 11496 4663 -8702
997 -8702 -15172 -8491 5931 13331 6769 -5358 -10860 -7746 1037 9369 11843 4955 -5256 -11496
1011 -11496 -5542 8882 16005 7931 -5560 -10531 -4765 4743 12315 11137 3028 -5258 -9656 -3441
1025 -3441 9264 14961 6208 -6938 -11326 -4952 6908 11693 7153 -1542 -7667 -9181 -3275 7264
$$ packed form
927a7324L851J3556J0750o0j0436j1322j453O533J0847P991l267j5372j1220M971
941a1955J5824J1042l522j2916r599L095O947Q998N997n402j3598q047N602J3855
955F321J0244m163j4448q375L217R426Q944J122p339j1280n274M432J2985R984
969A5796n225j5788r041N570J1434P924k377q900r098k703N518J1640Q283o355
983F678j5006p884O652J2628Q077n089j0901p119R61O003J1038N458o833j3365
997h702o470O681J4422P400o562j2127n502L114Q783Q332K474o888j0211o240
1011a1496N954J4424P123q074j3491m971N766R508P572j178q109q286m398O215
1025c441J2705N697q753j3146m388O374J1860M785m540q695o125j514N906J0539
$$ plain form
1039 7264 11362 3792 -8633 -14351 -6706 6599 11322 3733 -5837 -10595 -9676 -2305 6761 8758 1161
1054 1161 -10427 -14315 -5436 7785 11567 2407 -8046 -10615 -6674 1016 7590 6939 849 -7574
1068 -7574 -11160 -3165 9710 12842 3410 -7484 -9680 -3573 5373 10553 7529 1407 -6269 -8557
1082 -8557 241 11623 13351 3454 -7575 -10555 -1799 8771 10880 5372 -1611 -7033 -6939 1117 9585
1097 9585 10302 1990 -8643 -11387 -1944 8673 8746 1767 -5194 -8965 -7050 657 7630 7120 -1650
1112 -1650 -11246 -12893 -2475 8196 8135 -569 -8511 -10138 -4168 3240 6985 4527 -2473 -10475 -10765
1127 -10765 -565 9312 9496 66 -8557 -8606 -1208 5996 8004 4641 -1696 -8469 -6765 2328 11042
1142 11042 10487 1737 -7724 -7678 1529 9796 9115 3558 -3477 -7296 -3956 4825 10632 9206 874 -8907
$$ packed form
1039G264M098p570j2425n718P645J3305M723p589r570m758R19P371R066J997p597
1054A161j1588l888Q879J3221L782r160j0453k569L941P690O574o51o090q423
1068g574l586P995J2875L132r432j0894k196O107Q946N180l024o122p676k288
1082h557Q798J1382J728r897j1029k980Q756J0570K109n508o983n422R4Q056Q468
1097I585P17q312j0633k744R443J0617P3o979o961l771J915P707O973n10q770
1112a650r596j647J0418J0671o1q704p942j627N970P408L745k458p000q002k90
1127a0765J0200R877J84r430q623m9P398P204K008l363o337o773J704R093Q714
1142A1042n55q750r461M6R207Q267o81n557p035l819L340Q781N807j426q332r781
$$ plain form
1158 -8907 -7604 2531 9752 8120 659 -5964 -7881 -3374 3587 7531 6415 -1935 -10641 -9107 615
1173 615 7803 6127 -2205 -9366 -8796 -2082 4223 5924 3307 -4773 -10804 -7693 1031 7825 5731
1188 5731 -2576 -10557 -8020 547 5947 5981 1854 -4446 -8418 -5488 2639 9283 7451 -1976 -8976
1203 -8976 -5510 2826 8368 7538 1591 -4331 -6367 -1710 4916 9318 7049 -1842 -7875 -4598 4035
1218 4035 9683 7516 -410 -6939 -5567 -106 4168 7294 4821 -2931 -9159 -5441 3506 8856 5321
1233 5321 -3485 -8116 -5331 -66 4005 5554 1943 -5764 -9043 -4817 2638 7702 4822 -5017 -10365
1248 -10365 -5622 1061 6213 4820 -347 -5928 -7128 -3414 3514 8776 4456 -5349 -8978 -3677 4025
1263 4025 7294 5403 -1220 -5358 -4995 -218 5630 8566 4473 -4055 -7256 -3239 4985 9514 5875
$$ packed form
1158h907J303J0135P221j632p461o623j917M507O961L944j116q350q706J534R722
1173F15P188j676q332p161N70O714O305J701k617q080o031L111Q724O794k094
1188E731q307p981K537Q567N400L4m127o300l972K930Q127O644j832r427p000
1203h976L466Q336N542q30n947n922k036M657O626M402k269q891o033L277Q633
1218D035N648k167p926o529J372N461M274L126k473p752o228L718Q947N350l535
1233E321q806m631K785N265M071J549l611p707l279M226P455N064k880r839n348
1248a0365M743O683N152j393n167n581j200L714O928N262m320r805l629N301P702
1263D025L269j891o623m138L63M777N848K936m093q528l201M017Q224M529l639
$$ plain form
1278 5875 -2348 -5445 -2943 857 5520 7308 2305 -4620 -7884 -3629 5263 8942 3246 -4692 -6380
1293 -6380 -3831 1156 5164 4594 -569 -6396 -7356 -2948 3829 7195 2022 -6128 -9030 -3827 1854
1308 1854 5281 2695 -3005 -6309 -6591 -2688 4281 7510 1690 -6586 -8134 -3257 3839 7083 2681
1323 2681 -3316 -5510 -4399 639 6430 7444 1531 -4396 -6860 -1111 6448 8567 2649 -3381 -3948
1338 -3948 -1605 2446 6180 6521 1687 -4181 -5855 -347 6621 7528 1713 -4566 -5245 -2107 3524 6155
1354 6155 3368 -1044 -5352 -6084 -1027 4904 6154 -277 -6994 -7329 -2090 3937 4728 1438 -3305 -5688
1370 -5688 -6280 -1481 5141 4522 -1420 -7010 -6830 -1487 4721 5241 630 -3763 -5895 -3958 1390 5144
1386 5144 4342 275 -5458 -6669 -13 6858 6572 757 -3956 -4920 -1409 2916 5945 4498 -245 -4718
$$ packed form
1278E875q223l097K502L800M663J788n003o925l264M255Q892L679n696p938j688
1293f380K549M987M008n70n163n827r60M408O777L366n173q150k902N203N681
1308A854L427k586n700l304k82L903O969L229n820q276j548M877P096L244m402
1323B681n997k194J111N038N791J014n913n927k464N749P559K119n918o030n67
1338c948K343M051L734L41m834n868j674N508O968R07n815o279o79L138N631K631
1354F155k787m412m308p32N057N931J250o431o717l35N239O027P91l290m743k383
1370e688n92M799O622o19n942n590J80N343O208N20m611m393k132J937N348L754
1386E144q02m067n733j211O656O871k86n815m713r64L511M325L029j447m743m473
$$ plain form
1402 -4718 -4498 1789 7168 6238 905 -3713 -4639 -141 5607 6007 2766 -1405 -4391 -3730 1963 6762
1418 6762 5376 -775 -6187 -5449 357 5004 3807 817 -3039 -5593 -4224 1647 5405 3556 -2260
1433 -2260 -6658 -5839 -102 4829 4225 -233 -4948 -5888 -2386 1832 3978 2560 -2063 -6643 -5519 1093
1449 1093 6122 4570 -1174 -4921 -4335 -653 3724 5014 3332 -1606 -5665 -2902 3096 6748 4395
1464 4395 -33 -4360 -3632 1925 5598 4725 1779 -1946 -4378 -1943 2924 6507 4643 -1439 -5361
1479 -5361 -3621 2231 4881 3361 599 -3571 -5036 -1909 2574 5296 2870 -2906 -6992 -4549 2058
1494 2058 4551 2970 -1849 -5165 -4657 -1072 2714 3118 1321 -3575 -6642 -3616 1680 4927 2387
1509 2387 -2483 -5516 -3481 694 3837 4099 1835 -3404 -5505 -1603 3383 5209 3916 -1782 -4893
$$ packed form
1402d718K20O287N379r30n333m618r26M498N748M00l241m171k986O61N693M799
1418F762j386o151n412P38N806M647j197k990l856k554J369N871L758j849n816
1433b260m398Q19N737M931o04m458m715r40L502M218K146j418m623m580J124O612
1449A093N029j552n744l747N86L682M377J290j682m938m059K763N998L652k353
1464D395m428m327P28N557L673q73k946l725k432K435M867L583j864o082l922
1479e361J740N852K650j520k762m170j465L127M483K722k426n776m086K443O607
1494B058K493j581m819l316N08L585L786M04j797m896l067L026N296L247k540
1509B387m870l033K035M175L143K62k264n239k101L902M986J826j293n698l111
$$ plain form
1524 -4893 -1912 2527 4589 4149 951 -2628 -3770 -1209 3811 6115 3574 -2596 -4958 -1123 3177
1539 3177 5208 2960 -757 -3768 -3340 -333 3043 5084 1856 -3502 -5002 -2010 2929 4913 2004
1554 2004 -2761 -4540 -2620 -319 2876 3151 457 -4743 -5177 -1571 2892 4133 769 -3906 -4663 -2326
1570 -2326 1131 3200 3374 221 -4108 -4258 -1172 3314 5174 1734 -3467 -4592 -1159 3013 4472
1585 4472 3096 -364 -3145 -2729 153 4720 5707 1331 -3379 -3425 -488 3128 4791 2849 -1274 -3299
1601 -3299 -1907 632 4338 4814 407 -3830 -4277 -664 3691 4984 1406 -3300 -3612 -1859 446 2606
1617 2606 2782 -906 -4779 -5134 -1112 2901 3513 -362 -4006 -4662 -2619 1090 2812 2053 -1783 -4407
1633 -4407 -3855 -740 3251 3831 -656 -4126 -3964 -447 2617 3729 1496 -1524 -3002 -2599 1026 4364
$$ packed form
1524d893K981M439K062m40l198l579j142K561N020K304k541o170k362L835M300
1539C177K031k248l717l011M28L007L376K041l228n358j500K992M939J984k909
1554B004m765j779J920K301L195K75k694n200m34L606M463J241l364m675p57K337
1570b326L457K069J74l153m329j50L086M486J860l440n201j125L433M172J459
1585D472j376l460k781M16K882M567R87m376m710m6K937L616J663j942m123k025
1601c299J392K539L706M76m407m237m47L613M355J293l578m706l12J753K305K160
1617B606J76l688l873l55M022M013O12l875l644o56K043L709J722p59l836k624
1633d407N52L115L991N80m487l470J62L517L064J112k233l020j478M03L625L338
$$ plain form
1649 4364 4767 30 -3046 -2952 178 3908 4523 1742 -1558 -2827 -1292 2505 4704 3947 256 -3066
1665 -3066 -2877 739 4050 4088 593 -2200 -2436 -905 1889 3947 2261 -1217 -4069 -3279 852 4381
1681 4381 2137 -784 -3467 -3638 -876 1975 2923 572 -2137 -4294 -3566 62 3139 2150 -1573 -4068
1697 -4068 -4061 -242 2204 2420 40 -2416 -3773 -2496 1053 3928 2028 -914 -3519 -3181 1267 3820
1713 3820 3260 292 -1735 -2360 -1519 2249 3962 2407 -669 -3062 -2133 1638 3865 2837 -162 -2382
1729 -2382 -2370 54 2592 3235 1593 -941 -3236 -1827 1770 4001 2655 -1152 -3424 -2542 341 2362
1745 2362 2372 7 -1899 -3310 -2020 1148 3342 1118 -1893 -4224 -3194 381 2967 1431 -703
1760 -703 -2404 -3421 -1525 1229 2665 1971 -1853 -3221 -2218 1162 3598 1484 -23 -2445 -2656 340
$$ packed form
1649D364M03m737l076R4L130L730O15k781l300j269J535L797K199p57l691l322
1665c066J89L616L311L8l495k793k36J531K794K058j686l478k852P90M131L529
1681D381k244k921k683j71K762K851R48k351k709k157P28L628L077r89l723k495
1697d068PL819K446K16k380k456j357J277L549K875j900k942k605L38M448K553
1713C820n60k968k027o25Q41L768J713j555l076k393R29L771K227j028k999k220
1729b382J2K424K538O43j642k534k295J409L597K231j346l807k272Q82K883K021
1745B362J0k365j906j411J290L168K194k224l011k331J030L575K586j536k134
1760g03j701j017J896K754J436o94l824j368J003L380K436k114j507k422k11K996
$$ plain form
1776 340 2205 3469 1715 -1363 -2319 -973 2581 3764 2195 -847 -2161 -1820 1259 2776 2611 1053
1792 1053 -1595 -3406 -640 1780 3127 1681 -932 -3076 -1625 778 2279 1958 -429 -2705 -3013
1807 -3013 -1430 1589 2945 699 -2005 -3801 -1774 918 2034 811 -1421 -3111 -2741 -419 1781
1822 1781 2631 578 -2876 -3604 -1244 1711 2178 887 -1485 -2588 -1702 616 1962 2603 839 -1994
1838 -1994 -2551 -505 2126 3348 1546 -1250 -2954 -1072 1655 3408 2893 695 -1826 -1810 335 2799
1854 2799 3187 1229 -1578 -2204 383 1773 2826 1944 -357 -2390 -1847 143 2406 2719 684 -2381
1870 -2381 -2946 -1156 1351 2242 335 -1637 -3032 -2215 -120 1450 1843 -584 -2858 -3600 -758 1546
1886 1546 1576 594 -2435 -2666 -1475 -7 1932 1761 -459 -2867 -2389 213 2119 3280 387 -1807
$$ packed form
1776C40J865J264j754l078r56J346L554J183j569l042j314L41L079J517j65j558
1792A053k648j811K766K420J347j446k613k144J451K403J501l21k387k276l08
1807c013J583L019J356k246k704j796K027K692J116j223k232j690L70K322K200
1822A781Q50k053l454p28K360K955M67j291k372j103Q86K318J346O41j764k833
1838a994n57K046K631J222j802k796j704J882K727J753n15k198k521J6K145K464
1854B799L88j958k807o26K587J390J053q82k301k033N43J990K263L13k035l065
1870b381n65J790K507Q91j907j972j395Q17K095J570L93k427k274p42K842K304
1886A546L0r82l029k31J191J468J939j71k220k408M78K602J906J161k893k194
$$ plain form
1902 -1807 -1969 -408 1408 1643 2279 83 -1496 -1464 428 2887 3124 916 -1973 -1750 86 2346 2733
1919 2733 1407 -743 -1797 -1399 695 2549 2278 2 -2867 -1666 100 2321 2121 187 -1499 -2082
1935 -2082 -781 146 2361 1497 -1171 -2573 -2461 -56 1627 1792 -299 -2172 -2177 -1088 573 2238 1083
1952 1083 -1010 -2662 -2095 226 2456 2048 -545 -1794 -1540 -575 1678 2031 1081 -1115 -2151 -1578 973
$$ packed form
1902a807j62J561J816K35O36k196j579L2J892K459K37k208k889K23J836K260L87
1919B733j326k150j054L98K094J854k71k276k869J201J766K221k00j934j686n83
1935b082J301R27K215q64k668j402J12K405J683J65k091j873nJ089J661J665j155
1952A083k093j652N67K321K230m08k593j249K54R65K253L53r50k196j036N73K551
$$ [...]
8191E01
##END NTUPLES=NMR FID
##END=
