##TITLE=1H ikalashn
2D2
18.10.2024
##JCAMPDX= 6.0         $$ Bruker NMR JCAMP-DX V2.0
##DATA TYPE= NMR FID
##DATA CLASS= NTUPLES
##ORIGIN= UXNMR, Bruker Analytische Messtechnik GmbH
##OWNER= root
$$ TOPSPIN		Version 1.3
$$ 2024-10-18 16:06:36.000 +0400  Irina@DPX200
$$ Compression mode = diff/dup
##.OBSERVE FREQUENCY= 200.13100065
##.OBSERVE NUCLEUS= ^1H
##.DELAY= (6, 6)
##.ACQUISITION MODE= SIMULTANEOUS
##.ACQUISITION SCHEME= undefined
##.AVERAGES= 16
##.DIGITISER RES= 18
##SPECTROMETER/DATA SYSTEM= spect
##.PULSE SEQUENCE= zg
##.SOLVENT NAME= CDCl3
##.SHIFT REFERENCE= INTERNAL, CDCl3, 1, 15.99637
##AUDIT TRAIL= $$ (NUMBER, WHEN, WHO, WHERE, WHAT)
$$ ##TITLE= Audit trail, TOPSPIN		Version 1.3
$$ ##JCAMPDX= 5.01
$$ ##ORIGIN= Bruker BioSpin GmbH
$$ ##OWNER= Irina
$$ $$ F:/spectra/data/iren/nmr/1H/4/audita.txt
$$ ##AUDIT TRAIL=  $$ (NUMBER, WHEN, WHO, WHERE, VERSION, WHAT)
(   1,<2024-10-18 16:06:14.187 +0400>,<Irina>,<DPX200>,<TOPSPIN 1.3>,
      <created by zg
	started at 2024-10-18 16:05:05.828 +0400,
	POWCHK disabled, PULCHK disabled
       configuration hash MD5:
       BE 6D 3F 07 2A EA 11 49 91 17 2B D3 AF B3 58 0D
       data hash MD5: 16K
       83 48 65 77 F0 F6 26 6A D4 88 D4 97 59 2B 35 AB>)
$$ ##END=
$$ 
$$ $$ hash MD5
$$ $$ AD D0 77 E6 99 D4 D2 FA 4D 54 A8 B1 2E 5F 81 5C
##$RELAX= 
##$RELAX= 
##$RELAX= 
##$RELAX= 
##$RELAX= 
##$RELAX= 
##$RELAX= 
##$RELAX= 
##$RELAX= 
$$ Bruker specific parameters
$$ --------------------------
##$DU= <F:/spectra>
##$EXPNO= 4
##$NAME= <1H>
##$PROCNO= 1
##$TYPE= <nmr>
##$USER= <iren>
##$AMP= (0..31)
100 100 100 100 100 100 100 100 100 100 100 100 100 100 100 100 100 100 
100 100 100 100 100 100 100 100 100 100 100 100 100 100 
##$ANAVPT= -1
##$AQSEQ= 0
##$AQ_mod= 1
##$AUNM= <au_zg>
##$AUTOPOS= <>
##$BF1= 200.13
##$BF2= 200.13
##$BF3= 200.13
##$BF4= 200.13
##$BF5= 200.13
##$BF6= 200.13
##$BF7= 200.13
##$BF8= 200.13
##$BYTORDA= 1
##$CFDGTYP= 0
##$CFRGTYP= 5
##$CHEMSTR= <none>
##$CNST= (0..63)
1 1 145 1 1 1 1 1 1 1 1 1 1 1 1 1 1 1 1 1 1 1 1 1 1 1 1 1 1 1 1 1 1 1 
1 1 1 1 1 1 1 1 1 1 1 1 1 1 1 1 1 1 1 1 1 1 1 1 1 1 1 1 1 1 
##$CPDPRG= <>
##$CPDPRG1= <>
##$CPDPRG2= <>
##$CPDPRG3= <>
##$CPDPRG4= <mlev>
##$CPDPRG5= <mlev>
##$CPDPRG6= <mlev>
##$CPDPRG7= <mlev>
##$CPDPRG8= <mlev>
##$CPDPRGB= <>
##$CPDPRGT= <>
##$D= (0..63)
0 2 0 0 0 0 0 0 0 0.06 0 0.03 0 0 0 0 0.0002 0 0 0 0 0 0 0 0 0 0 0 0 0 
0 0 0 0 0 0 0 0 0 0 0 0 0 0 0 0 0 0 0 0 0 0 0 0 0 0 0 0 0 0 0 0 0 0 
##$DATE= 1729253170
##$DBL= (0..7)
120 120 120 120 120 120 120 120 
##$DBP= (0..7)
150 150 150 150 150 150 150 150 
##$DBP07= 0
##$DBPNAM0= <>
##$DBPNAM1= <>
##$DBPNAM2= <>
##$DBPNAM3= <>
##$DBPNAM4= <>
##$DBPNAM5= <>
##$DBPNAM6= <>
##$DBPNAM7= <>
##$DBPOAL= (0..7)
0.5 0.5 0.5 0.5 0.5 0.5 0.5 0.5 
##$DBPOFFS= (0..7)
0 0 0 0 0 0 0 0 
##$DE= 6
##$DECBNUC= <off>
##$DECIM= 32
##$DECNUC= <off>
##$DECSTAT= 4
##$DIGMOD= 1
##$DIGTYP= 9
##$DL= (0..7)
0 120 120 120 120 120 120 120 
##$DP= (0..7)
150 150 150 150 150 150 150 150 
##$DP07= 0
##$DPNAME0= <>
$$ [...]
##$SW= 21.9926370048069
##$SWIBOX= (0..15)
0 0 2 0 0 0 0 0 0 0 0 0 0 0 0 0 
##$SW_h= 4401.40845070422
##$TD= 16384
##$TD0= 1
##$TE= 300
##$TE2= 300
##$TE3= 300
##$TEG= 300
##$TL= (0..7)
0 120 120 120 120 120 120 120 
##$TP= (0..7)
150 150 150 150 150 150 150 150 
##$TP07= 0
##$TPNAME0= <>
##$TPNAME1= <>
##$TPNAME2= <>
##$TPNAME3= <>
##$TPNAME4= <>
##$TPNAME5= <>
##$TPNAME6= <>
##$TPNAME7= <>
##$TPOAL= (0..7)
0.5 0.5 0.5 0.5 0.5 0.5 0.5 0.5 
##$TPOFFS= (0..7)
0 0 0 0 0 0 0 0 
##$TUNHIN= 0
##$TUNHOUT= 0
##$TUNXOUT= 0
##$USERA1= <user>
##$USERA2= <user>
##$USERA3= <user>
##$USERA4= <user>
##$USERA5= <user>
##$V9= 5
##$VALIST= <valist>
##$VCLIST= <CCCCCCCCCCCCCCC>
##$VD= 0
##$VDLIST= <DDDDDDDDDDDDDDD>
##$VPLIST= <PPPPPPPPPPPPPPP>
##$VTLIST= <TTTTTTTTTTTTTTT>
##$WBST= 1024
##$WBSW= 25
##$XGAIN= (0..3)
0 0 0 0 
##$XL= 0
##$YL= 0
##$YMAX_a= 653035
##$YMIN_a= -1066310
##$ZGOPTNS= <>
##$ZL1= 120
##$ZL2= 120
##$ZL3= 120
##$ZL4= 120
##$ABSF1= 10
##$ABSF2= 0
##$ABSG= 5
##$ABSL= 3
##$ALPHA= 0
##$AQORDER= 0
##$ASSFAC= 0
##$ASSFACI= 0
##$ASSFACX= 0
##$ASSWID= 0
##$AUNMP= <proc_1d>
##$AXLEFT= 0
##$AXRIGHT= 0
##$AXTYPE= 0
##$AXUNIT= <>
##$AZFE= 0.1
##$AZFW= 0.1
##$BCFW= 1
##$BC_mod= 2
##$BYTORDP= 1
##$COROFFS= 0
##$CY= 7568.61572265625
##$DATMOD= 1
##$DC= 2
##$DFILT= <>
##$DTYPP= 0
##$F1P= 17.9538593292236
##$F2P= -4.03888763876832
##$FCOR= 0.5
##$FTSIZE= 32768
##$FT_mod= 4
##$GAMMA= 1
##$GB= 1
##$INTBC= 1
##$INTSCL= 1
##$ISEN= 128
##$LB= 0.02
##$LEV0= 0
##$LPBIN= 0
##$MAXI= 945.577
##$MC2= 0
##$MEAN= 0
##$ME_mod= 0
##$MI= -402.1523
##$NCOEF= 0
##$NC_proc= 0
##$NLEV= 6
##$NOISF1= 8.587773
##$NOISF2= 6.764455
##$NSP= 1
##$NTH_PI= 0
##$NZP= 0
##$OFFSET= 15.99637
##$PC= 1
##$PHC0= -38.88924
##$PHC1= 3.950947
##$PH_mod= 0
##$PKNL= yes
##$PPARMOD= 0
##$PPDIAG= 0
##$PPIPTYP= 0
##$PPMPNUM= 100
##$PPRESOL= 1
##$PSCAL= 0
##$PSIGN= 0
##$REVERSE= no
##$SF= 200.13
##$SI= 32768
##$SIGF1= 18.5376
##$SIGF2= -6.396296
##$SINO= 400
##$SIOLD= 32768
##$SREGLST= <1H.CDCl3>
##$SSB= 3
##$STSI= 0
##$STSR= 0
##$SW_p= 4401.40845070422
##$SYMM= 0
##$S_DEV= 0
##$TDeff= 0
##$TDoff= 0
##$TI= <>
##$TILT= no
##$TM1= 0
##$TM2= 0
##$TOPLEV= 0
##$USERP1= <user>
##$USERP2= <user>
##$USERP3= <user>
##$USERP4= <user>
##$USERP5= <user>
##$WDW= 1
##$XDIM= 8192
##$YMAX_p= 0
##$YMIN_p= 0
$$ End of Bruker specific parameters
$$ ---------------------------------
##NTUPLES= NMR FID
##VAR_NAME=  TIME,          FID/REAL,        FID/IMAG
##SYMBOL=    X,             R,               I
##VAR_TYPE=  INDEPENDENT,   DEPENDENT,       DEPENDENT
##VAR_FORM=  AFFN,          ASDF,            ASDF
##VAR_DIM=   8192,          8192,            8192
##UNITS=     SECONDS,       ARBITRARY UNITS, ARBITRARY UNITS
##FACTOR=    0.0002272,     1,               1
##FIRST=     0,             0,               0
##LAST=      1.8609952,     -37,             -44
##MIN=       0,             -1066310,        -1066310
##MAX=       1.8609952,     653035,          653035
$$ Real data points
##PAGE= N=1
##DATA TABLE= (X++(R..R)), XYDATA
0@%%%%%%%%%J6j6J6l2L2m8O4o4Q0r7J13j44J76k08K41k89L37l86M50n25O05o90
31c69P89r01J026j156J301j463J640j838K053k288K546k825L131l468L834m235
47b223M672n149N676o253O885p586Q370r243J0222j1332J2603j4073J5789j7836
61i478K0323k3415K7395l2729M0291n1947P2489j19395M21569L6707q44876l42842
73h05908l902M58227M61318L39112M912j39910j90631m8937P5j5953j64314k11764
85c17675j42457R8648L07351M02863K59215j4940l12803m21845l15275m2297J90877
96c08338K81639K01542O8326l7998n8442l7001j7545n4145j17113j47295p0716
107b97086Q3252K20011K26367R6355q5499j96013j77540n4671P5847J22987N6463
$$ y = [0, 0, 0, 0, 0, 0, 0, 0, 0, 0, 16, 0, 16, -16, 16, -32, 32, -32, 48, -49, 64, -80, 96, -112, 129, -160, 177, -209, 241, -284, 321, -369, 420, -481, 545, -611, 690, -773, 867, -971, 1082, -1206, 1340, -1485, 1646, -1822, 2012, -2223, 2449, -2700, 2976, -3277, 3608, -3978, 4392, -4851, 5371, -5961, 6642, -7431, 8358, -9478, 10845, -12570, 14825, -17904, 22387, -29560, 42929, -76466, 345103, 381810, -463066, -805908, -809810, -351583, 109735, 448847, 453759, 313849, 123218, 74281, 74356, 58403, -105911, -317675, -460132, -361484, -54133, 348730, 607945, 593005, 280202, -141643, -456918, -499215, -308338, -26699, 174843, 243169, 205171, 146729, 109728, 92183, 38038, -79075, -226370, -297086, -213834, 6177, 232544, 328899, 243400, 47387, -130153, -184824, -108977, 14010, 70473]
118G0473n6781j11319m6236Q8832J77909J38057j0892j68494k29769j50905K3778
129b75347J83682K21617J11207o5188j73868j38039K838J30570J43834L1158j25854
140D6610k08588j42451M4147K26122K68949J34261q7383k47395k49435j08261
150c23424P4519J86835J72393O0004n9242j00860n0078K8516N6360P378o9712
161a7311j04423o0255L9416J30855J51193P8583m6573j43598j48798o5596M1757
172a44750J01815Q8201K7834k7621m0691j1850K6299L2125r753o5432q0154k8887
184a32864N5935J08400Q8338R410p2936j03646o4079J7371Q2554Q2325J8168n9054
196B9922q6802m4842L1957Q4279P6368J6757n4267q7096n9927R167O7279O9735
$$ y = [70473, 13692, -97627, -143863, -55031, 122878, 260935, 250043, 81549, -148220, -299125, -275347, -91665, 129952, 241159, 175971, 2103, -135936, -133098, -2528, 141306, 172464, 46610, -161978, -304429, -260282, -34160, 234789, 369050, 281667, 34272, -215163, -323424, -248905, -62070, 110323, 170327, 111085, 10225, -39853, -11337, 45023, 52401, -17311, -121734, -181989, -142573, -11718, 139475, 218058, 171485, 27887, -120911, -186507, -144750, -42935, 45266, 73100, 45479, 4788, -7062, 19237, 51362, 41609, -23823, -103977, -132864, -76929, 31471, 119809, 129219, 56283, -47363, -111442, -94071, -11517, 70808, 88976, 29922, -56880, -101722, -69765, 14514, 90882, 107639, 53372, -33724, -93651, -84484, -17205, 52530]
208E2530J6429m6610o6181k7222L8864P9929O4150m721q1567j12700o9422K4470
220a32051J05743J19390O0370k5843q4043q5803m2613R986L8665L1802O660n758
232c495R521L6988M2185Q883m4939q2244p5494k5395M2875R2602R3801M3152k8532
245A09908p5765p4315l4343Q790K9320K5502J1249M090J1429K6064K8429L192
257G3550m0185p1431o0747r142N0113P9768O4157J6276l5338o1824n0470j3054
269e8327K2288L0461J3240o722q815O707K1923K1490L299k3067m2773l9345q448
282f8089L2513N4255M0576J762l2997m2608k5853K907K5779K8065Q630j7049k5886
295a7995r323J7405K8879J5227j0900k7705k5570p091J5775K8982K1814k195k3851
$$ y = [52530, 68959, 22349, -43832, -71054, -32190, 47739, 111889, 107168, 25601, -87099, -156521, -132051, -26308, 93082, 153452, 127609, 43566, -42237, -84850, -74864, -36199, -4397, 2263, -3495, 6026, 43014, 85199, 94082, 49143, -33101, -108595, -133990, -91115, 1487, 95288, 138440, 109908, 34143, -40172, -74515, -65725, -36405, -10903, 346, 4436, 15865, 41929, 70358, 73550, 33365, -38066, -98813, -107955, -57842, 21926, 86083, 102359, 67021, 5197, -45273, -58327, -36039, -5578, 7662, 940, -7875, -1168, 20755, 42245, 45544, 22477, -20296, -59641, -68089, -35576, 18679, 59255, 61017, 28020, -14588, -40441, -37534, -11755, 16310, 24940, 7891, -17995, -27318, -9913, 18966, 34193, 23293, -4412, -29982, -37073, -21298, 7684, 29498, 27303, 3452]
308C452k4457m864J6440K1354R117q862j9740j8064l635J6490K7993J8910o210
321B7924k6778k6819q798J2528K2529J7875L675j2198j8724r848P956J7546Q461
334A5329r991j9137j0724O754J9249J9884Q183j0648k4693k3775m935J7245K5145
347G886J4521k335j2336j1856o447J702O921N832k401r774o731O487J6859J4132
361B2460L20j3421j9396j5250k897J3892K3048J6932j012j6387j6398n272N158
374h223P235L389j808l749k726L937J0316R607j903j4311j6527o318O711J3695
388f75J2790O474k558j1127j3126n632N319J0276N448j953m666k307R34L276L680
403F153J719m705r679o520M010J2383J0387P04p848r882n977n98N147Q814N099
$$ y = [3452, -21005, -25869, -9429, 11925, 21042, 12180, -7560, -25624, -29259, -12769, 15224, 34134, 27924, 1146, -25673, -34471, -21943, 586, 18461, 22136, 9938, -8786, -18634, -10678, 6868, 15329, 5338, -13799, -24523, -17769, 1480, 21364, 29547, 18899, -5794, -29569, -34504, -17259, 7886, 22407, 20072, 7736, -4120, -10567, -8865, -1944, 3888, 1487, -8287, -15018, -8531, 8328, 22460, 22780, 9359, -10037, -25287, -28184, -14292, 8756, 25688, 24676, 8289, -8109, -13381, -8223, -988, 2401, 593, -3156, -5882, -1945, 8371, 17978, 16075, 1764, -14763, -21081, -14370, -675, 12115, 18589, 16031, 4904, -8222, -13854, -8535, 1741, 7189, 5236, 570, -1737, -803, 2473, 6153, 7872, 3167, -6512, -13032, -9022, 3361, 13748, 14452, 6604, -3278, -9255, -9853, -4706, 4108, 9207]
418I207j939o661m059K104M399R05l176l787k427j13K761O564O659J315o260r401
434c909n890K76L933N335M673K589j367l577j805J594J908l091p269n512J717
449a0395P395Q859O441J929l841r338r539m345J755M186L708L971N397M450O00
464A1233l374n351o312o141n144j88O237J0267R495M860M00m546r289j1248p774
479a6875j603M062O964R109J0349Q517J228q268j4468j3874q091j14P941J3079
493b044J2832P463Q1m606o361p626r476q831l726L909R922J3087J3383Q996m36
508B6567j1736j9078j7761q784K649J2769J8206J6526P763l465j1244j1852q970
521h410o161m230j09M703J0167J1742J1017O681j090j0675j8208j7306r077K466
$$ y = [9207, 7268, 607, -3452, -1348, 3051, 3956, 780, -3007, -5434, -5547, -2786, 3778, 10437, 11752, 5492, -3909, -9799, -9523, -5590, -255, 4418, 7007, 5640, 2063, 258, 1852, 3760, 669, -6600, -12112, -10395, -3000, 5859, 12300, 14229, 10388, 1050, -8489, -12834, -11079, -6893, -3185, 786, 6183, 10633, 11233, 7859, 2508, -3804, -9945, -15089, -15277, -9040, 1227, 10722, 15582, 15982, 11436, 2147, -9101, -16875, -18478, -14416, -7452, 1657, 12006, 20523, 21751, 13483, -985, -14859, -22950, -23064, -15123, -2044, 10788, 18251, 18332, 13726, 7365, -261, -9737, -18568, -22294, -18385, -8463, 4624, 18007, 27003, 26567, 14831, -4247, -22008, -30792, -28143, -15374, 2832, 19358, 27121, 23656, 12412, 560, -8410, -14571, -18801, -18910, -14207, -4040, 7702, 18719, 25400, 24310, 13635, -4573, -21879, -30956, -28490]
535b8490J2073J8037J8795J1496j404j4134j8989j4968o542J814P862J1121J0617
548G288O135J871q64j533m472q791j1331q439k855M343J1299J7180J7050P911
562C4792p398k0121k2482j5406k529J0888J9274J8386R110k858r803q428m088
575f63k471m171n126m412j072N597J3986J9483J4666l55j7598k6965k3872j0395
589d3368P521K3121K8433K0417K282j4092j9673j5419p669j748K462N224O084
602f425O495Q170J0452Q817m94j3344k0764k0341j1469J933J7511K7725K6408
615C4674J2202q743k3709k7102j9696o411Q352J9399K0999J2669J312o251p519
628A0176o575n690n546n254m743l592K507J2555K1367J9402N703j2838k5680k8221
$$ y = [-28490, -16417, 1620, 20415, 31911, 30507, 16373, -2616, -17584, -24126, -22312, -14450, -3329, 7288, 13423, 15294, 14430, 12897, 8425, -366, -11697, -20136, -22991, -18648, -7349, 9831, 26881, 34792, 27394, 7273, -15209, -30615, -33144, -22256, -2982, 15404, 24514, 21656, 11853, 3425, -663, -3134, -7305, -12431, -16843, -17915, -12318, 1668, 21151, 35817, 35462, 17864, -9101, -32973, -43368, -35847, -12726, 15707, 36124, 38406, 24314, 4641, -10778, -18447, -20195, -17733, -12509, -6425, 70, 8240, 18692, 27509, 27015, 13671, -7093, -27434, -38903, -36970, -19459, 8266, 34674, 46876, 38133, 14424, -12678, -32374, -38785, -30433, -11034, 9965, 22634, 23946, 17695, 10176, 3601, -2089, -7635, -12889, -17632, -21224, -18717, -6162, 15205, 34607, 40310, 27472, 1792, -26429]
642b6429j7863J239K0966L0057K3290N140j1078j7172j4325o663k10L309J540
655h199j658k957L423J3770J8547J1959l117j8752k6810k4091r080J1936K8252
668f777L0351J7227j942j5992k0789j7751j0167n4P777R527Q625O972P138O792
682B0937K171n771j2585j5875j5051q652M085J8108K5421K1420P666r009k1546
695A1319k5858k0381n909J1454K2531K2286J2524R72r026j3884j2847p307p91
708a4917L062K104Q41M104R153J1933Q168m30j1504j8897j9055r127P674K0600
722f291K2604J2823j289j2332j6361j3243m607M330Q925P265J816j462m71K786
736D493L514J791k015p180r198q032k46Q254J2434R817K887m290p614q372n742
$$ y = [-26429, -44292, -43053, -22087, 7970, 31260, 36400, 25322, 8150, -6175, -12838, -13048, -9739, -8199, -9857, -12814, -9391, 4379, 22926, 34885, 31768, 13016, -13794, -37885, -46965, -35029, -6777, 23574, 40801, 38859, 22867, 2078, -15673, -25840, -25894, -18117, -8590, 35, 7007, 14145, 20937, 23108, 17337, 4752, -11123, -26174, -34826, -30741, -12633, 12788, 34208, 41874, 32865, 11319, -14539, -34920, -40829, -29375, -6844, 15442, 27966, 28938, 19912, 6028, -6819, -14126, -14917, -11855, -9751, -8910, -4806, 4347, 16280, 24448, 24018, 12514, -6383, -25438, -34565, -26891, -6291, 16313, 29136, 27847, 15515, -846, -14089, -18696, -14366, -5441, 1824, 3640, 2178, 1707, 4493, 8007, 9798, 7783, 603, -8595, -16627, -16873, -8619, 3815, 13632, 16519, 12229, 4615, -3757, -9499]
751i499j335L186M758L266J927J380J186K72q02j546j567k842m133l757o5M237
767e334P235O708L856k03n566r205q666l169L109P181P791N715J679k553n832
782B746n691k253L84R75j14j19J521L777M657L417K92l968p599p870l572L291
798a0126P461P761M259N79k584n104n547l334O4J695K086K072K323K606J538q02
814D947k051k319l383k907j235J709M730L968J947l96j289k168k820k287p15P39
830c530J205J346J882K582R41j467k288j655n50l30q69l58J298K082J587J041
846B917L99O4j798l392k284j90J271J495K092K177J957p25k471k551j044m58l76
863b917j16J545K529J850N57k42q00k172l056k050P53K761K211J096N66R46l78
$$ y = [-9499, -10834, -7648, -2890, 376, 2303, 3683, 4869, 5141, 4339, 2793, 1226, -1616, -5749, -9506, -9571, -5334, 1901, 8609, 12465, 12262, 6696, -2509, -11175, -14344, -11235, -4054, 3737, 9452, 11131, 8578, 2746, -2945, -5198, -4814, -3839, -3953, -4072, -2551, 1226, 5883, 9300, 9592, 5624, -1975, -9845, -13417, -10126, -2665, 5096, 9355, 9934, 7350, 2246, -3301, -6635, -6571, -4876, -2790, -718, 1605, 4211, 5749, 4947, 2896, 577, -2806, -5713, -6948, -5239, -509, 3459, 5406, 5010, 3721, 1553, -1267, -3554, -4269, -3530, -2325, -979, 903, 3485, 4426, 2959, 671, -984, -1534, -1864, -2733, -3091, -1793, 289, 1876, 2917, 3316, 3380, 1582, -1810, -4094, -4284, -3013, -1518, 574, 2751, 4708, 3983, 1512, -1039, -2083, -2541, -2917, -3033, -1488, 1041, 2891, 3448, 3206, 2406, 234, -2822, -4872, -4119, -1358, 853, 1949, 2515, 3461, 3083]
880C083k223k530j382M7L61R80K006K783J067j187k361j407j120j307n95J509
896b276L208K275L62j296r92j513j772j617N91J924K137Q96M79L86p46k485k522
913b961l83J599J483R43N99J074L5j396k058q58M40q1j55J404K105J140q29j773
931C28j041k91o35m88N66K014J734j20q32o93o87j036j066M91J618J269j72l21
949F38N96K61j057j794p58N87J189P05M82P97L46j310j692o29M43P34L1O61J284
968A514O84j227j666q08O36M85l1J6P13Q69l95o54K47j49o98j129j54J602J332
987A187L26p51j79k32o59r30N8R43O89j92l47J33N90r5o09p9K99l09o99m32P32
1008e56J528L70p76l88MM6l73j57o6r9n62j36J088J981P35q77j975j382l65l4
$$ y = [3083, 860, -1670, -3052, -3005, -2644, -1664, 342, 3125, 4192, 3005, 644, -763, -1883, -3190, -3785, -2276, 932, 3207, 3569, 2273, 1281, -232, -2004, -3621, -3030, -1106, 1031, 1927, 2406, 2792, 2046, -439, -2961, -3344, -1745, -262, 681, 1280, 2354, 2389, 993, -1065, -1923, -1483, -1564, -1719, -315, 1790, 2930, 2101, 328, -713, -1004, -1639, -2127, -1561, 453, 2187, 2067, 1235, 542, -145, -1181, -2247, -1756, -138, 1131, 959, 638, 1234, 1495, 438, -1356, -2114, -1527, -338, 367, 849, 1646, 1992, 682, -1010, -1639, -1196, -462, -431, 230, 1514, 2198, 971, -695, -1503, -867, -382, -413, -397, 316, 1185, 790, 136, 383, 234, -464, -1593, -1747, -145, 1187, 1513, 762, 583, 351, -308, -1238, -1180, -237, 452, 260, -87, 46, 636, 541, -68, -147, 152, -157, -856, -1288, -556, 972, 1342, 566, 178, 182, 228, -145, -302, -368, -467, -1029, -1165, -77, 1904, 2639, 1762, -213, -1595, -1960, -1994]
1028a994M90J330J488M64l33n72Kr4j101j444o43J86R57J508J715J618M12k251
1046A738l291k123j63J065K157J518J522M81l58r71j082r91j690j853k08K245
1062b004L543K603N09j264k204k598k096j15J456J817Q24k5L97J041R94j84j139
1079A555k113k792j893K30L175M751L108k60l134l662k142k10R93J896J200o98
1095Dj303lK439K595J026j682l492l600k095L26L372M627L325O47k590k810k375
1112a589j638p52O12J289J834J334J150J355M77j028l012l008j258K54Q70J560
1128a550K051K385J898r9j027k496l851m042j645K815N823N707K286j390m261
1143B604n117l338j4L378L715J298j756j981j93K208K955J812j266m427o075l681
$$ y = [-1994, -1504, -174, 1314, 1778, 1445, 873, 875, 781, -320, -1764, -2407, -2221, -1264, 244, 1959, 3577, 3989, 1738, -1553, -3676, -3839, -2774, -617, 901, 2423, 2904, 2546, 1575, 493, -498, -2188, -4041, -4249, -2004, 1539, 4142, 4651, 3387, 1183, -1415, -3511, -3626, -2170, -353, 471, 446, 843, 1884, 2878, 2694, 1555, -558, -3350, -5243, -5013, -1838, 2913, 6021, 5761, 2627, -1035, -3177, -3387, -2394, -498, 702, 4, -1299, -1302, 1137, 3732, 4758, 3076, -416, -4016, -6111, -5785, -2413, 2214, 5539, 6186, 3596, 786, -1589, -3227, -3979, -3367, -2078, -244, 1090, 2240, 3595, 4072, 3044, 32, -2976, -4234, -3980, -3110, -1550, 501, 2886, 4784, 4685, 3658, 1162, -2689, -6731, -8376, -5561, 262, 5969, 8255, 6865, 2604, -2513, -5851, -5865, -2487, 1228, 2526, 770, -1211, -1404, 804, 3759, 5571, 4305, -122, -6197, -9878]
1159i878K021O975P573L587j897o151o253l782R61M652N011J530k449l258j072
1174b430J748L116J886m60l226m619l140jM782N909L466K3k919l776l871k495
1190f007J08K718L375K328Q42L03n37j447k751j664m1R40O53m3L99J084J249J575
1208C084J492L88k909n668n007o44M496P389O098J748l168p089p263k807L383
1223f477O527M996M71l588l553j714J649M088L572r27n391o884k677L436P576
1238A104P236K198l068p041p225k878L192O397M732M18k788l241j103Q64K149
1253I46K054j33k941m055j694K120M052L569J401q18k084l008k988p99Q75J697
1269a806J743J328K101J324j368k866l173j384P43J928J890J272k21j415r74J219
$$ y = [-9878, -7857, -882, 6691, 10278, 8381, 2230, -4023, -7805, -6844, -2192, 2819, 4349, 1900, -1358, -2430, -682, 2434, 4320, 3860, 634, -3985, -7125, -7126, -2344, 3565, 7031, 7054, 4135, 359, -3512, -6007, -5899, -3181, 194, 2522, 3364, 3667, 3130, 1683, -1068, -2732, -2773, -1833, -1180, -1223, -824, 260, 1509, 3084, 4576, 4964, 2055, -3613, -8620, -9264, -4768, 2621, 8719, 10467, 7299, 210, -7053, -9860, -6477, 50, 5046, 5517, 1929, -1624, -3338, -1689, 2399, 5971, 5044, -347, -7231, -9908, -6472, 1104, 8340, 10538, 7470, 429, -6796, -9674, -6482, -85, 4647, 5065, 2277, -964, -2067, -1203, 946, 3000, 2867, -74, -4129, -5823, -3703, 349, 3918, 5319, 4501, 2417, -591, -3579, -4378, -3503, -1806, -63, 1265, 3366, 4690, 3322, 456, -2717, -4101, -3358, -1430, 460, 1732, 1511, 96, -878, 341]
1285C41K549J243j856m523m119q32L014N756N813J836l438o944n795j116L721
1300d350N250L560J75k721l593j612J807L804K548j659m862m410o12L331N752
1315B408M256O07l382n993l730J50L600M041J384j260k098j219L30J613J677n0
1331B334k326l110j101J615L331K374J60j333j661j803p8P54J059k72j016p49
1347a822R81K586J734o1k401l003k030L22K473L143J588j143k406k200L45K350
1363D56J522J08k110k447q66R71L234L096Q31k649m311k669Q01K775L097J743
1379C582r48k559k707l14K544K869Q39j976l149j650N34K679L129J178j397l387
1395g33k670j48K674L048R96j757k471j476M84J894K337J175j334l292k227L09
$$ y = [341, 2890, 4133, 2277, -2246, -6365, -7197, -4183, 1573, 7386, 9222, 5784, -1160, -6955, -8071, -4350, 900, 4460, 4635, 1914, -1679, -3291, -1484, 2320, 4868, 3209, -1653, -6063, -6675, -3344, 2408, 6664, 7271, 3889, -2104, -5834, -5684, -2084, 1957, 3341, 2081, -17, -1236, -906, 707, 2384, 2334, 8, -3102, -4203, -2588, 743, 3117, 3277, 1944, 283, -1520, -1598, -844, 215, -57, -1073, -1822, -841, 1745, 3479, 3418, 1017, -1986, -4016, -3694, -1221, 1922, 3510, 2367, -39, -2239, -1894, 456, 1978, 2086, -24, -2471, -3337, -2366, 868, 3964, 4795, 2146, -2165, -4834, -4033, -1258, 1839, 3582, 2634, 75, -2632, -2946, -402, 2467, 3306, 1330, -1819, -3469, -2935, -256, 2873, 4051, 2654, -733, -3403, -3551, -877, 2171, 3167, 1410, -1061, -2537, -2053, -159, 2178, 3353, 2019, -1273, -3500, -3191]
1411c191K569K940R29j244k161j710m25J406K018J236j356k432j470J202K621
1426I32J919L7j884k399j767K31K294K803R78j553k578j336P61J932R19J81j348
1443A22j766n08Q06K711J847o42k595k438o42J479K231J767J84j500k537j458
1459b939Q82K729J828k85j893j916p83J181J697J826J78j803k856q55J593K676
1475A260J637o27j959j930j121P99K284J960M75j912k344j287J175J898J316J14
1491A738j093j264j407O64K002J555j60k211j801j49J320J690J209k70j200k260
1507a637j032J075K412J550p16j645j449j70J021J087R08j52j307j453l39J349
1523d98J998O20j069j580j046j16R72J513J336j59j930j721n79J609J646O44n56
$$ y = [-3191, -622, 2318, 3247, 2003, -158, -1868, -2293, -887, 1131, 2367, 1011, -1421, -2891, -1689, 932, 2851, 2888, 1004, -1395, -3162, -2931, -637, 2166, 3144, 1591, -987, -2323, -1562, 370, 1289, 1470, 122, -1644, -2152, -1346, 1365, 3212, 2570, -25, -2463, -3105, -1626, 605, 2372, 2556, 1056, -1481, -2939, -2057, 672, 2500, 2215, 322, -1594, -2377, -1196, 501, 2327, 2505, 702, -2154, -3009, -1416, 1260, 2897, 2270, 311, -1619, -2740, -1941, 343, 2303, 2778, 866, -1478, -2765, -1590, 308, 1624, 1738, 645, -619, -2026, -1362, 640, 2195, 2035, -176, -1977, -2126, -806, 884, 2093, 1823, 623, -1637, -2669, -1594, 818, 2368, 1652, 7, -1442, -1612, -591, 496, 1404, 1252, -55, -1508, -1847, -498, 1500, 2120, 1051, -529, -1575, -1691, -719, 794, 2130, 1971, 41, -1680, -2259, -650, 996, 1640, 1084]
1540A084j088j040n93P72J550J217q32j653j232K09J672J180K98n50j342j195
1556a543o15J367J965J079o88j809j271j05R10R79P28J94j095j078k98R76J318
1573A014L21q04j425l27J87R47J039P50m10j294j391k52R41J262L42l79k98n19
1591b96QJ12M94K27m83o72n40P92R03N15k67o38m36m23j79N44Q37L48o57p92r7
1612g00L26N76O69k34m66p75m19P8Q93J181j19n73j071k24M02O93K91o7k49p15
1632e03m21K07J075O72J09o61q20n26k01M91L46Q89M64n63m47k02j40K6k04j61
1652e70Q4L67N02J06K12P7o12q38k52K41L49L67J92J05L22j57j99k56rl63m42
1673g74k7M56O63M14O1k34j92m91l45m32L11O27L95j70j04o6J37k59j80L00J81
$$ y = [1084, -4, -1044, -1637, -865, 685, 1902, 1070, -583, -1815, -1606, 66, 1246, 1544, 994, -348, -1543, -2158, -791, 1174, 2253, 1565, -244, -1515, -1620, -710, 269, 997, 1191, 96, -982, -1280, -304, 1014, 1335, 531, -894, -1221, -1034, -87, 952, 1702, 1292, -2, -1393, -1645, -704, 558, 900, 521, 223, -296, -288, -176, 318, 545, 62, -610, -1150, -358, 545, 1060, 793, 155, -281, -704, -883, -339, 498, 846, 189, -603, -700, -374, 202, 871, 637, 171, -604, -1023, -945, -52, 1129, 1010, 437, -634, -858, -456, 237, 528, 461, 212, -503, -924, -717, 358, 1030, 1139, 478, -342, -868, -1069, -578, -232, 657, 1121, 558, 111, -91, -231, -205, -409, -570, -486, -119, 383, 489, 701, 778, 166, -672, -924, -683, -334, 33, 225, 330, 652, 495, 296, 40, 31, -332, -774, -801, -345, 318, 732, 793, 559, 367, -124, -469, -901, -590, 37, 432, 262, 158, 92, 229, -30, -210, 90, 271]
1694B71j91m84j68J16P11J28J87R2p5n94r95l88O08R24M20J79N6l26m92m96j19
1715f36N97K77j34n24k52L66N95K76N47j52o26j078r03K76P40J121O10M41m96
1734A045q47r97q74M47R52Q55P1j6j30l47m15n9M37K76k72l79n44J29N14L67P38
1755I51M73j69j194j217o72N20J115J075O46k73q43j082j021N40J376Q01O9q54
1773B41o10q74J09Q70J195J046o01j317j659n51P78J175J263R25l45j241j656
1790a252n49P85J091N96K68o04n82n14J60O05J278P1r44j164r18K49P15R26J183
1809A400P35q84j392j391k59N53Q98R09L46M74r45q56o15J39Q16M35n1L5l23p37
1829g13k30N91J166O48k41j073j288o19L47R46J287R67R5j350j616p17Q03J022
$$ y = [271, 80, -404, -572, -456, 255, 383, 570, 662, 587, -7, -1002, -1390, -782, 142, 562, 741, 797, 471, -21, -517, -636, -39, 238, 104, -420, -672, -306, 289, 565, 1112, 960, 334, -744, -1647, -1371, -631, 490, 1100, 1541, 1045, 198, -799, -1673, -1226, -274, 581, 652, 636, 506, 159, -256, -315, 122, 398, 126, -253, -797, -668, -154, 213, 951, 1424, 1255, 61, -1156, -1828, -1308, -193, 882, 1528, 1255, 412, -670, -1691, -1151, 225, 1026, 1095, 241, -369, -1243, -1134, -264, 931, 1977, 1376, 59, -1600, -2151, -1373, -198, 1065, 1990, 1645, 404, -1252, -1801, -1016, 75, 671, 939, 335, -247, -761, -601, 4, 1282, 1353, 409, -755, -1673, -1424, -709, 217, 1400, 2135, 1251, -141, -1532, -1791, -1238, -340, 569, 915, 1389, 444, -412, -1027, -888, -72, 363, 312, 347, 24, -713, -943, -352, 814, 1462, 1221, 148, -1140, -1759, -1412, -466, 821, 1788, 1883, 533, -1083, -1800, -997, 25]
1847B5Q92K51m34j053r95n1J115J426O11p88j301j157k29M25J198J420N11n81
1865A285j593q52k00P54O83M99P9l47o63k30N01P00K44l93o20o77j5K53M55P19
1885E82M45P9p90o02k56k92L11L3N90P09K30l33o41l43m82N2L38P57L28j77o38
1906a00m19j45P36M63J74o17m97o48l7O73J139Q57l89j133o94o22L49J061O71
1925H22K50p43p77n93J53J150O69K86o40r81p34J36M71J056P01l19q98p28QM21
1945b90N90M4M5n67l09J80L29Q33Jl22q98m57J1N51M07M99R4n11m71k53K18M01
1967A25N0l27l22K07M22L81P8j94n12n49j51M72P33M27k42n74o57P3M63K55L28
1988D86j03m45n60RN00P14L67n97o17n63J75K99P63M51n8j026q10P8M70J052M22
$$ y = [25, 917, 1168, 734, -319, -1314, -1365, -250, 1176, 1787, 999, -302, -1459, -1688, -1263, -65, 1355, 1866, 1285, -308, -1160, -1360, -606, 77, 576, 655, 308, -355, -585, -84, 616, 860, 467, -153, -830, -845, -592, -137, 582, 1027, 1106, 316, -286, -542, -834, -523, -490, 100, 809, 1039, 706, 65, -278, -760, -708, -370, 387, 715, 538, -100, -519, -664, 72, 535, 709, 92, -405, -1053, -1090, -417, 722, 1579, 1190, 57, -637, -1259, -910, 151, 822, 1072, 329, -448, -1041, -888, 262, 931, 1217, 577, -404, -1138, -1002, -531, 525, 1226, 907, 9, -719, -711, -290, 300, 344, 389, -178, -487, -307, 22, 855, 856, 534, -364, -821, -810, -259, 148, 647, 741, 230, -241, -494, -276, 125, 175, -152, -474, -267, 155, 536, 614, 420, -92, -641, -792, -320, 413, 840, 598, 24, -633, -560, -97, 158, 486, 383, -62, -622, -613, -113, 601, 968, 371, -246, -809, -634, -335, 428, 879, 821, -205, -1015, -937, -467, 585, 1007]
2009A007k97n64o96l73J63P23R15L7m18j109n2L00N99L33k23j43p46n5J62R35
2029D98N38k61q49o88O6M11N33L41J83m46o57j33J08O57l3q9m65O3J68J37L96
2050D78J28k03n85m78j34R10O33P3n25n29m46J71K50O32M37k96p35p23K91Q12
2070A61L91J59n53k94l31l6J65P90L53l99q15n43M75M98M59K56j90p57m52k15
2090h78N13P00K98j87o56j19J17M3M57J64j49m52m69m1O68P29l3m47n78m39M51
2111c08J88M48K56j36l05o43Q7N15K27J6j57l45j33l8M52N20K0l08o55l81N29
2132a51K86M20n1m2p10k79j56O15N92J27n48l45k86K83L15J60K01l67j54k83k9
2153d02N83M49k59m56m30K4J74O44L49J36n72o65m07J65R51M14j19l10n30K2j01
$$ y = [1007, 710, 146, -550, -923, -760, -37, 878, 915, 497, -612, -664, -364, 235, 568, 345, 202, -544, -599, -437, 498, 1036, 775, -74, -762, -696, -285, 248, 589, 772, 326, -331, -464, -356, 301, 268, 179, -286, -223, -55, 82, 478, 606, 403, -182, -660, -794, 116, 749, 822, 297, -232, -678, -507, -257, 375, 812, 516, -219, -942, -651, 161, 552, 711, 158, -136, -467, -503, -338, 452, 805, 406, -409, -952, -477, 21, 480, 736, 546, -211, -663, -878, -365, 335, 633, 446, -210, -329, -212, -169, 288, 452, 303, -149, -618, -659, 9, 738, 705, 258, -320, -759, -308, -120, 328, 584, 448, 143, -500, -413, 102, 329, 345, 188, -157, -290, -328, 124, 644, 664, 356, -299, -680, -151, 135, 555, 504, 462, -248, -527, -683, -68, 524, 651, 103, -242, -528, -245, 70, 230, 431, 64, -90, -373, -402, 181, 630, 371, -85, -515, -491, -317, 327, 676, 812, 240, -425, -832, -667, 284, 698, 579, 269, -261, -239, -340]
2174c40M33L47j6m57n51j35L73Q29L23k32m13p74k12K0O06P31M19m18p29n05K89
2195d12M64Q6J14j9k56l44Q4M37J96O4n03k83p0L75K46L20k0k47m71l11K22N24
2217A96K35O1p18j35L7K16K34K08J40n60k49m0K30L55L36m25m98l5n1M21M57L03
2239G18k3o55o79m69P81Q36O6P7n34l13m03L24M62L26j49k85m80j58O86J72K51
2260E51j36k82p30n3M34M32L06ok18l56l38L05M3J55m8k01L8r8L61K40r3m1n30
2283b65k70J67M05K36K40k19k62m55P4K25N75N8k41n83j6k32L46M07K48J5l25
2304A28o65pL14N54k0j68j77j52j12Q7K83L99j30m05l83pJ73Q8M50l1K65j58l20
2327Fl18l2K64n0K4K30J89J9m53L1j50m6jJ33J80J63Oj53k39J72K89l2j06l04
$$ y = [-340, 93, 440, 424, -33, -584, -719, -346, 483, 806, 574, 161, -613, -825, -805, -199, 532, 951, 533, -196, -701, -412, 52, 138, 252, 233, -23, -367, -283, 154, 350, 414, -89, -372, -442, -67, 179, 499, 479, 232, -239, -550, -328, 196, 431, 492, -226, -361, -324, -108, 126, 334, 474, -86, -335, -375, -145, 210, 546, 121, -377, -412, -463, -42, 415, 718, 695, 40, -639, -1108, -327, 509, 575, 652, 118, -195, -598, -274, 188, 514, 365, 80, -400, -558, 128, 300, 551, 415, 133, -597, -650, -216, 216, 522, 516, 298, -58, -396, -91, -48, 107, 59, -142, -104, -202, 159, 399, 306, 265, -265, -535, -368, 37, 273, 513, 294, 32, -423, -349, -124, 451, 509, 268, -315, -331, -563, -217, 190, 438, 453, 128, -537, -544, -230, 324, 304, 136, -41, -193, -305, -218, 65, 464, 334, -71, -454, -461, -288, -200, 250, 219, 484, 326, 6, -312, -344, -80, -130, -106, 124, 313, 332, -121, -90, -240, -286, -287, -154, 26, 189, 195, 42, -197, -25, 264, 232, 126, -178]
2351a78j8L8L1J60M46o9l51k38l71J33L19K34M02J34m54n16k43K30K66L97l6N5
2373C71k55m38o3k3O01J81J15m90k69j53J13N7K87J88J91k57k62j83J1J26K25
2394G3O9m2l38n0j84L82N62J08q4l79l62j70k77M49M61N85j48l29m58l68J24K65
2416a11J31L20L9l81j25J9R4L03p0k27m5j78p5L6J84L33J69k08j95l80J99o0P4
2439a54K56K77r4k13k64P7Q1l0%M28M6k34l33m08L16J05K88L58k9m90k56j62j99
2462f34O11L07J72o8m44j11l01L56L24J52J09l80l28k85L49M14L45m5m13k11o41
2483g22K8O66M63K97j88n17k63l56L57M08J62l6k34m85J84M07O2j07Kj93j18O3
2505a20P2l3M36j23k35q2j06O1M8J57J02k04J91j7j37N1m4m7j65O9K00J52j35
$$ y = [-178, -196, -158, -127, 33, 479, 410, 59, -179, -550, -417, -98, 136, 538, 672, 218, -298, -541, -311, -45, 352, 316, 371, 116, -322, -385, -408, 193, 374, 489, -1, -270, -423, -310, -253, 34, 222, 413, 156, -106, -289, -278, -152, 73, 142, 100, -238, -288, -472, -90, 472, 580, 496, 117, -245, -415, -692, -243, 218, 803, 655, 326, -132, -500, -376, -111, 20, 340, 379, -2, -127, -108, -14, 289, 219, -8, -53, -231, -306, -270, -86, 247, 416, 208, 13, -367, -168, -228, -154, 102, 379, 285, 72, -192, -115, -34, -64, -64, 364, 410, 176, -157, -565, -249, -144, 144, 502, 473, -17, -273, -435, -634, -23, 284, 456, 388, -56, -167, -468, -112, 212, 364, 473, 93, -235, -520, -171, 243, 588, 543, 130, -81, -722, -694, -28, 435, 732, 544, 27, -236, -592, -235, 173, 335, 299, 65, -420, -236, 171, 233, 126, 128, -65, -183, -120, -48, -81, 355, 232, -3, -85, -191, -130, -82, 75, 177, -27, 164, 147, 10, 61, 17, -30, -195, -126, 74, 226, 91]
2528I1j52l48J35J25J40K83J47k42m24k23oK90M17K51l15j95k08j80M18K33K48
2549D85j17m05l71PK31M01L50l28k22m44j87L41M67K35J66l89m80j15J90J63J90
2570A68J79k12j83k06J41J93l4J49j82j92K02j32K24OO6l24l9K3K22J60j26Nk46
2593a38j33K82j22J35J77k65k86j18L63M20K18k62n76j6q2j1N72K06J05k94l71
2614a96k57J13M08L19l9q2m24l40J94J62L70K66l95l55j13R1M05L3J80o1k69o11
2636f01J42L59K78J49k81j71J9j35N2O9L21j52j30pO2J73L7n9k10p8J4J25J56
2659A32J45J30j89n11p3K42J78Q6J39k70l16m7K18J72K32P6l13m05KJ96L44Q0
2681B48J48k24m07k33J12O12L67l42k90p0k39K12K90J16M2Q0m95j51K7M19oj77
$$ y = [91, -61, -409, -274, -149, -9, 274, 421, 179, -245, -468, -474, -184, 233, 484, 169, -26, -234, -414, 4, 237, 485, 368, -37, -408, -401, -170, 231, 581, 253, 31, -413, -600, -259, 208, 443, 609, 220, -260, -375, -185, -22, 168, 347, 135, -48, -254, -113, 80, 46, 195, 13, -179, 23, -109, 115, 121, 187, -137, -176, -153, 69, 229, 103, 108, -138, -271, 11, -111, 24, 201, -64, -350, -468, -105, 315, 533, 271, -305, -321, -403, -414, 158, 364, 469, 175, -196, -453, -340, 68, 387, 348, 266, -158, -498, -304, -142, 228, 494, 99, -256, -369, -278, 127, 160, 340, 279, 10, -601, -459, -100, 178, 327, 46, -125, -106, -241, -189, -120, 201, 49, -81, -88, -26, 147, 184, 125, -85, -163, -149, -24, 132, 277, 407, 218, -293, -366, -124, 54, 140, 279, 9, -307, -354, -136, 36, 268, 344, 31, -374, -372, -176, 168, 248, 396, 172, -235, -468, -356, 256, 623, 281, -9, -79, -318, -106, 184, 300, 342, 422, -73, -224, -197, 222, 216, 39]
2703C9j53m7J0J44M5J49k3j62k16j92L56K26P7o1p0k82q8J75K07J35j2l48k91
2726c82J26J91J91Q6k19Rk68J66q4M11p0J46k36l55r2K20L39J52k41M2k73j77
2748c18L28J84J12j96K0k44j5K30m6M6n1K6l05p9M17N0J60j12k11k84j5M32j52
2771b3J89Q5k67j04r1K22J84j61p6N2j59J23J33Q8P7ko65J5K15R7K69Ol2k55j39
2796b19n4l9L93J30j7k50j75R9P0O3K97k35j31j79J33P0K95n2o5k14l16K09L27
2819A40oL4o7j72Rj15K17q3O6o7J37j43JJ91M6lk02k45J32Q8J94K04j50k05k92
2844b91J30jK14K12j95M8k22n8k4K98j33K39j83j36M4j27J52K43j94k1o5L8r1
2867a23M9L30kq5k20j3N0J21Jm7p1K8Rj60J08J71o5j90J40q0j2K03q6l3j81M4
$$ y = [39, -114, -161, -151, -7, 38, 187, 164, 2, -214, -406, -50, 176, 253, 192, 122, -160, -248, -73, 134, 269, 257, -91, -382, -256, -65, 126, 212, -7, 2, -266, -100, -184, 227, 157, 303, 67, -288, -380, -160, 179, 331, 90, 132, -141, -318, 10, 194, 306, 110, 130, -114, -129, 101, 55, 101, 50, 76, -229, -308, 109, 159, 319, 207, -4, -288, -303, 129, -23, 166, 251, -16, -120, -211, 11, 195, 34, -42, 10, -149, -26, 107, 195, 272, 270, -395, -380, -165, -68, 201, 207, 175, -80, -219, -273, -312, 81, 211, 194, -56, -231, -132, -62, 1, 298, 63, -68, -247, -114, -44, 251, 199, 134, -80, -396, -187, 140, 134, 168, 101, -71, -62, -177, 40, -43, 23, -44, 93, -50, -49, 142, 188, 185, -17, -262, -130, -42, 152, 356, 206, 1, -291, -161, -162, 52, 264, 69, 117, -105, -163, -187, 111, -22, 217, 34, -102, -58, -185, -33, 210, 16, -5, -70, -32, -123, -74, 256, 254, 169, -51, -64, -14, 107, 108, 61, -10, 18, 27, -133, -25, 146, 81, -109, 31, -49, -61, 142, 56, 23, -158, -114]
2893a14L9J10o0J51P3k35k34J66J34J29mj91k7J82k34J69J4p3J11j27k45K11N7
2916BJ09J80j20j94m4k98K19J78K39N0j66k26nN8j36J78K15q7j05j30Q8q8N7l9
2940f5m1J33R3j43R5k46K32r8K91l63N3M7R8k63N5K68j70J34O1k18j01q4P3K26
2964F7J87j41p0r1l7J57k71K32o4O9J39k74j2j8J90J71j53r2M6j31J52j73J72
2987E5R0j38j1q7k7K19l25J39L01q7j47or1J81k36K56K0l6P9k62m5j2N5J95p1
3012IJ02l0k00j0O5k3L26q0j16k85O8l0K22qJ5P5j18k92J80J37M7K04n2k29q8
3037a11n2k2J30J3J08lo3o3Rj42K56J40j08M6l15j7K18q7J12o9k1J40j61l8L8
3062f2R0nQ4o7J35j30l7Jj4j30O1J4J82j37%r0N8J06N6O3k18j99K9J69J96J22
$$ y = [-114, -75, 35, -25, 126, 199, -36, -270, -104, 30, 159, 155, -36, -63, 119, -115, 54, 68, -5, 106, -21, -266, -55, 2, 111, 291, 171, -23, -67, -365, -146, 32, 271, 321, 155, -71, -76, -18, -154, 24, 239, 152, 47, -83, 5, -83, -26, -65, -106, 27, 120, -23, 72, -174, 58, -40, 251, -112, -59, -12, 86, -177, -122, 146, -24, 110, 171, -47, -148, -232, -159, 67, 254, 113, 43, -48, -85, 72, -199, 33, -31, 38, 177, -97, -109, -127, 63, 234, 81, -11, 35, -96, 56, -117, 55, 145, 7, -4, -91, -118, 101, -224, -85, 216, 129, -18, -24, -115, 66, -170, 86, 106, 70, 149, -113, -158, -170, -115, 80, 9, 111, 81, -119, -129, -64, -87, 239, 159, 43, -242, -174, -204, 18, 10, 25, 100, -18, -310, -130, 7, 54, 258, 206, -23, -111, -163, -185, -55, -42, 66, 63, 0, -63, -54, -196, 60, 200, 92, 138, -177, -194, 24, -63, 49, -20, -41, 99, -62, -100, -62, 28, 23, 107, 40, 175, 45, 8, 9, -5, -135, -74, -60, 122, -15, -15, -105, -47, 59, 115, 178, -40, -239, -210, -41, 155, 277]
3088B77j13j00j14j0j20K4J22R8J29n2m5j41K4K24o6q0M7k43K33p3n0K80k61j14
3112a24P9J4k6l1J39K03k40K8L3j22k09K70Rl4J03q1n6K9n7J17j33R4LJ16j13
3137A1J49j91j11J44j75J22J73j3j72k08P3J74M2j2J93j11j32j31K00j52J89J37
3159A99j89p7j94L4L23p2J96j87q8J0l45L99J14J37j80q3J17k30M4N7j1Mr4KP3
3184d1m3J26j74J25j34r2J09j7K76j00O3j69r6R7l7L1N2J12j63M8j01P8K02j86
3208c4R6j60J15RO4l2N1m6p2m8l3J83M9o7K1L5l43J32J17n1J91j87k5l6l6O3J35
3235I1k6l5j9j99N2j3J26K14k75J74k03kJ65k7MJ15j87p1j3L63r5J5m3k42J48
3260A7Nj18L02j04L9k50jL6N5MJ13o7j04j23L06j99J71nJ0j98Q5K1N6Q4oj29q2
$$ y = [277, 164, 64, -50, -60, -180, -156, -34, 64, 193, 141, 96, -45, -21, 203, 137, 57, 104, -139, 94, 21, -29, 251, -10, -124, -45, -31, -57, -88, 51, 254, 14, 42, 75, -47, -256, 14, 23, -11, 92, 11, -45, -16, -73, 44, -89, 5, 8, 124, 11, 160, -31, -142, 2, -173, -51, 122, 109, -63, -271, -198, -24, 18, 6, 199, 88, -44, -175, 25, -127, 62, 199, 10, -67, -261, -227, 96, 24, 220, 33, -55, -45, -390, 9, 123, 260, 80, -3, 114, -116, -72, -15, -26, -22, -116, -114, -41, -84, 42, -132, -7, -141, -233, -124, -141, 135, 35, 98, -71, -167, -70, -107, -76, -24, 88, -75, -27, -128, -50, 152, -34, 62, -98, 17, 26, 90, 58, 109, 63, -9, -57, -90, 93, 142, 75, 96, 131, -212, -80, 37, -14, 177, -10, -35, -71, -107, -44, 91, 65, 30, 11, -188, -136, -149, -23, 191, -84, 90, -113, -115, 50, 23, 27, 142, -45, -116, -129, 234, 139, 154, 111, -131, 17, 22, -96, 206, 102, 141, -109, -110, -74, -19, -15, 98, 31, -73, -196, 110, -89, 82, 77, 87, -111, -26, -5, 51, 135, 129, 0, -82]
3287h2N9r5K12L3L5j77j52o9J87Q9P4Np3Q0l34K04o8K21k32J83o6N8k74K14J53
3312A85k52K9K4j80J21P1J43o7R0k29m7J35j31J19J60j73K6j26O7j63L47n4j48
3335e3j79K1K70j63M43m41l8O9j09J20J83%j51j00j3j9K11q9M5R4k20J3j7J7K72
3360A66j07o7L0L5j86J02J54r3k47J40j08J34R5p1J16n7Kp8K6j0j38K67j3j4o4
3385A4J41l05R1J15nj1n7J32M0M2k01J20k67j7k7L87k39J34n2m5m6Lj04J20Q6
3410D9o6q5Q0M9m9o5K99j69o4rj3Q5o1J97k42m3O8O6j92K21M1N3p7k85J74J0L
3437b5N1j37O7OJ03o0j31J27o0J48q1N2j13J22j32K47Nk59j22K22R4j8J05j97
3461A4o1J0M6q8P5rk44J20jJ26K1N8j0q4K7j3k3L7J37l07K06j98J46N1R7o1O6
$$ y = [-82, -23, -118, 94, 127, 162, -15, -167, -236, -49, 40, 114, 119, 46, 126, -208, -4, -72, 149, -83, 100, 34, 92, -182, 32, 185, -67, -38, -14, -194, -73, -2, 141, 74, 164, -65, -112, 23, -108, 11, 171, -2, 24, -102, -35, -198, 149, 95, -53, -232, -211, 59, -104, 339, -102, -140, -71, -180, -60, 123, 123, -28, -128, -141, -160, 51, -38, 7, 101, -119, -106, -123, -106, 166, 59, -8, 22, 57, -129, -27, 127, 34, -213, -73, -181, -47, 48, -23, 93, 36, 38, -40, -14, -24, -162, 105, 92, 78, 14, 155, -150, -59, 56, 51, 40, -17, 115, 155, 197, -4, 116, -151, -168, -195, 192, -47, 87, 35, -10, -56, -53, -157, -37, 49, -17, -102, -22, 27, -22, -87, 212, 43, -21, -30, -43, 42, -19, 178, -64, -107, -39, 27, -165, 56, 97, 150, 73, -212, -38, -28, -25, 26, -111, -44, -38, 65, 5, -126, 1, -59, 89, 8, 60, -53, 69, -63, 184, 189, -70, -192, 30, 124, 106, 211, 14, -47, -37, 9, -79, -4, -13, -257, -137, -138, -12, 9, 67, 57, -27, 0, -13, -36, 1, 138, -169, 37, -161, -15, 36, 133, 72, 138]
3488A38n9j25RN3k6O7M1k36K01j03J46o9Q1j46j45L4R5J50j09PM8o2J3L5j62J69
3514D5J44l02o9Q0J45j25K6Q2J57k72P0J36l8j32KJ39p4k9K44j11o3L9j34J21
3538H1k29J56OK25rj1r3j94O1L8MR0j60N1q9k9J09l7P7O2L6j08L0k31N7J59n7
3565eK9n6L6RN2lK8k00J46q6J35j49J4L6K8J74p0j67J69j05N8J09l22J35J90j04
3591H1nJ4j53J39j51J50O5j96J63j54j80K63j34P1j8o9K14k79k8L72k50J40r9
3614d4J72k33J8p6L10j30J15j11Oj48m7K64r9q1R9j30j9J88l4J5M7j23K6J62j67
3639b0J57k25J95j12R0j73O3J0q7K4P5Q2o1m5J77k03J42kk40K30j51J29j25jo3
3664a34n1K2K39j56p9K0klJ48k0k9J69k41K17Oj23J00N5j30K0J2K7j9j65J48K05
$$ y = [138, 79, -46, -37, 16, -10, 57, 98, -138, 63, -40, 106, 37, 118, -28, -173, -139, -44, 106, -3, 4, 52, -10, 3, 38, -124, 45, 189, -113, -182, -102, 43, -82, -56, 26, 183, -89, -19, 117, 79, -53, -51, 88, 14, -15, 229, 118, 55, 94, -40, 81, -148, 8, 14, 239, 230, 219, 126, -68, -7, 31, 35, 125, -35, 16, -73, -102, 7, -30, 47, 109, 145, 37, 67, -164, -107, 52, -5, 24, -32, 4, 13, 65, 62, 90, -110, 36, -50, 85, -64, -50, -14, 14, 188, 118, -49, 120, 15, 73, 182, -140, -5, 185, 81, 76, 90, -63, 76, -75, 75, 140, -56, 107, -47, -227, 36, -98, -27, -45, -114, 100, -179, -207, 165, -85, 55, -44, 128, -105, -87, -163, 147, 17, 132, 21, 27, -121, -168, 96, -3, -84, 15, -115, -134, 54, 20, 35, 82, -41, -15, 147, -20, 137, -88, 107, -5, 85, -88, -25, -15, -102, -78, -3, 79, 18, -27, 150, -53, 89, 87, -153, 77, -74, 55, -70, -71, -134, -185, -163, 76, -80, -159, -139, -141, -144, 4, -16, -45, 124, -117, 100, 106, -17, 83, 138, 8, 28, 40, 67, 48, -117, 31, 236]
3690B36j89p8m9J35L6k36J46K1qK3o2m0r9j7K01M5J61k20k7P8m4j17J89p2q7J00
3716B6j74N7J96j27k9L7p1L2M0Q0j90K75l00J11Q9Rj34P2N3oO8j47M4p9O5NmK2
3744B0J74j63o4P7k25K80j41j20J63o8R7J36j59L1k07K74p5J00m0j1L4k79K19
3767E3k47J70O3o5j68j9J24J28j38K21j32L9j00m9J65j59K19qk8q1J1r9K9J84
3791A13r4q5J46k4n6j61J7qK07p9o1K76j17K1k47M1K40l4m0k09K8K9Q8n1Q0j12
3817i2K48k28Q2O0k53J74J96L3j71k7J8j79K03j23J07J63l93K84j98J40J01p0
3839G5N0k02J05j72O1K24j77J6K08O0l81K09p9m9R8k22j4J02mQ5J93l26J04j24
3863a60R8M8o9p2J15m3n6P8K28k8o7j46M9m4L3Q2O9nj56O5j86J35pK35k02O8Q0
$$ y = [236, 47, -31, -80, 55, 91, -145, 1, 22, 14, 37, -25, -65, -164, -181, 20, 65, 226, 6, -21, 57, 13, -104, 85, 13, -74, 26, -148, -91, 105, -22, -51, -14, -85, -53, -13, 67, -123, 152, -148, -37, 52, 61, -73, -1, 52, 46, 114, -33, 11, -68, -3, 2, -2, 20, 194, 31, -33, 44, -181, 99, -42, -162, 1, -67, 30, 166, 7, 38, -169, 105, 30, 130, 90, 79, 113, -166, 53, -194, -24, 39, -26, -194, -213, -89, 39, -99, 122, -10, 29, -71, -120, 45, -114, 105, 97, 69, -12, -1, -100, -71, 113, 19, -66, 80, 56, 0, -161, -144, -152, 55, -24, -85, 191, 74, 95, -152, -111, 129, 95, 55, -154, -126, -97, -9, -60, 20, -92, 156, -72, 10, 70, -183, -9, 187, 220, 49, 22, 40, -139, 64, -59, 48, 211, -182, 102, -96, 44, 145, 75, 125, -77, 28, -144, -83, 141, -36, -20, 188, 248, -133, 76, -3, -52, 46, -176, -190, -88, -92, -7, 186, -140, -36, -160, -62, -14, -83, -155, -40, -83, -139, -61, 167, 139, 72, -74, -25, -69, -36, 46, 115, 110, -46, 19, -167, -32, -39, 196, -6, 62, 142]
3890A42j69j0J18q5Q2k00J85j88J00j33K84j0o4j9N6j24J3N7N3O9r4k03M0Rl5
3915a26K00M%N6j2k15Q5j26K12N7q3j06j5K60j46j73P7nP9j25J5N6K30o9m9j4
3941F7j16M4l5N4p2J09J5k24J75l5qk5K0N6j19R1Q2j2j95K33j19j00O1K40k67
3966h0m1J48j1j00ML7J66k10L1L2J33p7J22k65J71k28J81O6J4K1j84l3J10J6r
3991A4J46L2j22J0rj99pJ26O1J32j76PJ24j27J7j26J57j74J25p2q3J53j30J58
4015C7P7j28ol2k6J62j50l6O7l2p6K30Q1L3k17J83j6j08k7o4K7O8j5m1R8K0O8
4042A77j98jO2J11k14J9K26r2N3p9k27nJ72p2o6K42q1R3M5r1k19Q7k8j25J36M9
4068b6P5j62J55j8J25k56N7P3o1Q4j00K16L0k05P6j42l2l1J31m7Q8j27J62j01
$$ y = [142, -27, -37, 81, -4, 78, -122, 63, -125, -25, -158, 126, 116, 52, 33, 89, -35, -22, 35, 88, 157, 63, -140, -100, -91, -126, 74, 78, 78, 134, 122, -93, -8, -134, 78, 135, 52, -54, -69, 191, 45, -128, -51, -56, 23, -102, -87, -31, 199, 130, 81, 67, -49, -5, -40, 14, -58, 51, 66, -158, 17, -18, -26, -51, -31, 25, -94, -3, 79, 67, -128, 105, -14, -114, -53, 187, -80, -121, 27, 16, -84, -80, -43, 123, -87, -56, -24, 109, 32, 154, -111, 60, -168, 13, 79, 93, 114, -70, -103, 7, 23, 14, 160, 192, 70, 80, 71, -128, -135, -9, 52, 184, 8, 15, 139, 12, 29, -97, 60, -114, 11, -61, -144, 9, -121, 37, 114, -14, -20, -52, -78, 84, -66, -102, -35, -67, -143, 87, 168, 201, -16, 167, 151, 43, 16, -48, -21, 47, 32, -9, 89, 109, 177, -21, -22, 40, 151, -63, -44, 182, 90, 143, 64, -163, -168, 4, -68, -134, 108, 27, 120, 165, 74, -145, -58, -86, -211, -75, -26, 49, -113, 42, 24, 149, -107, -50, 23, -38, 46, -54, 162, 192, -13, 63, -79, -111, -142, -11, -58, 30, -97, 65, -36]
4092c6J20j41K0J19k7J00oj52j20n9K12q6j19K49n2j40O0L2q9J59j45N4l5K35
4116A53j58L15m22M5J58j3k4K4j1M2r2q8J45p6Qoj26J93p7P5o1n3J72N0j61J3
4142B5Q1j82J20M3r9n4J55J2l2k21K15j4q1q7R6j33J83k1J11P2k36j85O4J68m1
4167d1N0J57j79P6j15l8Q9k3pQ4k99M9K3K10k6p6J80k27J82J4M4r9j10m9K13Q2
4193A64j98J17j99M4J8j00J43R0P0k08J58j20j4L8k14J10J48j55k7J5K78j84J09
4216H3RP0k33J55Rl1k9mq4J67Pk21J1j9J49k36J83o7J65j63j28J64K13j29j1n8
4242b8L5k2l8J63k06Q9m3J2R6M1j54K10j76Q9J7n2Q6p1M8j82K25k91R1r0K02q2
4268c1J48q9K7p3J30k90n9J77m8J85K4K8j02j72O9K36j30o4pJ91j2n2O1m3R6l83
$$ y = [-36, 84, -57, -37, 82, 55, 155, 149, -3, -123, -182, 30, -56, -175, 74, 22, -118, -58, -26, -115, 44, -101, -47, -82, 153, -5, 310, -112, -67, 91, 78, 54, 78, 67, 109, 17, -71, 74, -2, 6, 0, -126, 67, -10, 65, 4, -49, 123, 173, 12, 25, 106, -76, 44, 87, -12, -66, 89, 101, 69, -152, 63, 49, -32, -119, -23, -156, 27, 6, 117, 189, -47, -232, -168, 0, -41, 9, 166, -13, 63, -52, -90, -1, -24, -31, 53, -246, -197, -174, 36, 10, -66, 114, -113, 69, 83, 127, 28, -82, -131, 82, 164, -34, 83, -116, -72, -54, -154, -11, 79, 149, -59, 99, -21, -35, 3, -211, -101, 47, -108, -135, -120, 158, -26, 83, 92, 162, -71, 84, 93, 62, 33, 29, -55, 112, 119, -102, -91, -110, 39, -197, -14, -81, 84, -79, -207, -43, 170, 41, 30, -28, 7, -15, -53, 110, -96, -7, -50, -38, 58, 99, -55, 155, -21, 68, 85, 33, 119, 48, 96, -86, 139, -152, -61, -151, 51, -31, 117, 28, 55, -18, 112, -178, -237, -60, -108, 77, 101, 129, 27, -145, -76, 160, 30, -34, -41, 150, 138, 86, 147, 104, 200, -183]
4294a83J99N1j63Q2k02J68J57Kj46J0m7J3J37k0q1P3J22k11r6O3p0J66J24j46
4318BJ2O9J9q7j49J67M5j01Jm4J92j07N6K5j16j10J09J2J4l9kJ77p1K1L1j82J
4345e5J22O3Q1k61K11k52J3j31M7P1J32K6k39L87l88J20MP3Pj66j86L24l0r0J10
4370gQ3r0J2R4j6j83K28n9L3k0j22K6q2J9O5J36j47n4m8J26j07o4K57l9L3j00
4396b6Pk48L91j34Q2j29K20j5r5q5j11K08n5q7J12R8rj63N1J21j02r1K0j15P6
4421g9P0m5mJ15R2k57O0N9O1K7o6j25K24j09J46j63J7K0j18J41L2j45m8J21j78
4446a52R5J47o5j39K29k72J10N4%J8k3J00j33j04L50j74m6O3k9p8j72L15k67K39
4470F6m9Pm5k04R9N7J00n2R6j88Q4J7O9j8j32J33j43L09j83LQ7l19K88j87J04
$$ y = [-183, 16, 67, -96, -14, -216, -48, 109, 111, -35, -25, -72, -59, 78, 58, -23, 50, 172, -39, -135, -72, -142, 24, 148, 2, 14, 83, 102, 15, -134, 33, 78, -23, -22, -66, 126, 19, 75, 100, -16, -126, -17, -5, 9, -30, -32, 145, 74, 95, 126, -56, -55, 67, 130, 211, -50, 161, -91, -78, -209, -162, -91, 41, 67, -172, 215, -173, -53, -49, 24, 31, -135, -321, 3, -27, -117, -7, 76, -14, -2, 92, 76, -107, 121, 62, 95, 75, -47, -21, -103, -84, -19, 117, -30, -84, -132, -6, -113, -177, 80, 41, 74, -26, -19, -267, 124, -10, 72, -57, 163, 148, 53, -32, -143, 65, 10, -77, 35, 133, 124, -39, 12, 133, 31, -60, -40, -155, -79, -9, -54, -58, 57, 149, -108, -48, 11, 72, 99, 33, -92, 132, 23, 169, 6, 23, 43, -75, 66, 98, -47, -95, 26, -152, -57, 90, 25, -114, 115, -157, -47, 7, 7, 25, 2, 102, -31, -135, 215, 41, -5, 58, 29, -49, -221, 94, -173, 66, 17, 24, -21, -225, -126, -69, 31, -21, 75, -113, -29, -12, 57, 39, -93, 40, -103, 206, 23, 26, 113, -206, 82, -105, -1]
4495aJ33k5j26N7KJ29j20L2rj33J62p5O1k43O8L00k74Q8J3j45J05l9L1Q1j81J83
4521G4l4j15J39k01P6K58j51k01J55r1Q9j31K21j22j60J66Q0J46k56J84m1j15
4543c0j44J45j76J03J21Jq1j36M4K61k03J30N8j41Plo9J45r8J65q0KJ22k2J4O0
4569A95j55k20K21J6n2M3P2k00J10j70M3K81l04J91k09M8J38J2l9k9k8M0j27K0
4593a03j3J22J00k08J42j55K10j91J55m6K31j21q4J19k03J52j58j5k5Q1k1q7J10
4616hJ57j72J09Pj99O5J56m8j51J95j45J72l08R0k1j31K0J80j04J46l9J07m0q7
4640d9M0o3J72l4MJj20l2m7P1O3m6N8O8j28j59K36O5j71J55L0p8R4j95N7J1R3
4667I6j86K23p9m8m6J58K27l23P9j66k18J90J57l7l8j24J6K10Q1l25mJ07N7J7
$$ y = [-1, 132, 107, -19, 38, 40, 169, 49, 81, 72, -61, 101, 26, 87, -156, -88, 212, -62, 26, 39, -106, -1, -40, -9, 72, -109, 74, 40, -75, 64, -137, -61, 197, 46, -155, 0, -91, -2, -133, 88, -34, -194, -28, 52, 198, -58, 126, 85, -30, -174, -29, -205, -102, 19, 20, -61, -197, -153, 108, -95, 35, 93, -48, -41, -44, -113, 32, -66, 99, 19, 21, 143, 121, 135, 195, 40, -180, 41, 57, 5, 48, 120, -80, 30, -140, -97, 184, -120, 71, -138, -90, 48, 60, 21, -8, -36, 4, -123, -103, -116, 6, 106, -102, 40, -115, 95, -96, 59, 13, 244, 123, 39, 158, -45, 107, -51, -66, -91, -10, -31, -118, -8, 149, -23, 86, 93, -106, -41, 115, 67, -84, 111, -34, 138, -170, -80, -101, -232, -212, -32, -136, 10, -29, 78, 38, -49, -9, -72, 100, 66, 70, 71, -49, -81, -128, -57, 6, -40, 18, 86, -42, -201, 35, 100, -71, 84, 114, 36, 130, -65, -8, 3, 96, -90, 133, 54, 6, -40, 118, 345, 22, 101, -65, -283, -93, 64, 27, -11, -135, -119, 91, 172, -153, -157, -50, 7, 24]
4691B4j58j39L02j50o1M4J20n2O2O2l9QJ00j45m7j3Q9P5q1PO5l9m2j36P3R3l2
4718a0m4j2J73O6k83J7rO5l0J28J33j26l12K44Q6j29K3m0p0K34j44j6l6P0J6j15
4744a21J04k63M34j25J81k39J26j42j01J29n3o9K66m4j90J08P3j52J68j71O2J45
4766A26j34J24J7k5K1k65N9J63k95K45N9j56j60K40k22M9K03o5J70m4o8n9Q3j01
4790c5N5K2rl4j78J65Q2j24N7j30L0Q3O1p3Q4l9q9J79r8j2p4J99k89K4K06Lk2
4817D4j36O3N4k59K45j55J20n1P3j54N8M6j20Q2J49J58j09j12n3o8J42j13K67
4840A71j1k57J54k8l9qL1n7K65k62q7Q0k7P3M8l5j59K03J48q1k30J28pJ08k35
4865a14J19M4L0m4j41kJ71j68J44Q7k37J03j81J00J44p0R8jJ16m60J39J95j38
$$ y = [24, -134, -273, 29, -121, -182, -138, -18, -70, -8, 54, 15, 23, 123, -22, -69, -82, 7, 82, 1, 8, 73, 34, -8, -144, -71, 22, -10, -54, -66, 107, 173, -110, -93, -102, -37, -67, 61, 194, 68, -244, 0, 86, -43, -20, -60, -130, 104, -40, -56, -92, -22, -6, -121, -17, -280, 154, 29, 210, -29, 97, -45, -146, -17, -70, -139, 127, 83, -107, 1, 74, -78, 90, -81, -19, 126, -8, 116, 133, 108, 129, -136, -77, 86, -209, 36, 95, -61, -221, 19, -203, -154, 49, -16, 154, 110, 42, -17, 66, -35, 20, 42, 33, -1, -179, -14, 68, -56, 1, -129, -99, -16, 45, -28, 56, 17, -72, 107, 9, -3, -77, 122, -167, -143, 63, 66, 44, -92, -29, 25, -234, 11, -144, -24, -75, -2, -156, -98, -52, -172, -90, 59, 217, 108, -4, -57, -125, 17, -96, 171, 160, -97, 57, 29, -10, -18, 13, -44, 221, -41, -128, -48, -75, -2, 46, 11, -148, 55, 203, 122, -108, 20, 13, 121, -114, 5, 49, 79, 35, -106, -108, 63, -105, 39, 126, -111, -8, -189, -89, 55, -15, 83, 82, 198, -262, -123, 72, -66]
4888f6J66L0j38j05J42l2o8N6q8P9n9N7J13qN3q1r1m3j10O9K78o5mQ3j0j18p2
4915c2o6J42J1P0j44L3j32K89k81QJ07N5L4j54k5M1L4o3J54j23J16M8j98p9K53
4940I8nj33J21j79K78Q2l10J69N7j12R0o6q9m8q7K06o5J7M6M2j58L9o8J90j34
4965a9q7P4J52mj6o0n9K45l66Q3q3J53j40J32mJ9m8P2l9j04J60r0J59l21N0K5
4991a16n3J49k8K35j90p0J62j80K3l5J17K2j1J31k43Q1j61M1J78mn6O2M6o9q7
5016e6J47n9l5J8p9J65j31k31N18r2j58o0M2M5r9Po9L28p9l48K95m7P4j05j46
5041a55J82P9k04J21j55J34j76J43K0J12q5J22j58R5j64J47k8JL3j6pQ2k17J67
5065G3q4J2oj62J55P4j40K55j80l6K9j34J69l6M1k9K18q7j09q1L9N7j72j1J03
$$ y = [-66, 100, 130, -8, -113, 29, -3, -71, -15, -103, -24, -83, -26, 87, 79, 132, 51, -40, -83, -193, -124, 154, 89, 85, 168, 158, 40, -32, -98, 44, 55, 125, -19, 14, -118, 171, -110, -102, 5, 60, 94, -60, -85, -44, -10, -73, 81, -42, 74, 122, -76, -155, 98, 93, -40, 81, -98, 180, 262, -48, 121, 178, 66, 156, 90, 1, -47, -134, 72, 7, 24, 70, 112, -46, -7, -75, 115, -19, -106, -32, 120, 116, 100, 40, -19, 226, -140, -57, -140, 13, -127, 5, 1, 20, -28, 44, 5, -99, 61, -29, 130, -191, -141, -116, -169, -20, -48, 187, -3, -73, 89, -91, -68, -103, 14, 36, 25, 156, -87, -6, -167, -126, 52, 48, -8, 54, 100, 31, -56, 91, 32, -3, 15, -64, 101, -30, -261, 257, 165, 7, -53, -11, 34, -65, -58, -127, 201, 122, -226, 69, 22, 96, -9, -155, 27, 106, -98, 23, -132, 2, -174, -31, -11, 101, 16, 138, -20, 75, -89, 58, 30, 31, 64, 48, 41, 123, -94, 73, -11, 1, -5, -167, -12, 62, -78, 177, -3, -39, -10, -144, 25, -11, 30, 1, 219, 132, 23, -58, -19, 38, -134, -145, -42]
5090d2Q5K1l0R7n9k05J76m1j00n5j15K58L6o9n4J60lr6O2Q8k8L1j11J32k26R8
5116A0O9o4J14q7j28L5R0q9j86K84q7j25N4J32J69l05J12M1Jl3P6o2r8J10j76
5141a43J78J5m3P0r9j44K44l3Pj41j4K08k47J68J63q7j79J13J30j57p1K47j21
5164F4k04J97j4o0j01K09Qoj69P7p4N7J49O0j60q4j44J50j21N8J54PQ8j51J6k4
5190a8j24O7J15l7J27nk96P0R6Q2j61qJ10P5k1J84j93j46J42j12p7M3J54l0N4
5215I1Rj85J94JJ9k15J21J6K8j52K17nj49r4P9n5K03p3j29L7J78j85J2J08k2J01
5241A50j80j7l2l2J80O8k18Q4m6j00m0K47P2j37Nr1j09J46K2j5Q7k6J1q9Q7k7
5267@J32q0k26K56k28J43R2j51P9mlp3n2P7o1J20K2j84L36k06j19K06n3j68M9
$$ y = [-42, 43, 64, 34, 131, 72, -133, 43, 2, -98, -153, -268, -10, 26, -43, -97, 63, 60, -36, 26, 114, 86, 117, 6, 138, -88, 10, 79, 15, 129, 42, -86, -51, 39, -50, -236, 48, -39, -164, -110, 22, 191, -114, -2, 39, 40, 7, 83, 21, -77, 33, -143, 35, 50, 7, 77, -22, -166, 78, 45, 52, -89, -103, 105, -142, 26, 189, 102, -77, 36, 166, 9, -62, 185, 64, -140, 57, 43, -17, -118, 91, 99, 93, -76, 1, -73, -16, 133, 193, 33, -51, -195, -45, -166, -108, 46, 53, 141, -10, 6, -18, -142, -75, 40, 3, 130, 125, -171, -101, -5, 77, -84, -92, 18, 93, 72, 256, 63, -83, 59, -53, -130, -87, 67, 37, 91, 100, -85, 109, 110, 129, -86, 35, 51, 79, -73, 144, 139, -10, -104, -25, -80, 123, 50, -79, -42, 136, -49, -37, 71, 49, 150, -30, -47, -79, -111, 69, 137, -81, 3, -43, -143, -183, 64, 136, -1, 4, -87, -196, -50, -28, -43, 44, 18, 29, -60, 27, 0, 132, 52, -174, 82, -146, -3, 89, -62, 17, 13, 10, -63, -115, -38, -99, 21, 43, -141, 195, -11, -130, 76, 23, -145, -96]
5292i6j9K05R4o4k9j32N4Q0j79J31o5lN7J04l35P5K5J68J50J4j34P3n3j81P9p5
5318e6J14j1l2m7lj13K06r3J88q9j31K01o3j45J76j48R1j67J48j05L45k45l0j1
5342b0M3N0k47J82j34K24j04Nj04P7J67k59L8j70J30K74j35k2O9j75J14Q3k0j13
5366d7jN5q8R0p4N8o8k0p1L20j67n6L08k26L0k8j75L17j33P8o7P2j15j97J06J11
5392A2m9M6P5j26O1j27R0J4p8JJ14J37k31qP4J31m1j66P1K7j73K04p0N8K5l3P9
5419A17Q1p9r9m6N1j12J32j29m6K02j22K59l10M6J8Q7l3R5j33R2l9m9J06l2P2
5444A29k51N4J83kj31j64R6J19k7k3m9KjpP1j20J33o2J55p2r7kJ66k63J3Q8n3
5471a15J91J4j31l4J33N7j47o2O3J28J2nLJ17k90J09q8J78j72J22p1J37j59k2
$$ y = [-96, -115, 90, 184, 120, 91, -41, 13, 93, -86, 45, -20, -23, 34, 138, -197, -122, -97, 71, 221, 235, 101, 174, 121, -60, 19, -56, 58, 47, 15, -32, -35, -148, 58, -35, 153, 64, -67, 134, 71, -74, 102, -46, 45, -122, 26, -79, 266, 21, -9, -20, 23, 73, -174, 8, -126, 98, -6, -1, -105, -28, 139, -120, -82, -252, -122, 152, 17, -5, 64, -111, 3, 86, 66, -47, -48, 7, -81, 9, -65, -7, -75, -95, -166, 154, -13, -69, 239, 13, 43, 15, -160, 157, 24, 102, 35, 107, -8, -205, -99, 12, -37, 9, 84, -42, 19, -108, -18, -4, -82, -81, 33, 170, -61, -69, 5, 136, 95, -71, 0, 27, -146, 58, -12, 46, 71, 38, 117, 198, 119, 20, -26, 25, -87, 45, -84, -130, 72, -50, 209, -101, -55, -37, 50, 17, 112, -21, 71, 32, -17, 89, 57, 129, -122, -68, 115, 113, -18, -182, -86, 33, 6, -17, -66, -64, -65, -72, -1, -121, 12, -50, 105, 33, -64, -66, 100, -163, -150, -62, -115, 76, 90, -41, -75, 58, 115, -32, -94, -31, 97, 109, 104, 107, 224, -66, 43, -45, 133, -39, 83, 12, 149, -10, -32]
5495c2m3M7M5j6J24p6k53J14J66j56N3j44L17m1jl31J99J14p4N8r6j05J3J79r1
5520c0R0k49K23r9O3pj02J36j22K23j26q3L35j60j5j51J33j60J05J35j94O0j13
5543a08MJ71j39K10j30P9o2R1j23L5n8JJ43l29K62R3k02l6K2J06N4k14J7J01Q1
5568F9J19l45L09j86M1j04O6M0J8q2l0K39j04J49k13k0m5q8K27J01o7K8j4J5o3
5593F0j5p0J82j53L7o7J15j9N6j97jK79k45Q3j9q8L2R7j31Q7O3k90L12k04M1r
5619f4J30n4P0k37K19J07j71J00j44J42k26k2J14p3J62j06J53j98N3j3n6J86j91
5642a19O8o7Q6J73n4m7Kp3J83l25N2M1J62j9k4l1p7J5%Q9j12J4J8J49n6r4QJ07
5670F9j22K02k17K55j76PM0QM6r4n5p6l2K39j30pR3q0O5m9J74j18r9J60K8k65
$$ y = [-32, -75, -28, 17, 1, 125, 49, -204, -90, 76, -80, -27, -171, 146, 105, 104, -227, -28, 86, 12, 70, -26, -131, -118, 61, -30, 60, -189, 34, -65, -2, -9, -111, 25, -97, 126, 0, -83, 252, 92, 77, -74, 59, -101, 4, 139, -55, 5, -108, -104, 67, -72, 138, 8, 87, 25, 116, -7, 28, -30, -29, 114, -215, 47, 140, -62, -98, -76, 30, 84, -130, -113, -12, 69, 188, -157, 152, -34, 7, -97, -31, 9, 27, -55, -85, 154, 50, 199, -14, -34, -79, -167, 60, 161, 94, 122, 108, 123, 60, 45, -25, 157, 4, 41, -26, 89, 70, 126, -71, -72, 207, -38, 45, 26, -62, -30, 67, -64, 23, 86, -204, 108, -96, -55, -64, 66, 12, 82, -155, 64, 171, 0, 100, -44, 98, -128, -150, -36, -109, 53, -53, 100, -98, -45, -58, -114, 72, -119, -51, -118, -32, 141, 87, 40, 42, -31, 152, -173, -121, -80, 82, 63, 39, 8, -69, -54, -54, 35, -77, -63, -45, 104, 48, -46, -38, 69, -53, 149, -68, 187, 11, 18, 58, 66, 112, 18, -37, -113, -145, 94, -36, -43, 50, -30, 35, -14, 160, 42, -57, 103, 131, -134]
5696a34K03K4l9n5j36J72M4Q0Rj18P3j67k02L05o5Mm8m2J12pj03NR3J3n5N3M3
5723F2K8r0j5k0mK2J12p7J33j10Mk22K19M8k97J28P1P4j60QJ94q5m3L1l3N3L1
5750F2J05k35j56K0R5K66p3k40K48j59J91l00J41J4K5J41l2R1j28p4J84j00r6
5773a0Jj5j27J99%K8K0O4k14jp6J22J14q0K18j65J36j07r3m1N7ln1n8R7j39K01
5800G7k4k73L35q0n9j8J05M3j35K8j70J51N0k04K07m0j25L66p9Lp2j8j36L1N5
5825A8m4J11j38K25k59P1N1r6J42O5k22J95o3r4Q4j65j35J97K15j60j70K41Mp5
5849bM8l4k4K2j07Q3m4P5K4l6k21J95L9m4P3j62J42j4O7r8J69j84m6l0J40J3k3
5876B1j01J61k03J32l5k40K27J60j35q8N8J82j72r7J25j2RJ9j08J59q9J95nj70
$$ y = [-134, 69, 93, 54, -1, -137, 35, 79, 159, 168, 50, 123, -44, -246, 59, -6, -2, -50, -92, 20, 13, -90, -85, 8, 21, -34, 19, 62, 90, 0, -15, -35, -39, -17, 95, 18, 151, 41, 45, -177, 42, 90, -207, -79, -8, 66, -94, -86, 108, 23, -20, 11, -22, 31, 62, 167, -68, -224, -204, -109, 157, 84, -156, 92, -67, 124, -176, -35, -21, 4, 145, 113, 204, 76, 2, 186, 86, -10, -9, -24, -151, 48, 48, 76, 96, 160, -54, -55, -131, -9, 105, 25, 243, 78, 214, 107, 14, -27, 30, 27, -24, -82, 15, -124, 77, 53, -220, 115, 35, -24, -42, 63, 106, -29, -1, -171, -20, 30, -174, 33, -7, -132, 234, 155, 158, 86, 68, -68, -37, 18, -26, 85, -53, 172, -87, -16, 35, -61, 81, 146, -76, 119, 56, -38, 46, -119, -254, -57, 158, -2, -172, 69, 73, -2, 46, 12, -12, 10, -97, -14, -58, 17, 41, 5, -216, -21, 18, -26, 47, -115, 27, 13, 80, -18, 151, -33, -79, -109, 31, 44, 21, -80, 81, -122, 10, -25, -265, -38, 122, -13, -101, -43, 139, -33, -130, -5, -17, -8, 11, -97, 62, -27, 168, 163, -7]
5900gJ19p2L2RLk00J20pOL3Oj35M6o4J00R6q2j51J77j5J39k95M5J11j1Jp7Q0p9
5929g2j2j1j83L23J78j7k18m9N0j19J96p9Q1n2J65j67J51l90L76j35o8Q2M6L5
5953A11k19K14j78j27K42j19P9L4K5mMj16J6O6K1l2L6R3j26M6j9k75K56j09J73
5978I2m3j8j08J48q4J47k46N6Q4j0l4l2k7%J7Q2k9JQ2K4k8J24k44J08r6N2p1Q7
6006C4r1L17m08J90Rj1J5j33Q2o5O6J27j31O2J4k11J38l5L8Qn8P6O1n5Q2k29Q4
6033b4J10j99K58Jk16K4J12j13O4%k7J5k7P1q5O9p1R9q2rn1J28q2J21%q9n6J5
6061d4L8j11J34J3m4K56j69j81N1o0j8j1P3P5j33J29J4J1L1j32j33R4K25l6j44
6086g2J37j53n8J38O7k18L1J14R4o5rj3J24o0k25J92J1l0J93k23l6J2O6L5l1j4
$$ y = [-7, 112, 40, 72, 81, 84, -116, 4, -3, 3, 36, 42, -93, -47, -111, -11, 85, 3, -148, 29, 14, 153, -142, -97, 14, 3, 4, -73, 7, -72, -84, -95, -278, 45, 223, 206, -12, -61, -11, -130, 66, -13, 68, 16, 181, 14, 165, -225, 151, 16, -52, 30, 76, 111, -108, 106, -72, -199, 43, -76, 3, 37, 62, 58, 62, -54, -38, 28, 49, 17, 53, 146, 20, 66, 47, -228, 28, -81, 92, 49, 31, -77, 71, -13, 134, -112, -56, 28, 18, -16, -48, -75, -75, -58, 24, -5, -4, 78, 102, 74, 198, -46, 62, -34, 18, -53, 34, -57, 260, -148, 42, 51, 40, 55, -78, 4, -61, 5, 132, 1, 63, 77, -134, 4, -31, 7, 15, -43, 33, 94, 39, 121, -108, -24, 86, -113, 145, 146, -70, -46, 66, -47, 17, 17, -10, 5, -22, 49, -36, 33, -38, 61, -21, -30, -81, 47, -35, 86, 86, -3, -59, -44, -6, -117, 17, 30, -14, 242, 73, -108, -57, -117, -135, -146, -73, 2, -131, -2, 12, 23, 54, -78, -211, -117, 108, 72, -72, 65, -88, -146, -8, 59, -159, -128, -14, 80, 15, 6, -7, 117, 57, -168, 24, 35, 5, 198, -25, -61, -49, 17, 52, 21, 7]
6112GJ58j06P6k01K45l04J44o8k8P5j00J88k01j3J08r8P1o9O2L01o1j27O4M4k05
6137c8o2J67j63L5J36j49O8ln1j6K28j71j26j0K30nk9p9q8K41r1j94J23r8K86
6162A41n4l25P7K88k28J12K2J9R2j31J90k76L9J2L0q2J32p3K0j30J62J7j50R3
6186cM1N7L4R2k74K04k87J39p4L3J1L2P1M3j14N6p5M5Kk7k0K33l68J89K06k95
6212d9J24j00o1J06K2j13J12j58J61o6pj2L9nO6K2l38J18R9j40K60j72N2J13p6
6237cK4J1L6n1j18k2K95m2k08J59j57j37K46l0K7M0k7k79K51j5MQ5j40K1r7MJ64
6264D1j26M8J59j54K5j33J57K3jj10P1P1M3Pp2N1j0k51J28J8j2J45j85O6M3J1
6290E3q8N4j3J8l0J48j97mJ64Q9k60o3R0J75k45J06n3J23l9o4r5J48L6l3J2m3
$$ y = [7, 165, 59, 135, -66, 179, -125, 19, -49, -77, -2, -102, 86, -115, -128, -20, -118, -47, -116, -54, 247, 186, 59, 123, 167, -38, -100, 67, -96, -61, 75, -74, -6, -9, -60, -76, 152, -19, -145, -155, 75, 70, 41, -38, -126, 115, 24, -170, -47, -145, 141, 87, -238, -161, 127, -101, 11, 33, 52, 144, 13, 203, -73, -34, -22, 8, -74, 58, -15, 5, -125, 37, 54, -96, -3, 38, 95, 129, 221, -53, 151, -136, 3, -71, -38, -27, 5, 76, 119, 5, 61, -14, 31, 33, 6, -14, 219, -149, 40, 246, -49, 75, -25, -86, 20, 42, -71, 41, -117, 44, -22, -29, -41, -2, -7, 59, 81, -257, -139, -40, -180, 80, -92, -40, 73, -3, 21, 32, 68, 17, -101, -123, 172, 130, -78, 81, -76, -213, 33, 3, 30, 70, 43, -236, 15, 0, 4, 89, -51, -30, -127, -123, 41, -85, -37, 122, -32, -7, -140, 17, 40, 39, -71, 0, 71, 114, 121, 49, 100, 90, -161, -33, -15, -27, 118, -67, -1, 42, 53, -35, 19, 6, 24, -6, 142, -55, -59, 105, 194, -66, -129, -39, 136, -109, -3, -56, 67, 28, -36, -131, 17, 53, 20, 32, -11]
6316a1k9J25j24L3Q4j37J45q5r1Q4J42j68J4j54K52l5j18K26j5K9k08k1J23p6
6340a5Po4J25l3J56j28j18l0Q3j29J29m3n1J64K3l1r2J76j60L9N7j46q2J58J16
6365A11j02j01L2M8q0L9k6O6P4n4j33M1L6kK28k35J52J7o1l7k4L2J05r0o0J8q7
6392i3po5J35o4J22j23o2J42j21L9J1J0J31J23k82J34j57L1J3R3p3m9j05K84J2
6417G9j39L38j51j95n1R0J31j69K5qm9R8J95j52p0k1R4k06K55m9o1L3j79Q2n7
6442a37J68r1O6n3J39k10K83n6j57J08j17J02j83K3P8M4K8J7J77j50j44J7J49
6465A01k2j01J35j36jqN0p8J43P6k18J76k21L1R1r9m2J54K9PO7n1J5j25j15N9
6491h3J5Q7Mj5m3k48L19k30K05pL2n6L6P4j34P2o3lP8j05K6J47j17J38k00Q7p7
$$ y = [-11, -40, 85, -39, -6, 78, -59, 86, 1, -90, -6, 136, -32, -18, -172, 80, 45, -73, 153, 138, 167, -41, -62, 61, -15, -8, -72, 53, 20, 176, 48, -70, -100, -17, -146, -17, -60, -111, 53, 76, 45, -47, 129, -31, 8, 65, -81, -163, -5, 111, 9, -92, -60, -12, -92, -53, -79, -13, 61, 7, -126, -85, -49, -51, 177, -58, 94, 111, 50, 13, -11, 21, 126, 36, -24, -6, -93, -100, -165, -30, -94, 28, -95, -157, -15, -136, -97, -86, -76, 55, 178, -104, 30, -127, -96, -83, 10, -63, -112, -217, 67, 79, -60, 278, 127, -68, -119, -29, 102, -67, -42, -50, -99, -1, 194, 42, -28, -49, 45, -161, 94, 45, -16, 17, -162, -80, -137, 31, -60, 6, -47, 92, -118, 165, 109, -48, 60, -57, 45, -138, -115, -37, 7, 35, 52, 229, 79, -65, -48, 101, 79, -22, 113, -23, -24, -32, 18, -60, 83, 159, -59, 117, -104, -73, 18, -81, -123, 31, 60, 67, 134, 83, 98, -27, -142, -83, -68, 19, 23, 8, -35, -283, 36, -194, 11, 4, 36, -20, 16, 90, -44, 28, -35, -38, 40, -65, -39, 108, -9, 129, -71, 16, -61]
6518f1J22j15K9lJ00j33O8m9Q2j9o0k6o9N5Rl5K15l2j05K1P1r4l1O0j42KQ1R7
6546C8j33N7J41k96M4JJ68m5Q2k47m4L39N2p1k13J36J59j43K4m8J2j25K43j47
6570a6j5J01j8Pp2jK7j70J35j01K48j56M7L4q1Kk0Q5j35l1L31l62K43k8o3R7l06
6597b18K87J28q8j22N5j13J80k2M3j79r1mJ92J08p0q2j32M8J10q4M2J1jj13J76
6622F1k32K61k02K3J30j28L27M6k78o3j23J68J3q9K16j91J07j74O6J12M3j41M2
6645fK7J99j08k43Q5j39K90j62P1J40r8j62J12m5K17k48L5J5Q1o8o2J78P0j8j23
6670C8j38K1o2K26k51J18rL0k7n6k6J62j15J03OP7J78k53J67k78O7J8J8m2O8o9
6696b9j2K3j28J61k0oR2j51K22k88J57r0L9J53j10J01j77J73Ml7j05O4J2j26%
$$ y = [-61, 61, -54, -25, -28, 72, -61, 7, -42, 40, 21, -39, -65, -134, -79, -70, -105, 110, 78, -27, -6, 65, -29, -60, 0, -142, -140, -59, 38, -95, -38, 103, -193, -149, -148, 20, -25, 57, -190, -234, 105, 157, 86, -127, 9, 168, 25, 49, 1, 13, -112, 131, -16, -31, 70, 52, 59, -13, -14, 13, -157, -22, -123, 125, -31, 16, 50, -31, -29, -49, 36, -99, -130, 201, -161, 82, 54, -9, 88, -218, 69, 197, 109, -13, 42, -71, 109, 87, 130, -49, -140, -144, 48, 156, 86, 4, -128, -80, 30, -54, -12, -1, -2, -115, 61, -171, 90, -112, -89, 41, -87, 240, 286, 8, -55, -178, -10, 3, -86, 130, -61, 46, -128, -62, 50, 93, -48, -6, 21, 220, 112, -131, -46, -185, 105, -57, 14, 154, 56, -106, 6, -39, 178, -70, -35, -20, 61, -7, -69, 109, 179, 161, 38, -100, -79, -141, 85, -166, -48, -57, -27, -54, -110, -136, 26, -89, 14, 20, 97, 275, 22, 189, -89, -22, -4, 14, -28, 40, -29, -41, -18, -146, 15, -5, -11, 81, -70, 152, -136, 21, -69, -30, 123, 13, 114, -63, 110, 114, 77, -28, 36, 48, -78, -78]
6721g8O3Q3k12J31n7JJ62mk0p0j09J36p7K00r3q9K5KO3%KR5k09lQ4k1M9n5R5p8
6751A6J02k26K3J13j67O1J33j9r8j06J90k04K67j36nj55K28r1r1L23l30J10J88
6774A26Q9j63n2j50K23k5J33k20K9J07rj55KN9j50K54l90J84R9l8j51L1K55q7
6798Aj03J91q5J2m8L7n6l7M2J3p7L48l99K75J4q0oK18k75J8J55j73r7L1Q6j26
6824a21J8L4J08j10Q8Mj01K4O3p0N1P7j37j7pN3p1N8R0J11k4l01J24L7KRLq1J42
6853E6o0p0J4J2J09r9J29q4P8j67l1J41N1J0j43P3J87j81j23J35O5j18J00n8j41
6878a15L3J73k25K69m3n2j5j55K1K13m4P4k08j4K91k29M6JQ8j01L4Q2k2j38j5
6903e1k1J76q2J05PNl12K65j41J42k0K1j49J05L1p7j3J31Ok63J05j43K89p5q3
$$ y = [-78, -15, 68, -144, -13, -70, -69, 93, 89, 69, -1, -110, 26, -51, 149, 56, -33, -8, -6, 57, 57, 59, 154, -55, -58, 26, 5, 54, -1, 94, 16, 118, -108, -85, 28, -139, -78, 55, 36, -62, -168, 22, -182, 85, -51, -56, -211, 17, -74, -165, 158, -172, -62, 126, 215, 52, 0, -150, 73, 48, 181, -39, -10, 97, 88, -67, -65, -6, -156, 98, -292, -108, -9, -47, -198, -167, 88, 1, -102, 89, 4, 16, -32, 5, -51, -88, -46, -33, -110, 238, -161, 114, 128, 48, 42, 260, -15, 3, 158, -15, -112, -81, 5, -121, -103, -69, 39, -71, 17, 21, -80, -56, 7, -63, -12, 65, -72, -89, -96, -43, -114, -56, 34, 145, 121, -180, -56, -19, -17, -8, -5, -86, 56, -4, -74, -60, -48, 61, -38, 91, 7, 85, -82, -113, 28, 79, 89, -54, 19, 206, 25, -98, 37, 102, -16, 84, 26, -115, -82, 91, -134, 135, 92, 40, 25, -130, -109, 104, 60, 134, -74, -88, 203, -26, 20, 21, 109, 8, 42, 124, 102, -36, -51, -72, 104, 22, 127, 134, 139, -173, 92, -49, 93, 73, 94, -55, 50, 81, 4, -9, 122, 128, -135, -30, -173, 116, 41, -42]
6928d2J19L9j84nj4Q6p8K35l3k51K49j55Lj9k75L43m7J97q9j79M1P8Q1j16p1J75
6954H8l9J26l16R7K18j79O2q1J69j16p8J33j46m9k3Q1rq0L44k32P4o5J81j3m2
6979A05j12N4J11m9j35n7J09J7j12N3J07L1j52n7L9n0J82p1lJ74P1k92l4J19j7
7004C1j47K01Jj15j00N9P4j38N4J17p8Q0j10J06J4q0M3l3P1k29K60J25j51oq9
7029d0J1J72j78J55k47J69k42K71n3j8J58j48N1p1m0J13M8p0k3k25J48J70j19
7052ho3J9m0L3mqQ1K9L5J11k00j03J25j07J71j6q7j2J04J2n2K3o4q9J23kj61J73
7080B3j4J8J50j25q3M4J1j25J31J19J1l34N9J9k5J65k53J56K71k19p8L5N6P0j01
7105a9j4m4k5Q8m6mL6k1J48J45l62p8K92k6J6j88J19M3j02Q2R6j56Q5j29L0N1
$$ y = [-42, 77, 116, -68, -73, -87, -1, -79, 156, 123, -128, 121, -34, -31, -50, -325, 18, -29, 168, 79, -100, -59, 19, 100, -16, -87, 88, 49, 175, -141, -44, 174, -5, 57, -24, 145, 29, -49, 84, -62, -111, -134, -53, -62, -142, 202, -30, 44, -21, 160, 147, 105, -7, 47, 158, 109, -26, -83, 26, 43, -69, -16, 91, 122, -30, -87, -48, -98, 84, 13, 10, 184, 255, -37, -71, 48, 31, -116, 85, 86, -29, -129, -70, 4, -134, -80, 37, -41, 39, -71, 35, 49, -31, 12, -21, 50, -179, 81, 206, 55, 49, -40, -29, 143, -35, 120, -127, 42, -200, 71, 18, 0, 158, 10, 61, -10, -50, 63, 111, 41, 18, -207, -59, 111, -8, -71, -52, -92, -59, -63, -71, 10, 39, 74, 185, -15, -118, 7, -100, 71, 55, -32, -44, 60, 72, 20, 43, -21, -110, 13, 11, -150, 23, 9, 27, 177, 52, -31, 13, 24, -101, 30, 149, 160, -174, -115, -96, -121, 44, -209, -53, 218, -1, -79, -44, 12, 82, -19, -33, -77, -102, -14, -60, -64, -28, -49, 99, 244, -118, -196, 96, 70, 86, -102, 17, 60, -42, 40, 136, -20, 65, -64, -34, 17]
7131A7j3j09J54N9l0M8j90k1J32O7m8Q5k99L49k82R7Nj52N7q3J52L2J19o5o3k8
7157a0J2l8J44J20j79j6k35L09n1l9K7j9O6J2j14jL6r7PP8OK3J21j69O4o7j93
7184b03J45R7M8q4l2Q1k2r7N5M7j98J12J40kj9j65J40o6O6p6P5Q0j13o0j6n6K24
7211A01j34oK4P3r5L1j0J02m8K4J68k10l0o2j22J31k6j1J77j21J10o6r4N5Q9m4
7237Fl6J26r6l6k2Q3k32J47J87k4j67J40j00j66J20J00j15o9J93r4L0K26m16J30
7261h5k9R8r3J41p4J65M4j18P9l14Q4J33ok4J2J02j71M0O5L8N8n0j64K1j31J43
7287c6j5J79k46O2j22J35J06n4o4R2r8lK45k98J22j29K29j2k4l4j8j05J33o5P8
7312E8j29k3J71j27P9J6n4J3K7l6LJ12r8J42P3k81J16j36O6j42J79k9J29p4%n8
$$ y = [17, 4, -105, 49, 108, 78, 126, -64, -85, 47, 114, 66, 151, -148, 201, -81, 16, 21, -131, -74, -157, -5, 27, 146, 81, 18, -10, 2, -36, 108, 228, 49, 33, -202, 107, 56, 17, 44, 25, 91, 103, -11, -12, 24, -73, -66, 12, 18, 41, 162, -7, 57, -10, -203, -58, 39, 87, 3, -29, 52, 30, -67, -12, 35, -163, -51, 89, 87, 68, -97, 43, -23, 43, -33, 42, 122, 9, -51, -67, -123, 101, -33, -39, -15, 58, -37, -6, -16, 86, 38, 62, 230, 20, -10, -72, -194, -63, -89, -100, 77, -44, 66, 0, -94, -39, 50, 6, -30, 96, 0, -36, -58, 25, -207, -60, 127, 103, -64, 76, -24, -190, -70, 30, -85, -154, 39, -55, -25, 201, -215, -85, -114, -16, -109, 32, -42, 123, 167, 49, 128, -186, -102, 31, 25, 1, 13, 115, -56, -16, 49, 87, 145, 95, -69, -48, -179, -36, -51, 128, -118, -56, -178, -43, 63, 9, -55, 37, -61, -64, 181, -117, 5, -124, 105, 93, 69, 35, 17, -88, 45, -20, 58, -71, -94, 77, -50, 29, 45, -9, 4, 31, -5, -2, 110, 12, 154, 227, -54, 62, -74, -8, -150, 29, 0, 129, 55, 55, -3]
7338cj06j1J75j41R2j07J38q6M9r5P2P5M1j48p0J08M5j07n8J70L0mj20o2nJ39
7364A1j54K46o4J12n2L2j65r4R4Q4k71K90o3L8p6k24K38k1N5O6k28J24N8qp5P7
7390C0q9p4J24O6p6J78R2l41Q3L0N3j00l0J07m8K11m5k04P6k4r2m4r0Q4P3L1J23
7417A04k88L70j14k8J73l80J57K4Qj51k0J19N4j14N4K8m9P6M9Pl7j2K7o6R3q6
7443bRq2N3j42Q5J08J2k6O8j93Q4P8L1j23R4L9rq6j7M0%j09o8K58L0l20J05J25
7471D2j21R8NJ4q0PL5Q0n9j82M1K5q2J11J22k0n1j14P1O2l9j95K64j00l4M2N9
7498AJ81j82qJ16j27j8j49K97j1l28K26O7J3j80J33J57j56J15j80j36J22k3J66
7521I6j23j4J14q1J4L7J03n4j9J1m9%j20J08j5N0P7q2j51N5M0J7j35l7K78j07
$$ y = [-3, -109, -120, 55, -86, 6, -101, 37, -49, 0, -95, -23, 52, 93, -55, -125, -17, 28, -79, -137, 33, 63, 59, -61, -123, -128, 11, -143, 103, 39, 151, 99, 131, -34, -128, -34, 50, -221, 69, 6, 44, -32, -256, -18, -39, 16, 82, -146, -22, 36, 28, -47, 30, -59, -133, -9, 57, -19, 159, 251, -90, -7, 23, 76, -24, -54, 53, 5, 216, 171, -33, 43, 19, -73, -117, -207, -123, -50, -19, 104, -184, 186, 72, 44, 217, -163, -6, 18, 26, -125, -145, -26, 28, -86, -32, -4, -53, 23, 72, 79, 42, 30, 57, -9, 84, -2, 7, -75, -22, -164, -79, 29, 41, 15, 83, -110, -26, 52, 83, -40, 54, 93, 84, -2, -19, 21, 21, -88, -156, 102, 132, -188, -83, 42, -79, 19, 24, 38, -42, -35, 0, 80, 21, -161, -120, -95, -177, -66, 56, 36, -15, -129, -58, 4, -35, -230, 34, -66, -100, -58, 1, 182, 0, -8, 108, -19, -37, -186, 111, 100, -228, -2, 65, 78, -102, 31, 188, 32, 147, -33, -169, -47, -70, 96, -27, -41, 73, -8, 6, 43, 146, 92, 73, 84, 35, 35, -85, 23, 8, 58, 135, 53, -98, -43, -3, 14, -121, -158, 120, 13]
7547A3J9jj22J14m1M0N1P2k11JJ09j77J67JL2Q2p9P6j00r4J07r2J15m1j03l6J21
7574B3n5r1P3K36j70J65k04m6J02K03j04j79J7N3R2l00K00q0J7m7Q1O2j19n9N5
7599g5K01n7l0M5m8J6j09J34j22M3J33l10J66N5K1j24J14o1k02K72o8K2j00J5
7623f9J66k34P8J8o9K0m0J40l5K80k61o4R6%r5Q3J13Q6o7l66L15j21O1q8J5n8
7649i6O0M1P4k2O2q0j6K6n5m2O8j60K26j35r7o4K65M5n1l9L3j55J2K91k30j5J36
7676H2j61n4jQ4M9O0j01J85j92m5nJ50j82J94n6n8J06N6Lq7J24p2J50j77K2j20
7702d6J15o8O1r8jj32J28J13q8O1m6LN5l8O6j43k3J92n5j10m5O6k03K14J0o6J12
7729C4Q4m3j51N2KJ74j41R2p0j30J49J34k86J93o3J53q7j46J38k51K16J3q6r1
$$ y = [13, 32, 31, -91, 23, -18, 22, 73, 145, -66, -65, 44, -133, 34, 35, 67, 149, 70, 146, 46, -48, 59, -33, 82, 41, -62, -98, 23, -32, -123, -50, 186, 16, 181, -23, -69, 33, 236, 132, -47, -30, 23, 115, -185, 15, -65, -48, -95, -14, 48, -71, -130, -75, 126, 69, 39, 84, 36, 52, -57, 77, -45, -2, 131, -179, -13, 42, 63, -61, 53, -8, -210, 62, -6, 16, -84, -69, 97, -137, -59, -41, -110, -90, -130, 10, -25, 255, -6, -70, 26, 26, -69, 14, 127, 213, 146, -220, 95, -26, 35, -53, -38, -96, -36, 5, 79, 57, 119, 39, 23, 49, -6, -48, 20, -140, 86, -49, -146, -210, 55, 100, 49, 10, 43, -112, -100, 191, -39, -54, 82, -79, -133, -134, -50, -1, 59, -42, 143, -49, -94, -99, 51, -131, 63, 7, -51, 55, 111, 114, 27, 151, 79, 229, 52, 74, -46, 69, 1, 62, -36, -37, -169, -41, 72, -16, 45, -1, 2, 57, 19, 85, -58, -81, 111, 56, -54, -99, -33, -236, -22, -12, -78, 34, 118, 75, -76, -24, -22, 152, 11, 103, 33, -97, 52, 186, -100, 93, 30, 183, 96, -50, 88, -163, 53, 66, -20, -111]
7753a11Q4L8J15k36K31m5R1l15O5J51j7K16k49J03j21K0n2lj40J41p3J24K1j34
7777i6J64K05m46j9L24k86K13j01M1J10Pj34M1j69J21JK9J09j27J5p2J68k53J09
7801d6J24L1j07J68k02J28r8k16K11n2P0j8j06K19k02QL7j56J27J65j17P9p8K2
7825ij5o6m6K07k2p2kj6m1k5L16j73p1p3K50j49L2p6N9o6j5K16j30o2J72j00j37
7852a14K17j13J20r0N0j37J60j15J8l9K56k09j43J2J59m9l0M7r0K04j11j04J43
7875D2j59K65j62J5q2Q4J50k20Q5r3N9o9J89j04o3M7R5o3N7j13k63J38K46j36
7899e5O8j01J92j63%j1J21J11j86P8N9q2n4J68l2r9Jj5p4O3K9oN0l13K41J00Q
7926I8o8j09L7m2R1j23K05l8j23Q9k0j3j49K08RJ66k15N7n2q0L16k62J1Q8m7n0
$$ y = [-111, -27, 11, 126, -110, 121, 76, 167, -148, -83, 68, 51, 267, 18, 121, 0, 20, -32, -35, -175, -34, -107, 17, 38, -96, 68, 273, -173, -192, 132, -154, 59, -42, -1, 109, 116, -18, 23, -146, -25, -24, 5, 114, -13, 2, -70, 98, -155, -46, 78, 109, 2, 170, -32, 96, -2, -218, -7, -59, 11, -7, -113, 106, -96, -88, -51, -207, -80, 85, -32, 47, -31, -9, -24, -90, -136, 71, 49, -23, -25, -41, -82, -107, 209, 36, -35, -108, 142, -7, 25, -51, 8, -58, -73, 143, 13, -49, 123, 23, -114, 103, -10, 110, 20, 70, -67, 93, -22, -4, -43, 213, 4, -139, -127, 32, -17, -47, 0, -90, 114, 3, -101, 42, -117, 148, -14, 1, -81, 3, 153, -67, 18, -75, -16, -85, 104, 0, -63, -16, 79, 16, 73, -40, -303, -165, 81, -55, 13, -88, 104, -59, -59, -70, 51, 162, -24, 54, 113, 31, -23, 145, 113, 14, 15, 0, -74, -11, 18, 12, 62, -251, -10, 90, 98, 30, -79, -42, -84, 7, -116, 89, 51, -72, 17, -3, -16, -165, 43, 52, 218, 3, 60, 8, -72, 244, -18, -7, 81, 34, -16]
7952a6R3Q8k23j3K17j07m5L9l3j35J88j84J27J23o5K02j73k04j05K13O8J47n8
7975A44k15J92j57j4MR9n8P1J44k08J60p6j43qN5J67j9j32m5K55k92K31k62J19
7999A2k8q1Q5O2j71P8K15k18R1j69L30j38q8r6q3L23k73K76k92O2J12j86J18O
8023e3Q0j46J29p2Q5K6l7o0m1Q6j6o9p9M1J61L6j47O4J09j40L2j39J72O2o8j1
8049EK7M3q0j00mJ7q8J35l4K15k4k29O5K2m2J25j4K0N9j82J9k03K08J15j73q5
8075a83L53j28l3j07N3J02R2j36m6oJ86j59Q9p4O1rJj27o0K60j37R6j54J30q8
8100b4l0R1k3r7J73j14L0J61o8j41n0J06j3j04O0j3L0J41m8L1p8oK4k23P0K06
8126I1j15P2j11j38K38MO3k63J64J21j24l7L8N0o3m6j39M88k93k2q7J41O0r8K12
$$ y = [-16, 77, 165, -58, -71, 146, 39, -6, 33, 0, -135, 53, -131, -4, 119, 54, 256, 83, -121, -226, -13, 55, 202, 144, -71, 121, -36, -50, -46, 53, -5, 66, 210, 2, 162, 86, -57, -65, -10, 157, 138, 6, -39, 216, -76, 155, -107, 12, -16, -97, -12, 50, -121, -43, 172, -46, 45, -124, 206, 68, -20, -116, -199, 124, -149, 127, -165, -103, 9, -177, -59, -53, 27, -119, 10, -62, 23, 49, 12, -48, -89, -3, -19, -88, -167, -126, 35, 71, -76, -12, 97, -43, -11, -150, 22, 84, 16, 5, 32, 75, -5, -105, -109, -92, -180, -45, -79, 136, 112, -117, -52, -30, -72, 53, 39, 59, 118, -64, -45, -248, -40, 75, -98, -183, 170, 42, 9, -98, -45, 57, 149, 13, -33, -39, 147, -12, 77, 3, 64, 55, 56, -71, -131, 129, -8, 88, -66, 64, -24, -54, 37, 14, -83, 90, -24, 6, 167, 99, -42, -92, 14, 1, -103, -43, -56, -26, 115, 67, 98, 20, 14, 38, -185, -115, 91, -24, 48, -63, -201, 37, 41, 104, -159, 5, 126, 2, -35, 3, 53, -10, -56, -195, 293, 0, -22, -109, 32, 92, -6, 206]
8151B06k61J15Pj24K11j93j1J29k40R7J52j94J25q8J68j56K85k65N9O5J4j38n3
8174i0m5K9J17N3o5L3m7j16K77j73J60n4q8l9J53k10O8
$$ y = [206, -55, 60, 67, -57, 154, -39, -50, 79, -161, -64, 88, -106, 19, -69, 99, -57, 228, -37, 22, 87, 101, -37, -90, -135, -106, 11, 64, -1, 32, -15, -131, 146, -27, 133, 79, -9, -48, 105, -105, -37]
8191c7
$$ Imaginary data points
##PAGE= N=2
##DATA TABLE= (X++(I..I)), XYDATA
0@%%%%%%%%%%%j6L2l2L2l2M8o4P6r2J12j28J44j76K08k41K80l27L84m34M92n71
32c05O43p23Q19r27J045j170J308j459J626j807K003k221K457k714K996l303L643
49A911m014M418m869N368n922O544p241Q035q946J0000j1245J2733j4551J6837
63I058j9805K3840k9683L8942n5943R7583l92755p37547J97079M93124O60738
74B84631L51275J7129l07178l26757k14875m106N1979J4818r2651o4306O8054
85b21987K61729L17156K06776o4287l16039m30546l01239k2755K62175L64722
95E5705K69508N7838j08431j64873j16596n0630j7195l8790o2138l4815O9579
106a40838J82318K08970R8481q4814k18586k13676q6514P1686J55916J22348Q028
$$ y = [0, 0, 0, 0, 0, 0, 0, 0, 0, 0, 0, 0, -16, 16, -16, 16, -16, 32, -32, 44, -48, 64, -64, 80, -96, 112, -129, 151, -176, 208, -226, 266, -305, 338, -385, 434, -493, 552, -618, 690, -769, 857, -950, 1053, -1168, 1289, -1425, 1571, -1732, 1911, -2103, 2315, -2554, 2814, -3108, 3436, -3805, 4230, -4716, 5284, -5961, 6772, -7779, 9058, -10747, 13093, -16590, 22352, -33591, 63992, -328763, -1066310, -869231, -376107, 284631, 635906, 653035, 345857, 19100, -195775, -199881, -147902, -133084, -225735, -290041, -221987, 39742, 356898, 563674, 499387, 183348, -247198, -548437, -571192, -309017, 55705, 325213, 383051, 274620, 109747, -6849, -57479, -74674, -113464, -175602, -210417, -140838, 41480, 250450, 348931, 264117, 45531, -168145, -254659, -182973, -27057, 95291, 103319]
117A03319q6646q0828K2222J25446J26294P110j45686k15266j47173K0617J83664
128h6927K37830J44690l8779j85963j92882o3807R4652J58015Q4157o1830j64112
139g4956j38823Q188J77753K41725J38781p3567k48576k65758j18639Q8632K22872
150d2368K13715Q5752o8023j48341j16260j5557O1036N5268j4413p1975n8896
161a20062K0037J04302J29793P1408m1705j40128j56344p7116M4111J25477J19528
172G9301M5901l3980o8324m6918j65K8792J4728l0488o0532l6438L3648R4926
184B0451R3289K2853o5369j09004q0031j276P3597R2825M3835l5686q3406o1885
196h9807J1052P5009Q0205K5208m8263q8783o9021k808O4737Q4947M2635k8691
$$ y = [103319, 16673, -64155, -41933, 83513, 209807, 216917, 71231, -144035, -291208, -270591, -86927, 150903, 295593, 256814, 70851, -122031, -185838, -91186, 66829, 150986, 89156, -74956, -213779, -205591, -27838, 213887, 352668, 279101, 30525, -235233, -353872, -265240, -42368, 171347, 257099, 189076, 40735, -75525, -91082, -30046, 25222, 10809, -61166, -120062, -100025, 4277, 134070, 205478, 163773, 23645, -132699, -209815, -165704, -40227, 79301, 125202, 91222, 22898, -24020, -24185, 4607, 19335, -11153, -71685, -108123, -74475, 20451, 113740, 136593, 71224, -37780, -117811, -119087, -45490, 47335, 91170, 55484, -27922, -89807, -78755, -3746, 76459, 101667, 53404, -35379, -104400, -107208, -42471, 42476, 85111, 56420]
208E6420p1479n2214J0354O3676O4911J1629n8337r5349o7581J3965R5329J19146
220I0470O6050k7936r8343j02844n0277J8692O1275N8960K5585p801j5100L746
232B2477K1230R577k9797o4388o2338j7314M5635Q9493Q8119L8568l3229q6180
244B1853q8415m2257J7575N2211M8961K4058J562m837K726Q420q55k7835n3794
257d0627n0443q253M9225Q2394O7538J4664m2855p2671o1629j9817K5769M7566
269i139L4724N316j3228q822P171J3589J323j9593l4642l0516n680L0086N3235
282B3824M4618N897l6719n2956l5361k75K9136L6116K1053o770k5656k1211K272
295a6032K3328K0506l020k4166k6038p729J5264K7993K3059J844k1707k9813j4762
$$ y = [56420, -15059, -67273, -56919, 6757, 71668, 83297, 24960, -70389, -137970, -124005, -28676, 90470, 156520, 128584, 30241, -72603, -122880, -104188, -42913, 16047, 41632, 33831, 18731, 22477, 43707, 53284, 23487, -40901, -103239, -120553, -74918, 14575, 102694, 141262, 108033, 21853, -66562, -108819, -91244, -39033, 9928, 33986, 35548, 30711, 33437, 41857, 41002, 13167, -40627, -91070, -99323, -50098, 32296, 99834, 114498, 71643, -1028, -62657, -82474, -56705, -9139, 25585, 30901, 17673, 8851, 16022, 29611, 30934, 11341, -23301, -53817, -59497, -29411, 23824, 68442, 74339, 37620, -15336, -50697, -50972, -21836, 14280, 35333, 28563, 2907, -18304, -16032, 7296, 27802, 24782, 616, -25422, -33151, -17887, 10106, 33165, 35009, 13302, -16511, -31273]
308c1273J2028K6339J8175l275j9188j9930p550J0022K2799K0574J591k0719k8588
321a8995j3785R767K3877J9931L878j1171j8638j3097K414J5942J5523j463j7669
334c486j7029N9J7204K0908R871p609k1153k3246r883J2006K6007K0756J400j4883
348A0922j6851q082J642O498O487J814n294p201Q39J2409J5377L398j2962k0669
362a1673j5559j997J2826K1907J9463M284j4892k2162j3101K831J1059Q103J305
375B394k641j365J742N410O171J33j0849j6901r071O410J7580J6195O317m526
389A6999j2292j4625r409K196J1990J1999L319m811n281j363J406J426r0k118
403f54n318m505K003J0402J1930K984r116j3494q582L62P067J0190Q107J035o750
$$ y = [-31273, -19245, 7094, 25269, 21994, 2806, -17124, -24674, -14652, 8147, 28721, 30312, 9593, -18995, -32780, -23013, 864, 20795, 24673, 13502, -5136, -18233, -15819, 123, 15646, 14183, -3486, -20515, -20456, -3252, 17656, 27527, 19918, -1235, -24481, -34364, -22358, 3649, 24405, 25805, 10922, -5929, -14011, -12369, -5871, 616, 2430, -2864, -10065, -9226, 3183, 18560, 21958, 8996, -11673, -27232, -29229, -16403, 5504, 24967, 29251, 14359, -7803, -20904, -18073, -7014, 1089, 2394, -247, -1612, 130, 5540, 11711, 11844, 995, -15906, -24977, -18567, -987, 15208, 21525, 16999, 4707, -9918, -19327, -17131, -5141, 6858, 10177, 5366, 85, -1278, 128, 1554, 1464, -654, -5972, -10477, -8474, 1928, 13858, 16842, 7726, -5768, -14350, -13988, -6921, 3269, 11376, 12411, 5661]
418E661q668l872L259L952Q3k683j040K280L463L277K499J05n191r056o317J537
434a0711P733Q482M222K57l280n546n234r89L269K973j777m199n93N211P344M191
450A1353p91m750p581p312l162L147P064N814K277P13J099K61k860n566n591l427
466i312j576Q47N208R332Q790L864k505p350r434r417o415l5P273J0782R857O711
482A6620L710j995r602j5280j3802n786M639J2407J5187J3027N704l859j0873
495A0097j2348r334n764k632J789Q076J3006J2830Q023O16o840j4178j7897j4230
509b8786l255R912J8149J8793J2788K328r426j6887j6214q730K33N104O579P400
523b012Q777Q042M611o14n999j1016j4272j2028m056P535J5405J7236J3217M836
$$ y = [5661, -3007, -6879, -3620, 332, 415, -2268, -3308, -1028, 2435, 5712, 8211, 8316, 3125, -5931, -12248, -10711, -2978, 5504, 9726, 9983, 6703, 1157, -4077, -5066, -1797, 1176, -601, -4800, -5393, -182, 7162, 11353, 10562, 5812, -1769, -9081, -12243, -9096, -2032, 3782, 6059, 6772, 7871, 8132, 5272, -294, -5885, -9312, -10888, -10041, -4833, 4499, 13289, 17153, 14648, 7298, -2136, -11553, -17968, -18003, -10730, 52, 9909, 16620, 20330, 18335, 8733, -6547, -20349, -26135, -21496, -9089, 6098, 19125, 24829, 20970, 10097, -2251, -11585, -17349, -19981, -18192, -10116, 2890, 15720, 23743, 24359, 17519, 3341, -14556, -28786, -32041, -22129, -3980, 14813, 27601, 29929, 20503, 3616, -12598, -21328, -21095, -15991, -9412, -2012, 6765, 14807, 19418, 18804, 12805, 1789, -12483, -24511, -28567, -21032, -5627, 11609, 24826, 29662]
537B9662n511j5601j9603j4105k611P622J2763J2228R158M128j614n674o254n644
551a056o240p431n318Q89Q296J3070J4028J1028K994r565k0960k3094j3373K599
565c4133J6458K2650J9126Q441n785j5902j6318q909o37J937J200J675M091P265
579A159J0191J0667O433m379j7967k5099j9059k959J4954K6269K6632J5927l046
592C9723k0355k6844j8757l866O901J1558J0717Q373N375K255J209K14l231j0831
606B441j6498j4639m266Q401J9110K3342J9377N988j2430k6906k7618j6061Q18
619c8941J5034K2300K1388J1609k072j2571j4378r674m359k208j086P49K707N744
633e758J0065J4699J2890J878j5168k6739k5605j2220P240K4455L1589K3677L774
$$ y = [29662, 24151, 8550, -11053, -25158, -27769, -20147, -7384, 4844, 14002, 18130, 16516, 10842, 4588, -1056, -7296, -14727, -20045, -19156, -10860, 2210, 16238, 27266, 30260, 20695, -265, -23359, -36732, -34133, -17675, 4975, 24101, 32542, 26757, 10855, -5463, -14372, -15009, -13072, -11872, -10197, -6106, 1159, 11350, 22017, 28450, 24071, 6104, -18995, -38054, -41013, -26059, 210, 26842, 42769, 39723, 19368, -7476, -26233, -30099, -23198, -11640, -923, 7450, 12825, 15080, 16289, 16503, 13272, 2441, -14057, -28696, -32962, -24561, -5451, 17891, 37268, 43256, 30826, 3920, -23698, -39759, -38941, -23907, -1607, 19781, 31390, 29318, 16747, 2369, -7305, -11664, -13872, -14958, -14209, -11502, -5758, 4307, 19006, 31896, 33774, 18606, -8133, -33738, -45958, -38718, -14263, 17326, 41003, 44777]
646D4777j6882k6214k0583p671L585R825Q916N506J579J044N369R708O313n728
660A9544j8479k3334j6513j338J6390K8856K8385J3486q272k4755k6827j7433
672c0290l527P668J4961J5232J0308L221o92j597l129o702j1134j2072p861p52
686b6366Q092J6877K0833J6332K266j4313k4129k3908j4518L94J5519K4813K2778
699B4670J0854m857j5140j7787j3527o274K224P597Q352N422L255M960O176M340
713B0265l848j2327j7198j4686m586R912K1704K3193J2810m631j7882k0789j4409
726b2472l223P403J3423J2167N117k067m636k469J87m5k626n294n328l589J501
741a1951Q270J1793Q812M86p765j0983q671l482J714N850P095N039Q62j886k023
$$ y = [44777, 27895, 1681, -18902, -26573, -22988, -13163, -4247, 1259, 2838, 3882, 9251, 18959, 25272, 19544, 1065, -22269, -38782, -40120, -23730, 5126, 33511, 46997, 38725, 13970, -12857, -30290, -33817, -26149, -11188, 4044, 14352, 17573, 16881, 15284, 12155, 5453, -5681, -17753, -25614, -26366, -18274, -1397, 19436, 35768, 38034, 23721, -408, -24316, -38834, -38440, -22921, 1892, 24670, 35524, 30667, 15527, -2260, -15787, -22061, -19837, -12240, -3888, 1534, 4789, 9749, 15925, 20265, 16417, 4090, -13108, -27794, -32380, -22468, -764, 22429, 35239, 30608, 12726, -8063, -22472, -25695, -18292, -4869, 7298, 12415, 10348, 5712, 3243, 3430, 3385, 759, -4535, -9863, -13452, -11951, -3681, 8112, 16924, 17410, 9645, -1338, -10009, -13491, -11777, -5927, 1168, 6207, 7069, 5183, 3160]
756C160j050j029j458j424q84j578j661k69K991O295O113K360k022n968q114p152
772a1690k614L841Q539Q700M850M31l667o693o664l506K53L280K984J336J586
787I66K673L600J782j916n118o969o356k315M232R366R174M362j778n939p288
802a524n883k820J096M570N152L532J495J45o67k203l587k933j718k89Q09K769
818b056L949L967J150k536l834k670j626n53O28J694K376J378L31J66K28q29j650
835A13j984l03Q77K50m93J6J720J696R51J41n99j177k619k393j055J351K723K365
853A580J726J247j44k441l392k580o4O73J055J660K785K636J87j518k426k597
869a613k456j404P62L432M029K326n47j447j559k429k563j711J141K529K526J864
$$ y = [3160, 2110, 1081, -377, -1801, -2685, -4263, -5924, -6193, -3202, 3093, 9206, 11566, 9544, 3576, -4538, -11690, -14304, -10463, -1924, 6776, 11626, 12057, 8390, 1697, -4967, -8473, -8220, -4940, -1956, -620, 966, 3639, 7239, 9021, 7105, 1987, -4982, -11338, -13653, -9421, -55, 9119, 13481, 11703, 5764, -1524, -7407, -10227, -9131, -4561, 591, 4123, 5618, 5763, 5096, 2893, -694, -3627, -5345, -5634, -4825, -2056, 1893, 5860, 7010, 4474, 640, -2030, -3656, -4209, -3581, -1887, 489, 1867, 2198, 2364, 2592, 1763, 113, -1871, -2174, -1297, -1047, -1540, -1524, 196, 1892, 2843, 2984, 2385, 1208, -1411, -3804, -4859, -3508, -785, 1580, 3306, 4553, 4409, 1968, -1424, -4004, -4068, -3395, -2340, -680, 2105, 4741, 4928, 3410, 984, -1613, -4069, -5473, -4711, -1279, 2750, 5076, 4529, 3082, 1523, -906, -3469, -5180, -4039, -1510, 1016, 2880]
885B880J394K87k076l465k878l85J103J134J834K409K372j75k609l301j624j25
901c225K27J188K409K585N44j317j569j475j119j377k56K069K806J524n13j218
917A283p15j048j394p19O52J959Q31L81J45N29p60j676j704R5J510P59K99N12
935I39Q21o6j387j350k31M47L18O8P58J086N3j173j120L56P66l77o88j98J232
954B54O13l31m57J60k5p32n15K84J262L67o77k99N47J10q06r13N49J240J60o31
974A60q96M65M18j28j18N13L51p85j168nJ236Q10q3o27M0K30k40p07j43M23L20
995F6l31k27Q67R86j66r51n87n07k43p21M98J771J693M1j191r77o77j45o39j16
1015a556O48J028N05O24P22O52j277k489j928p6J421J582J640J055J48q91j795
$$ y = [2880, 4274, 4561, 2485, -980, -3858, -4243, -3140, -2006, -172, 2237, 4609, 4434, 1825, -1476, -3100, -3225, -2998, -1810, 599, 3184, 3728, 2411, 842, -633, -1752, -3129, -3385, -1316, 1490, 3014, 2501, 1283, 568, -480, -1874, -2593, -1941, 18, 849, 1230, 1375, 1904, 1144, -532, -2236, -2141, -631, 128, 427, 939, 1760, 1694, 307, -1043, -1274, -827, -509, -441, 317, 1403, 1456, 283, -837, -481, 285, -92, -780, -978, 254, 867, 536, 79, 239, 214, -518, -1033, -749, 513, 880, 203, -96, 451, 561, -245, -1158, -609, 631, 791, 160, -736, -271, 147, 19, -99, 414, 765, -20, -1188, -1193, 43, 853, 770, 143, 183, 413, 173, -534, -677, -254, 66, -265, -492, 375, 1361, 1195, 244, -343, -850, -1093, -1814, -1316, 455, 2148, 2189, 998, 21, -656, -801, -1440, -1556, -908, 120, 625, 1249, 1971, 2623, 1346, -1143, -3071, -3147, -1726, -144, 1496, 2551, 2699, 1808, 13]
1032A3j471k26L60J73j90O30J397J244J98Q2m12j567k338j706L73K299K370J278
1050B507L02o29j103j241j087m8p4n41k12R42K527K086N94j572k348k159j205
1067c261j10J317K180J272q7l80L78Q59J87j572j978k269j459N55K902M213L580
1084F327L02l396m564l218n34J704K233K433O66l54r38L49J600N65j811l654k763
1101e053r11J902L894M394K835m19l644m675k911p77J270J964K454K344R49l53
1117C263j130p88j018k000j863o58J265K287J780J266O74M09p68j561k204j997
1133c043j973p43K061M570N175K146k060m821m809k843L22L191M004K564j020
1148B721k576j534J374K600J630j251l569m916k870J100O169Q144M355k046o969
$$ y = [13, -1458, -1684, -1324, -1151, -1341, -711, 686, 1930, 2128, 2210, 1798, 231, -2107, -3813, -3440, -1141, 1229, 2507, 2809, 2180, 1077, -164, -1251, -1299, -1373, -1914, -2126, -1184, 1343, 3429, 4023, 2451, 103, -2056, -3261, -3371, -2054, 126, 1398, 1311, 931, 1309, 2168, 2355, 783, -1195, -3464, -4923, -4368, -1466, 2747, 6327, 6629, 3233, -1331, -4549, -5083, -3379, -1146, 1287, 1953, 1599, 661, 1010, 2610, 3175, 1364, -2290, -5053, -5964, -4062, -168, 4226, 7061, 6642, 2998, -1677, -4588, -5365, -4095, -2131, 323, 2667, 3616, 3263, 2133, 1345, 327, -1673, -3536, -4194, -2929, -642, 1138, 2404, 3078, 3487, 2719, 1158, -1046, -3043, -5016, -5759, -3698, 872, 6047, 8193, 6133, 1312, -3497, -6340, -6018, -2827, 1177, 3741, 2721, 145, -1389, -15, 2585, 4215, 2964, -605, -5521, -8391, -7291, -1122, 7022, 11377, 9331, 2362]
1163B362p364m088P03M641O166L618q64l936k930K8K730J576o67k730l034j978
1179e767O34M265N746L433r72m884n208l504q97J945L755M304K947p68k000k095
1195I34j733j849j217R12J719J920P67n53j16L52O55L44k73j154l185l763j091
1212g331L624O584N624J037l567o645o465k585K660O631O288J439l608m939k464
1227c717J341L250L192J74l907n831l488K376P558P591K897l640p539p659l531
1242a0933K382P157P065K143k829m794k523O8J544J817R3j468k805j253J728M161
1258A553L670O89k379l596l114k026L94J863L233K474O68k81m29j218k548k591
1274c638r98J374K982K291R03m96j664j853l51J684K202k62l005l841q94K271
$$ y = [2362, -5002, -9090, -8387, -3746, 2420, 6038, 5174, 1238, -1692, -1664, 1066, 2642, 1975, -755, -3789, -5767, -5133, -868, 4878, 8311, 7339, 2455, -2753, -6257, -7154, -5209, -1454, 2850, 5797, 5029, 3029, 934, -799, -2648, -3865, -2953, -1234, 686, 1453, 900, 784, 1136, 1791, 2135, 1862, 708, -2477, -6240, -7331, -3707, 2877, 8501, 9538, 5971, -674, -7139, -9724, -7064, -433, 5855, 7294, 3686, -1253, -3717, -2376, 874, 4066, 4240, 333, -5498, -8986, -6610, 948, 8539, 11436, 7796, 257, -7402, -10933, -8551, -1394, 5671, 7814, 4985, 191, -2332, -2264, -720, 1097, 1190, -278, -3083, -4336, -2608, 1553, 5223, 5912, 3533, -63, -3177, -5203, -4809, -2946, 287, 2761, 3429, 3148, 2719, 1501, -1047, -3638, -4636, -3262, -280, 2011, 2914, 2418, 754, -1099, -1450, 234, 2436, 2174, -831, -4672, -5566, -3295]
1290c295M939M546J833k364o340n838j922L185O135M322M52k988l718k234R81
1305b306L159K756k37m001m544j370L240N814M504P32l500o105m785q47L570N383
1321A463L105j94k929k125o04O91J229K56j208k134j001J222L363K833M20k190
1337B197l323j920k5J307J875J269j82j010p55J266J389J40j606k765j472N79
1353c036K166L194J483o92k920k795o48K194K985P40j330k745j385K99K546K760
1369B816J238j215l784k981l82K626L189J887n31k543k096q47J585K738J374j225
1385A849l278k466M23K714L517J829j173l148l417j183J383L663K465l79k528
1400B71k263j7J643J855P47q32k418k026l31K672L128J542j341k984k443m32J205
$$ y = [-3295, 1644, 6190, 8023, 5659, -681, -6519, -8441, -5256, 879, 5201, 5653, 2665, -1053, -3287, -2306, 853, 3609, 3372, -629, -5173, -6543, -3303, 2511, 7015, 7747, 4247, -1858, -6643, -7490, -3920, 1463, 4568, 4374, 1445, -680, -1284, -593, 636, 892, -316, -2450, -3451, -2229, 1134, 3967, 4387, 2197, -1126, -3046, -3071, -1764, 111, 1380, 1198, 188, -567, 699, 2088, 2228, 622, -2143, -3615, -3036, -870, 2324, 3807, 3115, 195, -2600, -3248, -1054, 1931, 2671, 1341, -1404, -2789, -2490, 56, 2816, 4054, 2839, -945, -3926, -4308, -1682, 1507, 3394, 2863, 320, -1776, -2623, -1038, 1700, 3074, 1849, -1429, -3895, -3472, -758, 2759, 4588, 3415, 267, -3150, -4333, -2950, 713, 3178, 2799, 271, -1992, -2009, -366, 1489, 2236, 1404, -1014, -3040, -3371, -699, 2429, 3971, 2630, -354, -2797, -3229, -2024]
1417b024K620J972k88j963k127m64J798K302O45j351k069j478K06J616K345J133
1433B873r98k716j777L42K094K030M28j291j925j225Q3J846K353P76j664k508
1449a279j626Q33K204J617L88r94j935j568L43K168K308M03k255k570j014R27
1465b050K369J934Q11j289k785k131J37K827K474N26j710k156j060L56J405K032
1481A690O08j181k446j328O11K379J883M1j494j874j126J38J646K261Q84j331
1497A361k298j385P96J654J402J86j280j147q80J67J496J906J7j697k099m71J390
1514h82J772Q80l4j404j690q14O42K074J443o8j549j561l64O45J292R34O2r38
1532D40j602o04R69J701J264q91j490j325k45O61J522J594m8j318k095q54J227
$$ y = [-2024, 596, 2568, 2280, 317, -1810, -2274, -476, 1826, 2471, 1120, -949, -2427, -2221, -605, 1740, 2873, 1875, -841, -2618, -2276, -182, 1848, 2276, 985, -940, -2165, -2082, -236, 2117, 2893, 1229, -1279, -2905, -2072, 132, 1749, 2137, 1143, -792, -2360, -2017, 151, 2459, 2862, 607, -1963, -2977, -2050, 319, 2253, 3064, 1775, -1010, -3141, -3004, -177, 2297, 2823, 1113, -1043, -2103, -1747, -342, 1690, 2298, 1117, -1329, -2657, -2046, 333, 2216, 2257, 763, -1111, -2237, -2099, -453, 1808, 2692, 1361, -937, -2322, -1526, 128, 1530, 1716, 436, -711, -1591, -1424, 72, 1978, 1995, 298, -1801, -2272, -882, 890, 1770, 1736, 332, -1358, -2172, -1530, 544, 1987, 1919, 370, -1191, -1555, -910, 382, 1316, 1378, 440, -1162, -1766, -797, 904, 2168, 1277, -213, -1538, -1783, -1122, 400, 1994, 1946, 628, -1467, -2321, -1094]
1549a094J722R06l68r39j103m85N36J301J079j08j601j496n5J495R45Q23l10r04
1567C44j361p85P98J442J184j59j388j124k86O29R25P70L24q65j156o60O16J015
1585B63P38m29p41l99J5N74K63L85L7j019j007M7R70J195K73m16p61m85l78L66
1605e09L09L83Q7m08l43L58O37N55n37p95p12k70L90Q07J189N43o59j167j053
1624a195n7P49N59M54k42r8k87k29L70M71K37n07q59l44J95Q60M36K21l9l78o89
1645c72m45K15M38M46j60k08L38K7j40q1K21o3l22m16j2K96L53qp3m4J09K77k65
1668A11o8l36k98k01K71N29P70M51m49l72n14n04m51K5P85N93L50l19m4o8Mm30
1690a65l46J03J20j08qL45P03M56k54m14n69n34m17p7M50J086R87N4k76q58q23
$$ y = [-1094, 628, 1534, 1166, 227, -876, -1361, -825, 476, 1555, 1447, -154, -1650, -1705, -210, 735, 1558, 1248, 344, -1017, -1802, -1004, 438, 1622, 1463, 75, -1049, -1335, -706, 219, 989, 1313, 448, -708, -1368, -752, 263, 1001, 572, -169, -568, -553, 21, 284, 669, 706, -313, -1320, -1273, -303, 892, 1165, 749, -12, -497, -875, -509, -200, 183, 270, -138, -481, -123, 514, 1069, 532, -263, -975, -1245, -855, -48, 1141, 1684, 1025, -142, -1195, -1252, -503, 56, 510, 268, 170, -117, -346, 24, 495, 732, 225, -634, -978, -783, 77, 513, 734, 695, 317, -372, -817, -602, -164, 282, 122, -86, 252, 279, 139, 58, 279, 216, -106, -522, -534, -238, 115, 107, 34, -10, 99, 376, 111, 43, -293, -591, -792, -521, 8, 778, 1229, 780, 408, -106, -610, -1061, -1036, -251, 342, 692, 373, 329, 261, 265, -165, -511, -408, -288, -396, -404, -59, 644, 1100, 846, 432, -137, -671, -1088, -1165, -715, 371, 1358, 1412, 1136, 278, -545]
1711e45m80j97P67Q80K23R8r43j04J08L64P1K36j58o14n74k02P20Q96Q09k07p32
1732D16m45n38p01K92P18J006J78n95l25j32j78R4N67J59j91n99m98k75N14J027
1752D94N07L51r8r28j292r14K17J221J363Q27k75n25j229j105j8P58J156L93m03
1771E00o85m03J10N05O06P42k45j401j445j53Q24J560J419K46n89j489j640q35
1789b373O17J818J360K36q18r42o63k24M32Q28R56k21j271j006J23N48J125N86
1807A111K29j83j101j254l60N06J147O08L46j62k98p92o86M2P70R04j48m19p15
1826d55j72J17K30Q66Q78j84p41j697p83K22J091J424J273Q8j204j632j409K11
1844a877J373J182M55q1r04p43l99O39R58N73k41j144j099j37O73J267R73O71
$$ y = [-545, -1025, -1222, -455, 425, 648, 746, -197, -301, -193, 171, 242, 478, 320, -294, -868, -1070, -350, 546, 1355, 1148, 416, -29, -567, -1268, -976, -258, 748, 926, 331, 6, -126, -304, -210, 357, 516, 325, -274, -772, -1047, -533, 494, 1001, 1352, 1254, 326, -966, -1880, -1663, -442, 921, 1748, 1473, 948, -281, -1386, -1404, -646, 510, 903, 500, -185, -588, -478, 27, 633, 1375, 1130, -271, -1716, -1869, -1045, 515, 1934, 2180, 1591, 102, -1538, -2373, -1756, 62, 1422, 1658, 840, -102, -765, -989, -557, 271, 1227, 1006, -265, -1271, -1148, -600, 525, 1111, 1340, 1157, 56, -1198, -1558, -1052, 95, 703, 1049, 887, 589, -203, -889, -847, -77, 827, 679, 260, -455, -627, -510, -280, 586, 1464, 1280, 539, -1158, -1941, -1719, -628, 796, 2069, 2157, 953, -679, -2088, -1877, -504, 678, 1133, 1052, 148, -595, -994, -355, 603, 1176, 935, -209, -1308, -1445, -772, 495, 1468, 2139]
1862B139r86j454j518M9J043J172P96m6p16p46m78j07Q97M32J47m48o01n9J20
1881c64L42L00J42L92m96n88l62N9J62M11R3J42K93N1k62n88k08K43J45Q7J84
1902A78J30k69o25J79M39P44J77p42o32o50QM32J181Q81L17j073j453o52J76J030
1922b24Q99K48j98o72q22R3O05P00K89p27q53l60K3P97J015N17k76j009j101k25
1942a281N76J032N17ro35n29l69K53N22L97q1n60m69J65K39N46K10j69j04n52
1962c01J0K00J54M15l73m41q9N0Q13K70j60k24n55l78K56L22N05J28k12q82R6
1983c96M19N51l7l21o40k54k17M35J134N45k27j104o47m17M39P23O55J47l84n92
2003a88n29K76P42L74j38p64n40J53K42N72Q70k08l99j122o36N94Q44N83J36m28
$$ y = [2139, 1153, -301, -1819, -1770, -727, 445, 1241, 1195, 479, -267, -745, -852, 45, 477, 624, 176, -425, -484, -364, -22, 278, 420, 812, 316, -272, -634, -575, -413, -2, 91, 233, 526, 577, 315, -273, -481, -238, -93, -6, 178, 308, 39, -586, -407, 32, 776, 953, 211, -421, -1071, -1063, -631, 550, 1431, 1748, 675, -778, -1430, -1254, -224, 675, 923, 725, 53, -769, -676, -71, 629, 918, 191, -662, -1022, -999, -202, 813, 1330, 1054, 45, -1056, -1281, -705, 327, 844, 835, 200, -329, -698, -445, 77, 474, 393, -167, -636, -471, -232, 314, 524, 355, 251, -301, -291, -91, 63, 478, 105, -336, -425, -375, 438, 708, 548, 324, -231, -609, -353, -31, 474, 602, 390, -492, -396, 23, 574, 537, 216, -424, -678, -895, -460, 674, 1219, 992, -112, -759, -1176, -737, -14, 641, 788, 404, -188, -717, -441, 301, 675, 537, -227, -767, -614, -372, 200, 1070, 862, 463, -659, -1295, -701, 143, 726, 862, 434]
2023D34o26l39j28M87M91M03l17p53k57K57M86L43l0l51j86k69n9M92O96l14m96
2044c6n73J95J59O63K9J15m60m22m14l4Q88M48L9n60l25Q2K60M32P8k52m33n66
2066f87j83Q55P70J64k96p41l12m40M85N54N32O0n87p33J01K51N29K80k81l49
2086b8j50l17J1R25M24l59n14o65j65O19M11K61J54m30o24k40K37O63L88j20n52
2107g1k14j61L86K35L13k99k59k83k78N22P47J12n00o22n0K3J55O47L73j69o15
2128hm99R5K90N01J53j96l29p1l38K03N06J40k28n54j70p6Q56J18J35k66m74m03
2150f15j59N76O25L14m04l80n08J82L28L43K05l88m86k67K83L62O10K87p71m62
2170c25l48R7Q77K19K03l04o55l99n8N85O57J15l76m64l13q7L46M77M01l26m52
$$ y = [434, -192, -531, -659, -172, 319, 722, 405, -348, -605, -348, 138, 481, 451, 100, -86, -355, -414, 78, 774, 460, -36, -609, -414, -255, 408, 437, 552, 92, -330, -744, -778, 110, 558, 597, 37, -288, -206, 54, 486, 564, 312, -121, -687, -870, -15, 755, 919, 623, -118, -430, -870, -385, 169, 701, 761, 174, -559, -458, -207, 322, 602, 321, -28, -178, -495, -484, 441, 865, 506, -8, -673, -838, -219, 192, 453, 607, 177, -447, -687, -450, 213, 601, 481, -71, -285, -446, -60, 175, 488, 189, -70, -353, -631, -109, 638, 750, 250, -372, -422, -399, -244, 403, 776, 607, -8, -507, -412, -122, 379, 532, 336, 7, -64, -402, -199, 307, 447, 219, -335, -505, -581, 275, 393, 528, 262, -212, -615, -774, -198, 427, 741, 337, -43, -551, -369, -41, 302, 507, 119, -367, -634, -351, 11, 621, 908, 137, -325, -673, -576, 301, 520, 723, 419, -236, -635, -693, -108, 549, 664, 288, -176, -489, -576, -230, 247, 648, 322, -130]
2191a30k79k5M52K71J76k36m53l72J63M03L06M50k82o51l91J42L20L41J69j45
2211B29k15l41Q8L27K05p4l39l76J5O12L48m6J17m59o10l2rO43N16J31p22k45
2233b37j65K33K88K34N2n27m01k13M33N47M65L9o87l91m65L72M90M71Q6j12p77
2254b65l53J71O80O9K11k46m82j27J04K31L05R2p1n91p5M36k02M13j65l51p2o
2276b94J75M20J64l8l25o43J39J30L44J95j59p8mk29J68L46Q3k34n78j12K57K16
2298e7M68J05n7k54p76k64K69O72M26Ll32k02m43L14q6L40J65r7l91k97N32k2
2320A6J73r2o4J85l12p0l6J98K32l74K30K1j15K00m53R2K08J36k74K10j36J50
2342A25j79j77J67L05o1j45j54j48j25K24P3M01L46k05l27o89n2J17N76J83m1
$$ y = [-130, -409, -434, 18, 289, 465, 229, -224, -596, -433, -30, 276, 726, 444, -207, -598, -456, -136, 205, 374, 229, 14, -327, -239, 88, 293, 219, -120, -496, -481, 131, 479, 433, 550, 91, -519, -551, -560, 83, 599, 730, 8, -237, -402, -169, 119, 353, 405, -122, -523, -736, -303, 244, 709, 748, 61, -330, -795, -423, 67, 538, 624, 512, -265, -618, -447, 233, 302, 513, 267, -215, -342, -238, -7, 298, 390, 319, -272, -347, 89, -113, 300, 135, -216, -288, -294, -119, 301, 465, 427, 102, -541, -402, -272, 72, 267, 108, 30, 26, -203, -35, 311, 394, 160, -418, -530, -273, -57, 411, 516, 459, 205, -571, -835, -566, 106, 532, 535, 203, 1, -442, -128, -214, 126, 291, 194, -197, -494, 38, 16, 189, 97, 33, 218, -94, -164, -200, -2, 230, -144, 86, 107, -8, 192, -261, -169, 39, 175, -99, 111, -25, 125, -54, -231, -64, 241, 180, 35, -119, -267, -392, -168, -95, 306, 652, 447, 120, -569, -621, -504, 72, 255, 214]
2363B14K28l52k42j34K80K15p0j14k23R2n2M4J88M20K08o01m76k62J87K97K49
2384I6K88J16k10m25n13J37K83M03J51j06l7j64k76r0K66M51M0k20l56l43J25
2405c84J80K68K55L05l71o66j86K06L68L04o2m8j52l97KK05M02K12r0k87j16k95
2427c47N9J44K65L47j6k10l49k00k6K31jL84N8j1l28j64j76K63P7K4L7k6j27n0
2451a42j30L02L99k67J4k08j23j63O6J35N14K37m04m02k22j53J08L48N09q0l2
2472C06n42k09L7N10K09K33j17n93l04O0L37M48J69k53l4n53j03J46L08K39M8
2493C42j48m92j70J90N23K27k02l19j47l88L34N5K66K39k4m21LMR5j55K6R2k5
2516i5L35p2k41J93j09l99K76j56K95J81J79n60r9N9P4L52M0k5m05j41j57N63
$$ y = [214, 442, 90, -152, -286, -6, 209, 139, 25, -198, -106, -158, -114, 74, 494, 702, 101, -375, -637, -450, -153, 96, 384, 500, 290, -135, -648, -511, -228, 175, 326, 220, 183, 19, -257, -347, -81, 370, 410, 190, -166, -509, -384, -204, 64, 319, 624, 253, -413, -599, -393, -25, 279, 217, 169, 17, -380, -378, -173, 229, 441, 351, 64, -52, -347, -288, -144, 121, 468, 452, 242, -107, -307, -333, -102, -103, 281, 339, 328, 0, -164, -340, -77, 0, 24, 61, 35, -92, -142, -272, 30, 429, 162, 176, -32, -155, -318, -252, -117, 397, 634, 230, -172, -394, -547, -439, -91, 418, 338, 306, -236, -445, -408, 102, 311, 544, 427, -166, -470, -410, -73, 375, 544, 291, 257, -296, -399, -253, 55, 294, 342, 194, -298, -468, -278, 245, 472, 270, -49, -196, -584, -250, -195, 71, 310, 286, -135, -132, -128, -33, -188, -162, -70, -95, 240, 168, -73, 120, 11, -388, -112, -268, 27, 208, 387, -173, -272, -213, -139, 213, 253, 228, -177, -318, -475, 88]
2538H8K51L98l67o22j54J61k8M32K36J60l05n72k52L46K30L07L7k05k73m13K36
2559c09K47K67K89l02l96j05p0N15J91p5n6k89l16N8M17K80J7l03k17p2J49L0
2581e0J62M7O7j52j55Q2J66Q9l03k44J5J65K01R0R1jl67l65M8L79L39J4l02j62
2605a46j07j45M06J87J51k92j61k42R6K60L92o0j77m36j26j50L30N62J98l9o20
2626a19k23p0K79K02K50Oj37l33j98%L37J32J6l53J17j1RM19j86L5j25k76m0K47
2650b2L01J5k95k45J06pq9L32KO2m01R4J6K71P0j97j43q2rJ71L7M16j68j45l68
2675b78k22K43K67L05k2r5k69k77J16J96K98j4L3n53j61K23K46K66M3Rn20l9j34
2698c39N14k7L07k29m54K7%K53J59l8Jj14j64k02K86Q8J41k96j33q8K82K8K03
$$ y = [88, 339, 737, 370, -252, -406, -245, -273, 159, 395, 555, 250, -322, -574, -228, 2, 309, 346, 141, -132, -545, -309, -62, 205, 494, 192, -204, -309, -379, 136, 327, 252, 196, -93, -409, -351, 66, 346, 363, 60, -157, -229, -80, -50, 112, 159, 226, 74, -81, 1, 167, 256, -47, -291, -276, -111, 90, 180, 271, 270, -97, -462, -414, -35, 304, 318, 16, -146, -253, -398, 8, 195, 346, 54, -107, -349, -253, 7, 399, 339, 162, -274, -400, -550, -220, 342, 540, 501, -119, -342, -412, -133, 69, 319, 325, 188, -145, -343, -343, -6, 126, 142, -211, -94, -105, -96, 323, 137, 172, 47, -229, -269, -22, 279, 294, -1, -246, -140, -147, -236, 96, 98, 160, -241, -147, -131, 140, 210, 13, -130, -212, -221, -50, -13, 403, 235, 90, -278, -500, -257, 10, 315, 293, 198, -71, -348, -232, -36, 262, 248, 281, -272, -433, -210, 36, 302, 345, 354, -166, -205, -339, 175, 148, 455, 226, -228, -201, -201, 52, 211, 173, 174, 60, -104, -306, -20, 68, 209, -87, -220, -308, -26, 2, 205]
2721B05%l04j89kJ02L58J78ml39j66j11k2M09mJ40l03n0j4R1J41Q9j05R4l94k8
2746b28J50K95j0O0k84j35j28j3L73J63k04K10m25L3j58K21M14j58l10o3O0J41
2768DR7p4J15k05m3r7M3M39L0j73j62K9q9J22J40M1R2k76l02p7L68J74j26R1k41
2793h0k6J9N4N2K93j43k14n5j12K81K9J57J5j65j17k73J85K31j45J47j92m7j67
2816b73L02o2P7n4P1r6N2K6N1K80l20j33l23K22J71J49j9J05l48j06n8M05L1o8
2840H2m8k26J38L4P1J18L4j18j76j79J37J48J70J69m87J05j33K51k48L07J13j02
2862A60k24j09jk2J93J5N9P3o6m7K4M4o8j3j31r8K38J6p9O4N0n1L3j50o3K06j21
2889f8K02k44J6K07M5k94K13j23j96L07ln3N5J76k64j44q6J56J08L6J99k30k05
$$ y = [205, 205, -99, -288, -290, -188, 170, 348, 344, 5, -161, -272, -294, 115, 111, 251, -52, -102, -116, -25, 116, 205, 100, 194, -200, -228, -78, 217, 207, 267, -17, -152, -280, -293, 80, 243, 39, 249, -176, -143, -301, -80, 334, 176, -134, -197, -137, 4, 101, 27, 142, -63, -106, -203, -160, 279, 309, 136, -26, 3, -86, 36, 176, 217, 309, 33, -269, -346, 22, 196, 70, 161, -80, -106, -87, -33, 19, 312, 169, -45, -100, -212, 69, 98, 255, 270, 105, -12, -285, -100, 131, -14, 133, -59, -106, -273, 29, -33, 44, -10, 61, -35, 17, 43, 94, 374, 54, -79, -402, -180, -9, 140, 121, 226, -122, -228, -286, 119, 150, 82, 34, -192, -54, -20, 51, 169, 203, 85, -91, -270, -133, 15, 185, 354, -133, -28, -161, 90, -158, 149, 262, 160, -64, -173, -174, -196, -3, 12, 71, 144, 78, 31, 55, 99, 31, 18, -113, -211, 27, 43, -36, 28, 78, 27, 60, -90, -153, 53, -68, 134, -110, -94, 113, 158, -136, 77, -46, -242, 65, 62, 9, 64, 240, -24, -168, -254, -98, 10, 46, 245, 15, -190]
2912a90k02J44K99Q8J05q6j68k21J95R0j89K91r4j47k2r9J08KQ8J15k5j75j27
2935b20j5M37k4j17q8R3k29n3O7R0J87j7J01o5j79q0J68j84P7K9J02P3j25J98
2959B26k97O8p7K94k83P8j44j19K39R8p4P2k92J74m0j3M6J69j06N5j12p0q4K8
2983a64J75j4M28l34j33M8j61R2QN8J28L0p1r9q6J61j21K37j3j88Q8k9j87K31
3007H4p9J44l6l5j8k2k3l22L37J26Ml0j38j62J49N5j3n8nqJ2j85o2L53p5J45K
3034A40j52MrO1K2Q8p9Q9k22J44m4j01J25m8J21l9k26k0K54q7K22j00j89O0j07
3059i3r2J40O1J05m0O9m8k70K18j84J53J46J16j37j49L2k90O4J45Q0J9O6j78j05
3083a72l2K20j42J33lM1j04j19J14P4K37p8l37j15K30j9R0m3J61Kj47L5l38M01
$$ y = [-190, -392, -248, 51, 139, 244, 158, -10, -231, -36, 54, -135, 156, 62, -85, -107, -206, -98, -96, -8, 107, 82, -93, -220, -235, 202, 178, 61, -27, 66, -163, -216, -149, -59, 128, 111, 212, 147, -32, -112, 56, -128, -51, -22, 80, 153, 28, 226, -71, -3, -80, 214, -69, 9, -135, -254, -15, 83, 9, 81, -211, -37, -77, -90, -44, 125, 19, 74, -38, -108, -192, -164, 11, -3, 425, 91, -42, 6, -155, -63, -55, 3, 131, 161, 90, -9, -95, 66, -55, 182, 169, -19, 69, 40, -147, 84, 5, 149, 113, 78, 60, 38, 15, -307, 30, 156, 160, 130, -8, -170, -21, 34, 21, -37, -42, -50, -38, -223, -285, 68, -7, 138, 140, -12, -8, -17, 44, 66, 154, 75, 164, -58, 86, 42, -59, 66, 18, 139, 100, -126, -146, 108, 21, 243, 143, -46, 14, -93, -185, -45, 16, 121, 81, 150, 102, -168, 50, -134, 19, 165, 281, 144, -5, 27, -263, -199, -54, 26, 45, 111, -67, -172, -204, 16, -126, 7, 4, 45, -59, -178, -64, 10, 247, 169, -168, -283, -53, -72, 18, -25, 136, 138, -9, 26, -312, 89]
3107H9K6R9Nk98m9M3L8k2L0J44l5q4O9j05Q1o3J33Jr3j07K22k17K51j84R6j03
3133c3k1o9J08j02J25o7o5K16J01j55M0qp6j19K4K15q0jj51qNr0L32M3j25L2j7
3160E4LM3j27J15j0L2l4j16j42K92J30k21R1m9j80J66r8N5J20j41Lj23K9J41R0
3185A23j27J14l77J80J01k56K75k6J4L8PL2L0lm0k79J32J66j48J40j75J57m9j63
3209a34k7K82j35L0K37j16r2j5j25K85r3L4k13O6J27k25M22k37P0k24j58J22n9
3232a78J98J13j7l21N1j14K82o1P6J1Mp5j04L34k15M0O1k20Q1j18J35M4O4K8j59
3257f0j7L2q4p8L33Kj33q5M9J69j14L2q8k42J15L60k85L20r8j11Mk82N1Q4L95
$$ y = [89, 115, 214, 219, -79, -128, -85, -47, -69, -39, 105, 70, -14, 55, -50, 31, -32, 101, 102, 9, -98, 124, -93, 158, -26, 70, -33, -54, -123, -15, -117, 8, -59, -124, 92, 193, 38, 78, 70, -6, -125, -101, 114, 34, 33, -118, -126, -121, -211, 121, 164, 39, 71, 54, 57, 100, -27, 88, 78, 110, 76, -40, -182, 110, 240, 19, 110, 61, -119, 47, -51, 4, 124, -17, -14, -137, -108, 33, 123, -4, 110, -267, -87, 14, -242, 33, 7, 21, 59, 66, 98, 128, 125, 85, -194, -62, 104, -44, 96, -79, 78, 29, -134, -161, 121, -14, 16, 253, 137, 45, 30, -95, 190, 97, 131, -82, -16, 111, -114, 308, 71, 141, -83, -241, -119, -178, 20, 133, 116, -205, -154, -268, 14, -47, 29, 40, 44, -31, -135, 199, -16, 24, 85, -135, -54, -172, -37, 7, 71, 99, -60, -77, -45, -129, -207, 126, 128, -5, -90, -41, 128, 14, 46, -42, -284, -169, 191, -94, 226, 128, 17, 21, -261, -210, -126, 269]
$$ [...]
8191d4
##END NTUPLES=NMR FID
##END=
