##TITLE=1H ikalashn
2D
18.10.2024
##JCAMPDX= 6.0         $$ Bruker NMR JCAMP-DX V2.0
##DATA TYPE= NMR FID
##DATA CLASS= NTUPLES
##ORIGIN= UXNMR, Bruker Analytische Messtechnik GmbH
##OWNER= root
$$ TOPSPIN		Version 1.3
$$ 2024-10-18 15:14:48.968 +0400  Irina@DPX200
$$ Compression mode = diff/dup
##.OBSERVE FREQUENCY= 200.13100065
##.OBSERVE NUCLEUS= ^1H
##.DELAY= (6, 6)
##.ACQUISITION MODE= SIMULTANEOUS
##.ACQUISITION SCHEME= undefined
##.AVERAGES= 16
##.DIGITISER RES= 18
##SPECTROMETER/DATA SYSTEM= spect
##.PULSE SEQUENCE= zg
##.SOLVENT NAME= CDCl3
##.SHIFT REFERENCE= INTERNAL, CDCl3, 1, 15.99637
##AUDIT TRAIL= $$ (NUMBER, WHEN, WHO, WHERE, WHAT)
$$ ##TITLE= Audit trail, TOPSPIN		Version 1.3
$$ ##JCAMPDX= 5.01
$$ ##ORIGIN= Bruker BioSpin GmbH
$$ ##OWNER= Irina
$$ $$ F:/spectra/data/iren/nmr/1H/4/audita.txt
$$ ##AUDIT TRAIL=  $$ (NUMBER, WHEN, WHO, WHERE, VERSION, WHAT)
(   1,<2024-10-18 15:14:09.953 +0400>,<Irina>,<DPX200>,<TOPSPIN 1.3>,
      <created by zg
	started at 2024-10-18 15:13:01.734 +0400,
	POWCHK disabled, PULCHK disabled
       configuration hash MD5:
       BE 6D 3F 07 2A EA 11 49 91 17 2B D3 AF B3 58 0D
       data hash MD5: 16K
       6C 37 4C CF 4D A4 32 61 FD 7C B6 76 A0 0D CB CF>)
$$ ##END=
$$ 
$$ $$ hash MD5
$$ $$ 11 69 B5 0D 4D A3 B1 E9 E1 0C 93 D8 42 FF 64 64
##$RELAX= 
##$RELAX= 
##$RELAX= 
##$RELAX= 
##$RELAX= 
##$RELAX= 
##$RELAX= 
##$RELAX= 
##$RELAX= 
$$ Bruker specific parameters
$$ --------------------------
##$DU= <F:/spectra>
##$EXPNO= 4
##$NAME= <1H>
##$PROCNO= 1
##$TYPE= <nmr>
##$USER= <iren>
##$AMP= (0..31)
100 100 100 100 100 100 100 100 100 100 100 100 100 100 100 100 100 100 
100 100 100 100 100 100 100 100 100 100 100 100 100 100 
##$ANAVPT= -1
##$AQSEQ= 0
##$AQ_mod= 1
##$AUNM= <au_zg>
##$AUTOPOS= <>
##$BF1= 200.13
##$BF2= 200.13
##$BF3= 200.13
##$BF4= 200.13
##$BF5= 200.13
##$BF6= 200.13
##$BF7= 200.13
##$BF8= 200.13
##$BYTORDA= 1
##$CFDGTYP= 0
##$CFRGTYP= 5
##$CHEMSTR= <none>
##$CNST= (0..63)
1 1 145 1 1 1 1 1 1 1 1 1 1 1 1 1 1 1 1 1 1 1 1 1 1 1 1 1 1 1 1 1 1 1 
1 1 1 1 1 1 1 1 1 1 1 1 1 1 1 1 1 1 1 1 1 1 1 1 1 1 1 1 1 1 
##$CPDPRG= <>
##$CPDPRG1= <>
##$CPDPRG2= <>
##$CPDPRG3= <>
##$CPDPRG4= <mlev>
##$CPDPRG5= <mlev>
##$CPDPRG6= <mlev>
##$CPDPRG7= <mlev>
##$CPDPRG8= <mlev>
##$CPDPRGB= <>
##$CPDPRGT= <>
##$D= (0..63)
0 2 0 0 0 0 0 0 0 0.06 0 0.03 0 0 0 0 0.0002 0 0 0 0 0 0 0 0 0 0 0 0 0 
0 0 0 0 0 0 0 0 0 0 0 0 0 0 0 0 0 0 0 0 0 0 0 0 0 0 0 0 0 0 0 0 0 0 
##$DATE= 1729250046
##$DBL= (0..7)
120 120 120 120 120 120 120 120 
##$DBP= (0..7)
150 150 150 150 150 150 150 150 
##$DBP07= 0
##$DBPNAM0= <>
##$DBPNAM1= <>
##$DBPNAM2= <>
##$DBPNAM3= <>
##$DBPNAM4= <>
##$DBPNAM5= <>
##$DBPNAM6= <>
##$DBPNAM7= <>
##$DBPOAL= (0..7)
0.5 0.5 0.5 0.5 0.5 0.5 0.5 0.5 
##$DBPOFFS= (0..7)
0 0 0 0 0 0 0 0 
##$DE= 6
##$DECBNUC= <off>
##$DECIM= 32
##$DECNUC= <off>
##$DECSTAT= 4
##$DIGMOD= 1
##$DIGTYP= 9
##$DL= (0..7)
0 120 120 120 120 120 120 120 
##$DP= (0..7)
150 150 150 150 150 150 150 150 
##$DP07= 0
##$DPNAME0= <>
$$ [...]
##$SW= 21.9926370048069
##$SWIBOX= (0..15)
0 0 2 0 0 0 0 0 0 0 0 0 0 0 0 0 
##$SW_h= 4401.40845070422
##$TD= 16384
##$TD0= 1
##$TE= 300
##$TE2= 300
##$TE3= 300
##$TEG= 300
##$TL= (0..7)
0 120 120 120 120 120 120 120 
##$TP= (0..7)
150 150 150 150 150 150 150 150 
##$TP07= 0
##$TPNAME0= <>
##$TPNAME1= <>
##$TPNAME2= <>
##$TPNAME3= <>
##$TPNAME4= <>
##$TPNAME5= <>
##$TPNAME6= <>
##$TPNAME7= <>
##$TPOAL= (0..7)
0.5 0.5 0.5 0.5 0.5 0.5 0.5 0.5 
##$TPOFFS= (0..7)
0 0 0 0 0 0 0 0 
##$TUNHIN= 0
##$TUNHOUT= 0
##$TUNXOUT= 0
##$USERA1= <user>
##$USERA2= <user>
##$USERA3= <user>
##$USERA4= <user>
##$USERA5= <user>
##$V9= 5
##$VALIST= <valist>
##$VCLIST= <CCCCCCCCCCCCCCC>
##$VD= 0
##$VDLIST= <DDDDDDDDDDDDDDD>
##$VPLIST= <PPPPPPPPPPPPPPP>
##$VTLIST= <TTTTTTTTTTTTTTT>
##$WBST= 1024
##$WBSW= 25
##$XGAIN= (0..3)
0 0 0 0 
##$XL= 0
##$YL= 0
##$YMAX_a= 560519
##$YMIN_a= -914234
##$ZGOPTNS= <>
##$ZL1= 120
##$ZL2= 120
##$ZL3= 120
##$ZL4= 120
##$ABSF1= 10
##$ABSF2= 0
##$ABSG= 5
##$ABSL= 3
##$ALPHA= 0
##$AQORDER= 0
##$ASSFAC= 0
##$ASSFACI= 0
##$ASSFACX= 0
##$ASSWID= 0
##$AUNMP= <proc_1d>
##$AXLEFT= 0
##$AXRIGHT= 0
##$AXTYPE= 0
##$AXUNIT= <>
##$AZFE= 0.1
##$AZFW= 0.1
##$BCFW= 1
##$BC_mod= 2
##$BYTORDP= 1
##$COROFFS= 0
##$CY= 7568.61572265625
##$DATMOD= 1
##$DC= 2
##$DFILT= <>
##$DTYPP= 0
##$F1P= 17.9538593292236
##$F2P= -4.03888763876832
##$FCOR= 0.5
##$FTSIZE= 32768
##$FT_mod= 4
##$GAMMA= 1
##$GB= 1
##$INTBC= 1
##$INTSCL= 1
##$ISEN= 128
##$LB= 0.02
##$LEV0= 0
##$LPBIN= 0
##$MAXI= 945.577
##$MC2= 0
##$MEAN= 0
##$ME_mod= 0
##$MI= -402.1523
##$NCOEF= 0
##$NC_proc= 0
##$NLEV= 6
##$NOISF1= 8.587773
##$NOISF2= 6.764455
##$NSP= 1
##$NTH_PI= 0
##$NZP= 0
##$OFFSET= 15.99637
##$PC= 1
##$PHC0= -38.88924
##$PHC1= 3.950947
##$PH_mod= 0
##$PKNL= yes
##$PPARMOD= 0
##$PPDIAG= 0
##$PPIPTYP= 0
##$PPMPNUM= 100
##$PPRESOL= 1
##$PSCAL= 0
##$PSIGN= 0
##$REVERSE= no
##$SF= 200.13
##$SI= 32768
##$SIGF1= 18.5376
##$SIGF2= -6.396296
##$SINO= 400
##$SIOLD= 32768
##$SREGLST= <1H.CDCl3>
##$SSB= 3
##$STSI= 0
##$STSR= 0
##$SW_p= 4401.40845070422
##$SYMM= 0
##$S_DEV= 0
##$TDeff= 0
##$TDoff= 0
##$TI= <>
##$TILT= no
##$TM1= 0
##$TM2= 0
##$TOPLEV= 0
##$USERP1= <user>
##$USERP2= <user>
##$USERP3= <user>
##$USERP4= <user>
##$USERP5= <user>
##$WDW= 1
##$XDIM= 8192
##$YMAX_p= 0
##$YMIN_p= 0
$$ End of Bruker specific parameters
$$ ---------------------------------
##NTUPLES= NMR FID
##VAR_NAME=  TIME,          FID/REAL,        FID/IMAG
##SYMBOL=    X,             R,               I
##VAR_TYPE=  INDEPENDENT,   DEPENDENT,       DEPENDENT
##VAR_FORM=  AFFN,          ASDF,            ASDF
##VAR_DIM=   8192,          8192,            8192
##UNITS=     SECONDS,       ARBITRARY UNITS, ARBITRARY UNITS
##FACTOR=    0.0002272,     1,               1
##FIRST=     0,             0,               0
##LAST=      1.8609952,     -191,            -64
##MIN=       0,             -914234,         -914234
##MAX=       1.8609952,     560519,          560519
$$ Real data points
##PAGE= N=1
##DATA TABLE= (X++(R..R)), XYDATA
0@%%%%%%%%%%%J6l2L2l2M8o4O5q1J12j28J44j76K08k41K89l38L87m50N15n95O89
$$ 0 0 0 0 0 0 0 0 0 0 0 0 16 -16 16 -16 32 -32 33 -48 64 -64 80 -96 112 -129 160 -178 209 -241 274 -321 368
32C68p84Q81r94J123j261J413j582J768j969K192k432K695k983L296l643M020
$$ 368 -416 465 -529 594 -667 746 -836 932 -1037 1155 -1277 1418 -1565 1731 -1912 2108
48B108m429M880n376N921o528P201p951Q792r748J0842j2102J3580j5340J7478
$$ 2108 -2321 2559 -2817 3104 -3424 3777 -4174 4618 -5130 5712 -6390 7190 -8150 9328
62I328k0140K3562k8144L4648m4682O2344j02668L63233K8354p28613k97930q294
$$ 9328 -10812 12750 -15394 19254 -25428 36916 -65752 297481 325835 -402778 -700708 -709002
74g09002L88793L93043K91124P235j15274j58473l8501J084j5452j45364j85322
$$ -709002 -320209 72834 363958 371193 255919 97446 58945 60029 44577 -100787 -286109
85b86109j23586Q7317K68838L51352K26002j3460k73546l69475k76431l7827J66283
$$ -286109 -409695 -322378 -53540 297812 523814 510354 236808 -132667 -409098 -446925 -280642
96b80642K47041J77629O1655l2802n2781l5861j7818m7994j01168j25726n8951
$$ -280642 -33601 144028 205683 172881 120100 84239 66421 18427 -82741 -208467 -267418
107b67418P5094J92069J96330Q1520p7125j72054j54168m5943O8641J09859N0533
$$ -267418 -192324 -255 196075 277595 200470 28416 -125752 -171695 -103054 6805 57338
118E7338n0594r8583m1051P8129J56922J22613p844j47195k01560j33489J9458
$$ 57338 6744 -91839 -132890 -54761 102161 224774 216930 69735 -131825 -265314 -245856
129b45856J61678J96920J01389n3862j50911j22354o69J10991J24751K8956j07015
$$ -245856 -84178 112742 214131 160269 9358 -112996 -113665 -2674 122077 151033 44018
140D4018j79658j22671L9607J98760K35910J17824p7282k18440k20758r6575O5097
$$ 44018 -135640 -258311 -218704 -19944 215966 333790 256508 38068 -182690 -279265 -214168
151b14168J65105J54025N5678n0682q8231m4025K5049M8672M859o4439r5756n6495
$$ -214168 -49063 104962 160640 109958 21727 -22298 2751 51423 56282 -8157 -103913 -160408
163a60408L4054J18238J39694P6597l6924j28357j38076o6585L0021Q7322P9606
$$ -160408 -126354 -8116 131578 208175 171251 42894 -95182 -161767 -131746 -44424 35182
174C5182K8989j9689l3081q957K3952K8783r372o1510p7495l2276M4864R7484
$$ 35182 64171 44482 11401 2444 26396 55179 45807 -15703 -93198 -125474 -80610 16874
186A6874Q4279J6600n8770r0602o0298J0582O9344P1902J5998n3839q0586m3132
$$ 16874 101153 117753 58983 -31619 -91917 -81335 -11991 59911 75909 22070 -58516 -101648
198a01648K8012P9988P7801K4133m4033q2184o3991m624N2612O2400K1541l2285
$$ -101648 -73636 6352 84153 108286 64253 -17931 -81922 -86546 -33934 28466 50007 17722
210A7722n2454k1670L4278P1161N6991m121p6366j07997p1243J6402R6845J17048
$$ 17722 -34732 -56402 -22124 49037 106028 101907 25541 -82456 -153699 -137297 -40452 76596
222G6596O8174j2819p2848q3260m9146j294K9265K8020Q234j917J2416L8158M4865
$$ 76596 144770 131951 59103 -24157 -73303 -74597 -45332 -17312 -9078 -10995 1421 39579 84444
235H4444J4473l8032p8742p9514l6636K9328Q2655R3228N3622j2443o3200p0399
$$ 84444 98917 60885 -17857 -97371 -134007 -104679 -22024 71204 124826 112383 49183 -21216
247b1216m0506j816K0339K0529J0474N225J3029K7480L1511J0388l2553o6928
$$ -21216 -61722 -63538 -43199 -22670 -12196 -6971 6058 33538 65049 75437 42884 -24044
259b4044o4217k0149L7255P1412O5180K4838k3208n3071m8531j7884J5622K6363
$$ -24044 -88261 -108410 -71155 257 65437 90275 67067 13996 -34535 -52419 -36797 -10434
271a0434J2420o261r152M586K0400K3647R260j5791l7734m0125j6300K2187M7653
$$ -10434 1986 -4275 -13427 -8841 11559 35206 44466 28675 -9059 -49184 -65484 -43297 4356
284D356M1545R314k3718l6751k5969j640K0584K5670J0240j3967k5277j1677J4012
$$ 4356 45901 55215 31497 -5254 -31223 -32863 -12279 13391 23631 9664 -15613 -27290 -13278
297a3278K8770J9210m717k4045k6471j2238R553K5204K3136L497j8618k2959p674
$$ -13278 15492 34702 29985 5940 -20531 -32769 -23216 1988 25124 28621 10003 -12956 -20630
310b0630J2463J9901J0661n501j8006j8740p860J1801K5998K1815O65k1493k6541
$$ -20630 -8167 11734 22395 16894 -1112 -19852 -27712 -15911 10087 31902 32567 11074 -15467
323a5467j2718O420J8153J7400O552q221j6278j0918N133J6595J0263o862j8465
$$ -15467 -28185 -21765 -3612 13788 20340 12119 -4159 -15077 -9944 6651 16914 10052 -8413
336h413j4046J539J5668K0056J2406m150k0170k3921j0524J0694K1995J5770J326
$$ -8413 -22459 -20920 -5252 14804 27210 23060 2890 -21031 -31555 -20861 1134 16904 18230
349A8230q960j0860o908jN460O790m49r066q634K211J4601J4924M865q414j6666
$$ 18230 9270 -1590 -8498 -8499 -3039 3751 3302 -5764 -14398 -12187 2414 17338 22203 13789 -2877
364b877j6367p158P677J9780J8693M126j2172j5579p340L018O702L758n33m021
$$ -2877 -19244 -26402 -18725 1055 19748 23874 11702 -3877 -11217 -8199 -1497 2261 1728 -2293
378b293m046J152R002J1151K637j0331j6047r205K214J0418J2075Q476J255p803
$$ -2293 -6339 -5187 3815 14966 17603 7272 -8775 -17980 -15766 -5348 6727 15203 16458 8655
392H655j2532q160K477Q241O308m27l662k778J53K485M125K972k815r292q501
$$ 8655 -3877 -12037 -9560 -1319 4989 4562 900 -1878 -1725 760 4885 7857 5042 -4250 -12751
407a2751L29J0373J1375M210m529q656p770l415K173P417O653Q47m787m298P44
$$ -12751 -12422 -2049 9326 13536 9007 351 -7419 -10834 -8661 -1244 5409 6256 1469 -2829 -2085
422b085M123J112k373m273l071j179J763N689P819M130l350q424p659k406J769
$$ -2085 2038 3150 777 -3496 -6567 -7746 -5983 -294 7525 11655 8305 -119 -7778 -10184 -8415
437h415M022N191M184J144k935k178J053K133j483o565o603j086M988Q088P964
$$ -8415 -4393 798 4982 6126 3191 1013 2066 4199 2716 -3849 -10452 -11538 -6550 1538 9502
452I502M602r39p034r481o663o14K782L017L249N090N358K673j467l759m968o141
$$ 9502 14104 13165 6131 -3350 -10013 -10627 -7845 -4828 -1579 3511 8869 11542 10075 6316 1348 -4793
468d793o210l293K280P506R316P055L891n96n685r962r719n439m24L675O465J0202
$$ -4793 -11003 -14296 -12016 -4510 4806 11861 15752 15156 9471 -491 -10210 -15649 -16073 -12398 -5933 4269
484D269J1105O527k202j0529j3636j1640n766J816R137J2035R931M818j19k195
$$ 4269 15374 21901 19699 9170 -4466 -16106 -21872 -20056 -10919 1116 11047 15865 15746 13551
498A3551n085q387j0964r039k518M401J0587J4494J4645P835l740j5232j9728
$$ 13551 8466 79 -10885 -19924 -22442 -18041 -7454 7040 21685 29520 25780 10548 -9180
511i180j6007o274N533J4792J8923J4258L917n957j0537r737q014o564m053O85
$$ -9180 -25187 -31461 -25928 -11136 7787 22045 25962 20005 9468 -269 -8283 -14847 -18900 -18215
525a8215N933J0134J1935J1145N987l255j3632j8927j5591o651M121J3971K0228
$$ -18215 -12282 -2148 9787 20932 26919 23664 10032 -8895 -24486 -31137 -27016 -13045 7183
538G183J8375Q000o375j6444j8181j2190l995M032R431J0894P872L413P25L80
$$ 7183 25558 33558 27183 10739 -7442 -19632 -23627 -19595 -10164 730 8602 12015 12740 13120
552A3120o59m504r109j0574q409l322M004J3193J9508J7074M759j1436k1108k1658
$$ 13120 12461 7957 -1152 -11726 -20135 -23457 -19453 -6260 13248 30322 35081 23645 2537 -19121
566a9121j3190P08J3457J9643J5698M762n626p825n134k275k677m825o605o480
$$ -19121 -32311 -31603 -18146 1497 17195 21957 16331 8506 3372 1097 -1580 -6405 -13010 -19490
580a9490k220O932J7683K2236J3958l203k0049k8279k3889r699J0130K5658K9018
$$ -19490 -21710 -14778 2905 25141 39099 35896 15847 -12432 -36321 -46020 -35890 -10232 18786
593A8786J7649j41j3671j7324j4315q572k915K202M424M792O313J0632J3191R529
$$ 18786 36435 36294 22623 5299 -9016 -17588 -20503 -18301 -13877 -9085 -2772 7860 21051 30580
607C0580j307j4073k1548k1795j3529J191J8929L0467K7482J1430q621k2925k7230
$$ 30580 29273 15200 -6348 -28143 -41672 -40481 -21552 8915 36397 47827 39206 16281 -10949
620a0949k1000p483Q992J9683J9297J0846J174l637m914m905m809n512o973r095
$$ -10949 -31949 -39432 -30440 -10757 8540 19386 20560 16923 12009 7104 2295 -3217 -10190 -19285
634a9285p696K328J5791K4811K1152N888j2578k6851k9478j8797J923K1696K8672
$$ -19285 -26981 -24653 -8862 15949 37101 42989 30411 3560 -25918 -44715 -42792 -21096 7576
647G576J9965L959r337j3921j1307n500J95K111j579o134m035N327J6032J9526
$$ 7576 27541 31500 22163 8242 -3065 -8565 -8370 -6259 -7838 -13972 -18007 -12680 3352 22878
661B2878J2351k194j7607k6769k4407r574J1742K6779K6871J5022o07j2435j7569
$$ 22878 35229 33035 15428 -11341 -35748 -45322 -33580 -6801 20070 35092 34485 22050 4481
674D481j6729r518l16N936P212O102O696P666O916K421l844r493j3932j5560j0160
$$ 4481 -12248 -21766 -22082 -16146 -8934 -2832 3864 11530 18446 20867 17023 7530 -6402 -21962 -32122
689c2122K131J6020K3161J9893Q594n367j8978k4448k0145n888J0318J9776J9399
$$ -32122 -29991 -13971 9190 29083 37677 32310 13332 -11116 -31261 -37149 -26831 -7055 12344
702A2344J1748J500p515j2381j1375n062m9J028j010o48M080R837J2386R521P05
$$ 12344 24092 25592 18077 5696 -5679 -10741 -10790 -9762 -10772 -11420 -7340 2497 14883 24404 25109
717B5109j0744j9918j9651q855P658J9719K0683J2217J70j0358j5021j2851n138
$$ 25109 14365 -5553 -25204 -34059 -26401 -6682 14001 26218 26388 16030 1009 -11842 -16980
730a6980L427P056N189J541P73J978L650L143J078k821q233j0440p404J052R287
$$ -16980 -13553 -6497 -1308 233 1006 2984 6634 9777 10855 8034 -199 -10639 -18043 -16991 -7704
745g704J1996Q756K769l047p218q536o455j473K425L975L645L013K643J225o63
$$ -7704 4292 13048 15817 12770 5552 -2984 -9439 -10912 -8487 -4512 -867 2146 4789 6014 5351
760E351j692j385j060k572m203l212j46L807N731O326M742P66m603q863q069l495
$$ 5351 3659 2274 1214 -1358 -5561 -8773 -8919 -5112 619 6945 11687 12453 7850 -1013 -9082 -12577
776a2577J490N341O910N960K825j766m534m139j547j85j236j819j205J021M319
$$ -12577 -11087 -5746 1164 7124 9949 8183 3649 -490 -2037 -2222 -3458 -5277 -6482 -5461 -1142
791a142N670N121K259l442q294q204m382J561N573O703N296K367p80l952m827
$$ -1142 4528 9649 11908 8466 172 -8032 -12414 -10853 -5280 1423 6719 9086 8306 4354 -473
806d73l329j342o6L54J403L031L622K183L90p59k560m072m329j694K061M107L547
$$ -473 -3802 -5144 -5210 -4856 -3453 -422 3200 5383 5773 5014 2454 -1618 -5947 -7641 -5580 -1473 2074
823B074J989O96m61j906k711k234p94jK19J372K588K176Q74j369j699r13m72o86
$$ 2074 4063 4759 4298 2392 -319 -2553 -3347 -3348 -3129 -1757 831 3007 3881 2512 813 -100 -572 -1258
841a258j083O8P13J238Q28R59J640L80j472k397j664n30l98K44J770K751J736
$$ -1258 -2341 -2273 -1560 -322 506 1465 3105 3485 2013 -384 -2048 -2578 -2976 -2732 -962 1789 3525
858C525k46j457j237k80j119j932q06R90J633J755J535J406K39k183l459k215
$$ 3525 3279 1822 585 305 -814 -2746 -3552 -2562 -929 826 2361 3767 4006 1823 -1636 -3851
874c851R7J203J407J381J896J504J10j957k257j423j286o76R01K720K866J102
$$ -3851 -3754 -2551 -1144 237 2133 3637 3747 1790 -467 -1890 -3176 -3852 -2951 -231 2635 3737
890C737m96j038j656j752k522j052J909L382K344N00j01q88k201k631j491Q43
$$ 3737 3241 2203 547 -1205 -3727 -4779 -2870 512 2856 3356 3255 2367 166 -2465 -3956 -3113
906c113J675J565J244J404J088j439k815k561k27P59J087J220J717J411N3j845
$$ -3113 -1438 127 1371 2775 3863 2424 -391 -2952 -3179 -2420 -1333 -113 1604 3015 3068 1223
922A223j977r06m18m80J20K364K450R18j030j592r18q75j331l56J176K327J502
$$ 1223 -754 -1660 -2078 -2558 -2438 -74 2376 3294 2264 672 -246 -1121 -2452 -2808 -1632 695 2197
939B197m9k97o20j012k140q71Q18J853R40j02L83P69k32j913j445l37P28O44Q01
$$ 2197 2148 1851 1231 219 -1921 -2792 -1974 -121 819 717 1100 1869 1637 -276 -1721 -2058 -1330 -686 115
958A15P88J282l95j295j636k86K65J03K64J132J522O7j277j465k22M93J01o1L36
$$ 115 903 2185 1790 495 -1141 -1427 -1162 -1059 -795 337 1859 1926 649 -816 -1038 -545 -444 -505 -169
977a69R29Qo96k05M61J85r18j059M14J134P76j26k49k4k16p47n62L81J028M42
$$ -169 760 768 72 -133 328 513 -405 -1464 -1050 84 860 734 485 461 245 -502 -1064 -683 345 787
997G87p73n54M43K36j81j31Q29O26o60j555o62N76J018K47j26K85N23P8m09m70
$$ 787 14 -540 -97 139 -42 -173 656 1282 622 -933 -1595 -1019 -1 246 120 405 928 1006 597 127
1017A27j49r85j230k53J829K482J420o16j395j441j206j181k64J445J754R90k8
$$ 127 -22 -1007 -2237 -2490 -661 1821 3241 2625 1230 -211 -1417 -2598 -2862 -1417 337 1327 1299
1034A299M30N68o64j385j986j234q5M14J711K589K548L92j735l248k345q02L07
$$ 1299 1729 2297 1633 248 -1738 -2972 -3057 -2643 -932 1657 4205 4597 2862 -386 -2731 -3533 -3226
1051c226J330J595J698R05o4j4n4r27k303k555q02J294K793K532J414J32j386
$$ -3226 -1896 -301 1397 2302 2238 2224 2170 1243 -1060 -3615 -4417 -3123 -330 2202 3616 3748 2362
1068B362k342j928l35Q67Q25l80l44J67J715J763R45J88j336l304l391j396K193
$$ 2362 20 -1908 -2243 -1376 -551 -931 -1275 -1108 607 2370 3315 3503 2167 -1137 -4528 -5924 -3731
1085c731L858L442Q08j112k057k143q65O38J161Q6j527j835O7K907L496K403l09
$$ -3731 127 3569 4377 3265 1208 -935 -1800 -1162 -1 85 -1442 -3277 -3210 -303 3193 5596 5287
1102E287k838m143m009j428J981M530M011J489r9j633k209k432j697l46N76R73
$$ 5287 2449 -1694 -5703 -7131 -5150 -620 3391 4880 4781 3148 939 -1493 -3190 -3536 -2960 -1987
1118a987J108J696K244J566q44j982k776j560j071l61N45J862K500K271J807O64
$$ -1987 -879 817 3061 4627 3783 1801 -975 -2535 -3606 -3967 -3422 -1560 940 3211 5018 5682
1134E682j304m055n488l497J173M727N578M096P96k980m926m170q03K715L169
$$ 5682 4378 323 -5165 -8662 -7489 -2762 2816 6912 7708 4728 -198 -4368 -5171 -2456 713
1149G13Q77j811k144p74K156L687M050O94l805p138o390q36N229Q004N823J203
$$ 713 1590 -221 -2365 -3139 -983 2704 6754 7448 3643 -3495 -9885 -10721 -5492 2512 8335 9538
1165I538l334n989n638j096K943M340J648j292l039q36J877L106L155P27k392
$$ 9538 6204 215 -5423 -6519 -3576 764 2412 1120 -1919 -2755 -878 2228 5383 6110 3718
1180C718n361n591j673K904N437N256K786m4k973m587m230j868R87K301K727K359
$$ 3718 -1643 -7234 -8907 -6003 -566 4690 7476 7432 4459 -128 -4358 -6226 -5239 -2938 -211 2148
1196B148J666O18j416k390j903m06M53q2n48m11L5O94K509L894K878j363n680
$$ 2148 3814 4432 3016 626 -1277 -1683 -1230 -1312 -1860 -2271 -2236 -1542 967 4861 7739 6376 696
1213F96p138l732J496N640P360N261J77n184p629m738J452M981M582J051k692
$$ 696 -6442 -10174 -8678 -3038 4322 9583 9760 4576 -3053 -7791 -6339 -1358 3224 4275 1583
1228A583l928k644J182N300N997J670m801q311o162k15N166Q024O328R38m737
$$ 1583 -2345 -4989 -3807 1493 7490 9160 4359 -3952 -10114 -10329 -5163 2861 9189 10127 5390
1243E390p159n043QM271L970J446j317k080j481Q75K253K715O88k727m604k934
$$ 5390 -1769 -6812 -6804 -2533 1437 2883 1566 -514 -1995 -1120 1133 3848 4536 1809 -2795 -5729
1259e729J50K602L738K902J848n97k391l349k289q24K21M57K292L535K446Qk640
$$ -5729 -5579 -2977 761 3663 5511 4914 2523 -826 -3115 -3939 -3718 -3261 -969 2566 5012 5020 2380
1276B380l264k395k99J138K290K270m84k293j799J157L620K840k78l673m975l535
$$ 2380 -884 -3279 -3578 -2440 -150 2120 1636 -657 -2456 -1299 2321 5161 4883 1210 -3765 -7300
1292g300R8M359O867M493q32n111o455k721J417M152M061J263k187l861k783J562
$$ -7300 -7202 -2843 4024 8517 7685 2574 -3881 -6602 -5185 -1033 3028 4291 2104 -1757 -4540 -2978
1308b978M672L968K66m252n467l394N97M608N424L582r56m387m721j379J697K629
$$ -2978 1694 5662 5928 1676 -3791 -7185 -6588 -1980 3444 7026 6070 1683 -3038 -4417 -2720 -91
1324i1J398m42j382j050M17K175K279O14k297l748k272K82K515K713J639J71j372
$$ -91 1307 865 -517 -1567 -1150 1025 3304 3918 1621 -2127 -4399 -4117 -1602 1111 2750 2921 1549
1341A549j402j042N54L71l00j537j145Q78K523K966R75j468l219l208j064J835
$$ 1549 147 -895 -341 30 -270 -1807 -2952 -2074 449 3415 4390 2922 -297 -3505 -4569 -2734
1357b734L500K536k46k559k537k78J680K535P35j163k660k572J0K313M113K259
$$ -2734 766 3302 3056 497 -2040 -2318 -638 1897 2632 1469 -1191 -3763 -3753 -1440 2673 4932
1373D932j133l728l160r74J851K884K542j71k237l404r58K097L496J889j001k852
$$ 4932 3799 71 -3089 -4063 -2212 672 3214 3043 806 -2598 -3556 -1459 2037 3926 2925 73
1389G3k947j373J552L263K960J98k466l154j514J594K948J449o64k289k014n04
$$ 73 -2874 -4247 -2695 568 3528 3726 1260 -1894 -3408 -1814 1134 2583 1919 -370 -2384 -2888
1405b888J695L144K093o72l148l229j125J762K767K324K02j476k361j381N42K289
$$ -2888 -1193 1951 4044 3372 224 -3005 -4130 -2368 399 2723 2925 1449 -912 -2293 -1751 538
1421E38J566m78k122k071K54K060K314J097q84k334k702p64J863L067J704r51
$$ 538 2104 1626 -496 -2567 -2313 -253 2061 3158 2274 -60 -2762 -3526 -1663 1404 3108 2157
1437B157k243j761k05J235J820Q90n57j863j704q8K158K364L87j477k251j393
$$ 2157 -86 -1847 -2052 -817 1003 1893 1336 -527 -2231 -2319 -161 2203 2590 1113 -1138 -2531
1453b531J89J674K423J230p92k712k590nK498K565R07j138k032j946l78J395K713
$$ -2531 -2342 -668 1755 2985 2193 -519 -3109 -3114 -616 1949 2856 1718 -314 -2260 -2638 -1243 1470
1470A470J633r79k607j946J11K131J999N11r28j921j773k20J773K604J242r62
$$ 1470 3103 2124 -483 -2429 -2318 -187 1812 2323 1395 -526 -2299 -2519 -746 1858 3100 2138
1486B138k718j893J08J561J700J293j48j561k251m33J319K024P00r26j875p99
$$ 2138 -580 -2473 -2365 -804 896 2189 2041 480 -1771 -2204 -885 1139 1839 913 -962 -1761
1502a761M43J213J476Q97q57k363j701M99K020K210K67j488j508j094j0J209J762
$$ -1761 -1318 -105 1371 2268 1411 -952 -2653 -2154 -134 2076 2343 855 -653 -1747 -1757 -548 1214
1519A214Q76r54k041r59N44J771R50o5r69q82j022o9J453J903O09j459k043j064
$$ 1214 2090 1136 -905 -1864 -1320 451 1401 1336 367 -515 -1537 -1606 -153 1750 2359 900 -1143 -2207
1537b207P08J471J490N53p17j680j611kJ567K034J35j014j544n18M84J111J117
$$ -2207 -1499 -28 1462 2015 1298 -382 -1993 -1995 -428 1606 1741 727 -817 -1335 -851 260 1377
1554A377o6o63j606j090P20J737J459P4j418j506o49L09R59J110R40p18j252r86
$$ 1377 1311 648 -958 -2048 -1328 409 1868 1942 524 -982 -1631 -1322 -363 747 1687 969 -283 -1269
1572a269M5J351R23j44m40j057n69J58R08J237L53p95j461l83M85R81M37J80n10
$$ -1269 -1224 127 1050 906 466 -591 -1160 -1002 -94 1143 1496 701 -760 -1143 -658 323 760 940 430
1591D30p17n16K55O22Q26K81j098q22k48O61L89L97Q4l15m48l22L09N61N38n01
$$ 430 -287 -803 -548 74 900 1181 83 -739 -987 -326 63 460 544 229 -219 -541 -232 329 867 366
1611C66j072m91K68O77R46O33k3p32j522n73K71J334O94P2m52m54m5L4J29J34
$$ 366 -706 -1197 -929 -252 694 1327 1304 572 -950 -1523 -1252 82 776 848 396 -58 -103 -69 60 194
1631A94N1m64q71K15O31J056L90j11p98n58p69L4M33P92L30R9m25j38J67k68k18
$$ 194 245 -219 -1090 -875 -244 812 1202 1091 293 -265 -1034 -1000 -567 225 555 654 229 91 258 -10 -228
1652b28j72J28J96k37K25N26J63k32m58m08J55J34K47R6k59q9J57M2Q7K80K17
$$ -228 -400 -272 -76 -313 -88 438 601 369 -89 -497 -342 -208 39 135 -124 -213 -56 -14 73 353 570
1673E70l96n81k47m9L81K53M51J72J32m28m45k21J19K23n2j26J87J06N7J96L35
$$ 570 174 -407 -654 -703 -322 -69 382 554 686 258 -187 -408 -289 -66 -118 -244 -57 49 106 302 637
1694F37J86m01o98l93l90K73M43P25O84M44l94j309o35m31P6N31Q15O63L00k84
$$ 637 823 422 -276 -669 -1059 -786 -343 382 1066 1510 1116 -193 -828 -1259 -1183 -652 163 826 1126 842
1714H42q33l94J56N8K28j32m1r7NL1N24Q49qr55p90p52K7L19Q22R21P04j91j175
$$ 842 9 -385 -229 -171 57 -75 -116 -213 -208 -177 347 1196 1188 233 -557 -1309 -1282 -963 -141 780 1484 1293 118
1737A18j035j12L09M75M20L03q7l08m08k69L70Q09L14k23n80p11n48K2K34J476
$$ 118 -917 -1029 -720 -245 175 478 391 83 -325 -594 -224 585 899 676 96 -615 -1163 -1141 -907 569
1757E69J081M8q53j308p82j76K45R82J196K74n79j131l35N20O53M60j81n97q29
$$ 569 1650 1698 845 -463 -1245 -1421 -1176 -194 1002 1276 697 -434 -769 -249 404 864 683 86 -743
1776g43j007K61J246J895P52n94j439j680j059K76R91K016J276j15j477j507m52
$$ -743 -1750 -1489 -243 1652 2404 1810 371 -1309 -2368 -2092 -1101 915 2191 2076 599 -908 -1360
1793a360M42L35R03M05k29o23r88J92J092P72K84p23p27p56n01K76R22J388M68
$$ -1360 -918 -583 320 725 496 -127 -1115 -923 169 941 1225 502 -225 -981 -1482 -1206 -284 1104 1572
1812A572k55j063q39m36q1L16J188N16jp77o25j85N6O84M25M01N4j041j044o97
$$ 1572 1317 254 -585 -1021 -1102 -786 402 918 917 140 -485 -670 -614 70 495 896 950 -91 -1135 -1832
1832a832Q36J485R73L60o53j251j465m39O57J628J195P8q84j085n87J37N92R04
$$ -1832 -996 489 1462 1822 1169 -82 -1547 -1986 -1329 299 1494 1572 688 -397 -984 -847 -255 649
1850F49M29m34j267j003K77J378J307N43m16j294j396j271O39J591J577N75m15
$$ 649 1078 644 -623 -1626 -1349 29 1336 1879 1463 169 -1227 -2498 -1859 -268 1309 1884 1469
1867A469j420o55l51m4Q48P17L07p89n22R5L26N06M0j52m22k30l24M9J59O52K39
$$ 1469 49 -606 -957 -1001 -153 564 871 82 -440 -345 -19 487 527 375 -47 -277 -601 -552 -393 259 498
1888D98o6Rk53k64j53l94J69L96L59L07j76k28n22k03r2O50N60J38l87r38m91
$$ 498 432 441 188 -76 -229 -623 -454 -58 301 608 432 204 -318 -521 -613 37 597 735 348 -590 -1081
1909a081K30Q01P99O35j68j076j390l02M69J336P12J46n43m95q72N6P23P04J78
$$ -1081 -851 -50 749 1384 1216 140 -1250 -1552 -1083 253 965 1111 568 73 -799 -743 -20 684 862
1928H62q07p90n10N49R48R59J54o50j172j046o3J020J044P36k34p32p36l82L18
$$ 862 55 -735 -1245 -696 252 1211 1365 715 -457 -1503 -1566 -546 498 1234 1000 268 -468 -850 -532
1947e32O41L76q9n61l67QM21P79Kl01n66k20k03L28O03K70Op63m85J07N87M26
$$ -532 109 485 396 -165 -532 -524 -103 676 678 377 -189 -409 -612 -284 319 589 595 -168 -653 -546 41 467
1969D67k5l64n64k11M93L56K78J82m52o97j52N15M99M61m86n76o25N5N10Q02O76
$$ 467 442 78 -486 -697 -204 152 430 612 160 -537 -689 -174 325 786 300 -276 -901 -846 -336 466 1142
1990A142j13j043r83j97N52R01O10p2m89p64m00M37N48P41k8q09j032N3N79R63
$$ 1142 1029 -14 -997 -1194 -642 259 869 797 308 -456 -856 -419 129 870 842 33 -999 -946 -367 596
2010E96M10J48r34q75q14L83J315P36J84o83j007l24K35K96Q79O3l07m93n54K21
$$ 596 1006 1154 220 -655 -1469 -1086 229 965 1149 466 -541 -865 -630 -334 545 608 301 -192 -746 -525
2030e25P27L88k46l15p04m8J70N16N31K14n73q05k35M70P25K35K6n41l35k82K51
$$ -525 202 590 344 29 -675 -723 -553 -37 494 708 135 -670 -905 -435 290 525 551 10 -325 -607 -356
2051c56O08O88m72o41o97K72M56N87o3k50l60l28j01M20R17L87m19q64p67R6M45
$$ -356 252 940 468 -173 -870 -598 -142 445 382 132 -228 -556 -657 -237 680 1067 648 -216 -983 -887 -442
2072d42N74N14K51n00r49l90L63R14M23k95r15j63L1M29M24N40j32o90o39k54
$$ -442 132 646 897 397 -552 -942 -579 335 758 463 -452 -615 -584 -155 269 809 677 -13 -652 -906
2092i06N57P74L60j24p01k91l43J05M12P68r7m88o61J23L44N93k5j59l77l98l3
$$ -906 -349 425 785 661 -40 -331 -674 -569 -157 611 514 26 -635 -512 -168 425 400 241 -136 -534 -567
2113e67L89O34L49m40o31l75lO03K27N02n0n67n86l44M61P78K45m41l30l79J17
$$ -567 -178 456 805 365 -266 -641 -644 -41 186 688 638 71 -515 -859 -398 380 625 184 -146 -525 -408
2134d08K90L53J99k91k79n85R9N95Q03J99p22m56n21M3L23O85L71j33n16n02k
$$ -408 -118 235 434 143 -136 -721 -622 -27 776 975 253 -203 -724 -681 -358 327 698 565 49 -453 -455
2155d55O89J43J4m18j55j00l71O50O37K80n73q67k13l0O81P32rl17m24m05m4N51
$$ -455 234 377 391 -27 -182 -282 -653 -3 634 914 341 -526 -739 -769 -88 644 635 318 -106 -511 -555 -4
2177dN25J16k95n53m54J29N28J78K83J05q37l87O4M91P53j33p3n98m06NL90O00
$$ -4 521 637 342 -211 -665 -536 -8 170 453 558 -279 -666 -602 -111 642 509 436 -162 -568 -563 -173 427
2199D27K24j46n69o35oN57L42L2J44k46m31J55J71K41k8k72m05j13N12O04J15
$$ 427 651 505 -64 -699 -705 -148 194 226 370 124 -307 -152 19 260 232 -40 -445 -558 -46 558 673
2220F73k10l35n34k38j1M32O86L26l82o17l47K85L55K05J2k75n07Q8nN90N86j01
$$ 673 463 128 -406 -644 -655 -223 463 789 407 -210 -557 -272 83 288 300 25 -482 -394 -399 191 777 676
2242F76m72q29k27L24L62Q43M7l01m35n07r3L63P06L2l13k57n33L87K89K58K91
$$ 676 204 -625 -852 -528 -166 677 724 423 -12 -519 -612 -249 457 489 176 -81 -614 -227 62 320 611
2263F11n36l11j85%M23J98n7k53k78J29R5K21M59j20m38l92j78J39P83O3j4k04
$$ 611 75 -236 -421 -421 2 200 143 -110 -388 -259 -164 57 516 396 -42 -434 -612 -473 310 373 359 155
2285A55k06j60L1L15J54n7l46l53Q0L17M33K81j19m51n26k35R2L74P14Q6o6o78
$$ 155 -51 -211 -180 135 289 232 -114 -467 -387 -70 363 644 525 74 -452 -687 -595 -221 493 579 513 -165
2307a65l80K44J77R9K09rj66j73l3K61K40j24J3l01RM8j43L27J14O2k38j75J96
$$ -165 -545 -301 -124 -25 184 175 9 -164 -197 64 304 180 193 -108 -99 -51 -194 133 247 309 71 -104 92
2330I2r3j98J09k0K11K38k28P4j31j66J60k25Q7L54Q3l06k70l2j00L53K75J77
$$ 92 -1 -199 -90 -110 101 339 111 185 54 -112 48 -177 -90 264 347 41 -229 -261 -361 -8 267 444
2352D44J37n24l15l60J43N28K79R3M3m65k15l3R9L82o8K4k38k34jP8M40RJ47j79
$$ 444 581 57 -258 -618 -475 53 332 425 468 3 -212 -245 -146 236 168 192 -46 -280 -281 -203 237 246 393 214
2376B14m21m98J95L63M70K01J39l34l36m13j15M7M17M71l5k73l8k87n1J26K73
$$ 214 -207 -705 -510 -147 323 524 663 329 -7 -420 -535 -488 -71 400 365 92 54 -233 -284 -158 115
2397A15K29j77j69k93J29Q3K76J57J30k47k86l69k7L92M33J82j73l64j72j24j19
$$ 115 344 167 -2 -295 -166 -83 193 350 480 233 -53 -422 -449 -57 376 558 385 21 -151 -275 -394
2418c94L65N37L1m79j49q2k17J57K64L31rj64m08j03K08J5J58NK09j57j15r1j49
$$ -394 -29 508 539 60 -89 -171 -388 -231 33 364 355 191 -217 -320 -112 -97 61 66 275 118 3 -88 -237
2441b37P1K12j27N3J47n0l19K08m9J18L03l13p1k24L3j62M40L28K32j49m75l95
$$ -237 -166 46 -81 -28 119 69 -250 -42 -91 27 330 17 -54 -278 -245 -407 33 361 593 444 -31 -426
2463d26j11K45K64M34J00r8n83l99n7L32N86J81j25k95l97k5Q4L40L82Q1l32n38
$$ -426 -537 -292 -28 406 506 408 -175 -574 -631 -299 287 468 343 48 -349 -374 -290 50 432 513 181 -357
2485c57j26qO91m6J73o9k72k74l7K96L90M9l28k18j17L8P0K11K47r7j03j87k02
$$ -357 -483 -491 200 154 327 258 -14 -288 -325 -29 361 410 82 -136 -253 -215 -145 66 313 216 113 -74 -276
2508b76J6K80o2L21l82J60m1M11l53jj49m5lJ9K45j65k6j22j06q1M72n7R9j78
$$ -276 -260 20 -42 279 -103 57 16 427 74 73 -76 -121 -124 -105 140 -25 -51 -173 -279 -360 112 55 154 -24
2532b4j76j00J75J76M13j81l71k37j95O4M77L70N9l39k30k35j86L81M48J80j40
$$ -24 -200 -300 -125 51 464 283 -88 -325 -520 -456 21 391 450 111 -119 -354 -540 -159 289 469 329
2553C29l66j67l45K14M88O7J73l26l31j52L42L80Nj7k77k41j1Q5J71L50k13Q1
$$ 329 -37 -204 -549 -335 153 220 393 67 -264 -416 -74 306 311 294 17 -224 -235 -150 21 371 158 239
2575B39n12R9N9J52J7K49k78j92J23q6L11K6k44j27j55K26L13ml9j9m62r5J80
$$ 239 -273 -174 -115 37 54 303 25 -167 -44 -130 181 207 -37 -164 -319 -93 220 216 177 158 -304 -399 -219
2598b19L52K76m5k74k87r3K61j22K56P5K1k95l25K49K90L37q1m02l40m6l7N50
$$ -219 133 409 364 90 -197 -290 -29 -151 105 180 201 -94 -419 -170 120 457 376 -26 -366 -412 -449 101
2620A01L16K36l58l92n72L63L75N7J04m8q6l87M7k5M65K56k82k67j62K17J53N8
$$ 101 417 653 295 -97 -669 -306 69 126 230 182 96 -291 -244 -269 196 452 170 -97 -259 -42 111 169
2642A69k2lk71o7k33L44r2N56j69l70p8j54K87J28J87j61n8j91J97J38J95j96
$$ 169 147 144 -127 -194 -427 -83 -175 381 212 -158 -236 -390 -103 25 212 51 -7 -198 -1 137 332 136
2664A36l82N3k9J74K72J12q7j33l24m4MN00K58j66l97nk41P4J33M04j31j56k16
$$ 136 -246 -193 -222 -48 224 336 249 116 -208 -252 -248 252 510 344 -53 -58 -299 -225 -92 312 181 25 -191
2687a91j43L12q3M32K1l29j67j87K8L92J01K3nm25j19N3M53OK87k62k67k18J3
$$ -191 -334 -22 -105 327 348 19 -148 -335 -307 85 186 209 204 -221 -340 -287 166 172 459 197 -70 -288 -275
2710b75L43P7J44k89k95K64K2J57P0rj29l47P9J29L20O2R1m21k51J7R4Q5L88k6
$$ -275 68 145 289 0 -295 -31 -9 148 218 209 80 -267 -188 -59 261 323 414 -7 -258 -241 -147 -62 326 300
2734C00l01j44k08M00J45Qj35k07rj20O1L84jJ33m61q9k12L11K64RmK6l70k4J17
$$ 300 -1 -145 -353 47 192 200 65 -142 -151 -271 -210 174 173 306 -155 -244 -456 -145 119 128 124 150 -220 -244 -127
2759a27K99J92p9k45k38J99j0J97J20j60k81o9K8m8K12Q9Ok35r5J55m9J99J93
$$ -127 172 364 285 40 -198 1 -9 188 308 148 -133 -202 -174 -222 -10 79 85 -150 -245 -90 -139 60 253
2782B53k5l31p4N2J96k6M9l9j26J5j02k4J37J50j49j87N0J27M5J41r8n5nk2m0
$$ 253 228 -103 -177 -125 71 45 94 55 -71 -56 -158 -182 -45 105 -44 -231 -181 -54 -9 132 34 -21 -26 -48 -88
2807h8j58M07pJ9j30j83J66n6o0O6q4K00k01J54OJ95j39J5j92J9j74J18L15k5
$$ -88 -246 161 154 173 43 -140 26 -30 -90 -24 -108 92 -109 45 51 246 107 122 -70 -51 -225 -107 208 183
2831A83n3k27J0p2P7L11j05j22p4j79OL13J04q5P7k31j99J44J79J13M5j41j68
$$ 183 130 -97 -87 -159 -82 229 124 2 -72 -251 -245 68 172 87 164 -67 -266 -122 57 170 215 74 -94
2854i4k29LJ15K67Q4j33j51j71J38L1J3K58R8j46j24Rj77M05r9J04k91q2KK52
$$ -94 -323 -320 -205 62 146 13 -138 -309 -171 -140 -127 131 229 83 -41 -32 -209 196 97 201 -90 -172 -170 82
2878H2o6J31k2j31l5l3m6J85P1P6k41l2P3j0k11K31p1M3k9Q8O0J27k21j8j05p9
$$ 82 16 147 125 -6 -41 -74 -120 65 136 212 -29 -61 12 2 -209 22 -49 -6 -35 53 113 240 19 1 -104 -183
2904a83K00J65P9j2k78Lj49P1J89R2j64nn7j99J45r5K31P6m5k8k59M0O1K37jr2
$$ -183 17 182 261 249 -29 -26 -175 -104 85 177 13 8 -49 -248 -103 -198 33 109 64 36 -223 -183 -122 115 114 22
2930B2N6j94j57K22N3J67P2n28J13j42MK36k8J71J4M0J9k77J34l8j16J11Q5J62
$$ 22 78 -116 -273 -51 2 169 241 -287 -174 -316 -312 -76 -104 67 81 121 140 -137 -3 -41 -157 -46 39 201
2954B01k07J0k25n1J15R4O6Q3j16or0R4J56l2j17Q7N4n2j79K0J67K19j44m65O5
$$ 201 -6 4 -221 -272 -157 -63 3 86 -30 -36 -126 -32 124 92 -25 62 116 64 -115 -95 72 291 147 -318 -253
2979b53K4J72j6R5L06j06j32j70J6k41K51J68q0J31j2j82j31K14N3N0j14k5M5
$$ -253 -229 -57 -73 22 328 222 90 -80 -64 -305 -54 114 34 165 153 -29 -160 54 107 157 43 18 63
3002F3M3l11J21o0K76k93N0K42j24r6K0N3K61k07j34j63K81Q7pl3K4R2k8l78Q
$$ 63 106 -205 -84 -144 132 -161 -111 131 7 -89 -69 -16 245 38 -96 -259 22 109 102 69 93 185 157 -221 -213
3027b13j63M04J44P6j59j53l3l8J05p7L09k9K5k73K0o2L6j05K01O0j05J56j25
$$ -213 -376 28 172 248 89 -64 -97 -135 -30 -107 202 173 198 -75 -55 -117 -81 -186 15 75 -30 126 1
3050An5R5P9n5kM0p6k21J45jJ6J04l7n9j12q7K15l4K42j01o7r5n5j5j41K81R4
$$ 1 -54 41 120 65 63 103 27 -194 -49 -50 -34 70 33 -26 -138 -225 -10 -44 198 97 30 -65 -120 -135 -276 5 99
3077I9q2K9j72J26lj43K87o0R1k11k4J94J0m7R0k1k21J17k37j11K58J62n0J1j71
$$ 99 17 46 -126 0 -3 -146 141 81 172 -39 -63 131 141 94 184 163 -58 59 -178 -289 -31 131 81 92 -79
3102g9k1k14L39K27k22J99k60j29j98L09qK29Q7k71K4M6k41J82r4P4j4J46o1%
$$ -79 -100 -314 25 252 30 229 -31 -160 -358 -49 -57 172 259 -12 12 58 -183 -1 -95 -21 -35 111 50 50
3126E0L3r9mj76J18J43p0J24k94L8O3j39m8K45J88j10k1o9k57L10K41j45j30j08
$$ 50 83 -16 -20 -196 -78 65 -5 119 -175 -137 -74 -213 -261 -16 172 62 41 -28 -285 25 266 121 -9 -117
3150a17j7P2j03L06Q9j42q7m0l3l4K39j3J08k96J43l70j0L18O0J39j60k29j6K38
$$ -117 -134 -62 -165 141 230 88 1 -39 -72 -106 133 120 228 -68 75 -295 -305 13 73 212 52 -177 -193 45
3174D5L1J1K8M9j37k60K00Q6k2J45Q6n50L95k03R5L9J40m9k19J36l1Ml9K7P5k49
$$ 45 76 87 115 164 27 -233 -33 53 31 176 262 -288 107 -96 -1 38 178 129 -90 46 15 19 -20 7 82 -167
3200a67m7J46K1L10l11J31j24j56K7L51l3j66P3k68J02O1LJ18J08q4l61J84K16
$$ -167 -214 -68 -47 263 -48 83 -41 -197 -170 181 148 -18 55 -213 -111 -50 -47 71 179 95 -266 -82 134
3223A34j24J43n1q6j52j69K35K32KJ17l10r8n2J32J4J39K62j87m52L0K26p0J85
$$ 134 10 153 102 16 -136 -305 -70 162 164 281 -29 -127 -179 -47 -33 106 368 181 -271 -241 -15 -85 100
3246A00j00J82p3j14j38O7J77j84J22j09j98P3L14o4P6j05j10k9m7J63J48j75
$$ 100 0 182 109 -5 -143 -76 101 -83 39 -70 -268 -195 119 55 131 26 -84 -113 -160 3 151 -24
3268b4k23J55J15k9J42j13l6n4j86J03J65K45l9n9k52j3p2J3J54J44K9j80k24
$$ -24 -247 -92 23 -6 136 23 -13 -67 -253 -150 15 260 221 162 -90 -103 -175 -162 -8 136 165 -15 -239
3291b39P2J14j8L76j81n6j87P2p5K35n1P1k10L1j91O3K86O6k32M4O9q8j51K29
$$ -239 -167 -53 -71 305 124 68 -119 -47 -122 113 62 133 -77 -46 -237 -174 112 178 -54 -10 59 -29 -180 49
3315D9N7O3O6k60j02K41q3r9L22m18K0Q6m1L37j54m6o5o9r0K53q8J58o4jp0j53
$$ 49 106 169 235 -25 -127 114 31 -68 254 -164 -144 -58 -99 238 84 38 -27 -96 -186 67 -21 137 73 72 2 -151
3341a51J52J51P0j94k64K75j29m8K36J94m8k52J06j35O6L1Q7J9k17J28j65L7L9
$$ -151 1 152 222 28 -236 39 -90 -138 98 292 244 -8 98 -37 29 60 147 166 -51 77 -88 -51 -12
3364a2R5nj6n1k10k0J01L36n3j94j20j40K85P9J14n7j30j01L0L2R4M1k9j72k23
$$ -12 83 78 62 11 -199 -219 -118 218 165 -29 -149 -289 -4 75 189 132 2 -99 -69 -37 57 98 69 -103 -326
3389c26L96l34M96k52lJ42k38J8M2L14k68R1j55O4M5M5K26m8j67j48l0P5O7R5
$$ -326 70 -264 232 -20 -23 119 -119 -101 -59 255 -13 78 -77 -13 32 77 303 255 88 -60 -90 -15 52 147
3413A47j03J56j68m43K91Q5J86q0J7n6k37J64J30J31Qk30Q6k98J99K02q9k13J48
$$ 147 44 200 32 -411 -120 -35 151 71 88 32 -205 -41 89 220 228 -2 84 -214 -15 187 98 -115 33
3436C3L2l13L79k44J76j21Q5j39j2J12J32L4q7M8j27j74K79q8M3J39q9j25Q6n5
$$ 33 65 -248 131 -113 63 -58 27 -112 -124 -12 120 154 67 115 -12 -186 93 5 48 187 98 -27 59 4
3460DK01k56J47l6p6j22O5N6Q8m1R3j83o4P3m4K44j5Qj7k71P8J44L2j01K3j04
$$ 4 205 -51 96 60 -16 -138 -73 -17 71 30 123 -60 -124 -51 -95 149 134 142 125 -146 -68 76 108 7 30 -74
3486g4m1Q3j21L15O7k32p1M4k4Q8J57j54J38k00K7j10kJ02L5%j85K00j8Q4k84
$$ -74 -115 -32 -153 162 229 -3 -74 -30 -54 34 191 37 175 -25 2 -108 -110 -8 27 27 -158 42 24 108 -176
3511a76Q5L6P2K51k00jn5p2k10J94L4O0l9Rj23KL7j28R8k2J63j9n4j7J07l8O2
$$ -176 -91 -55 17 268 68 67 12 -60 -270 -76 -42 18 -21 -12 -135 -133 -96 -224 -126 -148 15 -4 -58 -75 32 -6 56
3538E6M3Q3m0k02j15J70J65n8n6q3R9k04K23k15L23j17j4j7R3J0k32RR9J17j48
$$ 56 99 182 142 -60 -175 -5 160 102 46 -37 62 -142 81 -134 189 72 58 41 134 144 -88 -79 20 137 -11
3563a1nJ35j73l2K73k29p0Q1K7J07l5j71K9K05k5jk41K65j32j00J11o0K01M7j17
$$ -11 -16 119 -54 -86 187 -42 -112 -31 -4 103 68 -103 -74 131 106 105 -136 129 -3 -103 8 -52 149 196 79
3588G9l6j14o0J24N4K38k53qnj16K14k45K44j38J00M9q2o7q2n2J97K23l48J91
$$ 79 43 -71 -131 -7 47 285 32 24 19 -97 117 -128 116 -22 78 127 45 -22 -104 -156 41 264 -84 107
3612A07j22J8j6r4P1R3j64M8N2O7j96L04k61l5K23N3p1j3%q0r1N2K03k39L0O3
$$ 107 -15 3 -13 -107 -36 57 -107 -59 -7 60 -136 168 -93 -128 95 148 77 64 64 -16 -107 -55 148 -91 -61 2
3638BM3o1P3MJ30l0j8k63Mk1J75o2j1n3O1j02P9K32j87J02j27R5K1J3j8J12k05
$$ 2 45 -16 57 61 191 161 143 -120 -116 -137 38 -24 -35 -88 -27 -129 -50 182 -5 97 -30 65 86 99 81 193 -12
3665a2M1j22J31o2j24J01m8l2j8K76k17M5J0J39j06n5m6J76Pj85j50K77M6j15
$$ -12 29 -93 38 -24 -148 -47 -95 -127 -145 131 -86 -41 -31 108 2 -53 -99 77 84 -101 -251 26 72 -43
3689d3J03j81L5K09j22J01j16J8J89l03K08P3l26K58m37K63J61j14q1O0P8o3J4
$$ -43 60 -121 -86 123 1 102 -14 4 193 -110 98 171 -155 103 -334 -71 90 -24 -105 -45 33 -30 -16
3712a6N4j45J17k3k4M4P3J51l55QR6L1K26j11l31J58J55j31O8j18P9J39k02m1
$$ -16 38 -107 10 -13 -37 7 80 231 -124 -116 -20 11 237 126 -205 -47 108 -23 45 -73 6 145 -57 -98
3736i8L01l00R7j60M6J93j43J5J52Q6n9k77L5QJ60M5r3o8QK24n4J13j43j57O4
$$ -98 203 -97 0 -160 -114 79 -64 -49 103 189 130 -147 -112 -104 56 101 8 -60 -52 172 118 231 88 -69 -5
3761ej07N1N6J73J4j19m2rop7Qq8J40O3j23P6l0O6O6j27m8J19m0k5k9J37j86M7
$$ -5 -112 -61 -5 168 182 63 21 12 6 -71 -63 -151 -11 52 -71 5 -25 41 107 -20 -68 51 11 -14 -43 94 -92 -45
3789d5j1j53J90nj7L9r2J92j94J2Q3J59j06r8l3K33q9k05K10k49J43pR8p0k16
$$ -45 -56 -209 -19 -24 -41 -2 -94 98 -96 -84 -1 158 52 -46 -79 154 65 -140 70 -179 -36 -43 55 -15 -231
3814b31J59Mj9N9p7J40j35K73o1j25j11o7K80j78N1J30n1k3OOk9M6l6j7j66p3
$$ -231 -72 -68 -87 -28 -105 35 -100 173 112 -13 -124 -191 89 -89 -38 92 41 18 24 30 1 47 11 -6 -172 -245
3840b45K75J1l9K64k05k17R9J28j10M7j4M5o9m1R5R3k82N0J32p1J3K4no5m5M0
$$ -245 30 41 2 266 61 -156 -57 71 -39 8 -6 39 -30 -71 24 117 -165 -115 17 -54 -41 -17 -22 -87 -132 -92
3866i2J02pn6N0l2R9m7m7J7Qj2N8k6JN0q0o3J35r2o3O2Q2j1j05J45j74j1M5O9
$$ -92 10 3 -53 -3 -35 64 17 -30 -13 -5 -17 41 15 16 66 -14 -77 58 -34 -97 -35 47 36 -69 76 -98 -109 -64 5
3895EPK9P8j5o3j28L9j00K20n9J02r3p9Q4l3k1K29j56j05J18j81J8J03N2j19J41
$$ 5 12 41 119 104 41 -87 -48 -148 72 13 115 22 -57 27 -6 -27 202 46 -59 59 -122 -104 -1 51 -68 73
3921G3j15L3r9O4qO1J1qLq4J25n1J5l3j19n8K32pm6r3Q3J59k30M7j21L12n6Q0
$$ 73 -42 -9 -108 -44 -52 9 20 12 15 -69 56 5 20 -13 -132 -190 42 35 -11 -104 -21 138 -92 -45 -166 146 90 170
3949A70j84J44k39K23j43L3k67K44J52j97Q4j59K84r3j85k2K08k1n9J28j11k5
$$ 170 -14 130 -109 114 -29 4 -263 -19 133 -64 20 -139 145 52 -133 -155 53 32 -27 101 -10 -35
3971c5n7J1R7R8J69k77n6j11L34j49Q4j37k5N2k33j8K8J97L5p1M2q7L5J49o7m2
$$ -35 -92 -81 16 114 283 6 -50 -161 173 24 108 -29 -54 -2 -235 -253 -225 -28 7 -64 -22 -109 -74 75 8 -34
3997c4k7J53n8j61J66n5N7J4j07K15j41l5j00k6J71ko8O6o1O7l51K36j00Q2L4
$$ -34 -61 92 34 -127 39 -16 41 55 -52 163 22 -13 -113 -139 32 30 -38 28 -33 34 -317 -81 -181 -99 -65
4022f5J81j48N4Qj67O2J66q5K7qr0J81k07k1L7J17N6j70jk9J45k0j80K65r2o5
$$ -65 116 -32 22 30 -137 -75 91 6 33 25 -65 116 -91 -112 -75 42 98 -72 -73 -102 43 23 -157 108 16 -49
4048d9K3J81j27m3m7l1j49K51J99k52J45Pm0j48P4m9Onl6O9J23j50P6K28k93J06
$$ -49 -26 155 28 -15 -62 -93 -242 9 208 -44 101 108 68 -80 -6 -55 -49 -54 -90 -21 102 -48 28 256 -37 69
4074F9p7J30j77O5K9j09K15j16j54J25q5O3J4M8J32j92K9r0jl4J32N0J62n3j63
$$ 69 -8 122 -55 10 39 -70 145 29 -125 0 -85 -22 -8 40 172 -20 9 -81 -82 -116 16 66 228 175 12
4099A2m5J46k38J70J0j4k8P8o8K00q9j36L4j58J44j8j29K5n8k5J86ln8J12r3j2
$$ 12 -33 113 -125 45 55 41 13 91 23 223 134 -2 32 -126 18 0 -129 -104 -162 -187 -1 -4 -62 50 -43 -55
4125e5J17J20k25O8K21j75k9k79J87J88O9j69k1l0m0j4QJ26r8J52m5l5k39M58
$$ -55 62 182 -43 25 246 71 42 -237 -50 138 207 38 17 -13 -53 -67 -59 67 -31 121 76 41 -198 260
4149B60k54K2j34J9K31j4j66J32r9J34k24J45K8p2K20j93q4N3N3J55j53r0J73
$$ 260 6 28 -106 -87 144 130 -36 96 -3 131 -93 52 80 8 228 35 -49 4 57 212 59 -31 142
4172A42o3J9pk12R6J41j68j9J32Q0R9l46R0M4j37Q4j26L6J60oJ33j46j2J5j25
$$ 142 79 98 91 -121 -25 116 -52 -71 61 141 240 -106 -16 28 -109 -25 -151 -115 45 39 172 26 14 29 -96
4197i6J51k2n9J7k7r0N4L7P6J19j73%Mn7J59N1j4o1m1n7J7L9ml0Q6k09J41J00
$$ -96 55 33 -26 -9 -36 -126 -72 -35 41 160 -13 -13 -9 -66 93 144 130 69 28 -29 -12 27 23 -7 79 -130 11 111
4225A11j68q9J91N7J0k43K12P8l11J51J24J6j93lJ4J15j73J42m1N1j49JJ24L5
$$ 111 -57 -146 45 102 112 -131 81 159 -152 -1 123 139 -54 -57 -43 72 -101 41 0 51 -98 -97 27 62
4249F2j11j7J62J51k41k11J62r0j8K35L8l8j34J60j04j6j66J69P7k9M2o5m6M5
$$ 62 -49 -66 96 247 6 -205 -43 -133 -151 84 122 84 -50 110 6 -10 -176 -7 70 41 83 18 -28 17
4273A7J15J04j90j12O5P7j69M4J60K1k15r8R4P9k26L66j31O4J8j42L9j30j6L5
$$ 17 132 236 46 -66 -1 76 -93 -49 111 132 -83 -181 -87 -8 -234 132 1 65 83 -59 -20 -150 -166 -131
4297a31R5J46j10KR3r7j92K33jJ9q6J57j32m2oN2nR2k6m1m9Q4k1j73J87k7J45
$$ -131 -36 110 0 2 95 -2 -194 39 38 57 -29 128 -4 -46 -52 0 -5 87 61 20 -29 55 34 -139 48 21 166
4324A66j08j70J52r3rJ0L4J02j90R9nM9l5J47k69J53r8j07J84l0l4J51n9j23J41
$$ 166 58 -112 40 -53 -62 -52 -18 84 -106 -7 -12 37 2 149 -120 33 -65 -172 12 -18 -52 99 40 -83 58
4349E8J6j63J02k7M2M1k45K38k25J16J22j37J45k1j83Q7l4J14K3k38J86J7KO3
$$ 58 74 -89 13 -14 28 69 -176 62 -163 -47 75 -62 83 62 -121 -34 -68 46 69 -169 17 34 36 99
4373I9k24J02J68o1j29r3R5j5J69n7l2M6J3K8r9m3Jq2Q0j7l3J79Mj05l4m0J03
$$ 99 -125 -23 145 84 -45 -138 -43 -58 111 54 22 68 81 109 10 -33 -32 -114 -34 -51 -84 95 99 -6 -40 -80 23
4400B3j70J18P2k33J60Q5ol9m3J10Nj01J23J4j18K0k20K40p6N7j01Q6R7j08j11
$$ 23 -147 -29 43 -190 -30 55 49 10 -33 77 82 -19 104 118 0 20 -200 40 -36 21 -80 6 103 -5 -116
4425a16J92j81J95o8kl7O8o2N6P7J02k80J5J62j9r3l2M4J84j64N9j79J49o0J45
$$ -116 76 -105 90 22 20 -17 51 -11 45 122 224 -56 -41 121 102 9 -23 21 205 41 100 -79 70 10 155
4450A55k36o8K68k18k7p2J61j53R3J69k28J29L1K5k8m2j38O4K89pk91J56M8n2
$$ 155 -81 -149 119 -99 -126 -198 -37 -190 -97 72 -156 -27 4 29 1 -41 -179 -115 174 167 -124 32 80 28
4474B8j1o5M7r4J74p5R2q0J24k12kq3q0K45L0m1l5M1j16L51k41qL2N7k6j29l1
$$ 28 17 -48 -1 -95 79 4 96 16 140 -72 -74 -157 -237 8 38 -3 -38 3 -113 238 -3 -11 21 78 52 -77 -108
4501a08K33j20j14n4R3Q1J52l0j04M1l03J23J27n2j09J07M3J56j00k67J50p7J60
$$ -108 125 5 -109 -163 -70 11 163 133 29 70 -233 -110 17 -35 -144 -37 6 162 62 -205 -55 -132 28
4524B8o8L3j79L21l4j13J21k01J49o2Pj2K02lL1j95j9n8n6P5l9l6J27j51K45r7
$$ 28 -40 -7 -186 135 101 -12 109 -92 57 -5 2 -10 192 189 220 25 6 -52 -108 -33 -72 -108 19 -132 113 16
4550A6qM0k1k24O2L7J32n7r8K85j68k78K35L8R3K4j24M8O4j43K6R7j33J67j0l4
$$ 16 8 48 27 -197 -135 -98 34 -23 -121 164 -4 -282 -47 -9 84 108 -16 32 96 -47 -21 76 -57 110 100 66
4576F6j95k7J29j32K17j43J10j35J28n2N0m3Q5J1q4j63K25j3j0p2J7n2R4M9l96
$$ 66 -129 -156 -27 -159 58 -85 25 -110 18 -34 16 -27 58 69 -15 -178 47 34 24 -48 -31 -83 11 60 -336
4601c36K03J21m2o0K42q5J83r5j08L6j28Q7r9J47j7j21K26j82j09J92K2j92J64
$$ -336 -133 -12 -54 -114 128 43 226 131 23 59 -69 18 -81 66 49 -72 154 -28 -137 55 77 -115 49
4624D9n2R0p9n5p8M4K35j86Q5l0pQ0j69J91j09J2m7j25L18j53P8M9q6l0M7j89
$$ 49 -3 87 8 -47 -125 -81 154 -32 53 23 16 96 -73 118 9 21 -26 -151 167 14 92 141 55 25 72 -117
4650a17L3J46j20l9J1K16Q0j89j8o0l8J57Q9l03K73j12Jj70J96K2L0N3k18J14
$$ -117 -84 62 -58 -97 -86 130 210 21 3 -57 -95 62 151 -152 121 9 10 -160 36 58 88 141 -77 37
4674C7p2N8J1R9m9m5k2k39J68N7N4p6n7m7J91K2m2J3K7k07P7P3N0P0q5l0j29O5
$$ 37 -35 23 34 133 84 39 17 -222 -54 3 57 -19 -76 -123 68 90 48 61 88 -119 -42 31 81 151 66 36 -93 -28
4702b8j59P5j6K43j72N3rPn5J82j38K07k25k24L28m3L11j13j75k52K11o1J54j84
$$ -28 -187 -112 -128 115 -57 -4 -13 -6 -61 121 -17 190 -35 -259 69 26 337 224 49 -203 8 -53 101 -83
4726h3J17j15kJ15p6M6J6j09o1P3J58j0q8J22j6k33J6j4m2J79J01j28O2Qr4L4
$$ -83 34 -81 -83 32 -44 2 18 -91 -152 -79 79 69 -19 103 87 -146 -130 -144 -186 -7 94 -34 28 36 -58 -24
4752b4O4j10L1Q1J07l11J44P1r9p4L5p1O9m1K81j76J46p0q3q7J0M37k38j31KQ1
$$ -24 40 -70 -39 42 149 -162 -18 53 -46 -120 -85 -156 -87 -128 153 -23 123 53 -30 -117 -107 330 92 -39 -37 44
4778D4k21J44j64K25n8K3R0rj30l3K07j67J14j53p0J54K20j21k2j93Q6Q4q5m0
$$ 44 -177 -33 -197 28 -30 -7 83 74 -56 -89 118 -49 65 -88 -158 -4 216 95 73 -120 -34 50 -35 -75
4802g5rK95j48j51R2J69k47J84j15p9o8K93l56K26j5O5L7l06J45M0M1n1J53j38
$$ -75 -84 211 63 -88 4 173 -74 110 -5 -84 -152 141 -215 11 -4 61 98 -208 -63 -23 18 -33 120 -18
4826a8P7j70J22q2J98p9j3P4j46j83j6J61q2K04L3k68J57K6jJ06j24q0N4p3K30
$$ -18 59 -111 11 -71 127 48 35 109 -37 -220 -236 -75 -157 47 80 -188 -31 -5 -6 100 -24 -104 -50 -123 107
4851A07o3N3Q9j07m9j5O4k4j65j46P0M9J91l0K3j32J97j67Q3J45k53J89p0n4j21
$$ 107 44 97 186 79 30 15 79 55 -110 -256 -186 -137 54 24 47 -85 112 -55 28 173 -80 109 39 -15 -136
4876a36R6J46o6o5K15j56j48j77J91J48o1P7j08p6K81j67P0N9j24J56k07l0kK24
$$ -136 -40 106 40 -25 190 34 -114 -291 -100 48 -13 64 -44 -120 161 -6 64 123 -1 155 -52 -82 -84 140
4900A40k54J12Q6kk31Q7L2R8o4p0m2J28r9mO2j15n3P0J12J8mKL5k06R8K35n6r0
$$ 140 -114 -2 84 82 -149 -62 -30 68 4 -66 -108 20 -79 -83 -21 -136 -189 -119 -7 11 7 9 44 -162 -64 171 115 25
4928B5j19R8j9k6m5J6j03J63P8j83J88J9o0j15J10j87j7O7K59j33J62Qj33k12
$$ 25 -94 4 -15 -41 -86 -70 -173 -10 68 -115 73 92 32 -83 27 -160 -177 -110 149 16 178 186 53 -159
4952a59J62o4P1m6L6l5M2J5j75J35R8m0J08j66J22k5q6J37j65J0j08m5M8J42K7
$$ -159 3 -61 10 -36 0 -35 7 22 -153 -18 80 40 148 -18 104 79 -7 130 -35 -25 -133 -178 -130 12 39
4977C9j6n0R4p1J4p8J92j56OJ63L5j34j38J05j24K82j45J0O1p1k5j40K00J23n4
$$ 39 23 -27 67 -4 10 -68 124 -32 -26 137 172 38 -100 5 -119 163 18 28 89 18 -7 -147 53 176 122
5002A22o6P0J61k84p3l1J2o6J26K1rQ0Nk4o2K09j13k57K02k2K5P2j20Q6j86J07
$$ 122 56 126 287 3 -70 -101 -89 -155 -29 -8 -17 63 68 44 -18 191 78 -179 23 1 26 98 -22 64 -122 -15
5028a5j42qJ81q7J67j41N6j4q3R6l1j80K22l2l0J16n7p9p2N8P5J60m9j96M9K44
$$ -15 -157 -165 16 -71 96 -45 11 -3 -86 10 -21 -201 21 -11 -41 75 18 -61 -133 -75 0 160 111 -85 -36 208
5054B08Lo0k56K08j63j4j09J60J08J53m01J50N2Q6j14n6K3J79rk08Q2n8M5L1R6
$$ 208 211 151 -105 103 -60 -74 -183 -23 85 238 -163 -13 39 125 11 -45 -22 157 148 -60 22 -36 9 40 136
5079A36j92O2j20L8J10k42J74R1j21O1j13K65o1j03K32q5k25j84K16J50n6K3J38
$$ 136 -56 6 -114 -76 34 -208 -34 57 -64 -3 -116 149 88 -15 217 132 -93 -277 -61 89 33 56 194
5102A94k17j3J0O9j25q6K01p0J91k46M2r4P4m1j5K73j33Rj8L5k5M9R8p1j04j24
$$ 194 -23 -36 -26 43 -82 -168 33 -37 154 -92 -50 -144 -70 -111 -126 147 14 23 5 40 15 64 162 91 -13 -137
5128a37j5M00l52J09J74j96P4k92J54MO8J62j44N8j54N4Q2N2m3n7K3p8K25o5j34
$$ -137 -152 248 -104 5 179 -17 57 -235 -81 -77 -9 153 9 67 -87 -33 49 101 58 1 24 -54 171 106 -28
5153b8N5M9J99j74J0j53J0M8M8m7L5j05J57k85j1K30j03O9j64J14J1j16K73j18
$$ -28 27 76 275 101 111 -42 -32 16 64 17 52 -53 104 -181 -192 38 -65 4 -160 -46 -35 -151 122 4
5177DJ05k59J26q2n4J06k29L04L5n3N5k2P0j6j57Q0j12K59j13Ooj96M6J00j67
$$ 4 109 -150 -24 -106 -160 -54 -283 21 56 3 58 36 106 90 -67 13 -99 160 47 53 47 -149 -103 -3 -170
5202a70J63O5l18K59q3J02j16O3J49q7n1j38K10L0j85J08q5N3l5l3l7J30J1l7
$$ -170 -7 58 -260 -1 -84 18 -98 -35 114 27 -24 -162 48 78 -107 1 -84 -31 -66 -99 -136 -6 5 -32
5226c2N3j18J47j42K36k33N9J68j36Jp8J95k03qK8M0M3k38J86mPL2K9Q6l31J21
$$ -32 21 -97 50 -92 144 -89 -30 138 2 3 -75 120 -83 -91 -63 -23 20 -218 -32 -36 -29 3 32 118 -213 -92
5252i2RJ02jp2J42Jo6k12J93N0j2j73Q3L2j32N5ol9J68n5J09J35j61L2j59J9n
$$ -92 -83 19 18 -54 88 89 23 -189 4 54 42 -131 -48 -16 -148 -93 -99 -138 30 -25 84 219 58 90 -69 -50 -55
5279e5M0r2J25m1J93j57q3J59k22L06k71P2pO3K7o7m0j25J47J20k3o8q0q9J92
$$ -55 -15 -107 18 -23 170 13 -70 89 -133 173 -98 -26 -33 30 57 -10 -50 -175 -28 92 69 1 -79 -168 24
5304B4k79K30N2Q1k88K18J75k28J68j51k4K14l08NJ10j01K8O8n6J66J11m78J31
$$ 24 -255 -25 27 108 -180 38 213 -15 153 2 -22 192 -116 -111 -1 -102 -74 -6 -62 104 215 -263 -132
5327a32K52j01j0M6j04q8K15j10n7j16L1J30K0P7J3j88K49j14m7L3K2j51O6J89
$$ -132 120 19 9 55 -49 -137 78 -32 -89 -205 -174 -44 -24 53 66 -122 127 13 -34 -1 21 -130 -64 125
5351A25j72L1j20J12l5JJ00L7j09N6r1k1j04K01n0K7J77m6j22M4P8k75J55j53
$$ 125 -47 -16 -136 -24 -59 -58 42 79 -30 26 -65 -86 -190 11 -39 -12 165 119 -3 41 119 -156 -1 -154
5375a54J68PO3j35K62k50j26J87j18J77j56L9l3j6j2M3N1q2J63p7l8O4j22J00
$$ -154 14 21 84 -51 211 -39 -165 22 -96 81 -75 -36 -69 -85 -97 -54 -3 -85 78 1 -37 27 -95 5
5399El0k0QJ47j31k0J08Q2q9j84Q1k17J39J78o2M6n8J22k22L7o7l8K46j86J9M9
$$ 5 -25 -45 -37 110 -21 -41 67 149 60 -124 -43 -260 -121 57 -5 41 -17 105 -117 -80 -147 -185 61 -125 -106 -57
5425e7J22M2k2k12q2J92J13J8k01J1K8O9m4o7q3J42R2mm2j04m6K06L8n0K4r4k3
$$ -57 65 107 85 -127 -209 -17 96 114 -87 -76 -48 21 -23 -90 -173 -31 61 57 15 -89 -135 71 109 59 83 -11 -34
5452c4l9K43N4j97J20j32j09m1J28P8K3j23J4L2k4J95l43K44K1K2j72qJ37r5J37
$$ -34 -73 170 224 27 147 15 -94 -135 -7 71 94 -29 -15 17 -7 188 -155 89 110 132 -40 -48 89 -6 131
5477A31p7o7K6n4J31l00K34k5J32j99J08JP7j38j14J05N7K14l32L3J77j06j47
$$ 131 54 -13 13 -41 90 -210 24 -1 131 -68 40 41 118 -20 -134 -29 28 242 -90 -57 120 14 -133
5500a33Q2M9l1m5l2p3N1J82k35K51k08O5K13l2Qr3l5K0j3N5j13K7j28K59k58J83
$$ -133 -51 -2 -33 -78 -110 -183 -132 50 -185 66 -142 -77 136 104 112 19 -16 4 -9 46 -67 -40 -168 91 -167 16
5526A6K7j62J58j89J63n7N9n5R3l0j06N0NR1j43L5M2n5j41R0l3J58j4k5O6l8O7
$$ 16 43 -119 39 -150 13 -44 15 -40 53 23 -83 -33 -28 63 -80 -45 -3 -58 -199 -109 -142 16 2 -23 43 5 72
5553G2j51J76r2j1J83k12N2j1O6r3J08j76K30o1j38K0M7J46j86N4j59K39j91p9
$$ 72 -79 97 5 -6 177 -35 17 6 72 -21 87 -89 141 80 -58 -38 9 155 -31 23 -136 103 -88 -167
5577a67J88j56M5Q4q5K3p2J9O9R0m1l4L6Mj67J33n1N6J2L0j57J74k3q8J99k84
$$ -167 21 -135 -90 -6 -91 -68 -140 -121 -52 38 -3 -37 -1 3 -164 -31 -82 -26 -14 16 -141 33 10 -78 121 -163
5603a63J95L2p4j1R0j47P4j9P8j73M6N6j5rK23j09kp5R5j80j09J21K8kp0J34l6
$$ -163 32 64 -10 -21 69 -78 -4 -23 55 -118 -72 -16 -31 -40 183 74 72 -3 92 -88 -197 -76 -48 -50 -120 14 -22
5630b2q8P2k3Q6m2j39J47k08K0J45m2N6q3Q8P7j46O3j17J59O3K7j33p6K14J21
$$ -22 -110 -38 -61 25 -17 -156 -9 -217 -197 -52 -94 -38 -121 -33 44 -102 -39 -156 3 66 93 -40 -116 98 219
5655B19j50l1j49R7J38j82m0Q1J80k06qRl3J71k37J74k9K8N7j81J4L04j74l0J32
$$ 219 69 38 -111 -14 124 -58 -98 -17 163 -43 -51 -42 -75 96 -141 33 4 32 89 -92 -78 226 52 22 154
5680A54m2j89Q2r2K67r1j17N9m0j11J54j36M8p2lK03k21J81j74l4N9o0J44K08
$$ 154 112 -77 5 -87 180 89 -28 31 -9 -120 34 -102 -54 -126 -129 74 -147 34 -140 -174 -115 -175 -31 177
5704A77j55j06kL9n0L51p3k59L5O9n5rJ2J7J73q0k05O7J81r3N2k18P6J61j10K1
$$ 177 22 -84 -86 -47 -97 254 181 -78 -43 26 -29 -38 -26 -9 164 84 -121 -54 127 34 86 -132 -56 105 -5 16
5730A6j07N1o3J61j50q0lJ03o6J0N9R2k6m5J03K7q5P3j59j08J79kJ15m8n0p4L0
$$ 16 -91 -40 -103 58 -92 -172 -175 -72 -138 -128 -69 23 -3 -48 55 82 -3 70 -89 -197 -18 -20 95 47 -3 -77 -47
5757d7O7j06o1M7J57k44J69pN6R3p0K8Oq8k0K31r4k47Q5m0pK05j93Q5L4j60J40
$$ -47 20 -86 -147 -100 57 -187 -18 -25 31 124 54 82 88 0 -20 211 117 -130 -45 -85 -92 113 -80 5 39 -121 19
5784A9J22j20J50j45m6rJ2N3J9j17J34j52m4L7J18K2k4j23J28r4N0R5j60N3J17
$$ 19 141 21 171 26 -20 -29 -17 36 55 -62 72 -80 -124 -87 31 53 29 -94 34 -60 -10 85 -75 -22 95
5809I5j32J07j33O1J55k13K15l5k61J47k13K63o2J21j17O2j11O9j41N2m2J42Q0
$$ 95 -37 70 -63 -2 153 -60 155 120 -141 6 -207 56 -6 115 -2 60 -51 18 -123 -71 -113 29 109
5832A09q0J2l7J7k1l3j26J32j38R3J37j41Q6r3L6N7p9j17K19k6j1J6Q2J18k46
$$ 109 29 41 4 21 0 -33 -159 -27 -165 -72 65 -76 10 -83 -47 10 -69 -186 33 7 -4 12 94 212 -34
5857c4L1M9j20p0J86k25M2J20j6R9j75J10j37K63j30j40K12kp0J45j48K3J13n9
$$ -34 -3 46 -74 -144 42 -183 -141 -21 -37 62 -113 -3 -140 123 -7 -147 65 63 -7 138 -10 13 126 67
5881F7j25k7K32k24Q0J00k74j4K51P5j13KR9j16Qp6J14r8o4J06r0K5J35j80J56
$$ 67 -58 -85 147 -77 3 103 -171 -185 66 141 28 30 129 13 21 -55 59 -39 -103 3 -87 -62 73 -107 49
5906D9O2j53Op1R6J3n8R3r5M7j45P8J79j15J45j15J47k33J13J28j5k38J07p8l5
$$ 49 111 -42 -36 -107 -11 2 -56 37 -58 -11 -156 -78 101 -14 131 16 163 -70 43 171 156 -82 25 -53 -88
5931h8J06P9j59M7j8K33k9j3p6%L8j01K2o2J00r8j41J34J5qo0m8J83M7N6j40j05
$$ -88 18 97 -62 -15 -33 200 171 158 82 82 120 19 41 -21 79 -19 -160 -26 -11 -19 -79 -127 56 103 159 19 -86
5958h6K2O2L3j6l7j4k16M43k62K77k28j76J45J05Nj5L3N4j48k0M4O9K4j77k4J0
$$ -86 -64 -2 31 15 -22 -36 -252 191 -71 206 -22 -198 -53 52 57 42 75 129 -19 -39 5 74 98 -79 -103 -93
5984i3Q6J28j6n9L6j61P3j41K00l2K0j70J98j45J79j81N3L8q6J71p7m0J19j71
$$ -93 -7 121 105 46 82 -79 -6 -147 53 21 41 -129 69 -76 103 -78 -25 13 -73 98 21 -19 100 -71
6008g1k8P9o4J64k29J84Jj41J69J0j19R4r0J00j39O5J22j85O6j2j22Q0m6M3l4
$$ -71 -99 -20 -84 80 -149 35 36 -105 64 74 -45 49 -41 59 -80 -15 107 -78 -12 -24 -146 -66 -112 -69 -103
6033a03K4M0J58K2j23P1m2M2j98J08K1k96L62N4l6k09P4L1m8j27K37j41N7q8o4
$$ -103 -79 -39 119 141 18 89 47 89 -109 -1 20 -276 86 140 104 -105 -31 0 -48 -175 62 -79 -22 -110 -174
6058a74J80K2j15J38K7k19P8L6p4M5M4o7Q3OR9J9No1L4rK4p7j10n1Q8L9l2n6J68
$$ -174 6 28 -87 51 78 -141 -63 -27 -101 -56 -12 -79 4 10 109 128 133 72 106 97 121 44 -66 -117 -29 10 -22 -78 90
6087I0m5p5O1j08m4J51q3O0L2k7K9o5k5J28j31P9m3J54k04J34j32M9K7k9J80j09
$$ 90 45 -30 31 -77 -121 30 -53 7 39 12 41 -24 -49 79 -52 27 -16 138 -66 68 -64 -15 12 -17 163 54
6113E4j0r6o6o5K47m5jj03J39N5r1o2JN1O0j57K19k39J47k0J08j19m1j9R5m7N1
$$ 54 44 -52 -118 -183 64 19 18 -85 54 109 18 -44 -43 8 68 -89 130 -109 38 18 126 7 -34 -53 42 -5 46
6140D6J4p8N9j09J70j45M9n9K1l3J01Jo6k1L9K3O5j80N6J65k53k9J96m8j04J75
$$ 46 60 -18 41 -68 102 -43 6 -53 -32 -65 36 37 -29 -50 -11 12 77 -103 -47 118 -135 -164 32 -16 -120 55
6166E5o5J2j2P3M3q2o2l0K21j56Kj8o0K18j30o0O3M7k9j18j46L30K7k70J72o3
$$ 55 -10 2 -10 63 106 24 -38 -68 153 -3 -1 -19 -79 139 9 -51 12 59 30 -88 -234 96 123 -147 25 -38
6192c8J43j31K4j06L43q1n5j32j8K5k3Q3J13j16Kj95Q5K29j09J4P3j67M2m6M2
$$ -38 105 -26 -2 -108 235 154 99 -33 -51 -26 -49 34 147 31 33 -162 -77 152 43 57 130 -37 5 -41 1
6217AM3M4j74M9N2O8j74J75n8L5j66p9J99N8j17K2J19J46j43j00m6R9p4l3j1J45
$$ 1 44 88 -86 -37 15 83 -91 84 26 61 -105 -184 15 73 -44 -22 97 243 100 0 -46 53 -21 -54 -65 80
6243H0j59o0M6lo6J64K6J19j97r8J43o1r3J06m8J25r1J11j09j1K24j63P8k4ko1
$$ 80 -79 -139 -93 -96 -162 2 28 147 -50 -148 -5 -66 -159 -53 -101 24 -67 44 -65 -76 148 -15 63 39 37 -24
6269b4p3n8J72j65K47j78K56k72J03J62j66m4O8j95l8J09K12k16PP0lj14K42o9
$$ -24 -97 -155 17 -148 99 -79 177 -95 8 170 4 -40 28 -167 -205 -96 116 -100 -93 -23 -26 -140 102 33
6293C3j25J43q9J53j50m4j03J11%R7J44k65J29K9k19Q4o6K39j74N5K18l30J86
$$ 33 -92 51 -38 115 -35 -79 -182 -71 -71 26 170 -95 34 63 -156 -72 -138 101 -73 -18 200 -130 56
6316E6k17K96r6k24J46p8J36j62J29q5J46J8o4l1j63K13O8N6N2j0k47K9J01r0
$$ 56 -161 135 39 -185 -39 -117 19 -143 -14 -99 47 65 1 -30 -193 20 88 144 196 186 -61 -32 69 -21
6340b1J42o7oP2k54J06JJ17j23o4J24p7M8p0q2J96j62P6J24j04J07k81K78q0O8
$$ -21 121 54 48 120 -134 -28 -27 90 -33 -97 27 -50 -2 -72 -154 42 -120 -44 80 -24 83 -198 80 0 68
6365F8l3j29m1J43k5N1L3L1j38J02q0p2J3K29j47N0m7kL26k52j69O9MQJ52Rj01
$$ 68 35 -94 -135 8 -17 34 67 98 -40 62 -18 -90 -77 152 5 55 8 6 332 80 -89 -20 -16 -8 144 153 52
6392E2kJ9O8o7j27m4K16r5Kr7O8N9j06rJ68o5rj55P2m4l7J53l7J14k44J56n3O6
$$ 52 50 69 137 70 -57 -101 115 20 22 -75 -7 52 -54 -63 105 40 31 -124 -52 -96 -133 20 -17 97 -147 9 -44 22
6420B2l8Q5N8j55p6o0K61j28m9J24J0n6J96l0j53K8k09J82j3j09K4O6n0N5j37
$$ 22 -16 69 127 -28 -104 -164 97 -31 -80 44 54 -2 194 164 11 39 -170 12 -1 -110 -86 -20 -70 -15 -152
6445a52K28j14J04j5k06J77M7k03K6Q9oJ86j44J26j04j84K29M8j57L2J22j82Q7
$$ -152 76 -38 66 51 -155 22 69 -134 -108 -19 -25 161 17 143 39 -145 84 132 -25 7 129 -53 34
6468C4j57Qj61J41l3L35j08j04j4N1K0j35K31q4jj61L9N1o7J25j4r6mqJ9N0J29
$$ 34 -123 -115 -276 -135 -168 167 59 -45 -59 -8 12 -123 108 24 23 -138 -99 -48 -115 10 -4 -100 -104 -112 -93 -43 86
6495H6q5J7k08L04k9k24J80j53J02r1J26L0m9l1J23j45J03q5J05l5M3p4j30J39
$$ 86 1 18 -190 114 85 -139 41 -112 -10 -101 25 55 6 -25 98 -47 56 -29 76 41 84 10 -120 19
6519A9j09K08j30L5r4J6O5K0k5k62L39n0L9j25o4O9J4R3p6r2N4P1N1K9%j01J34
$$ 19 -90 118 -12 23 -71 -55 10 30 5 -257 82 32 71 -54 -118 -49 -35 58 -18 -110 -56 15 66 95 95 -6 128
6546A28n0j73O6m7J39J8k54J32p0L30l62J55K0P2j33j27K44Lk16Q5j0O4J8mj46
$$ 128 78 -95 -29 -76 63 81 -173 -41 -111 219 -143 12 32 104 -29 -156 88 91 -125 -40 -50 14 32 28 -118
6571a18J54k8M0K09l12p1J67p5J21j99K62l6N5j95M2l7m3J00j01R2N8j61j04K46
$$ -118 36 8 48 257 -55 -126 41 -34 87 -112 150 114 169 -26 16 -21 -64 36 -65 27 85 -76 -180 66
6595F6j93J96mM3K1l40J49JMQ0R9k03P8J05k24L0N9r4J91qL1k62K55k09J82P0
$$ 66 -127 69 65 108 129 -211 -62 -61 -57 23 122 -81 -3 102 -122 -92 -33 -127 64 56 87 -175 80 -129 53 123
6621A23j26R9j38M8l74K33J20J49jk55Q2j08K37l4j19J33k8N6j92J72j89O2N4
$$ 123 -3 96 -42 6 -368 -135 -15 134 133 -122 -40 -148 89 55 -64 69 41 97 -95 77 -112 -50 4
6644Dj9M1P6J1k15K84p4m5n2k1Q0j50J86j15j30J68j7p2pM8O9j02J89j47J44j86
$$ 4 -15 26 102 113 -102 182 108 63 11 -10 70 -80 106 -9 -139 29 12 -60 -67 -19 50 -52 137 -10 134 -52
6670e2N5r8J66m8j26J52O4j38K2j02J31k9P7k94J07O5j29J25Q8L4j19O8k6k6j10
$$ -52 3 -95 71 23 -103 49 113 -25 -3 -105 26 -3 74 -220 -113 -48 -177 -52 36 70 -49 19 -7 -33 -143
6695a43Q2J53K5n1k42J72M6Q0n7M2pkj86qP0N8m5p1j39J08J68j81J42o2j32J62
$$ -143 -61 92 117 66 -176 -4 42 122 65 107 100 98 -88 -96 -26 32 -13 -84 -223 -115 53 -128 14 -48 -180 -18
6721a8j34K10o9n9L7m7Q6j3K0K4m1%p9Q6l3J2j92K87j5j27K8P0p1k0J82j52m2
$$ -18 -152 58 -11 -70 -33 -80 6 -7 13 37 -4 -4 -83 3 -30 -18 -210 77 62 -65 -37 33 -38 -58 124 -28 -70
6748g0o2Q6L6l5J12j15J03l5K1L2j62K45j15K3J7j25P7j20O2l2R2o0J20q5o2J38
$$ -70 -132 -46 -10 -45 67 -48 55 20 41 73 -89 156 41 64 81 -44 33 -87 -25 -57 35 -25 95 10 -52 86
6774H6n3n5N3m8q0P6Mr7L4O8R8j98Q1qO5j93m7L08j66jP0pQ3jk8J4ql5j7k6o7
$$ 86 33 -22 31 -17 -97 -21 -17 -114 -80 -12 86 -112 -31 -39 26 -167 -214 94 -72 -73 -3 -10 73 72 44 58 50 15 -2 -28 -95
6805i5J23n2M2o9O5J5J5j45PJK74k5k74P7J33r5K5N0k18J88j56Q1o5K17m5J9o6
$$ -95 28 -24 18 -51 14 29 44 -101 -94 -93 181 156 -118 -41 92 -3 22 72 -146 42 -114 -33 -98 119 74 93 27
6832B7q3R9j12K9N6OR8k32J92n6o3o9J65o5K9o0R3j28j0Q5j0L3o8m7J70k6j17
$$ 27 -56 43 -69 -40 16 22 120 -112 80 24 -39 -108 57 -8 21 -39 54 -74 -84 1 -9 24 -44 -91 79 53 -64
6859f4J83k12l5J11j66K08n9K42n8q9r2J63j84P7j08P4L3L6j37J03q6mM6j49J78
$$ -64 119 -93 -128 -17 -183 25 -34 208 150 61 -31 132 -52 25 -83 -9 24 60 -77 26 -60 -64 -18 -167 11
6884A1O8L7j30N5%M3J5j39Q1J13j86nK43k46l3n0J47jR5o5N5j85J17K8j4j21J14
$$ 11 79 116 -14 41 41 84 99 -40 41 154 -32 -37 206 -40 -73 -123 24 23 118 53 108 -77 40 68 54 -67 47
6911D7j4J45k07J84m9p6K3L3j24K1J2Q7O6m40K20J84l01k3J09J16M4J0k74J34
$$ 47 33 178 -29 155 106 30 53 86 -38 -17 -5 82 148 -292 -72 112 -189 -212 -103 13 57 67 -207 -73
6935g3p8J40lq7o0J70p2N7J8n3R1j70K34k29K50j21K6M5k04K23m2l4r2P1M3j22
$$ -73 -151 -11 -14 -101 -161 9 -63 -6 12 -41 50 -120 114 -115 135 14 40 85 -119 104 62 28 -64 7 50 -72
6961g2J7K10k07Q1J65j62k24J43J70k79K13L1j66J15J01r8J78l87J52l9L03m18
$$ -72 -55 155 -52 29 194 32 -192 -49 121 -158 55 86 -80 35 136 38 216 -171 -19 -58 245 -173
6983a73K87O5r7o5j00J4K12j05L6J47k65J04k1Oj26J61q6j3L51o21N15j09j83
$$ -173 114 179 82 17 -83 -69 143 38 74 221 -44 60 39 45 -81 80 -6 -19 332 -289 226 117 -66
7006f6P1L6L8j20q2J08M6n2R1J0k3j51n2L55j63J8n9j8o2KL4k2J09j01J65j93
$$ -66 5 41 79 -41 -123 -15 31 -21 70 80 57 -94 -146 209 46 64 5 -13 -75 -73 -39 -61 48 -53 112 -81
7032h1L7N3J74k26M5NJ89k41k01J16J59N1j37J33n6j86K21l1j00J05J77l18q9
$$ -81 -44 9 183 -43 2 7 196 -45 -246 -130 29 80 -57 76 20 -166 55 24 -76 29 206 -112 -201
7055b01M28j51R6o7m8j67J53J4N3r1j62K72j62N3J3k31K83J9j02j18J89j3p4k8
$$ -201 227 76 172 105 57 -110 43 57 110 19 -143 129 -33 20 33 -198 85 104 2 -116 73 60 -14 -42
7079d2M3L7n4kj3J9n5L4K1k7J02k44L42j94j20J23J02J4Qj06o2O2j6l6j91R3O0
$$ -42 1 38 -16 -18 -31 -12 -67 -33 -12 -39 63 -181 161 -33 -153 -30 72 86 94 -12 -74 -12 -28 -64 -255 -162 -102
7106a02l2J62K9j32k81K14J13nP3R8o1k11J57k21K19q7N7N3j52R4N9l9ORj04Q2
$$ -102 -134 28 57 -75 -356 -142 -29 -34 39 137 76 -135 22 -199 20 -67 -10 43 -109 -15 44 5 11 20 -84 -2
7132bJ6o8J42k23O7l9J57j60J1N9N0P3j08oJ36J44k98J94k8j01j48K11o6N6k88
$$ -2 14 -54 88 -135 -68 -107 50 -110 -99 -40 10 83 -25 -31 105 249 -49 145 117 16 -132 79 13 69 -219
7157b19K05J70j50L3M7o8K2j54M5J11L2k3m4JmJ12o4N8j29p4%J84j32J86k13j51
$$ -219 -14 156 6 39 86 18 40 -114 -69 42 74 51 7 8 4 116 52 110 -19 -93 -93 91 -41 145 -68 -219
7183b19J85J12r0Q0m08K68K26j64L7K7Q2j9l00J90N8k04Q0Q4q6N7k7J51j42O8
$$ -219 -34 78 -12 68 -340 -72 154 -10 27 54 136 117 -183 7 65 -139 -59 25 -61 -4 -31 120 -22 46
7207D6P6r3l4j22K56j97K64k14K7r1J31K0j15J48j53O4j30P8L2j6J37k35lM3n2
$$ 46 122 29 -5 -127 129 -68 196 -18 9 -82 49 69 -46 102 -51 13 -117 -39 -7 -23 114 -121 -124 -81 -133
7232a33J22k51L39k10l2L03j10J9k21J38J48j81KJ47k42K03M6o2n2N5K1j66L96
$$ -133 -11 -262 77 -133 -165 138 28 47 -174 -36 112 -69 -67 80 -162 41 87 25 -27 28 49 -117 279
7255B79k37p2j6J77r6j04m9J59l5N7j10PJ19j94K7n4K36k59L1Q2J03M4N7l4k18
$$ 279 42 -30 -46 131 35 -69 -118 41 6 63 -47 -40 79 -115 -88 -142 94 -165 -134 -52 51 95 152 118 -100
7280a00Q8n0j1J09l4nJ03N0k12rJ03j01J35k12J48l0O9m4l5l2J13J0q9J34j27
$$ -100 -12 -62 -73 36 2 -3 100 150 -62 -71 32 -69 66 -146 2 -28 41 -3 -38 -70 43 53 -36 98 -29
7305b9K3J64k2j01r9K9J41J47k91K3Q8j96R2j47R7Q5Q4kj72K92j98R1j07O0j92
$$ -29 -6 158 136 35 -64 -35 106 253 -38 -15 73 -123 -31 -178 -81 4 88 86 -86 206 8 99 -8 52 -140
7330a40Lm8K64No7P3k55K34R3l74N0L54j25j01RL4nnM4j53K89l35R1Q2P7j25J1
$$ -140 -137 -185 79 84 17 90 -165 69 162 -212 -162 192 67 -34 -25 9 4 -1 43 -110 179 -156 -65 17 94 -31 -20
7357b0p8R4R3j9j07Q3j90qL51j01j89n0J29J16m8M3p9p4K2O1k58K11M8m3m4O5
$$ -20 -98 -4 89 70 -37 46 -144 -152 199 98 -91 -141 -12 104 56 99 20 -54 -32 29 -229 -18 30 -13 -57 8
7383Hm4Q7n6L1j03M7RO4m5N4Mj90O0q1o5R7K31n8R6l42O4l8K28j68OO9N8M3j51
$$ 8 -36 51 -5 26 -77 -30 -21 43 -2 52 56 -134 -74 -155 -220 -123 108 50 146 -196 -132 -170 58 -110 -104 -35 23 66 -85
7412h5J60m2qm2L7L1R6j44m7J39l67L18l5p5L9J7J8j1k0j50J71n9qO7j21K16n8
$$ -85 75 33 25 -17 20 51 147 3 -44 95 -272 46 11 -64 -25 -8 10 -1 -21 -171 0 -59 -67 0 -121 95 37
7439C7q3O3n7l9k1K19n5J5k26K5J07p0K20k47M4K03j26j5%l70L20J07k3l3%j09
$$ 37 -46 17 -40 -79 -100 119 64 79 -147 -122 -15 -85 135 -112 -68 135 9 -6 -6 -376 -56 51 28 -5 -5 -114
7465a14r6K35N4N5l36L62j29n9J30j62m3K87j05p8O8j09J26p0O4p3P7j08O9J45
$$ -114 -210 25 79 134 -202 160 31 -28 102 -60 -103 184 79 1 69 -40 86 16 80 7 84 -24 45 190
7489A90k18r8J1J40o0O4m2J5j05j1J52j8n8m9K81k54p9j31J74K03j67M4n6K22
$$ 190 -28 -126 -115 25 -35 29 -13 2 -103 -114 38 20 -38 -87 194 -60 -139 -270 -96 107 -60 -16 -72 150
7513A50k07J06k3J47k16J25j81P6J77j26j91J94q4J63j99p4L23j35N4j49J18L6
$$ 150 -57 49 26 173 -43 82 -99 -23 154 28 -163 31 -53 110 -89 -163 160 25 79 -70 48 84
7535H4n8q8K68k43J0R5j29K37j74m8R1o2j41J39j5J76j10p4r7K03o8J68k23J23
$$ 84 26 -62 206 -37 -27 68 -61 176 2 -46 45 -17 -158 -19 -34 142 32 -42 -139 64 -4 164 -59 64
7559F4O0j97O0J51j92J1N8p0q8N9M4k8K08o1j46Q2J40j58J9o1r6J13J61k34J54
$$ 64 124 -73 -13 138 -54 -43 15 -55 -143 -84 -40 -68 140 79 -67 15 155 -3 16 -45 -141 -28 133 -101 53
7584E3p4j1L0j11J82k5q9L0J57k33K82m32K87J5j03m2j15K20K00k45k4n2J8J45
$$ 53 -21 -32 -2 -113 69 44 -45 -15 142 -91 191 -241 46 61 -42 -84 -199 21 221 -24 -48 -100 -82 63
7608F3j42J22o3O1j87R1P5r6J14q0K15k49R2J19m36L15J01j29M9L3j28j09K30
$$ 63 -79 43 -20 41 -146 -55 20 -76 38 -42 173 -76 16 135 -301 14 115 -14 35 68 -60 -169 61
7631F1l9J12k34J9J19m3P2l4n2k8mO2M0n5K22j36o5o6L1J7J7J40j86K8J94k16
$$ 61 22 134 -100 -81 38 -5 67 33 -19 -47 -51 11 51 -4 218 82 17 -49 -18 -1 16 156 -30 -2 192 -24
7657b4R5l4n0l2J16J1q6l6j10N7j8J08l3J35j57Q6m1j12k4K24j34r0M07j02j31
$$ -24 71 37 -13 -45 71 82 -4 -40 -150 -93 -111 -3 -36 99 -58 28 -13 -125 -149 75 -59 -149 258 156 25
7682B5J3L4L5l10L94j28j60K24k7o7O1j89J63m9n1J11k11R9p9j23N1J96m5J57
$$ 25 38 72 107 -203 191 63 -97 127 100 33 94 -95 68 19 -32 79 -132 -33 -112 -235 -184 12 -33 124
7706A24j43j16J69j53R9J62k13N9k1N7l8l0J98k27J34l9M3l1m3J51k74J19N1J3
$$ 124 -19 -135 34 -119 -20 142 -71 -12 -33 24 -14 -44 154 -73 61 22 65 34 -9 142 -132 -13 38 51
7730E1pL0j73J01j7K11k49JK1q8R3J77r6q1p7K72j36Lj10j07K23K3j2J6j14j11
$$ 51 44 74 -99 2 -15 196 -53 -52 -31 -119 -26 151 55 -26 -103 169 33 36 -74 -181 42 65 53 69 -45 -156
7756a56K02k2j23P8j9L8Qkj66N9K16j59P6q9K27k66J67j2k2P2j42K1L9j57J16
$$ -156 46 24 -99 -21 -40 -2 6 4 -162 -103 113 -46 30 -59 168 -98 69 57 35 107 -35 -14 25 -132 -16
7781a6J09o4o4J19L2l8p0P8j81K48j04J09J7l11P1O8k6J0P8Jj00m8K26k59O3J73
$$ -16 93 29 -35 84 116 78 8 86 -95 153 49 158 175 -136 -65 3 -23 -13 65 66 -34 -82 144 -115 -52 121
7807A21k56J4M5R3o1J8n7m9K84k46O6J49n6j41J65%j69j23J05p1J28K35l02pK14
$$ 121 -135 -121 -76 17 -44 -26 -83 -132 152 -94 -28 121 65 -76 89 89 -80 -203 -98 -169 -41 194 -108 -115 99
7832I9O9j43m8p0L8o4J93J6p5J5P8l7j08M4n4j3JK01k17R0j65J85QQ3k12J13J03
$$ 99 168 25 -23 -93 -55 -119 74 90 15 30 108 71 -37 7 -47 -60 -59 142 -75 15 -150 35 43 126 -86 27 130
7859A30k43J33n9J41k4J0K2r5j01N1j40L78j87q8KP7J15q2j47R8J2Q1N6k30L6
$$ 130 -113 20 -39 102 78 88 110 15 -86 -35 -175 203 16 -72 -70 7 122 40 -107 -9 3 84 140 -90 -54
7884e4m3J30rj83K98j16j64J76j6r5J61pr7J9n6J75N6j37J52k00O9N9r0q6M0R5
$$ -54 -97 33 24 -159 139 23 -141 35 19 -76 85 78 -19 0 -56 119 175 38 190 -10 59 118 28 -58 -18 77
7910G7K1k4k3j83K75j15K0l9m6n6J62j8j01NL6NM3j82J20J4Q7R6j36p1J14j26
$$ 77 98 74 51 -132 143 28 48 9 -37 -93 69 51 -50 -45 -9 -4 39 -143 -23 -9 78 174 38 -33 81 -45
7936d5M8l3o7J61j12l2N1l7mJ11J1r7Q3l4K9J21n0R6j67k3J31n9%nM6k38J48K6
$$ -45 3 -30 -97 64 -48 -80 -29 -66 -70 41 52 -45 38 4 33 154 104 200 33 10 141 82 82 77 123 -115 33 59
7964E9J2p9kJ93k3l7m17M72q9j29J80k80R4K21k75J73oO8j19o6N2j03J03o3jj01
$$ 59 71 -8 -10 183 160 123 -294 178 89 -40 140 -140 -46 175 -100 73 67 135 16 -50 2 -101 2 -61 -62 -163
7990a63K24k7J51j89rJ21j57k9J68o1Rj1J20j51Nj41J97p2l1q0K15j55R4l5LQ8
$$ -163 61 34 185 -4 -13 108 -49 -78 90 29 38 27 147 -4 1 -140 57 -15 -46 -126 89 -66 28 -7 -4 84
8016H4k12J59J16j62Q0P3j68N1k05J30O0J01j06m1j54K83j05N4k5ln6o4K12r0
$$ 84 -128 31 147 -15 65 138 -30 21 -184 -54 6 107 1 -40 -194 89 -16 38 13 10 -46 -110 102 12
8040A2M7k8Kj41K72N0k14M1N8l9k8p3Q3j81K24j4j03L1l5j0Q1J3j5k8rm5P9j04
$$ 12 59 31 33 -108 164 214 0 41 99 60 32 -41 42 -139 85 71 -32 -1 -36 -46 35 48 33 5 -4 -49 30 -74
8068g4O7R1pJ9j05O9K4k3j77J73k08J78M7j12J29J0j37J47o8r7K8N8O0j2r6q9
$$ -74 -7 84 77 96 -9 60 84 61 -116 57 -151 27 74 -38 91 101 -36 111 43 -54 -26 32 92 80 -16 -105
8094a05J22Mj4j70J95k57K63M6J7l5j95Q8j61J38J89k94J71j1j91J83o5J95j39
$$ -105 17 21 7 -163 32 -225 38 84 101 66 -129 -41 -202 -64 125 -169 2 -9 -200 -17 -82 113 -26
8117b6L6j35K77l06J58M8P0r3l6L1K2j20J15n0J00j44n8R6J86l26J09N1P0j90
$$ -26 10 -125 152 -154 4 52 122 29 -7 24 46 -74 41 -9 91 -53 -111 -15 171 -155 -46 5 75 -115
8141a15J21K00j51j40J55k3k4r7J54j00M4n7R7q9J16j7P3j22j36M8O1J5r2L08
$$ -115 6 206 55 -85 70 47 23 -74 80 -20 24 -33 64 -25 91 74 147 25 -111 -63 -2 13 -79 229
8165B29j91jq9j39O4J6J67r5K26k83J35J0j75L3J91j61qQ9PJ59j6k59l3J28n3
$$ 229 38 37 -52 -191 -127 -111 56 -39 187 -96 39 49 -126 -93 98 -63 -71 18 25 184 168 -91 -124 4 -49
8190d9j42
$$ -49 -191
8191a91
$$ Imaginary data points
##PAGE= N=2
##DATA TABLE= (X++(I..I)), XYDATA
0@%%%%%%%%%%%j6K1k1L2l2L2m8O4p3Q9j12J28j44J76k08K40k73L21l69M18m82
$$ 0 0 0 0 0 0 0 0 0 0 0 0 -16 5 -16 16 -16 16 -32 32 -41 48 -64 64 -80 96 -112 128 -145 176 -193 225 -257
32b57N46o19O99p86Q83r92J113j239J378j532J700j884K085k306K546k807L094
$$ -257 289 -330 369 -417 466 -526 587 -652 726 -806 894 -990 1095 -1211 1335 -1472 1622
49A622l408L756m140M562n034N561o154O829p602Q499r556J0822j2366J4306j6829
$$ 1622 -1786 1970 -2170 2392 -2642 2919 -3235 3594 -4008 4491 -5065 5757 -6609 7697 -9132
64i132K0258k5221L3089m7543Q2945l31525o37105J64966M21795N65974L03937
$$ -9132 11126 -14095 18994 -28549 54396 -277129 -914234 -749268 -327473 238501 542438
75E42438J8081k58565k76358j81728l626M2650R124q2889n6373O0073K28378K75816
$$ 542438 560519 301954 25596 -156132 -159758 -117108 -107984 -190873 -247246 -187173 41205 317021
87C17021J79222n6857k76042l75268k63642k0350K28350L18568K35997N0889r5039
$$ 317021 496243 439386 163344 -211924 -475566 -495916 -267566 51002 286999 337888 242849
98B42849j45067j04513m6385j5889l2328n2197k8759O0803J57761J80337Q2528
$$ 242849 97782 -6731 -53116 -69005 -101333 -153530 -182289 -121486 36275 216612 299140
109B99140p6168j91906j85777p3850O4189J36471J05840N421p7998p2132J9128
$$ 299140 222972 31066 -154711 -228561 -164372 -27901 77939 83360 5362 -66770 -47642
120d7642J10757J11968O034j27877j90285j30752J6496J61108K10735J29947l1385
$$ -47642 63115 175083 181117 53240 -137045 -267797 -251301 -90193 120542 250489 219104
131B19104j62727j71715n9980P9245J37014P5660m9833j39166j18735P181J54136
$$ 219104 56377 -115338 -175318 -96073 40941 116601 66768 -72398 -191133 -183952 -29816
142b9816K10584J20279o5316k18783k33289j03498P9118J98122J90711P8083n8609
$$ -29816 180768 301047 235731 16948 -216341 -319839 -240721 -42599 148112 226195 167586
153A67586j30937j03305j4961N3698M8344j3231o4516n2464J8253R5071J20041
$$ 167586 36649 -66656 -81617 -27919 20425 7194 -57322 -109786 -91533 3538 123579
164A23579O8975l3654j25044j44155p6104L3237J10260J09408M7362k3704n6688
$$ 123579 192554 158900 33856 -110299 -186403 -153166 -42906 66502 113864 90160 33472
175C3472m1089j569K3626J0847l0041n8163l6940K7474Q6965Q9229K8985n1922
$$ 33472 -7617 -9186 14440 25287 -4754 -62917 -99857 -72383 14582 103811 132796 80874
187H0874r6374p6430q602N9091P9764L9939k9879p3906n5203J0569P0826P7644
$$ 80874 -15500 -91930 -100532 -41441 38323 78262 48383 -25523 -80726 -70157 669 78313
199G8313K8122m1953q4640p2732j4235N1677P8241M7832j3908n6251m5810N108
$$ 78313 106435 64482 -20158 -92890 -107125 -55448 22793 70625 56717 466 -45344 -40236
211d0236N1617N4070Q752n4069q8441o4770R514Q8174J16176P0897j6688q7796
$$ -40236 11381 65451 74203 20134 -68307 -133077 -123563 -35389 80787 151684 134996 47200
223D7200j00985n7567O339N0458N5629K9593j27q197O674K2110J0709k7213o3199
$$ 47200 -53785 -111352 -105013 -54555 1074 30667 30540 22343 29017 51127 61836 34623 -28576
236b8576o6374k6581L4715Q2439Q9472N0253j7398p3477q6067n1132L741M0156
$$ -28576 -94950 -121531 -86816 -4377 85095 135348 117950 44473 -41594 -92726 -88985 -48829
248d8829M3928K5903P106J354O590J1354J741k4507n2451n4550j8372L7557P5710
$$ -48829 -4901 21002 28108 29462 36052 47406 49147 24640 -27811 -82361 -100733 -63176 12534
261A2534O9715K4841k9579o3445o0824k7338J5951L9398L3273P896j0661p452
$$ 12534 82249 107090 77511 14066 -46758 -74096 -58145 -18747 14526 22422 11761 4309
273D309P319J4438M742j5202l1790l2434j2578K0656M7211M5700J3856k6223m6811
$$ 4309 11628 26066 30808 15606 -16184 -48618 -61196 -40540 6671 52371 66227 40004 -6807
286f807l6171o543K1635L2143K1430k479k2058k0956j47K1277K2366J827k0852
$$ -6807 -42978 -49521 -27886 4257 25687 23208 1150 -19806 -19953 1324 23690 25517 4665
299D665k6029j2430R335K4386K3962P522j5332k6999j6794O930K3311J8852L08
$$ 4665 -21364 -33794 -24459 -73 23889 31411 16079 -10920 -27714 -20784 2527 21379 21687
312B1687j6401j9876j0268O188K0625K2473P771j5032k7013j7790L398J9164J8988
$$ 21687 5286 -14590 -24858 -18670 1955 24428 32199 17167 -9846 -27636 -24238 -5074 13914
325A3914P713o216j5096j2913j46J3348J4933J000j5878j8611m127J3852K0991
$$ 13914 21627 15411 315 -12598 -12744 604 15537 16537 659 -17952 -22079 -8227 12764
338A2764J4324j793j6979k3229j4832M807K1302K1647O319r971j4603q955o21
$$ 12764 27088 25295 8316 -14913 -29745 -24938 -3636 18011 24330 14359 -244 -9199 -9820
351i820M119O005K446m196p470j610R794J5532P680q268j8343j6980o931P246
$$ -9820 -5701 304 2750 -1446 -8916 -10526 -732 14800 22480 14212 -4131 -21111 -28042 -20796
365b0796J8679K0627R458q983j9711j5304j376Q718Q015K314j487j579N38M326
$$ -20796 -2117 18510 27968 18985 -726 -16030 -17406 -8688 -673 1641 154 -1425 -887 3439
379C439O792K861p128j5646j2005J576J4260J5874R213n11q999j3658j1542j625
$$ 3439 10231 13092 5964 -9682 -21687 -20111 -5851 10023 19236 18725 9726 -3932 -15474 -17099
393a7099R086J2012N818k508m549k478N17Q60M07j168m082n413n58Q007J2470
$$ -17099 -8013 3999 9817 7309 2760 282 799 1659 2066 898 -3184 -8597 -9155 -1148 11322
408A1322N913n569j2411j0473k785M029R369R203M065l783q494n395P74L289N49
$$ 11322 17235 11666 -745 -11218 -14003 -9974 -605 8598 12663 8880 386 -5009 -4235 -946 -397
423c97k218j344J447L008L098L180J582l098q237p526j913N502P665N495K025
$$ -397 -2615 -3959 -2512 496 3594 6774 8356 5258 -2979 -10505 -12418 -6916 749 6244 8269
438H269j338m222n570k341K218L210q81m189k555K916O588N784J984k011n483
$$ 8269 6931 2709 -2861 -5202 -2984 226 -655 -4844 -7399 -4483 2105 7889 9873 7862 2379
453B379p851n767j76M904N878L241J549K484K142r44m732n586m491l515j637K460
$$ 2379 -5472 -11239 -11415 -6511 -633 2608 4157 6641 8783 7839 3107 -2479 -6970 -10485 -12122 -9662
469i662P666R832P063J581l880p302j0118r387m741L018Q367J0148R234P147K915
$$ -9662 -1996 7836 14899 16480 12600 5298 -4820 -14207 -18948 -15930 -7563 2585 11819 18966 21881
484B1881n184j2945j5428j0876j495P091J3206J4402J0290K051o290j0035r618
$$ 21881 16697 3752 -11676 -22552 -24047 -16956 -3750 10652 20942 22993 16703 6668 -2950
497b950p914n980k920K840R723J2880J1641P004P7q929j6164j8282j1393P36J2410
$$ -2950 -10864 -16844 -19764 -16924 -7201 5679 17320 24324 24401 15472 -692 -18974 -30367 -29631 -17221
512a7221J8264J7341R991j297j2263j6073j2510m987R19L758N096P109Q893P464
$$ -17221 1043 18384 28375 27078 14815 -1258 -13768 -18755 -17836 -14078 -8982 -1873 7020 14484
526A4484M384j4o088j2276j5205j1525j797R130J5857J7277J3296L539q745j8455
$$ 14484 18868 18854 12766 490 -14715 -26240 -28037 -18907 -3050 14227 27523 31062 22317 3862
540C862j9390j1024N56Q975J2729J1999P999J887l285n080m554m988p322q163
$$ 3862 -15528 -26552 -25996 -17021 -4292 7707 15706 17593 14308 9228 4674 -314 -7636 -15799
554a5799m577K196Q596J3739J5104J1908N76j4261k3793k1794r418O619J8606
$$ -15799 -20376 -18180 -9584 4155 19259 31167 31743 17482 -6311 -28105 -37523 -30904 -12298
567a2298K3045J7069L812r884j6444j2868m863L04J092J27O04K906O848J1573
$$ -12298 10747 27816 31628 21744 5300 -7568 -12431 -12127 -11035 -10908 -10304 -7398 -550 11023
581A1023J3119P057o720k0915k5851j7877j178J6294K7170K7160J4100n799k1687
$$ 11023 24142 31199 24479 3564 -22287 -40164 -41342 -25048 2122 29282 43382 37583 15896
594A5896k4749j5669l217N322R586R789P520M966L660M314L108l498j2850j9101
$$ 15896 -8853 -24522 -27739 -22417 -12831 -3042 4478 9444 13104 17418 20526 17028 4178 -14923
608a4923j5989n872P470J9996K6781K2722O857j3836k7920k8349j7294q98J4178
$$ -14923 -30912 -36784 -29314 -9318 17463 40185 47042 33206 5286 -23063 -40357 -41255 -27077
621b7077K3583K2393J1585k146j1185j1746q531n718m132k863j156N82N556J3245
$$ -27077 -3494 18899 30484 28338 17153 5407 -3124 -8842 -12974 -15837 -16993 -16411 -10855 2390
635B390J9138J5604N04j7475k8534k6605j2880P912K5858L2295K2388J088j6988
$$ 2390 21528 37132 37636 20161 -8373 -34978 -47858 -39946 -14088 18207 40595 41683 24695
648B4695k3320j6968o465L027Q058O983K462r55J534Q845J2277P070o056j7806
$$ 24695 1375 -15593 -22058 -19031 -10973 -3990 -1528 -2483 -949 7896 20173 27243 21187 3381
662C381k2695j7145k978J4918K7698K6625J1980p795k0397k2082j5032n353N643
$$ 3381 -19314 -36459 -39437 -24519 3179 29804 41784 33989 13592 -8490 -23522 -28875 -23232
675b3232J1961J2635Q046L008J288J037j314n722r897j0966r002m067N115J5421
$$ -23232 -11271 1364 9410 12418 13706 14743 13429 7707 -2190 -13156 -22158 -26225 -21110 -5689
689e689K1065J6905L869j1196k1263k2681j6597j920J3862K3522K1577J0407l048
$$ -5689 15376 32281 36150 24954 3691 -18990 -35587 -37507 -23645 -123 21454 31861 28813
702B8813j2811j6138j3368o160K111O521O151L550L650O583Q247M115l728j2652
$$ 28813 16002 -136 -13504 -19664 -17553 -11032 -4881 -1331 2319 8902 17149 21264 17536 4884
716D884j7300j5626m729J0539K2481K2398J1181m876j6268j9268j4157l776O755
$$ 4884 -12416 -28042 -32771 -22232 249 22647 33828 28952 12684 -6584 -20741 -24517 -17762
729a7762J2444J1311M363j227k526j399k75j340l327n051n983l339K394Q516J1971
$$ -17762 -5318 5993 10356 9129 6603 5204 4929 3589 262 -4789 -10772 -14111 -11717 -3201 8770
744H770P271l25o711r026p875m380O03N026O161M506J534k53m89j194j894k169
$$ 8770 16041 15716 9005 -21 -7896 -12276 -11673 -6647 -486 4020 5554 5301 4812 3618 1724 -445
760d45j239r73k234k194k11L896O096N986L002r25n248q644q112l410K983P772
$$ -445 -1684 -2657 -4891 -7085 -7296 -3400 2696 8682 11684 10759 5511 -3133 -11245 -14655 -11672 -3900
776c900Q440N911J902k816o142o625m010N9J805J319Q57K390M175M092K385j014
$$ -3900 4540 10451 12353 9537 3395 -3230 -7240 -7181 -5376 -4057 -3200 -810 3365 7457 9842 8828
792H828m747p844p243k747L643Q605Q311M487m14l854n992n940l198M40L078L588
$$ 8828 4081 -3763 -11006 -13753 -10110 -1505 6806 11293 10879 7025 1033 -4907 -8105 -7665 -4587 -999
808i99K405J715J656L78j180k597k644k266j701l34K108M212L465R08j317k007
$$ -999 1406 3121 4777 5155 3975 1378 -1266 -3532 -5233 -5567 -3459 753 4218 5126 3809 1802
824A802j759j806r56k74Q16J026N43R77J585J365n55j822j731k88r5q62o93M72
$$ 1802 43 -1763 -2719 -2993 -2177 -1151 -608 369 1954 3319 2764 942 -789 -1077 -1172 -2034 -2727 -2255
842b255J779J698J063J038L33j531k695l176r69Q67J977K192K510K195j88k302
$$ -2255 -476 1222 2285 3323 3656 2125 -570 -3746 -4715 -3848 -1871 321 2831 5026 4838 2536
858B536l357k134m79j49M76J627K964K334N39p96j669k224k996k017P85L178L276
$$ 2536 -821 -2955 -3434 -3583 -3107 -1480 1484 3818 4357 3561 1892 -332 -3328 -5345 -4560 -1382 1894
875A894J442K68l71j131k455k474j298J118J346J587J704J779N83j709k831j824
$$ 1894 3336 3604 3233 2102 -353 -2827 -4125 -3007 -1661 -74 1630 3409 3992 2283 -548 -2372
891b372l79j8L30J448K702K126j17k066k169j211p79l06P86K281J849L99o98n29
$$ -2372 -2751 -2769 -2439 -991 1711 3837 3720 1654 -515 -1726 -2505 -2811 -2025 256 2105 2504 1806 1277
909A277p55j479j770l11J650K235O78P7p5j78j042j774o29O15Q71L71N43R69J068
$$ 1277 522 -957 -2727 -3038 -1388 847 1525 1602 1527 1349 307 -1467 -2096 -1481 -610 -239 304 1273 2341
928B341o44j693j371R7N07n6j91J242J421R7r55p15k54l88q06j9J248J199k73
$$ 2341 1697 4 -1367 -1270 -763 -819 -1010 232 1653 1750 795 80 -174 -562 -1368 -1387 -139 1060 787
947G87p08j54Q83l2j216q38J85P75L03K45L28R14j84j255j037J35N25k85k9Q52
$$ 787 79 -75 808 776 -440 -1278 -1093 -318 -15 230 558 1472 1288 33 -1004 -869 -344 -629 -658 194
967A94J107R9j308p97K55P23m84n89qQ76K43l7K26O37m99j258j283K69J515J111
$$ 194 1301 1400 92 -705 -450 273 -211 -800 -808 68 311 274 500 1137 638 -620 -1903 -1634 -119 992
987I92m16K08K49l24j105q66J76Q20J54m40L61J023O38n34o56n04l04r03o87Q86
$$ 992 576 784 1033 709 -396 -1262 -1086 -266 -112 -552 -191 832 1470 936 280 -224 -528 -1431 -2118 -1232
1007a232J809J653k49r05j021j95q07l44L6N49N72l74O62J604Q72r05k175j763
$$ -1232 577 2230 1981 1076 55 -140 -947 -1291 -1255 -706 -134 -508 154 1758 2630 1725 -450 -2213
1025b213l29O32N83J508J393P18p49j158n79J37m44o80n12K0R45P21J212J362
$$ -2213 -2542 -1910 -1327 181 1574 2292 1543 385 -194 -57 -501 -1181 -1693 -1673 -728 -7 1205 2567
1043B567Q30j220k704k291n61R59J498J278R91O49J04q21k20p33j167k008j209
$$ 2567 3397 2177 -527 -2818 -3379 -2420 -922 356 1347 1996 2100 1279 1059 326 -841 -2849 -4058
1060d058Q34K560L068J651k96j397k120k376j240M85J455R92L74M59J234J495
$$ -4058 -3224 -664 2404 4055 3759 2362 242 -2134 -3374 -2889 -1434 -442 -68 391 1625 3120
1076C120M60j070k300k840k418q69K232M630M650J176k216l990l380j400N62K121
$$ 3120 3580 2510 210 -2630 -5048 -5917 -3685 945 5595 6771 4555 565 -2815 -4215 -3653 -1532
1092a532J932L88p02o07R67K114J336q84k911l323k166j80K593M200L765J103
$$ -1532 400 788 86 -521 446 2560 3896 3012 101 -3222 -5388 -5568 -2975 1225 4990 6093
1108F093k040l335k363j595m92R60J396J735R86K77O78M26k55j476k523j464j86
$$ 6093 4053 718 -1645 -3240 -3732 -2772 -1376 359 1345 1622 2300 2726 2471 995 -1528 -2992 -3178
1125c178O23P45J357K100J850P25k70j431l013m105k973L24M493O145M247M14
$$ -3178 -2555 -1810 -453 1647 3497 4222 3952 2521 -492 -4597 -7570 -7246 -2753 3392 7639 8053
1141H053l107n212m493j714J798M070K730k04k228j117J734K707K326l42l455
$$ 8053 4946 -266 -4759 -6473 -4675 -605 2125 1921 -307 -1424 310 3017 5343 5001 1546
1156A546o027n204n44N661Q632O789M77n010p598o085k177L185N988M813M13l081
$$ 1546 -4481 -9685 -10229 -4568 4064 10853 11330 6320 -1278 -7363 -9540 -6355 -367 4446 4859 1778
1172A778k789l67K083K299Q4j541l648l781j018K556N781N047J184j882l919m403
$$ 1778 -1011 -1378 705 3004 3088 1547 -2101 -5882 -6900 -4344 1437 6484 7668 5786 1867 -2536
1188b536l083q94K022L752L197J145k8n49j060k231k041l72R98J002j73m87J07
$$ -2536 -5619 -6513 -4491 -739 2458 3603 3575 3026 1966 -265 -2306 -2678 -1680 -678 -851 -1338 -1231
1205a231J000J757K196K125r14m313o527m067J184O214P396N155J27m927p645
$$ -1231 -231 1526 3722 5847 4933 620 -5907 -9974 -8790 -2576 4820 9975 10102 5175 -2470
1220b470n895n38N082O044K933j640l704k777L95L276M245J791l362p270o118
$$ -2470 -8365 -8903 -3821 2223 5156 3516 -188 -2965 -2570 706 4951 6742 3380 -3890 -10008
1235a0008k7O144Q567N840M48n335q183o314p95M823O579L800r08k988k490p29
$$ -10008 -10035 -3891 4676 10516 10964 5629 -2554 -8868 -9663 -4840 1739 5539 4631 1643 -847 -1576
1251a576J059J699J312j143l258k729J67L055L698K235J33j280k768k883j856
$$ -1576 -517 1182 2494 1351 -1907 -4636 -4469 -1414 2284 4519 4652 3372 604 -2279 -4135
1266d135J61J536J770J465J669J181J87k137l223k166J21J606K025J737J86j635
$$ -4135 -3974 -2438 -668 797 2466 3647 3834 1697 -1526 -3692 -3571 -1965 60 1797 1983 348
1282C48j849j38K559L033O25l442m808l188L6M047O363M971J58m886p280m370
$$ 348 -1501 -1639 920 3953 4578 1136 -3672 -6860 -6824 -2777 3586 8557 8715 3829 -3451 -7821
1298g821P28M527N023K449j374l095k979l24L101L749P89l466n122l334J180M803
$$ -7821 -7093 -2566 2457 4906 3532 437 -2542 -2866 235 3984 4773 1307 -3815 -7149 -5969 -1166
1314a166N648L365q14n110o027k581J687M084L551O16j555j819r57N94J692Q90
$$ -1166 4482 7847 7033 1923 -4104 -6685 -4998 -914 2637 3253 1698 -121 -1078 -484 1208 2098
1330B098q23k719k403L98K402L108J427o98j919j935r44N42J344Q79r24j291n43
$$ 2098 1275 -1444 -3847 -3449 -1047 2061 3488 2790 871 -1064 -2008 -1466 -122 757 -167 -1458 -2001
1347b001J811K268J527j139k592k502j351J222K745K692O56j969k991p69J377
$$ -2001 -190 2078 3605 2466 -126 -2628 -3979 -2757 -12 2680 3336 1367 -1624 -2393 -1016
1362a016K581J152q89k610k701n61K168L832K956J58l633m197j887J056L150K963
$$ -1016 1565 2717 1828 -782 -3483 -4044 -1876 1956 4912 5070 1437 -2760 -4647 -3591 -441 2522
1378B522P46j391k744j918Q50K630K204j7l073l053r25J905L401K943M17k441
$$ 2522 3268 1877 -867 -2785 -1935 695 2899 2882 -191 -3244 -4169 -2264 1137 4080 4497 2056
1394B056m005k310P09L169K982M31j849k387j203P13K202J833L67j873l150j403
$$ 2056 -1949 -4259 -3550 -381 2601 3032 1183 -1204 -2407 -1694 508 2341 2708 835 -2315 -3718
1410c718J398L142K276pj938k443j392N94K064K322M48k017k538j077J399K486
$$ -3718 -2320 822 3098 3091 1153 -1290 -2682 -2088 -24 2298 2746 729 -1809 -2886 -1487 999
1426I99J750J6j851k516j275O61K529J999R5j847k191n96J457K025R01o51j887
$$ 999 2749 2765 914 -1602 -2877 -2216 313 2312 2407 560 -1631 -2227 -770 1255 2156 1505 -382
1443c82j841o08J631K978J622q82k671k529j56J412K250J518n8j724k263q73J504
$$ -382 -2223 -2831 -1200 1778 3400 2518 -153 -2682 -2838 -1426 824 2342 2284 560 -1703 -2576 -1072
1460a072K475J244j049k139j601m82J605K343J799n45k482k890p98K112K787J661
$$ -1072 1403 2647 1598 -541 -2142 -2624 -1019 1324 3123 2578 96 -2794 -3592 -1480 1307 2968
1476B968p08j769j942j073R08J859K138K2k374j692m97J474J742Q25l39j570j546
$$ 2968 2260 491 -1451 -2524 -1616 243 2381 2403 29 -1663 -2160 -686 1056 1881 1542 -28 -1574
1493a574o85R72K246J714p90k113j915j00J257J954R68j55j402j912p20J095K101
$$ -1574 -2259 -1287 959 2673 1883 -230 -2145 -2245 -988 966 1934 1779 377 -1535 -2255 -1160 941
1510I41J061q23j878q71N29R17J221Q44p48j754j656J00J913K120M49j215j634
$$ 941 2002 1179 -699 -1570 -1041 -124 1097 1941 1193 -561 -2217 -2117 -204 1916 2365 1150 -484
1527d84j187l09R94J575J266k34j770j399r4J610J174M35q10j256j055j51J212
$$ -484 -1671 -1980 -986 589 1855 1621 -149 -1548 -1642 -32 1142 1577 767 -489 -1544 -1695 -483
1544d83J848R02j154k117j336O03J494J452P20o95j548j294k39J313J736P14r68
$$ -483 1365 2267 1113 -1004 -2340 -1737 -243 1209 1929 1234 -314 -1608 -1847 -534 1202 1916 948
1561I48j330q84L63P38O56P02k84j202j164J31J156J718L2r95j411n46o4Q32J206
$$ 948 -382 -1266 -903 -165 491 1193 909 -293 -1457 -1326 -170 1548 1580 585 -826 -1372 -1436 -604 602
1580F02J270k69j565j110k73O57Q73L66m26j57l6K6M21M31pr83q15m16O85J198
$$ 602 1872 1603 38 -1072 -1345 -688 185 551 125 -32 -68 -42 379 810 803 -180 -995 -1411 -726 472
1600D72N54K57n41p41q51k78N16J047K28m80m97p1L62P06J42m04n74r48k8J63
$$ 472 1026 1283 742 1 -850 -1128 -612 435 663 183 -314 -385 -23 683 825 421 -153 -1101 -1129 -966
1620i66J128J275L7j296r30j43L32L87P58L97m23p38p35K30Q17O26J55n41n18
$$ -966 162 1437 1474 178 -752 -895 -563 -176 582 979 556 -182 -917 -687 130 756 911 370 -148
1639a48m66k7j01O82N19K80n14l63N1J53L20m96k34k02J27K32M02N86J24m38o48
$$ -148 -614 -641 -742 -60 459 739 225 -138 -87 66 386 -110 -344 -546 -419 -187 215 801 925 487 -161
1660a61o20K04J44J99j09K40L56L34L6n0l15n93m16m52M76O95P27L32j47k42o30
$$ -161 -781 -577 -433 -234 -343 -103 253 587 623 573 258 -335 -751 -1203 -727 -32 695 1027 880 638 8
1681Hr46l27K45Q05O00O9K20k69l23r3k68K43j17j53j79k1M18K61L53o1J50o4
$$ 8 -938 -1265 -1020 -215 385 454 674 405 82 -11 -279 -36 -153 -306 -485 -506 -88 173 526 465 615 551
1703E51o56q07j71N13N83M62M56q0m31o72o26K26P42L66j69m55l13q6L98M11O21
$$ 551 -105 -912 -1083 -570 13 475 931 851 420 -252 -878 -652 90 456 287 -168 -481 -567 -169 242 863
1724H63M09n40r59r74k27L55J177O06O97O8n85j329p43Q6M10O93K86J07K03k74
$$ 863 1272 732 -227 -1201 -1428 -1073 104 710 1407 1475 890 -439 -1182 -1096 -686 7 293 400 603 329
1744C29m00J22K40K18n96n30k95O9L35O54P18Q76j12j104j610p91J08J055J057
$$ 329 -71 51 291 509 -87 -617 -912 -843 -508 146 864 1740 1628 524 -1086 -1877 -1769 -714 343
1763C43J336K63q01j270j324K3J004R72J67o5p27n29l41L46J135J145j95j386
$$ 343 1679 1942 1141 -129 -1453 -1430 -426 546 713 648 -79 -608 -949 -603 532 1677 1482 96
1781I6j144p30J93R51J209J271j9j272j729n39O71Q95J045j10k81p50p53KQ79
$$ 96 -1048 -1778 -1585 -634 575 1846 1827 555 -1174 -1713 -1042 -147 898 788 507 -243 -996 -994 -115
1800a15J153O28o50j184r34m33M06P52J232R85j27j147j485m74J88K55Q67O75
$$ -115 1038 1666 1016 -168 -1102 -1535 -1129 -377 855 1840 1713 566 -919 -1393 -1205 -950 -83 592
1818E92N28j23r16n66J2M36J32J81k83m4o22m20L14J520R21k15p69j376j088J5
$$ 592 1120 997 81 -485 -473 -37 95 276 -7 -51 -673 -1093 -779 741 1662 1447 678 -698 -1786 -1771
1838a771N27J813J224M78j000k004q29k9Q96J151P37k3j048j194o56R58J603M57
$$ -1771 -1244 569 1793 2271 1271 -733 -1562 -1591 -695 456 1193 1170 122 -1072 -1728 -770 833 1290
1856A290L3j008j264r29L76J073J462Q92p17j225j049j20N01O55N09K49p11m85
$$ 1290 1323 315 -949 -1878 -1502 -429 1033 1925 1208 -17 -1066 -1186 -685 -30 479 728 17 -468
1874d68m29M75R85M74l05n39p82l7j04K4R00O19K43j23n83k60o33k41m5M13P32
$$ -468 -897 -422 563 1037 732 193 -589 -626 -730 -706 194 813 1056 933 350 90 -543 -784 -829 -416 316
1895C16N38m3m32m33l08m54K90M84O02j76n02n54K86L03Q37J09l44o06j012k58
$$ 316 854 811 379 -54 -362 -816 -526 -42 560 384 -118 -672 -386 -83 754 863 519 -87 -1099 -1357
1915a357M56J371J089P9r22j302p67L31O82J174M00p0j407q65R9N39J179M63j97
$$ -1357 -901 470 1559 1638 716 -586 -1353 -1022 -340 834 1234 1164 -243 -1108 -1009 -470 709 1172 975
1934I75j013p29m35N91R73Q50k79r17q70O7M77O92K05m7m96o50l26M53J030L72
$$ 975 -38 -767 -1202 -611 362 1212 933 16 -854 -787 -310 382 587 540 44 -606 -932 -479 551 923
1954I23r7o57p86m32O08L09O07K4k19k80j02J28L73p2n77l11k01M69P62M16j4
$$ 923 826 169 -617 -1049 -441 -132 475 499 280 0 -102 26 399 327 -250 -561 -762 -293 469 885 871
1975H71m95p46p07K04P50P96L00n37p34j13K03L90M17Pm91q73k58N78J049O21
$$ 871 376 -370 -1077 -873 -123 673 973 436 -298 -411 -208 182 599 606 115 -758 -1016 -438 611 1232
1995A232m12n43q81o95M83O67J077J36p18r14n39K36R63P85Ll82q51m26j69P14
$$ 1232 820 277 -604 -1299 -816 -149 928 1064 346 -568 -1107 -871 92 877 880 498 -353 -779 -948 -234
2015b34Q65L52m56r03l33Q4P87L36K37m88p42m67J80Q77P46Q1p02k69p38O9N05
$$ -234 631 983 527 -376 -709 -625 162 498 735 247 -495 -962 -782 95 841 922 220 -49 -787 -718 -213
2036b13M58L15k46k45m97L8M45M54k70k60n85n3N07M20N54J1n73r95k24N74O61
$$ -213 245 560 314 69 -428 -390 55 509 239 -21 -606 -659 -152 268 822 833 260 -735 -959 -385 276
2057B76N16k10m69o29o5K56L86O31j22o37o72J03N61M81L65l02m77n65k99M07
$$ 276 792 582 113 -516 -581 -325 61 692 570 -67 -739 -636 -75 406 771 469 -8 -573 -872 -465
2077d65P61O52N3p67j005j6K96L85O49K46m48o80n39J95P71N43k19l91k60k96
$$ -465 296 948 1001 234 -771 -787 -491 -106 543 789 341 -339 -878 -683 88 631 412 21 -239 -535
2097e35N14J99K83J63m72p56k33N42P34K76p1m64m74l30J04N06M87K27n75o01
$$ -535 -21 178 461 624 152 -604 -837 -295 439 715 644 180 -294 -624 -520 -14 473 700 125 -476
2117d76j21M83L09J91j79m87q8l57K84Q04M81j53p48p30R4M34M27P05l40k97n62
$$ -476 -597 -114 195 386 207 -280 -368 -725 -441 363 844 691 -57 -787 -693 -259 168 873 533 236 -326
2138c26j91J56N01L17j53l20l51k5K23M18K28j80m31l66j88N28P54J38k93p13
$$ -326 -517 -361 140 457 304 -16 -367 -392 -169 249 477 297 -134 -500 -688 -160 594 732 439 -274
2158b74m08K7K70R28K50k61n44o30l17P23O62L1j40m55j34l19N17O09L30n38o94
$$ -274 -682 -655 -385 543 793 532 -12 -642 -959 -236 426 457 317 -138 -272 -591 -74 535 865 327 -367
2179c67m74K2Q80L93M03k55m88o36l19L19L87R24k41m45m33q4K17M83N1k98l00
$$ -367 -841 -819 61 454 857 602 114 -522 -841 -522 -135 789 548 103 -330 -414 -197 286 337 39 -261
2200b61k32j4M96O03J5j31o50n47K67K20O11J74k05k45l12k25J73O19K29m84k71
$$ -261 -493 -507 -11 592 607 476 -174 -721 -454 -234 377 551 346 101 -211 -436 -263 356 585 101 -170
2221a70j39K56M3N29r5k91k89o22M24L01M67J78l27n47m69J53M30P86N1k06n41
$$ -170 -309 -53 -10 519 424 133 -156 -778 -354 -53 414 592 265 -282 -751 -598 -168 618 669 463 -78
2242g8p44J62N07L44L96j26m65l25j90L62M21Q1L7p67j48N0N66M47Q2k65n15k38
$$ -78 -822 -660 -153 191 587 461 -4 -329 -519 -157 264 345 382 -385 -533 -483 83 530 612 347 -168 -406
2264d06j84J72N14K93m2l21k07OJ7J53J12j2l59j78J59O88L08k71m73m70j28K83
$$ -406 -590 -418 96 389 347 26 -181 -175 -158 -5 107 95 -264 -442 -283 405 713 442 -31 -501 -629 -346
2286c46J86N60J23l0o40l83J94L48L64J28k65l80j90J58P9M27K40j82n77j54p5
$$ -346 -160 400 523 493 -147 -530 -336 12 376 504 239 -141 -331 -173 -94 333 573 391 -186 -340 -415
2307d15L75K39K10k05j12m41j41L29N43K87j38m50l09q2o5J17K91M31o4j31k40
$$ -415 -40 199 409 204 92 -349 -490 -161 382 669 531 81 -228 -310 -375 -258 33 464 400 269 29
2328B9j31j50J03J53j66J65K76p2M5j83P1k83l5P1J31K78l22j92K0L90P5l8m01
$$ 29 -102 -252 -149 4 -162 3 279 207 252 69 140 -143 -178 -107 24 302 -20 -212 -192 198 273 235 -166
2351a66J84l10j59J93M52M46P6m20m79l37J8L21L04J91J48l14k96j70J6M22P5
$$ -166 18 -292 -451 -258 194 640 716 296 -183 -520 -502 -181 123 314 462 148 -148 -318 -302 120 195
2372A95j91K91j56m32J2NM24K58Lj99l05k18k23K13L62L90Q9m97k16k36J31L05
$$ 195 4 295 139 -293 -281 -276 148 406 409 210 -95 -313 -536 -323 39 429 518 21 -195 -431 -300 5
2394EK51J68j28m80l33j50L43O63L41k69r9l10m40k45J28O43L38N0l4n92j32M9
$$ 5 256 424 296 -184 -517 -667 -324 339 680 411 312 2 -438 -683 -555 88 426 476 442 -150 -282 -233
2416b33l6P9N75j33l88r5J7M65j87K45k28n8k82k29J00M07K78Jlk80j44Lj80K4
$$ -233 -269 -190 385 252 -136 -231 -214 251 64 309 81 23 -259 -488 -388 19 297 298 295 15 -129 -126 -306 -282
2440b82L97K25p8Ml17n8k14L2L03L10P9Qm44l04J42Q5L41N7K09k16n20k93J2O62
$$ -282 115 340 262 266 -51 -109 -323 -291 12 322 401 409 -35 -339 -197 -112 229 286 495 279 -241 -534 -522 140
2464A40K58j30Rk49k57j14M0N51L74k72l88m72n8L68R9P04O7l02o68n36Q7P31
$$ 140 398 268 277 28 -229 -343 -303 248 622 350 -38 -510 -568 -200 -101 603 670 368 -300 -836 -749 -18
2486a8L04J67Q4n21k53q9j18M23K17J13l99ro7J09J62J65qk46k37k78K54K63J63
$$ -18 286 453 537 16 -237 -326 -444 -21 196 309 -90 -99 -166 -57 105 270 262 16 -221 -499 -245 18 181
2509A81m3j54J41m6p6pr4J0k4Q1PJ59j47n9l17N7K31K40J19M8p3l29l18j5M34
$$ 181 138 -16 125 79 3 -4 -98 -88 -112 -31 -24 135 -12 -71 -388 -331 -100 140 259 307 234 -95 -413 -428 6
2534FM80R2k98m36l24K34R4N49L9r5m14j74r6M18J44K89j68o03j88J3K73L32L56
$$ 6 486 578 280 -156 -480 -246 -152 397 436 341 -73 -247 -343 75 219 508 340 -263 -451 -438 -165 167 523
2557E23N5l95n36k33J59N60L73kj61m52j91J02J72J12K46k65k19o7J75J90p6k6
$$ 523 578 183 -353 -586 -427 133 506 504 343 -109 -300 -198 -26 86 332 67 -152 -219 -44 146 70 44
2579D4Q9j61r1J9K44j0J14l56j34J8K19J23m7L4j51k70J33K59K42J52m60l23J09
$$ 44 133 -28 -119 -100 144 134 248 -108 -242 -224 -5 118 71 105 -46 -316 -183 76 318 470 10 -313 -204
2602b04J11K17K67q4j78k26k84j50O49L96K03m64m05j88n8O8M05L09j6j56n70
$$ -204 -93 124 391 307 129 -97 -381 -531 118 514 717 253 -152 -340 -398 -330 75 384 368 212 -358
2623c58j96L15L40J87j82m2k47j53J93K13L05k07pn92R4J05K59L35k20j05j17
$$ -358 -554 -239 101 288 106 64 -183 -336 -143 70 375 168 161 -431 -337 -232 27 362 142 37 -80
2644h0k8K34o0K37j64l85K0J99J68n0J18k31rj26L6J15L46Q2m94k3k11K15K48
$$ -80 -108 126 66 303 139 -246 -226 -27 141 91 209 -22 -31 -157 -121 -6 340 422 -72 -95 -306 -91 157
2667A57q0J14rl38l27K30L40J70l8j45l82M2Q5K99J01J67k41m15j74J24L69L29
$$ 157 77 191 182 -156 -483 -253 87 257 219 74 -308 -266 -181 118 219 386 145 -270 -444 -320 49 378
2689C78k6j06l11k92M8O7L12K90j89k65k32J62j07K08L06k54j00j56J97J24J79
$$ 378 352 246 -65 -357 -309 -242 70 360 171 -94 -326 -164 -271 -63 243 -11 -111 -267 -70 54 233
2710B33J37k42l86k01K92K83R0QM4k82j71R6J97J08ML5m02j4KK51Q8m4j91k16
$$ 233 370 128 -258 -459 -167 116 206 214 258 -24 -195 -99 98 206 210 245 -157 -171 -169 82 170 126 -65 -281
2734b81J73q1K79K43j00k70j36n7%L78K17K0j65l01j06j9L03o0jq7j85J55p7K06
$$ -281 -108 -189 90 333 233 -37 -173 -230 -230 148 365 385 220 -81 -187 -206 97 37 36 -51 -236 -81 -158 48
2758D8J61j42l3j74j76L66J35K18j87k40r1j59j38K64K56P3j30o0j91P4K26q6
$$ 48 209 67 34 -140 -316 50 185 403 216 -24 -115 -274 -412 -148 108 181 51 -9 -200 -126 100 14
2780A4R3k21j31j9L92J91n8N6l53j90n8M6M42j05J28m7j95k60R2K16J67m9l8m43
$$ 14 107 -114 -245 -264 128 319 261 317 -36 -226 -284 -238 204 99 227 180 -15 -275 -183 33 200 151 113 -330
2804c30K44J01P5L51m20q4Q0l67L10l5J98J0j69j35j2RL12p1l6o6n5J50n4K52
$$ -330 -86 15 90 441 21 -63 17 -350 -40 -75 123 133 -36 -171 -183 -174 138 67 31 -35 -90 60 6 258
2828B58k19N0k06R3p4Q7K07j1l36k45J79J56J59J62J4p6j80k79J85j91K21J63
$$ 258 39 89 -117 -24 -98 -11 196 185 -151 -396 -217 -61 98 260 274 198 18 -261 -76 -267 -46 117
2850A17j18n7l2j98J94J69L18k85p4r9j70J34K41M5m9k22R0r2K1O4K9L23k64n9
$$ 117 -1 -58 -90 -288 -94 75 393 108 34 -65 -235 -101 140 185 136 -86 4 -88 -67 -3 26 349 85 26
2874B6l02J48K1Q6L3l7R7N1j89K3L00k35j22m1J4J87Q2O1k87l1J28j39K11O4o
$$ 26 -276 -128 -107 -21 12 -25 72 123 -66 -43 257 22 -100 -141 -127 60 142 203 -84 -115 13 -126 85 149 143
2899A43j14Nl44K84J93l0j72n4JQ4k9M2J95jl5m11O2O0K13J18K0N9k79m18L16
$$ 143 29 34 -310 -26 167 137 -35 -89 -88 -4 -33 9 204 203 168 -243 -181 -121 92 210 230 289 10 -408 -92
2924i2j57L47j1j47J65j22k1p6P2lJ52j95Q4J50j70j0n7R9pj55J12N9No3K97l95
$$ -92 -249 98 87 -60 105 -17 -38 -114 -42 -45 107 -88 -4 146 -24 -34 -91 8 1 -154 -42 17 22 -41 256 -139
2950a39J58P4j69O9j35J94o7K3L9k6R8k72J26j09J24M9J07J57l32P7j74j8R3J5
$$ -139 19 93 -76 -7 -142 52 -15 8 47 21 119 -153 -27 -136 -12 37 144 301 -31 46 -128 -146 -53 -38
2974c8J43J33k77j23P4J48pN7N0j47R1j48j5o3J17J04j40N8m2j53K42J90m2j12
$$ -38 105 238 -39 -162 -88 60 53 110 160 13 104 -44 -59 -122 -5 99 -41 17 -25 -178 64 254 212 100
2998A00pl48J80j9N5M7P7J43j69j78J90k16OO3J35R0j49n9J7p2p5K3J80J02j62
$$ 100 93 -255 -75 -94 -39 8 85 228 59 -119 71 -145 -139 -76 59 149 0 -59 -42 -114 -189 -166 14 116 -46
3023d6J81m2j52r2M36k37j21O4k06K06r5K2J91o9j20L2k18J22J35J71K3n0P8k63
$$ -46 135 93 -59 -151 285 48 -73 -9 -215 -9 -104 -82 109 40 -80 -48 -266 -144 -9 162 185 135 213 -50
3047e0j14N7j11L97m3J03j44J6j38J6J1j11K67j47J44Q4k61J91j20j03J90j37
$$ -50 -164 -107 -218 179 136 239 95 111 -27 -11 0 -111 156 9 153 237 -24 167 47 -56 134 -3
3069cK4j03NO9R9m7r6N7j20k0L5M9O7R0o9o0j24NPR9K01J33j48j87j08j18J11
$$ -3 21 -82 -77 -8 91 44 -52 5 -115 -135 -100 -51 16 106 37 -23 -147 -142 -135 -36 165 298 150 -37 -145 -263 -152
3096a52J69J92j31P9k09j60O5Q1K2O6R8q3j22q1J29l9J97r6j21m9L1L6K28j38
$$ -152 17 209 78 157 -52 -212 -147 -66 -44 22 120 37 -85 -166 -37 -76 121 25 -96 -145 -114 -78 150 12
3120A2q0L65k80J92k73L1r0Q0j1J86j15J73k15j7qJ08P7q9K8L8j44l3J2r4J36
$$ 12 -68 297 17 209 -64 -33 -123 -43 -54 132 17 190 -25 -42 -50 58 135 46 74 112 -32 -65 -53 -147 -11
3145a1K54Mk13j37l3q2K93j27K39j01k25L5K99k39J05J23k15k2k03K11l8L28k23
$$ -11 243 247 34 -103 -136 -218 75 -52 187 86 -139 -104 195 -44 61 184 -31 -53 -256 -45 -83 245 22
3168B2J47k12l6J69Pj05P8JJ76q8l06J01j9J74m4p3J8rO9Jm2R2j93o6J28J88l14
$$ 22 169 -43 -79 90 97 -8 70 71 247 159 -147 -46 -65 109 65 -8 10 1 70 71 29 121 -72 -138 -10 178 -136
3195a36K11J26l07J48Qq7P0M3j1k17J71LJ08j6q1k55k5J48k9J11K18K8j46k02
$$ -136 75 201 -106 42 50 -37 33 76 65 -152 19 22 130 114 33 -222 -247 -99 -128 -17 201 229 83 -119
3219a19q4J81J02M8J14j01k64O2n4J8J36J08j1r8j53o0K54K07j74K6p9j92N3k
$$ -119 -203 -22 80 128 242 141 -123 -61 -115 -97 39 147 136 38 -115 -175 79 286 112 138 59 -133 -80 -82
3243h2J74J05r1j22N5m2j08%J06J14p8j68L3N0J50k5L0j95J21p7jJ38q0K0j57
$$ -82 92 197 106 -16 39 -3 -111 -111 -5 109 31 -137 -104 -54 96 71 101 -94 27 -50 -51 87 7 27 -130
$$ [...]
8191f4
##END NTUPLES=NMR FID
##END=
