##TITLE=1H ikalashn
1H
16.10.2024
##JCAMPDX= 6.0         $$ Bruker NMR JCAMP-DX V2.0
##DATA TYPE= NMR FID
##DATA CLASS= NTUPLES
##ORIGIN= UXNMR, Bruker Analytische Messtechnik GmbH
##OWNER= root
$$ TOPSPIN		Version 1.3
$$ 2024-10-16 16:31:56.140 +0400  Irina@DPX200
$$ Compression mode = diff/dup
##.OBSERVE FREQUENCY= 200.131392401
##.OBSERVE NUCLEUS= ^1H
##.DELAY= (6, 6)
##.ACQUISITION MODE= SIMULTANEOUS
##.ACQUISITION SCHEME= undefined
##.AVERAGES= 16
##.DIGITISER RES= 18
##SPECTROMETER/DATA SYSTEM= spect
##.PULSE SEQUENCE= zg
##.SOLVENT NAME= CDCl3
##.SHIFT REFERENCE= INTERNAL, CDCl3, 1, 17.95386
##AUDIT TRAIL= $$ (NUMBER, WHEN, WHO, WHERE, WHAT)
$$ ##TITLE= Audit trail, TOPSPIN		Version 1.3
$$ ##JCAMPDX= 5.01
$$ ##ORIGIN= Bruker BioSpin GmbH
$$ ##OWNER= Irina
$$ $$ F:/spectra/data/iren/nmr/1H/4/audita.txt
$$ ##AUDIT TRAIL=  $$ (NUMBER, WHEN, WHO, WHERE, VERSION, WHAT)
(   1,<2024-10-16 16:31:41.921 +0400>,<Irina>,<DPX200>,<TOPSPIN 1.3>,
      <created by zg
	started at 2024-10-16 16:30:33.796 +0400,
	POWCHK disabled, PULCHK disabled
       configuration hash MD5:
       BE 6D 3F 07 2A EA 11 49 91 17 2B D3 AF B3 58 0D
       data hash MD5: 16K
       C6 16 83 EB 51 4D BD 2D C9 E4 D1 57 7A ED 37 87>)
$$ ##END=
$$ 
$$ $$ hash MD5
$$ $$ 26 3F CB B7 27 02 3C 44 7D 3B 4E F0 1F F6 E0 2A
##$RELAX= 
##$RELAX= 
##$RELAX= 
##$RELAX= 
##$RELAX= 
##$RELAX= 
##$RELAX= 
##$RELAX= 
##$RELAX= 
$$ Bruker specific parameters
$$ --------------------------
##$DU= <F:/spectra>
##$EXPNO= 4
##$NAME= <1H>
##$PROCNO= 1
##$TYPE= <nmr>
##$USER= <iren>
##$AMP= (0..31)
100 100 100 100 100 100 100 100 100 100 100 100 100 100 100 100 100 100 
100 100 100 100 100 100 100 100 100 100 100 100 100 100 
##$ANAVPT= -1
##$AQSEQ= 0
##$AQ_mod= 1
##$AUNM= <au_zg>
##$AUTOPOS= <>
##$BF1= 200.13
##$BF2= 200.13
##$BF3= 200.13
##$BF4= 200.13
##$BF5= 200.13
##$BF6= 200.13
##$BF7= 200.13
##$BF8= 200.13
##$BYTORDA= 1
##$CFDGTYP= 0
##$CFRGTYP= 5
##$CHEMSTR= <none>
##$CNST= (0..63)
1 1 145 1 1 1 1 1 1 1 1 1 1 1 1 1 1 1 1 1 1 1 1 1 1 1 1 1 1 1 1 1 1 1 
1 1 1 1 1 1 1 1 1 1 1 1 1 1 1 1 1 1 1 1 1 1 1 1 1 1 1 1 1 1 
##$CPDPRG= <>
##$CPDPRG1= <>
##$CPDPRG2= <>
##$CPDPRG3= <>
##$CPDPRG4= <mlev>
##$CPDPRG5= <mlev>
##$CPDPRG6= <mlev>
##$CPDPRG7= <mlev>
##$CPDPRG8= <mlev>
##$CPDPRGB= <>
##$CPDPRGT= <>
##$D= (0..63)
0 2 0 0 0 0 0 0 0 0.06 0 0.03 0 0 0 0 0.0002 0 0 0 0 0 0 0 0 0 0 0 0 0 
0 0 0 0 0 0 0 0 0 0 0 0 0 0 0 0 0 0 0 0 0 0 0 0 0 0 0 0 0 0 0 0 0 0 
##$DATE= 1729081898
##$DBL= (0..7)
120 120 120 120 120 120 120 120 
##$DBP= (0..7)
150 150 150 150 150 150 150 150 
##$DBP07= 0
##$DBPNAM0= <>
##$DBPNAM1= <>
##$DBPNAM2= <>
##$DBPNAM3= <>
##$DBPNAM4= <>
##$DBPNAM5= <>
##$DBPNAM6= <>
##$DBPNAM7= <>
##$DBPOAL= (0..7)
0.5 0.5 0.5 0.5 0.5 0.5 0.5 0.5 
##$DBPOFFS= (0..7)
0 0 0 0 0 0 0 0 
##$DE= 6
##$DECBNUC= <off>
##$DECIM= 32
##$DECNUC= <off>
##$DECSTAT= 4
##$DIGMOD= 1
##$DIGTYP= 9
##$DL= (0..7)
0 120 120 120 120 120 120 120 
##$DP= (0..7)
150 150 150 150 150 150 150 150 
##$DP07= 0
##$DPNAME0= <>
$$ [...]
##$SW= 21.9925939549014
##$SWIBOX= (0..15)
0 0 2 0 0 0 0 0 0 0 0 0 0 0 0 0 
##$SW_h= 4401.40845070422
##$TD= 16384
##$TD0= 1
##$TE= 300
##$TE2= 300
##$TE3= 300
##$TEG= 300
##$TL= (0..7)
0 120 120 120 120 120 120 120 
##$TP= (0..7)
150 150 150 150 150 150 150 150 
##$TP07= 0
##$TPNAME0= <>
##$TPNAME1= <>
##$TPNAME2= <>
##$TPNAME3= <>
##$TPNAME4= <>
##$TPNAME5= <>
##$TPNAME6= <>
##$TPNAME7= <>
##$TPOAL= (0..7)
0.5 0.5 0.5 0.5 0.5 0.5 0.5 0.5 
##$TPOFFS= (0..7)
0 0 0 0 0 0 0 0 
##$TUNHIN= 0
##$TUNHOUT= 0
##$TUNXOUT= 0
##$USERA1= <user>
##$USERA2= <user>
##$USERA3= <user>
##$USERA4= <user>
##$USERA5= <user>
##$V9= 5
##$VALIST= <valist>
##$VCLIST= <CCCCCCCCCCCCCCC>
##$VD= 0
##$VDLIST= <DDDDDDDDDDDDDDD>
##$VPLIST= <PPPPPPPPPPPPPPP>
##$VTLIST= <TTTTTTTTTTTTTTT>
##$WBST= 1024
##$WBSW= 25
##$XGAIN= (0..3)
0 0 0 0 
##$XL= 0
##$YL= 0
##$YMAX_a= 1356808
##$YMIN_a= -1687381
##$ZGOPTNS= <>
##$ZL1= 120
##$ZL2= 120
##$ZL3= 120
##$ZL4= 120
##$ABSF1= 10
##$ABSF2= 0
##$ABSG= 5
##$ABSL= 3
##$ALPHA= 0
##$AQORDER= 0
##$ASSFAC= 0
##$ASSFACI= 0
##$ASSFACX= 0
##$ASSWID= 0
##$AUNMP= <proc_1d>
##$AXLEFT= 0
##$AXRIGHT= 0
##$AXTYPE= 0
##$AXUNIT= <>
##$AZFE= 0.1
##$AZFW= 0.1
##$BCFW= 1
##$BC_mod= 2
##$BYTORDP= 1
##$COROFFS= 0
##$CY= 7568.61572265625
##$DATMOD= 1
##$DC= 2
##$DFILT= <>
##$DTYPP= 0
##$F1P= 17.9538593292236
##$F2P= -4.03888763876832
##$FCOR= 0.5
##$FTSIZE= 32768
##$FT_mod= 4
##$GAMMA= 1
##$GB= 1
##$INTBC= 1
##$INTSCL= 1
##$ISEN= 128
##$LB= 0.02
##$LEV0= 0
##$LPBIN= 0
##$MAXI= 945.577
##$MC2= 0
##$MEAN= 0
##$ME_mod= 0
##$MI= -402.1523
##$NCOEF= 0
##$NC_proc= 0
##$NLEV= 6
##$NOISF1= 8.587773
##$NOISF2= 6.764455
##$NSP= 1
##$NTH_PI= 0
##$NZP= 0
##$OFFSET= 17.95386
##$PC= 1
##$PHC0= 323.6586
##$PHC1= -2.03623
##$PH_mod= 0
##$PKNL= yes
##$PPARMOD= 0
##$PPDIAG= 0
##$PPIPTYP= 0
##$PPMPNUM= 100
##$PPRESOL= 1
##$PSCAL= 0
##$PSIGN= 0
##$REVERSE= no
##$SF= 200.13
##$SI= 32768
##$SIGF1= 18.5376
##$SIGF2= -6.396296
##$SINO= 400
##$SIOLD= 32768
##$SREGLST= <1H.CDCl3>
##$SSB= 3
##$STSI= 0
##$STSR= 0
##$SW_p= 4401.40845070423
##$SYMM= 0
##$S_DEV= 0
##$TDeff= 0
##$TDoff= 0
##$TI= <>
##$TILT= no
##$TM1= 0
##$TM2= 0
##$TOPLEV= 0
##$USERP1= <user>
##$USERP2= <user>
##$USERP3= <user>
##$USERP4= <user>
##$USERP5= <user>
##$WDW= 1
##$XDIM= 8192
##$YMAX_p= 0
##$YMIN_p= 0
$$ End of Bruker specific parameters
$$ ---------------------------------
##NTUPLES= NMR FID
##VAR_NAME=  TIME,          FID/REAL,        FID/IMAG
##SYMBOL=    X,             R,               I
##VAR_TYPE=  INDEPENDENT,   DEPENDENT,       DEPENDENT
##VAR_FORM=  AFFN,          ASDF,            ASDF
##VAR_DIM=   8192,          8192,            8192
##UNITS=     SECONDS,       ARBITRARY UNITS, ARBITRARY UNITS
##FACTOR=    0.0002272,     1,               1
##FIRST=     0,             0,               0
##LAST=      1.8609952,     -170,            17
##MIN=       0,             -1687381,        -1687381
##MAX=       1.8609952,     1356808,         1356808
$$ Real data points
##PAGE= N=1
##DATA TABLE= (X++(R..R)), XYDATA
$$ [...]
$$ plain form
1787 -1843 -676 3712 3964 -317 -1910 1204 3400 2017 55 -518 1123 2474 552 -724 796
1802 796 1406 -53 -1002 -86 1046 1142 -1255 -2697 -360 2139 233 -2594 -2799 -249 1351 -52 -3207
1819 -3207 -3051 429 1024 -1507 -2807 -2019 49 249 -1773 -2300 -121 619 -1723 -2338 267 1699 -135
1836 -135 -2551 -1797 2248 3127 -1142 -3317 454 3613 1976 -1162 -1513 1586 3738 1172 -1509 1016
1852 1016 3115 1011 -423 571 2464 2025 -484 -1344 1843 3894 428 -2225 -263 2340 2016 -298
1868 -298 -2071 -510 1836 664 -1659 -1299 -25 -343 -614 -667 -1177 -625 -682 -1727 -1151 12 -973 -1833
1886 -1833 -1327 -1021 -427 109 -1319 -2480 -635 767 -72 -1182 -1689 -936 1469 1158 -1798 -1361 1354
1903 1354 1499 11 -159 127 1299 1263 -739 214 2989 1755 -1390 -102 2718 2624 554 -991 91
$$ packed form
1787a843J167M388K52m281j593L114K196j383j962n73J641J351j922j276J520
1802G96O10j459r49R16J132R6k397j442K337K499j906k827k05K550J600j403l155
1819c207J56L480N95k531j300P88K068K00k022n27K179P40k342o15K605J432j834
1836a35k416P54M045Q79m269k175L771L159j637l138l51L099K152k566k681K525
1852A016K099k104j434R94J893m39k509q60L187K051l466k653J962K603l24k314
1868b98j773J561K346j172k323L60J274l18k71n3n10N52n7j045N76J163r85q60
1886a833N06L06N94N36j428j161J845J402q39j110n07P53K405l11k956M37K715
1903A354J45j488j70K86J172l6k002R53K775j234l145J288K820r4k070j545J082
$$ plain form
1920 91 3166 2695 -994 -1056 2359 2200 -249 -182 574 905 667 -833 -787 1703 504 -2348 -1116 1457
1938 1457 526 -1455 -2031 -1162 607 341 -2532 -1999 500 -542 -1968 -803 -414 -1454 -1360 -839 -832 -120
1956 -120 -852 -1995 -197 1020 -873 -1325 202 215 -165 421 -64 -44 880 -89 -58 1872 1244 -743 416
1975 416 2226 1395 204 287 799 2229 1561 -560 394 2598 983 -832 883 1821 719 -218 -321
1992 -321 768 1811 -129 -1975 148 1935 -224 -1728 -656 213 275 -691 -1964 -569 756 -1299
2008 -1299 -2693 -242 722 -1383 -2080 -1131 12 -96 -1688 -2536 -168 964 -1364 -1921 137 375 -760
2025 -760 -770 -126 600 401 -624 -658 1560 1050 -991 -52 1498 1060 636 398 703 1670 1123 179 787
2044 787 2055 820 -151 963 1812 839 -27 94 1114 1597 14 -1066 726 1694 -274 -1095 183
$$ packed form
1920I1L075m71l689o2L415j59k449O7P56L31k38j500M6K490j199k852J232K573
1938A457r31j981n76Q69J769k66k873N33K499j042j426J165L89j040R4N21PP12
1956a20p32j143J798J217j893m52J527J3l80N86m85K0R24r69L1J930o28j987J159
1975D16J810q31j191Q3N12J430o68k121R54K204j615j815J715R38j102r37j03
1992c21J089J043j940j846K123J787k159j504J072Q69O2r66j273J395J325k055
2008a299j394K451R64k105o97R49J143j08j592q48K368J132k328n57K058K38j135
2025g60j0O44P26j99j025l4K218n10k041R39J550m38m24k38L05R67n47r44O08
2044G87J268j235r71J114Q49r73q66J21J020M83j583j080J792R68j968q21J278
$$ plain form
2061 183 687 -42 -1131 -927 378 354 -1666 -1746 269 243 -1628 -1868 -778 -82 -537 -1814 -1574 266
2079 266 -85 -1839 -1545 -87 159 -1006 -993 -239 770 244 -1352 -402 1386 498 -806 -215 968 939
2097 939 -143 -144 900 1499 373 -210 1040 1884 552 -52 872 1611 1078 258 116 1407 1626 -62
2115 -62 -309 1198 1136 -126 -333 327 744 220 -874 -607 911 138 -1472 -1025 309 -2 -1082 -1238
2133 -1238 -604 62 -395 -1692 -906 280 -677 -1703 -875 184 -525 -1299 -945 -241 237 -540 -1774 -97
2151 -97 942 -471 -1216 147 669 389 -106 -268 850 1278 -118 -650 1566 1957 -30 -429 1163 1522
2169 1522 1053 60 -40 1716 1795 -346 -225 1695 1416 -151 138 815 1001 589 -820 -558 1381 675
2187 675 -1466 -755 695 147 -847 -722 -856 292 -315 -1560 -1003 418 -717 -1963 -423 51 -1097
$$ packed form
2061A83N04p29j089K04J305k4k020q0K015k6j871k40J090O96m55j277K40J840
2079B66l51j754K94J458K46j165J3P54J009n26j596R50J788q88j304N91J183k9
2097I39j082jJ044N99j126n83J250Q44j332o04R24P39n33q20j42J291K19j688
2115f2k47J507o2j262k07O60M17n24j094K67J518p73j610M47J334l11j080j56
2133a238O34O66m57j297P86J186r57j026Q28J059p09p74L54P04M78p77j234J677
2151i7J039j413p45J363N22k80m95j62J118M28j396n32K216L91j987l99J592L59
2169A522m69r93j00J756P9k141J21J920k79j567K89O77J86m12j409K62J939p06
2187F75k141P11J450n48r94J25j34J148o07j245N57J421j135j246J540M74j148
$$ plain form
2204 -1097 -968 -1092 -613 223 -677 -1796 -294 577 -950 -1134 327 116 -685 -248 69 485 638 -869
2222 -869 -407 1592 1371 -638 -154 1262 1248 608 204 70 1620 1582 -273 241 1821 1085 -480 146
2240 146 1304 1059 219 -744 41 1781 821 -1456 -281 1194 231 -662 -286 -142 97 -70 -1175 -474
2258 -474 392 -853 -1804 -319 336 -1032 -1325 -968 -560 42 -622 -1532 -530 177 -759 -874 162 -121
2276 -121 -878 -376 -1 258 232 -775 -558 1289 976 -798 -265 1143 840 434 403 463 1160 783 -171 234
2296 234 1872 695 -346 492 1460 1116 268 -330 75 1421 1063 -572 -124 958 358 -69 -5 -134
2314 -134 -57 12 -643 -237 233 -525 -1087 -409 41 -496 -894 -911 -1041 -329 -201 -984 -675 -739 -842 -129 -137 -1055
2336 -1055 -1143 -197 121 -271 -416 -592 -135 439 16 -644 229 684 49 -87 574 806 740 64 -68 1262
$$ packed form
2204a097J29j24M79Q36r00j119J502Q71j527j84J461k11q01M37L17M16J53j507
2222h69M62J999k21k009M84J416j4o40m04j34J550l8j855N14J580p36j565O26
2240A46J158k45q40r63P85J740r60k277J175J475r63q93L76J44K39j67j105P01
2258d74Q66j245r51J485O55j368k93L57M08O02o64r10J002P07r36j15J036k83
2276a21p57N02L75K59k6j007K17J847l13j774N33J408l03m06l1O0O97l77r54M05
2296B34J638j177j041Q38R68l44q48n98M05J346l58j635M48J082o00m27O4j29
2314a34P7O9o55M06M70p58n62O78M50n37l98j7j30P12J28p83L09o4j03P13qr18
2336a055q8R46L18l92j45j76M57N74m23o60Q73M55o35j36O61K32o6o76j32J330
$$ plain form
2356 1262 1562 319 -410 838 1481 1060 102 -100 852 1534 581 -246 496 823 408 229 146 513 605 72
2376 72 -562 18 738 -131 -972 -719 27 437 -313 -1373 -954 387 65 -895 -1289 -716 -45 -200 -1086 -1259
2396 -1259 -117 126 -1059 -1036 -153 -95 -553 -736 -525 449 636 -766 -999 466 1017 323 -281 -225 570
2415 570 1236 416 -400 540 1276 655 122 616 487 906 558 77 588 1228 279 -132 572 689 634 380
2435 380 -205 -223 977 657 -597 -387 107 247 129 -514 -1144 -316 470 -566 -1180 -242 -187 -514 -624 -997
2455 -997 -494 284 -755 -1797 -448 575 -594 -1220 -632 -25 558 -170 -1425 -589 1155 329 -1199
2472 -1199 -145 634 316 46 -322 54 1550 695 -1002 285 1732 569 -275 238 710 1226 862 -436
2490 -436 23 1381 771 -402 457 619 379 432 250 11 526 450 -405 115 672 -372 -233 42 -470 -597
$$ packed form
2356A262L00j243p29J248O43m21r58k02R52O82r53q27P42L27m15j79q3L67R2n33
2376G2o34N80P20q69q41K53P46M10p50j060M19J341l22r60l94N73O71j55q86j73
2396a259J142K43j185K3Q83N8m58j83K11R74J87j402k33J465N51o94o04N6P95
2415E70O66q20q16R40P36o21n33M94j29M19l48m81N11O40r49m11P04J17n5k54
2435C80n85j8J200l20j254K10M94J40j18o43o30Q28P86j036o14R38N5l27j10l73
2455i97N03P78j039j042J349J023j169o26N88O07N83p28j255Q36J744q26j528
2472a199J054P79l18k70l68L76J496q55j697J287J447j163q44N13M72N16l64j298
2490d36M59J358o10j173Q59J62k40N3j82k39N15p6q55N20N57j044J39K75n12j27
$$ plain form
2510 -597 150 -490 -925 -245 -552 -788 -223 -728 -1176 -163 245 -997 -1102 -272 -307 -290 -628 -935 -69 662
2530 662 -729 -1154 284 648 -614 -585 111 652 653 -436 -676 883 1520 -209 -607 635 1311 618 11
2549 11 124 867 1376 -60 -658 1084 1328 52 -47 377 802 663 -192 -347 841 918 -488 -672 594
2568 594 191 -348 -154 -245 -15 11 -520 -812 -32 -265 -986 -411 36 -723 -790 -351 -422 -575 -583 -781 -305 153
2590 153 -784 -913 195 92 -688 -699 -52 317 380 -450 -532 771 643 -649 -323 895 804 86 -114 295
2610 295 1030 694 -162 85 1417 1018 -254 -29 1001 1098 368 -139 73 1179 475 -350 31 851 322
2629 322 -278 -388 -53 486 11 -693 -161 300 -406 -801 -206 -92 -631 -592 -674 -441 -381 -718 -813 -61 -145 -891
2651 -891 -754 43 -151 -509 -582 -280 79 -55 -730 -414 718 70 -535 -60 518 450 -219 -141 323 1006 310
$$ packed form
2510e97P47o40m35O80l07k36N65n05m48J013M08j242j05Q30l5J7l38l07Q66P31
2530F62j391m25J438L64j262K9O96N41Jj089k40J559O37j729l98J242O76o93o07
2549A1J13P43N09j436n98J742K44j276r9M24M25j39q55j55J188P7j406j84J266
2568E94m03n39J94r1K30K6n31k92P80k33p21N75M47p59o7M39p1j53qj98M76M58
2590A53r37j29J108j03p80j1O47L69O3q30q2J303j28j292L26J218r1p18k00M09
2610B95P35l36q56K47J332l99j272K25J030R7p30n07K12J106p04q25L81Q20n29
2629C22o00j10L35N39m75p04N32M61p06l95N95J14n39L9q2K33O0l37r5P52q4p46
2651h91J37P97j94l58p3L02L59j34o75L16J132o48o05M75N78o8o69P8M64O83o96
$$ plain form
2672 310 -289 310 1437 439 -361 314 856 745 364 -198 436 1135 174 -362 602 1056 213 -233 10 458
2692 458 475 -260 -702 287 749 -445 -717 45 117 -467 -495 -489 -152 -58 -739 -674 237 -176 -1039 -570 66 -312
2714 -312 -467 -449 -505 -71 -186 -820 -443 391 -393 -804 234 397 114 -163 -62 234 689 10 -718 383
2734 383 947 113 -113 513 539 582 348 36 632 926 193 -225 933 853 -76 73 506 437 352 29 -360
2755 -360 473 507 -528 -138 634 -30 -421 -135 10 -158 -157 -587 -538 283 -117 -1190 -491 112 -455 -794 -321
2776 -321 -440 -153 -362 -996 -357 369 -459 -1118 69 233 22 -494 -253 60 520 107 -608 472 756
2795 756 -58 -65 614 505 305 279 176 642 824 45 -49 890 835 -53 170 487 593 499 158 -121 294 464
2817 464 -148 210 469 96 -407 156 19 -137 -97 -388 -219 114 -176 -849 -204 11 -632 -695 -181 -178 -446
$$ packed form
2672C10n99N99J127r98q00O75N42j11l81n62O34O99r61n36R64M54q43m46K43M48
2692D58J7p35m42R89M62j194k72P62P2n84k8OL37R4o81O5R11m13q63M69O36l78
2714c12j55J8n6M34j15o34L77Q34p84m11J038J63k83k77J01K96M55o79p28J101
2734C83N64q34k26O26K6M3k34l12N96K94p33m18J158q0r29J49M33o9q5l23l89
2755c60Q33L4j035L90P72o64l91K86J45j68Jm30M9Q21m00j073O99O03n67l39M73
2776c21j19K87k09o34O39P26q28o59J187J64k11n16K41L13M60m13p15J080K84
2795G56q14pO79j09k00k6j03M66J82p79r4R39n5q88K23L17J06r4l41k79M15J70
2817D64o12L58K59l73n03N63j37j56M0k91J69L33k90o73O45K15o43o3N14Lk68
$$ plain form
2838 -446 -702 -720 -331 186 -793 -777 31 79 -600 -544 -183 166 329 -282 -592 285 476 -83 -327 494 434 100
2860 100 263 111 546 579 299 93 731 546 92 312 405 506 502 324 331 430 472 -78 214 419 -77 -44 336
2883 336 225 -86 -30 -110 48 -16 -269 -591 -85 -176 -727 -287 -161 -451 -521 -685 -426 170 -133 -674 -674 128
2905 128 -77 -599 -438 -222 34 -29 -558 -345 294 164 -435 -234 183 131 -29 -59 115 631 454 -37 -43 542
2927 542 400 213 228 290 482 506 374 167 348 389 201 446 291 243 303 228 -67 209 369 26 -40 79 -257
2950 -257 -226 162 -401 -301 2 -26 -419 -645 -267 -178 -42 -402 -688 -146 219 -471 -529 -292 -255 -29 -207 -625
2972 -625 -238 223 -248 -613 7 26 -38 42 -225 -116 476 162 -520 119 720 341 -7 193 189 629 635 -110
2994 -110 197 595 469 78 291 525 292 737 191 -108 586 485 -161 -35 334 133 209 225 -270 -97 488
$$ packed form
2838d46k56j8L89N17r79J6Q08M8o79N6L61L49J63o11l10Q77J91n59k44Q21o0l34
2860A00J63j52M35L3k80k06O38j85m54K20R3J01mj78PR9M2n50K92K05m96L3L80
2883C36j11l11N6q0J58o4k53l22N06r1n51M40J26k90p0j64K59N96l03n41%Q02
2905A28k05n22J61K16K56o3n29K13O39j30n99K01M17n2j60l0J74N16j77m91oN85
2927E42j42j87J5O2J92K4j32k07J81M1j88K45j55m8O0p5k95K76J60l43o6J19l36
2950b57L1L88n63J00L03k8l93k26L78Q9J36l60k86N42L65o90n8K37L7K26j78m18
2972f25L87M61m71l65O20J9o4Q0k67J09N92l14o82O39O01l79l48K00mM40Op45
2994a10L07L98j26l91K13K34k33M45n46k99O94j01o46J26L69k01P6J6m95J73N85
$$ plain form
3015 488 -305 -538 -110 -56 -206 -124 -362 -485 119 -143 -640 -346 -166 -232 -513 -264 -222 82 -134 -776 -479
3036 -479 306 -116 -463 -173 -9 -6 45 -74 -425 299 270 -301 25 529 110 220 554 108 361 593 202
3057 202 42 664 467 217 339 430 334 609 484 -206 143 597 240 58 117 13 198 330 -264 -339 354
3078 354 231 -515 -294 -88 -138 -39 -355 -619 177 143 -627 -609 -42 -139 -385 -474 -468 -86 -28 -430 -752 79 -52
3101 -52 -355 -117 -120 -208 -162 -176 -350 62 329 -256 13 283 161 154 247 154 126 520 291 294 353 227 310 499 295
3126 295 -18 299 281 380 126 139 -66 252 310 -23 -149 401 149 -393 -30 115 -101 -342 -385 -224 116 -82
3148 -82 -723 -278 261 -99 -537 -446 -344 -113 -105 -565 -285 102 -63 -584 -352 41 -237 -253 -406 -371 459 -27
3170 -27 -446 83 237 119 -24 12 -55 400 318 1 256 481 267 120 577 317 172 174 422 328 319 296 171
$$ packed form
3015D88p93k33M28N4j50Q2k38j23O04k62m97K94J80o6k81K49M2L04k16o42K97
3036d79P85m22l47K90J64LN1j19l51P24k9n71L26N04m19J10L34m46K53K32l91
3057B02j60O22j97k50J22R1r6K75j25o90L49M54l57j82N9j04J85J32n94p5O93
3078C54j23p46K21K06n0R9l16k64P96l4p70J8N67r7k46q9OL82N8m02l22Q31j31
3101e2l03K38lq8M6j4j74M12K67n85K69K70j22pR3r3k8L94k29LN9j26Q3J89k04
3126B95l13L17j8R9k54J3k05L18N8l33j26N50k52n42L63J45k16k41m3J61L40j98
3148h2o41M45N39l60m38R1J02K31Qm60K80L87j65n21K32L93k78j6j53L5Q30m86
3170b7m19N29J54j18j43L6o7M55q2l17K55K25k14j47M57k60j45KK48r4rk3j25
$$ plain form
3193 171 506 152 -222 207 427 18 -270 -34 281 221 -108 -168 -145 203 -342 -612 33 205 -288 -529 -397
3214 -397 -89 67 -411 -436 -108 190 -465 -530 -91 85 -137 -333 -554 187 317 -431 -548 -62 232 -13 -204
3235 -204 174 156 104 1 -156 315 415 -94 -53 398 351 118 176 245 277 464 127 34 435 221 -75 228 594
3258 594 64 110 225 107 122 139 -191 57 328 -258 -260 183 102 -336 -241 -17 83 -77 -339 -568 116 168 -674
3281 -674 -490 -82 22 -323 -406 -308 -50 144 -488 -544 251 56 -273 -161 121 165 -128 -363 -184 382 354 -243
3303 -243 -58 460 252 -2 113 276 367 375 131 234 506 288 -258 376 787 69 133 181 182 312 61 -25 166
3326 166 471 -251 -196 226 92 -265 -296 -98 -234 -189 -374 -481 -92 -51 -533 -254 87 13 -355 -303 -213 44
3348 44 -186 -537 -530 183 -151 -559 -164 114 -122 -200 -141 -168 92 267 -318 31 512 33 -74 169 373 153
$$ packed form
3193A71L35l54l74M29K20m09k88K36L15o0l29o0K3L48n45k70O45J72m93k41J32
3214c97L08J56m78k5L28K98o55o5M39J76k22j96k21P41J30p48j17M86K94k45j91
3235b04L78j8n2j03j57M71J00n09M1M51m7k33N8O9L2J87l37r3M01k14k96L03L66
3258E94n30M6J15j18J5J7l30K48K71n86kM43q1m38R5K24J00j60k62k29O84N2q42
3281f74J84M08J04l45q3R8K58J94o32n6P95j95l29J12K82M4k93k35J79N66k8n97
3303b43J85N18k08k54J15J63R1Qk44J03K72k18n46O34M11p18O4M8JJ30k51q6J91
3326A66L05p22N5M22j34l57l1J98j36M5j85j07L89M1m82K79L41p4l68N2R0K57
3348D4k30l51PP13l34m08L95K78k36p8N9k7K60J75n85L49M81m79j07K43K04k20
$$ plain form
3370 153 107 106 303 654 299 -201 288 672 167 -62 286 327 397 54 117 383 373 -58 -31 497 258 -180 -99
3393 -99 -85 166 -42 -303 -340 4 -159 -501 -431 114 -50 -367 -478 -34 -29 -20 -658 -205 147 -17 -464 -241 233
3416 233 -145 -185 -275 -168 6 -168 -427 38 297 57 -191 64 163 124 12 131 240 186 108 1 223 405
3438 405 0 97 220 215 101 50 154 303 348 -73 -71 350 297 -127 -180 193 170 -78 -294 -85 266 -163 -343
3461 -343 -95 121 -50 -310 -504 -71 65 -421 -531 -174 88 -58 -515 -364 -18 -125 -120 -356 49 193 -396
3482 -396 -341 158 115 -51 17 168 215 15 -77 -36 165 190 -68 146 317 228 125 87 351 207 105 80 200
3505 200 315 26 -118 403 385 11 -68 206 185 188 137 -150 136 272 -109 -326 104 258 -303 -210 -134 38 5
3528 5 -255 -428 22 64 -285 -455 11 -202 -334 -316 -380 -108 1 -341 -474 -116 -83 -322 -74 44 -19 -45 -311
$$ packed form
3370A53m6jJ97L51l55n00M89L84n05k29L48M1P0l43O3K66j0m31K7N28k39m38Q1
3393i9J4K51k08k61l7L44j63l42P0N45j64l17j11M44NRo38M53L52j64m47K23M74
3416B33l78m0r0J07J74j74k59M65K59k40k48K55R9l9j12J19J09n4p8j07K22J82
3438D05m05R7J23nj14n1J04J49M5m21KM21n3m24n3L73k3k48k16K09L51m29j80
3461c43K48K16j71k60j94M33J36m86j10L57K62j46m57J51L46j07Nk36M05J44n89
3482c96N5M99m3j66O8J51M7k00r2M1K01K5k58K14J71q9j03l8K64j44j02k5J20
3505B00J15k89j44N21j8l74p9K74k1Ln1k87K86J36l81k17M30J54n61R3P6J72l3
3528Ek60j73M50M2l49j70M66k13j32J8o4K72J09l42j33L58L3k39K48J18o3k6k66
$$ plain form
3551 -311 -130 158 298 -132 -45 13 116 126 395 57 48 191 117 5 310 385 -20 322 268 -223 325 248 67
3574 67 74 163 79 167 202 -89 -11 230 -91 -153 14 35 -195 75 -80 -224 73 -6 -167 -232 19 -79 -330 -186
3598 -186 -315 -18 20 -329 -293 153 -79 -390 -104 107 -258 -2 -174 -178 11 246 -148 -127 128 -39 15 -20
3620 -20 -141 217 215 57 170 172 232 50 133 215 144 241 207 6 143 199 96 31 177 -292 134 261 131 -48
3644 -48 136 216 150 39 -193 -139 -52 -32 -304 -187 309 13 -345 -133 -111 -175 -198 -278 -205 124 -104 -400 -89 -44
3668 -44 -15 21 -51 -144 -73 -19 -120 -139 119 -36 28 -39 -70 134 -13 -41 16 257 185 253 224 83 78 140 -89 25
3694 25 124 455 135 -43 154 28 305 258 -207 -10 272 46 -19 -119 92 0 -132 -48 -116 -65 91 -278 -251
3717 -251 -189 -174 -160 -267 -67 -80 -45 -100 -215 -145 -247 -106 -45 -85 -89 -66 -113 -175 27 38 -243 -147 -104 45 111 181
$$ packed form
3551c11J81K88J40m30Q7N8J03J0K69l38rJ43p4j12L05P5m05L42n4m91N48p7j81
3574F7PQ9q4Q8L5k91P8K41l21o2J67K1k30K70j55j44K97p9j61o5K51r8k51J44
3598a86j29K97L8l49L6M46k32l11K86K11l65K56j72mJ89K35l94K1K55j67N4l5
3620b0j21L58kj58J13KO0j82Q3Q2p1R7l4k01J37N6j03o5J46m69M26J27j30j79
3644d8J84Q0o6j11k32N4Q7K0k72J17M96k96l58K12K2o4k3q0P3L29k28k96L11M5
3668d4K9L6p2r3P1N4j01j9K58j55O4o7l1K04j47k8N7K41p2O8k9j41nO2k29J14
3694B5R9L31l20j78J97j26K77m7m65J97K82k26o5j00K11r2j32Q4o8N1J56l69K7
3717b51O2J5J4j07K00j3L5n5j15P0j02J41O1m0mK3m7o2K02J1k81R6M3J49O6P0
$$ plain form
3743 181 -3 23 139 173 93 -47 47 181 107 -39 11 102 36 18 -4 142 108 198 129 -46 325 372 106 2 120
3768 120 165 233 162 -157 84 151 5 -150 -30 122 -189 -172 -13 -286 -47 -108 -350 -71 146 -277 -171 -94
3790 -94 -85 -125 -92 -139 -134 -176 -180 -84 -127 8 -21 103 28 -275 -76 222 -186 -115 163 -111 140 31 -26 -50 239 82
3816 82 -89 25 404 304 84 66 -23 234 277 -8 8 329 132 76 191 39 88 215 -81 44 79 115 -91
3839 -91 -29 95 -43 26 -51 -244 34 10 -383 -152 48 -160 -172 -131 -134 -260 -28 -40 -309 -121 -69 -150 -250 -101
3863 -101 -239 19 127 -238 145 256 -120 -146 127 -34 -56 126 -89 -141 152 92 48 215 -20 59 80 -36
3885 -36 -67 45 414 184 -82 153 249 -25 73 -32 29 314 42 -191 63 113 -45 -92 -138 -160 91 27 -342
3908 -342 -76 -34 -146 -102 -73 -337 -238 -172 -270 -232 30 -168 -181 -156 -76 -138 -221 -79 -163 -160 18 -27 -62 62 -50 74
$$ packed form
3743A81j84K6J16L4q0j40R4J34p4j46N0R1o6j8k2J46l4R0o9j75L71M7k66j04J18
3768A20M5O8p1l19K41O7j46j55J20J52l11J7J59k73K39o1k42K79K17m23J06P7
3790i4Rm0L3m7Nm2mR6m3J35k9J24p5l03J99K98m08P1K78k74K51j09n7k4K89j57
3816H2j71J14L79j00k20j8q9K57M3k85J6L21j97n6J15j52M9J27k96J25L5L6k06
3839i1O2J24j38O9p7j93K78k4l93K31K00k08j2M1lj26K32j2k69J88N2q1j00J49
3863a01j38K58J08l65L83J11l76k6K73j61k2J82k15n2K93o0m4J67k35P9K1j16
3885c6l1J12L69k30k66K35R6k74R8j05O1K85k72k33K54N0j58m7m6k2K51o4l69
3908c42K66M2j12M4K9k64R9O6r8L8K62j98j3K5Q0o2q3J42q4LJ78m5l5J24j12J24
$$ plain form
3934 74 -25 94 -57 -171 64 53 178 28 32 121 42 117 162 180 -173 1 254 139 199 156 107 263 283 96 -149
3959 -149 164 219 105 -164 81 -155 13 -104 -84 124 -89 -227 -296 -87 -166 59 -249 -190 -26 -29 -266 -253 -166
3982 -166 -3 -196 -96 -164 -93 -147 -92 -253 14 -38 -335 4 -1 -227 -52 36 313 206 23 122 -70 128 19
4005 19 136 379 133 48 175 124 190 70 144 122 166 119 51 -111 278 128 28 158 25 80 -38 178 -83
4028 -83 123 -113 -102 64 -47 40 -38 -90 -162 -35 98 -9 -56 -180 -187 -147 -98 -235 -80 -78 -168 -34 61 -104 -287
4053 -287 29 -56 -292 164 -63 -9 83 47 60 -68 94 108 25 309 194 51 158 144 -51 18 174 3 103
4076 103 102 116 1 188 96 43 -29 65 -11 30 -97 -96 158 -6 -201 126 24 -3 -9 -6 -28 159 82 -245 -17 44
4102 44 -323 -83 63 -178 -183 -98 -49 -73 31 -91 -204 -29 144 -264 -262 171 -206 -78 -265 -216 -47 127 -112
$$ packed form
3934G4r9J19j51j14K35j1J25j50MQ9p9P5M5J8l53J74K53j15O0m3m9J56K0j87k45
3959a49L13N5j14k69K45k36J68j17K0K08k13j38o9K09p9K25l08N9J64lk37J3Q7
3982a66J63j93J00o8P1n4N5j61K67n2k97L39nk26J75Q8K77j07j83R9j92J98j09
4005A9J17K43k46q5J27n1O6j20P4k2M4m7o8j62L89j50j00J30j33N5j18K16k61
4028h3K06k36J1J66j11Q7p8n2p2J27J33j07m7j24pM0M9j37J55Kr0J34R5j65j83
4053b87L16q5k36M56k27N4R2l6J3j28J62J4q3K84j15j43J07j4j95O9J56j71J00
4076A03jJ4j15J87r2n3p2R4p6M1j27JK54j64j95L27j02k7oLk2J87p7l27K28O1
4102D4l67K40J46k41nQ5M9k4J04j22j13J75J73m08KM33l77J28j87M9J69J74k39
$$ plain form
4125 -112 15 178 98 8 4 107 109 129 185 31 -38 205 -85 124 138 65 -86 25 243 84 110 17 -4 94 29
4150 29 15 125 200 -106 -49 126 -42 -86 -28 -154 -170 153 -44 -75 122 -151 -222 -157 -91 -206 30 -63 -187 9
4174 9 -145 -355 11 113 -249 -142 100 -46 62 151 -37 -109 -47 94 -40 -20 -40 8 -68 129 46 82 203 81
4198 81 256 85 -80 129 184 54 69 123 106 166 116 124 -76 161 154 110 -16 -67 111 140 -77 -97 10 78 -71
4223 -71 -137 62 -174 -156 -34 -206 12 -110 -48 -101 5 -69 -97 -184 -113 -64 -144 -15 -6 -69 -1 39 67 8 -157 61
4249 61 -19 -21 225 178 -95 -113 187 99 -113 188 294 136 166 202 143 130 12 21 13 153 21 39 66 105 133 -96
4275 -96 139 37 -57 -112 3 87 63 -153 87 120 -132 52 -61 -39 -58 67 -23 -94 -40 -215 -129 -198 -28 -40 -4
4300 -4 -77 -84 -16 -172 -243 -25 -150 -77 -60 -35 -147 17 52 -126 76 36 -99 -35 83 16 -134 134 46 93 92 -89
$$ packed form
4125a12J27J63q0r0mJ03KK0N6j54o9K43k90K09J4p3j51J11K18j59K6r3k1R8o5
4150B9j4J10P5l06N7J75j68m4N8j26j6L23j97l1J97k73p1O5O6j15K36r3j24J96
4174Ij54k10L66J02l62J07K42j46J08Q9j88p2O2J41j34K0k0M8p6J97q3L6J21j22
4198H1J75j71j65K09N5j30J5N4j7O0n0Qk00K37pm4j26n1J78K9k17k0J07O8j49
4223g1o6J99k36J8J22j72K18j22O2n3J06p4k8q7P1M9q0J29Ro3O8M0K8n9j65K18
4249F1q0kK46m7k73j8L00q8k12L01J06j58L0L6n9j3j18RqJ40j32J8K7L9K8k29
4275i6K35j02r4n5J15Q4k4k16K40L3k52J84j13K2j9J25r0p1N4j75Q6o9J70j2L6
4300dp3pO8j56p1K18j25P3J7K5j12J64L5j78K02m0j35O4J18o7j50K68q8M7jj81
$$ plain form
4326 -89 96 14 280 -43 229 193 -136 151 -78 56 37 -50 -36 10 50 -123 37 85 0 -77 17 93 -116 -20 56
4351 56 -196 13 -67 -19 117 14 -107 -106 63 -108 -192 116 -175 -83 -22 -42 -23 162 -36 -98 -31 -17 -167 79
4375 79 73 18 131 143 -9 72 164 -23 -39 -96 107 -10 80 114 179 -14 96 -104 21 14 -50 41 51 88 -57 -17
4401 -17 88 -21 184 190 36 140 3 -17 113 -20 -178 94 101 -232 -88 -111 32 -114 -1 -75 -23 -72 -5 -15
4425 -15 -28 -226 -7 -15 -66 -185 -18 11 -131 -131 -181 4 3 139 -132 34 91 -27 -60 266 266 -108 -44 161 53
4450 53 5 122 224 187 37 11 34 74 42 300 113 190 93 122 -40 -50 -23 76 -273 35 21 183 22 -60 -133
4475 -133 -181 -153 -124 -133 -42 -160 -194 116 -60 -68 70 -80 52 -23 -107 -122 -33 76 51 63 35 -107 19 -134 -5
4500 -5 -7 -198 -14 -16 50 9 28 42 -26 140 84 45 129 149 149 34 -44 123 11 -102 168 18 254 -8 -16 96 -31
$$ packed form
4326h9J85q2K66l23K72l6l29K87k29J34j9q7J4M6M0j73J60M8q5p7R4P6k09R6P6
4351E6k52K09q0M8J36j03j21JJ69j71q4L08k91R2O1k0J9J85j98o2O7J4j50K46
4375G9on5J13J2j52Q1R2j87j6n7K03j17R0L4O5j93J10k00J25po4R1J0L7j45M0
4401a7J05j09K05Oj54J04j37k0J30j33j58K72Pl33J44k3J43j46J13p4N2m9O7j0
4425a5j3j98K19qn1j19J67K9j42%n0J85jJ36k71J66N7j18l3L26%l74O4K05j08
4450E3m8J17J02l7j50k6K3M0l2K58j87P7r7K9j62j0K7R9l49L08j4J62j61q2p3
4475a33m8K8K9rR1j18l4L10j76qJ38j50J32p5q4j5Q9J09k5J2k8j42J26j53J29
4500ekj91J84kO6m1J9J4o8J66n6l9Q4K0%j15p8J67j12j13K70j50K36k62qJ12j27
$$ plain form
4527 -31 -5 -4 125 -23 60 17 23 28 259 -92 43 77 113 165 -205 -4 -218 -159 30 -108 33 78 -125 -123 23 -125
4553 -125 64 80 -48 -37 -89 -84 -21 6 89 -13 41 -151 -35 -34 -9 15 -66 -172 -68 -148 135 101 98 85 -38 39 -81
4580 -81 37 -21 70 -105 122 -101 260 -85 -58 20 104 22 -61 42 -64 52 -122 -24 110 -137 103 -35 -61
4603 -61 131 -88 -141 -142 16 -43 -75 -164 43 -210 -8 -20 -130 -182 92 -46 -193 -20 -5 -32 -89 -45 -205 -70
4627 -70 -27 63 112 237 -132 -4 106 14 -17 -61 65 -67 -112 109 -87 162 120 9 11 11 -83 -111 39 103 262
4652 262 8 -109 37 116 -17 58 39 107 122 11 -92 -226 -143 76 -89 43 183 -41 65 -115 74 -168
4674 -168 -78 -7 40 -101 -132 141 -104 6 -255 -30 59 34 24 -57 69 -74 21 -53 -86 -61 -180 -159 14 94 -54
4699 -54 46 134 60 -97 11 58 55 -33 -243 81 20 193 18 149 53 -25 14 88 67 176 -104 -60 -112 15 -103
$$ packed form
4527c1K6JJ29j48Q3m3ONK31l51J35L4L6N2l70K01k14N9J89j38J41M5k03KJ46j48
4553a25J89J6j28J1n2NO3K7Q3j02N4j92J16JK5K4q1j06J04q0K83l4lj3j23P7j20
4580h1J18n8R1j75K27k23L61l45K7P8Q4q2q3J03j06J16j74R8J34k47K40j38k6
4603f1J92k19n3jJ58n9l2q9K07k53K02j2j10n2K74j38j47J73J5k7n7M4j60J35
4627g0M3R0M9J25l69J28J10r2l1m4J26j32m5K21j96K49m2j11K%r4k8J50O4J59
4652B62k54j17J46P9j33P5j9O8J5j11j03j34Q3K19j65J32J40k24J06j80J89k42
4674a68R0P1M7j41l1K73k45J10k61K25Q9k5j0q1J26j43R5p4l3K5j19K1J73Q0j48
4699e4J00Q8p4j57J08M7lq8k10L24o1J73j75J31r6p8L9P4k1J09k80M4n2J27j18
$$ plain form
4724 -103 5 -63 -191 45 -125 -71 -56 4 -58 -70 66 -108 -31 -11 -194 51 150 21 -86 30 -75 -196 139
4747 139 -85 -14 -99 -70 68 -36 -10 63 5 -113 204 -104 -108 52 -27 70 -84 55 -38 -73 69 -26 -12 40 -192
4772 -192 -64 65 -82 108 -16 89 -121 26 94 -22 -159 -18 57 -64 195 6 -45 -153 -135 -174 -122 -48
4794 -48 158 18 90 -43 -96 -26 4 -44 56 -153 110 -9 -30 249 48 52 28 -157 -16 88 -51 -91 -69 40
4818 40 30 47 84 26 89 106 166 52 93 52 -49 21 -145 -44 98 -18 63 64 147 62 132 135 13 -121 32 44 -1
4845 -1 -46 -101 140 49 4 87 -27 -112 -46 -40 -3 -96 -69 13 -102 46 -162 -149 39 115 -13 -222 -1 -143 19 -58
4871 -58 -74 246 -27 -10 -176 85 -41 114 -33 -142 -30 104 148 82 223 177 -25 -88 -36 44 8 -99 -28 40
4895 40 155 22 36 159 130 -20 6 182 -58 125 93 33 -24 -51 -75 126 4 -15 216 -35 78 49 81 27
$$ packed form
4724a03J08o8j28K36j70N4J5O0o2j2J36j74P7K0j83K45R9j29j07J16j05j21L35
4747A39k24P1q5K9J38j04K6P3n8j18L17l08mJ60p9R7j54J39r3l5J42r5J4N2k32
4772a92J28J29j47J90j24J05k10J47O8j16j37J41P5j21K59j89n1j08J8l9N2P4
4794d8K06j40P2j33n3P0L0m8J00k09K63j19k1K79k01Mk4j85J41J04j39m0K2J09
4818D0j0J7L7n8O3J7O0j14M1m1j01P0j66J01J42j16Q1JQ3q5P0Lj22j34J53J2m5
4845am5n5K41r1m5Q3j14q5O6OL7r3K7Q2j15J48k08J3J88P6j28k09K21j42J62p7
4871e8j6L20k73J7j66K61j26J55j47j09J12J34M4o6J41m6k02o3N2Q0l6j07P1O8
4895D0J15j33J4J23k9j50K6J76k40J83l2o0n7k7k4K01j22j9K31k51J13k9L2n4
$$ plain form
4919 27 72 52 -118 13 68 0 -120 -160 21 51 -60 -47 -256 -104 256 -144 17 -19 -122 2 153 120 -96
4942 -96 -70 137 84 -48 229 60 114 -152 -4 -46 143 75 40 -4 123 -80 -27 -5 90 -43 -35 -16 91 199 1
4967 1 -123 20 172 43 -60 131 134 19 145 -106 80 -25 -117 122 -76 -131 98 7 -50 94 104 -79 -55
4990 -55 -19 22 90 24 -86 -50 66 -109 -103 -9 59 -185 -187 49 19 -52 -30 0 -18 123 -209 -124 17 184 -157 -74
5016 -74 -64 161 94 65 95 91 57 -103 -4 -89 72 -47 -120 -41 26 -41 -27 31 -18 10 89 -84 39 -12 80 43 -88
5043 -88 -121 -6 -7 7 -55 -161 -24 149 128 56 54 -273 36 -97 62 71 -107 -17 41 -28 21 -71 12 47 73 -67 -132
5070 -132 60 74 -33 -140 -76 -181 167 34 34 147 -11 -24 -2 144 25 -31 -30 35 -115 61 105 38 -57 154
5094 154 169 -87 -35 22 69 -90 88 13 90 69 44 41 -66 114 100 60 43 -32 75 38 164 -204 66 150 111 -112
$$ packed form
4919B7M5k0j70J31N5o8j20m0J81L0j11J3k09J52L60m00J61l6j03J24J51l3k16
4942i6K6K07n3j32K77j69N4k66J48m2J89o8l5m4J27k03N3K2R5j33QJ9J07J08j98
4967Aj24J43J52j29j03J91Lj15J26k51J86j05r2K39j98n5K29r1n7J44J0j83K4
4990e5L6M1O8o6j10L6J16j75OR4O8k44kK36l0p1K2L0j8J41l32Q5J41J67l41Q3
5016g4J0K25o7k9L0ml4j60R9q5J61j19p3P9O7o7J4N8m9K8P9j73J23n1R2l7j31
5043h8l3J15jJ4o2j06J37J73k1p2kl27L09j33J59Rj78R0N8o9M9r2Q3L5K6j40o5
5070a32J92J4j07j07O4j05L48j33%J13j58j3K2J46j19n6JO5j50J76M4o7r5K11
5094A54J5k56N2N7M7j59J78p5P7k1k5lj07J80j4m0j7p5J07l7J26l68K70Q4l9k23
$$ plain form
5120 -112 12 -3 -31 21 1 124 -133 -44 30 34 18 -71 -208 -63 -13 31 -162 -88 -216 180 -32 79 61 -226 -209
5145 -209 228 1 83 -12 43 -25 -51 117 -4 -89 -23 164 -198 93 53 -40 -6 47 -8 133 152 22 -175 -47
5169 -47 -107 118 110 -4 -66 28 65 -68 -34 -17 -10 -182 -33 -125 -169 -2 -135 60 -9 46 96 -193 114 15 22 94 -117
5196 -117 -99 -76 17 -90 -119 -19 76 44 -4 -122 -48 22 -230 -274 130 -66 -82 -101 -7 -163 -141 75 47 -46 -5 19
5222 19 -6 102 -110 -48 62 42 -42 37 167 -45 30 86 -4 -1 78 -43 -8 -40 27 -39 -82 50 21 169 -19 -275
5248 -275 57 -152 -215 61 -212 -49 -257 59 93 -34 -8 -91 13 -57 47 77 -42 -127 -36 1 19 39 134 -34
5272 -34 130 -85 77 -8 69 -49 -81 198 23 -157 52 24 -91 -19 -102 -82 -105 9 150 -31 73 38 -84
5295 -84 83 -38 -32 -81 173 -105 59 -111 148 -30 43 69 -15 39 54 -161 62 17 -141 118 17 24 -142 52
$$ packed form
5120a12J24j5k8N2k0J23k57Q9P4Mj6q9j37J45N0M4j93P4j28L96k12J11j8k87J7
5145b09M37k27Q2r5N5o8k6J68j21q5O6J87l62K91m0r3L4N3n5J41J9j30j97J28
5169d7o0K25qj14o2R4L7j33L4J7Pj72J49r2m4J67j33J95o9N5N0k89L07r9PP2k11
5196a17J8K3R3j07k9J00R5l2m8j18P4P0k52m4M04j96j6j9R4j56K2K16k8r3M1K4
5222A9k5J08k12O2J10k0q4P9J30k12P5N6r0LP9j21L5l2O7o6m3J32k9J48j88k56
5248b75L32k09o3K76k73J63k08L16L4j27K6q3J04p0J04L0j19q5R1L7J8K0R5j68
5272c4J64k15J62q5P7j18l2K79j75j80K09k8j15P2q3K0k3J14J41j81J04l5j22
5295h4J67j21Om9K54k78J64j70K59j78P3K6q4N4J5k15K23m5j58K59j01Pj66J94
$$ plain form
5319 52 -37 29 94 -34 60 157 -83 154 2 93 65 -34 -89 -84 -97 20 74 -8 -11 -4 208 193 100 -105 92 -39 -2
5346 -2 -103 3 110 -4 -168 -77 151 75 1 84 -63 71 -21 -31 -118 167 77 -92 -60 47 98 7 22 34 128
5371 128 58 76 -80 64 -42 121 -1 -74 -57 126 -163 -128 177 154 14 19 -76 81 -94 152 1 37 -91
5394 -91 68 -190 -51 126 52 4 -49 -87 -122 -67 48 0 -88 133 30 -21 82 -97 -44 139 302 -24 -100 59
5418 59 34 147 -116 -77 -255 -180 -91 -172 -27 -2 -91 -211 -35 150 -34 -49 55 -5 151 -39 107 -182 32
5441 32 -20 -26 11 211 -51 11 -66 75 155 94 224 -83 148 61 22 -18 -101 -177 55 -76 -117 151 77 97 -152 -122
5467 -122 -33 71 -118 81 104 1 -4 -86 48 -35 102 85 -160 123 17 -65 -21 -107 43 -53 65 -1 124 -268
5491 -268 59 223 -144 -12 -77 179 -37 52 131 -50 57 -59 43 14 105 145 -97 29 -135 -8 46 172
$$ packed form
5319E2q9O6O5j28R4R7k40K37j52R1k8r9n5Nj3J17N4q2lPK12j5r3k05J97j31L7
5346bj01J06J07j14j64R1K28p6p4Q3j47J34r2j0q7K85r0j69L2J07N1r1J5J2R4
5371A28p0J8j56J44j06J63j22p3J7J83k89L5L05k3j40Nr5J57j75K46j51L6j28
5394i1J59k58J39J77p4m8n3l8l5N5J15m8q8K21j03n1J03j79N3J83J63l26p6J59
5418E9k5J13k63L9j78P5Q9q1J45K5q9j20J76J85j84j5J04o0J56j90J46k89K14
5441C2n2oL7K00k62O2p7J41Q0o1J30l07K31q7l9m0q3p6K32j31m1K68p4K0k49L0
5467a22Q9J04j89J99K3j03nq2J34q3J37j7k45K83j06q2M4q6J50r6J18o6J25l92
5491b68L27J64l67J32o5K56k16Q9P9j81J07j16J02k9R1M0k42J26j64J27N4J26
$$ plain form
5513 172 113 -70 -29 -168 178 26 135 15 193 70 -80 21 -41 172 143 123 150 59 85 101 51 105 -1 30
5537 30 38 -97 -48 -169 33 7 112 -59 -79 25 83 -29 10 42 33 44 -50 111 -96 -54 -70 -27 13 100 3 5 -22
5564 -22 -52 -115 -3 -14 123 16 108 21 38 -45 -10 -219 0 -13 160 82 -100 -153 -13 -39 106 -53 58 -101
5588 -101 156 81 -25 94 -38 -98 71 151 -39 -30 79 204 -1 65 -86 -42 68 -213 84 -29 163 13
5610 13 35 -186 19 95 -118 -29 28 60 -65 -5 -2 23 91 89 6 13 95 15 -110 82 69 101 -108 236 61 -6 196
5637 196 -55 42 61 132 74 11 43 -6 -27 33 143 0 184 158 21 -89 -289 57 77 -45 27 -122 142 42
5661 42 83 -26 127 -34 -201 137 2 -6 32 120 -120 82 -33 152 28 -67 -22 -30 99 -102 50 64 75 44
5685 44 66 54 61 17 26 -138 -3 -45 26 185 -124 29 161 -79 135 272 -87 -25 -66 -71 23 82 -151 202 46
$$ packed form
5513A72n9j83M1j39L46j52J09j20J78j23j50J01o2K13k9k0K7r1K6J6n0N4j06L1
5537C0Qj35M9j21K02k6J05j71k0J04N8j12L9L2rJ1r4J61k07M2j6M3M0Q7r7Kk7
5564b2l0o3J12j1J37j07R2q7J7q3L5k09K19j3J73p8j82n3J40k6J45j59J11j59
5588a01K57p5j06J19j32o0J69Q0j90RJ09J25k05O6j51M4J10k81K97j13J92j50
5610A3K2k21K05P6k13Q9N7L2j25O0LK5O8kq3PQ2q0j25J92j3L2k09L44j75o7K02
5637A96k51R7J9P1n8o3L2m9k1O0J10j43J84k6j37j10k00L46K0j22P2j49K64j00
5661D2M1j09J53j61j67L38j35qL8Q8k40K02j15J85j24r5M5qJ29k01J52J4J1l1
5685D4K2j2Pm4Rj64J35m2P1J59l09J53J32k40K14J37l59O2m1nR4N9k33L53j56
$$ plain form
5710 46 0 -33 -121 -39 -103 70 -13 -25 8 -207 -70 -31 86 12 17 -126 106 38 10 13 -147 134 -45 50 71 73 220
5737 220 -17 122 -77 -119 -3 29 -4 -46 -136 43 -28 77 149 -21 -93 24 126 -29 52 172 -93 56 -40
5760 -40 12 -10 -54 -134 -51 38 244 -83 -54 77 86 92 16 66 49 31 -119 -99 -29 -112 35 107 45 -2 -41 2 14 0 -150
5789 -150 156 85 -85 -146 -42 18 -29 -1 14 -140 177 -30 10 -44 196 150 -5 33 -34 -62 -109 -152 -121 115 -116
5814 -116 -101 38 -41 91 -15 -2 -66 116 46 90 32 9 213 93 127 53 100 -30 10 2 25 -99 -58 42 66 73
5840 73 128 -87 -59 150 37 -75 19 240 -18 193 81 130 62 173 122 -33 -13 -99 -73 -114 -43 24 -4 -59 -119
5865 -119 29 -100 -72 -57 95 -160 -86 39 -126 -11 -114 -66 -186 79 9 -74 -49 -72 -51 -242 -37 -243 73
5888 73 42 -47 191 -22 70 32 183 22 -18 -138 -18 -47 -34 2 10 24 -13 10 -106 -117 68 40 22 -26 4 -122
$$ packed form
5710D6m6l3q8Q2o4J73q3j2L3k15J37L9J17p4Nj43K32o8k8Lj60K81j79R5K1KJ47
5737B20k37J39j99m2J16L2l3m2r0J79p1J05P2j70p2J17J02j55Q1J20k65J49r6
5760d0N2k2m4q0Q3Q9K06l27K9J31ROp6N0j7j8j50K0P0q3J47P2o2m7l9M3J2j4j50
5789a50L06p1j70o1J04O0m7K8J5j54L17k07M0n4K40m6j55L8o7k8m7m3L1K36k31
5814a16J5J39p9J32j06J3o4J82p0M4n8k3K04j20L4p4M7j30M0qK3j24M1J00K4P
5840G3N5k15K8K09j13j12R4K21k58K11j12M9o8J11n1j55K0q6K6m1P1O7k8n5o0
5865a19J48j29K8J5J52k55P4J25j65J15j03M8j20K65p0q3K5k3K1j91K05k06L16
5888G3l1q9K38k13R2l8J51j61m0j20J20k9J3L6QJ4l7K3j16j1J85k8j8m8L0j26
$$ plain form
5914 -122 -53 105 -2 -29 61 -61 -257 -53 -26 -178 -48 96 -196 -186 -163 -14 -118 -11 85 40 -30 129 -55
5937 -55 -29 -154 95 -218 54 -37 -41 42 -16 167 109 42 89 119 -9 5 141 19 57 120 53 211 69 -113 19
5962 19 16 -42 -75 142 -36 -102 -32 77 7 -89 91 134 16 -37 -21 -91 51 -53 157 -164 57 -75 14 -37 -56
5987 -56 7 7 -5 -149 8 86 85 90 25 -89 -94 -95 167 -76 65 -89 -71 -96 8 -18 12 -47 -85 -41 -31 -73 91 -53
6015 -53 68 -101 -101 26 26 -29 71 -24 -2 148 -45 50 -42 -66 -137 -57 -99 125 -5 -51 179 150 34 -146 109
6040 109 -30 32 -88 6 -136 139 101 68 -103 150 184 -63 47 -42 -94 -69 -45 -135 78 -19 61 76 18 -54 -56 95
6066 95 43 -168 -13 -122 108 55 -74 -26 64 -66 21 -25 84 49 24 -10 62 -32 -116 -111 2 -7 -62 -15 57 154 44
6093 44 126 56 -7 -39 -125 20 201 5 -14 5 -95 39 20 49 -29 -42 -112 -152 -48 -12 -117 -55 -40 -54 30 -26 134
$$ packed form
5914a22O9J58j07k7R0j22j96K04K7j52J30J44k92J0K3J49j04J07R6m5p0J59j84
5937e5K6j25K49l13K72r1mQ3n8J83n8o7M7L0j28J4J36j22L8O3o7J58j42j82J32
5962A9ln8l3K17j78o6P0J09p0r6J80M3j18n3J6p0J42j04K10l21K21j32Q9n1j9
5987e6O3%j2j44J57P8jNo5j14njK62k43J41j54J8k5J04k6L0n9l8M4J0m2J64j44
6015e3J21j69%J27%n5J00r5K2J50j93R5r2k4p1Q0m2K24j30m6K30k9j16j80K55
6040A09j39O2j20R4j42K75l8l3j71K53L4k47J10q9n2K5K4r0K13r7Q0J5n8p2kJ51
6066I5n2k11J55j09K30n3j29M8R0j30Q7m6J09l5k5l4P2r4q4NJ13rn5M7P2R7j10
6093D4Q2p0o3l2q6J45J81j96j9J9j00J34j9K9p8j3p0m0J04L6j05O2J5j4Q4n6J60
$$ plain form
6120 134 27 -79 -147 -152 -123 -38 -88 22 -31 142 -111 28 75 -81 -44 -149 263 -2 39 -81 -15 23 -271 37
6144 37 73 -74 32 120 88 -143 88 -224 203 -56 159 -116 108 -30 126 103 46 25 -101 -125 -94 -107 133
6167 133 -64 -224 1 15 -19 87 -24 -63 -50 -35 -128 59 -48 -8 181 -26 -77 -214 -39 -78 -23 -27 -20 -82 30
6192 30 51 -13 -35 -103 -83 178 19 -96 63 -39 -67 4 32 -46 179 201 -10 101 48 -4 139 80 -28 128 120
6217 120 106 29 -25 19 43 -127 9 -25 61 21 -172 8 27 63 0 -19 -54 207 23 -16 -18 13 2 -2 -26 16 -163
6244 -163 12 -119 -102 67 -16 -59 94 72 106 2 -20 -18 42 25 -5 -102 8 -154 -131 125 -51 -32 109 141 -21
6269 -21 -58 -46 0 -113 -114 5 27 109 152 -11 21 82 -6 -120 -97 -27 165 -57 87 149 83 3 -54 44 -118 -56 312
6296 312 -2 126 -125 53 -41 96 82 0 -8 -114 -113 -84 20 19 88 16 11 -86 -65 0 47 36 -89 -20 -97 -174 79
$$ packed form
6120A34j07j06o8nK9Q5n0J10n3J73k53J39M7j56L7j05M12k65M1j20O6L8k94L08
6144C7L6j47J06Q8l2k31K31l12M27k59K15k75K24j38J56k3n7k1j26k4L1j3K40
6167A33j97j60K25J4l4J06j11l9J3J5r3J87j07M0J89k07n1j37J75l9N5mPo2J12
6192C0K1o4k2o8K0K61j59j15J59j02k8P1K8p8K25K2k11J11n3n2J43n9j08J56q
6217A20j4p7n4M4K4j70J36l4Q6m0j93J80J9L6o3j9l5K61j84l9kL1j1mk4M2j79
6244a63J75j31J7J69q3m3J53k2L4j04k2KO0j7l0r7J10j62K3K56j76J9J41L2j62
6269b1l7J2M6j13jJ19K2Q2M3j63L2O1q8j14K3P0J92k22J44O2o6q0n7R8j62O2L68
6296C12l14J28k51J78r4J37j4q2qj06JK9J04jO9p2nr7K1O5M7j1j25O9p7p7K53
$$ plain form
6323 79 -212 -139 166 -65 -48 11 57 169 -26 -25 28 110 -47 -119 -192 -69 80 -28 70 -162 5 7 57 140 63 155
6349 155 93 -136 -148 -3 -14 118 147 -70 135 -138 -40 73 -131 -86 -52 18 64 -45 -38 -14 -151 -11 -105 7
6373 7 -48 -118 -33 -227 -68 -50 43 -77 -138 -213 124 207 -80 -21 105 22 68 0 -5 107 -18 109 -41 -44 28 85 118
6400 118 73 -83 32 -33 128 160 -145 115 96 -99 -207 229 45 -44 -35 -23 78 -132 60 -74 -28 35 -29 89
6424 89 68 -99 122 -77 -42 -68 -99 -63 -112 -153 -55 24 -152 -24 159 172 20 -58 -33 97 -67 -125 95 -25 -66
6449 -66 -25 -215 -2 -15 157 50 52 119 90 73 -23 1 173 -56 27 62 -107 58 -31 -50 56 14 -32 64 163 -51
6475 -51 105 82 37 18 113 17 42 -44 -4 -17 -29 78 -59 -145 -39 287 -80 -202 238 -44 58 -206 0 -256
6499 -256 -32 15 -119 72 25 -133 4 -17 -235 -69 11 -2 -46 70 -144 20 34 126 -35 109 -49 55 64
$$ packed form
6323G9k91P3L05k31J7N9M6J12j95JN3Q2j57p2p3J23J49j08R8k32J67KN0Q3p7R2
6349A55o2k29j2J45j1J32K9k17K05k73R8J13k04M5L4P0M6j09PK4j37J40r4J12
6373Gn5p0Q5j94J59J8R3j20o1p5L37Q3k87N9J26q3M6o8nJ12j25J27j50lP2N7L3
6400A18m5j56J15o5J61L2l05K60j9j95j08M36j84q9RJ2J01k10J92j34M6O3o4J18
6424H9k1j67K21j99L5k6l1L6m9m1R8P9j76J28J83J3j52p8K5J30j64n8K20j20m1
6449f6M1j90K13j3J72j07KO7k9j7r6K4J72k29Q3L5j69J65q9j9J06m2m6R6R9k14
6475e1J56k3m5j9R5r6K5q6M0j3j2J07j37q6J06L26l67j22M40k82J02k64K06k56
6499b56K24M7j34J91m7j58J37k1k18J66Q0j3m4J16k14J64J4R2j61J44j58J04R
$$ plain form
6522 64 55 118 133 52 -124 217 -39 195 36 35 81 107 148 -17 -4 -19 2 -10 75 -57 -130 52 156 -3 -4 24 1
6549 1 -70 111 -85 -36 9 69 21 71 -128 29 38 99 49 85 -21 53 13 64 -46 -161 27 -180 40 -111 24
6574 24 26 121 -231 -147 -139 -102 -55 98 0 -13 -22 -36 25 70 -73 -52 -83 -73 -176 82 14 -58 66 35 79 38 -205 78
6602 78 -74 166 -122 -83 185 84 -88 -125 -72 -44 -78 116 76 -68 20 96 64 -74 -21 -36 8 -58 -8 28 15 -34
6628 -34 20 34 -147 -163 -56 98 -126 -67 72 98 62 1 80 4 -56 93 138 17 -36 164 -54 191 61 195
6652 195 -44 228 209 -133 138 45 -82 -140 -42 29 129 42 20 241 38 166 -168 -175 64 -44 162 -78 -31
6675 -31 194 29 -149 -13 43 -67 -44 -131 10 -53 -54 20 -24 81 128 -58 177 96 -96 -21 -40 -22 -230 -65 53
6700 53 -7 -143 -58 16 47 116 -14 44 -199 -9 154 -72 46 86 42 106 117 -30 78 111 -78 -50 -151 75
$$ packed form
6522F4rO3J5q1j76L41k56K34j59jM6K6M1j65J3j5K1j2Q5j32p3J82J04j59jK8k3
6549Ap1J81j96M9M5O0m8N0j99J57RO1n0L6j06P4m0N1j10j15J88k07K20j51J35
6574B4KR5l52Q4QL7M7J53r8j3rj4O1M5j43K1l1J0j03K58o8p2J24l1M4m1k43K83
6602G8j52K40k88L9K68j01j72l7N3K8l4J94m0j44Q8P6l2j38N3j5M4o6N0L6j3m9
6628c4N4J4j81j6J07J54k24N9J39K6l6o1P9p6o0J49M5j21n3K00k18K45j30J34
6652A95k39K72j9l42K71r3j27n8R8P1J00q7k2K21k03J28l34pK39j08K06k40M7
6675c1K25j65j78J36N6j10K3q7J41o3jP4m4J05M7j86K35q1j92P5j9J8k08J65J18
6700E3o0j36Q5P4L1O9j30N8k43J90J63k26J18M0m4O4J1j47J08L3j89K8j01K26
$$ plain form
6724 75 87 96 70 48 31 -129 -37 -124 -13 -55 -133 23 41 -80 -74 -69 -56 -142 -117 -16 -174 22 -43 29 122 28 -44 72
6752 72 -118 30 -11 111 -40 130 116 41 -201 -75 -223 32 -47 -10 -22 -29 70 -156 122 10 46 -8 115 -107
6776 -107 -21 -55 -11 27 -6 -47 201 132 24 5 57 -89 -42 77 22 -35 -93 40 -76 62 -107 -40 -21 8 -45 23
6802 23 -32 12 122 -4 -82 -38 -26 71 144 148 -175 -68 -170 -148 -75 -36 -198 -3 -104 -66 -168 57 52 -200 49
6827 49 -19 58 -104 -67 -79 -152 24 4 -4 61 -62 54 -72 -50 98 164 107 88 -9 166 71 -4 -112 50 101 -53
6853 -53 64 -54 30 -99 127 1 -47 138 -136 120 -67 12 180 -32 8 12 -99 -104 -122 -6 -1 41 107 -94 -44
6878 -44 -229 7 -53 57 -67 -44 50 -91 -16 -16 -67 57 -125 -85 -283 25 -76 -58 79 -11 124 13 33 143
6902 143 149 78 84 -92 109 -135 -44 224 -104 -28 115 146 181 137 142 -110 -98 23 -74 -81 -52 -98 66 -107 39 110
$$ packed form
6724G5J2Rk6k2j7j60R2q7J11m2p8J56J8j21ONJ3q6K5J01j58J96o5P2R3r4p2J16
6752G2j90J48m1J22j51J70j4p5k42J26j48K55p9L7j2pR9k26K78j12L6n4J23k22
6776a07Q6l4M4L8l3m1K48o9j08j9N2j46M7J19n5n7n8J33j16J38j69O7J9K9n3O8
6802B3n5M4J10j26p8M4J2R7P3Ml23J07j02K2P3L9j62J95j01L8j02K25nk52K49
6827D9o8P7j62L7j2p3J76k0qO5j23J16j26K2J48O6n7j9r7J75r5p5j08J62N1j54
6853e3J17j18Q4j29K26j26m8J85k74K56j87P9J68k12M0Mj11nj8J16NM2O6k01N0
6878d4j85K36o0J10j24K3R4j41P5%n1J24j82M0j98L08j01J8J37r0J35j11K0J10
6902A43Op1Oj76K01k44R1K68l28P6J43L1L5m4Nk52J2J21r7pK9m6J64j73J46P1
$$ plain form
6928 110 9 63 -130 77 -37 119 12 28 -230 76 -156 -447 -27 -88 -2 47 -81 -105 -16 48 92 85 65 86
6952 86 1 156 -213 30 21 100 -89 -21 39 116 65 -59 52 308 24 39 -54 -99 -25 160 -33 62 173 -62 -3
6977 -3 94 161 -166 114 80 73 -6 15 -28 -27 55 167 -52 59 -17 204 -249 -51 -26 -210 187 -239 -92 -76 -183
7002 -183 -28 -74 -80 -24 -9 48 -40 -85 -3 -191 -60 -161 -41 -52 33 -289 -129 27 6 14 15 132 -94 -37 8 -26
7028 -26 -64 -62 67 -56 29 27 -53 1 -38 -178 198 -91 12 13 124 -85 -55 154 -113 43 127 -95 -163 -54 -67
7053 -67 42 -92 -22 115 11 14 28 -159 177 -66 -1 -190 -28 -26 -113 -94 -62 -81 -114 13 -96 -122 97 20 129
7078 129 -168 -43 -146 -18 70 -161 -44 112 -56 153 24 28 -70 54 -90 -60 151 -205 120 14 26 -46
7100 -46 -74 144 71 73 -53 -54 -21 168 -62 90 -148 155 55 154 119 -86 44 96 23 -52 -79 5 11 104 112 75 66 86
$$ packed form
6928A10j01N4j93K07j14J56j07J6k58L06k32k91M20o1Q6M9j28k4Q9O4M4pk0K1
6952H6q5J55l69K43rP9j89O8O0P7n1j24J11K56k84J5r3m5P4J85j93R5J11k35N9
6977cR7O7l27K80l4pp9K1m3JQ2J12k19J11p6K21m53J98K5j84L97m26J47J6j07
7002a83J55m6oN6J5N7q8m5Q2j88J31j01J20j1Q5l22J60J56k1QJJ17k26N7M5l4
7028b6l8KJ29j23Q5kq0N4l9j40L76k89J03JJ11k09L0K09k67J56Q4k22o8J09j3
7053f7J09j34P0J37j04LJ4j87L36k43O5j89J62Kq7J9L2j9l3J27j09k6K19p7J09
7078A29k97J25j03J28Q8k31J17J56j68K09j29Mr8J24j44L0K11l56L25j06J2p2
7100d6k8K18p3Kj26jL3J89k30J52k38L03j00R9l5k05J30N2p3p5k7Q4OR3Ql7rK0
$$ plain form
7128 86 92 -58 -64 -16 47 -121 -232 -97 -39 -65 65 -65 64 2 49 -62 46 -114 -36 -135 3 121 -114 -90 165
7153 165 50 -177 49 -74 156 15 -198 17 39 36 -57 87 -99 169 -118 94 93 -79 -117 -84 18 71 30
7176 30 -19 123 -70 106 96 -140 -7 65 -102 44 -17 -36 -54 -39 -9 30 -45 53 -45 108 0 -136 -245 -186 -12
7201 -12 -177 -151 -114 -122 -39 -63 -202 -97 19 -32 101 18 -107 -50 120 38 -70 -44 131 16 77 73 16 220 -138
7226 -138 -96 12 162 1 29 91 139 -51 -73 -47 3 -64 17 -38 -19 248 127 30 5 106 15 -70 -192 -43 7
7251 7 -106 -37 149 -199 -102 -67 -145 -159 -6 73 -49 -33 -87 -129 62 20 5 -83 -28 -46 48 -168 -1 177 -192 171
7277 171 -72 -65 77 165 -14 -85 -55 -21 10 -18 167 -57 -132 156 -92 -95 -148 -210 67 -105 122 64 136 96 21 -244
7303 -244 -152 41 -41 -67 -120 -10 118 -116 -30 -51 67 13 183 119 -107 -128 -13 -95 73 -33 -154 -28 7 -5
$$ packed form
7128H6Oj50oM8O3j68j11J35N8k6J30j30J29o2M7j11J08j60P8r9J38J18k35K4K55
7153A65j15k27K26j23K30j41k13K15K2lr3J44j86K68k87K12jj72l8L3J02N3m1
7176C0m9J42j93J76j0k36J33P2j67J46o1j9j8J5L0L9p5R8r8J53j08j36j09N9J74
7201a2j65K6L7qQ3k4j39J05J16n1J33q3j25N7J70q2j08K6J75j15O1mn7K04l58
7226a38M2J08J50j61K8O2M8j90k2K6N0o7Q1n5J9K67j21r7k5J01r1q5j22J49N0
7251Gj13O9J86l48R7L5p8j4J53P9j22J6n4m2J91m2j5q8N5j8R4k16J67J78l69L63
7277A71k43PJ42Q8j79p1L0L4L1k8J85k24p5K88k48ln3o2K77j72K27n8P2m0p5k65
7303b44R2J93q2k6n3J10J28k34Q6k1J18n4J70o4k26k1J15q2J68j06j21J26L5j2
$$ plain form
7327 -5 3 103 -42 -56 23 51 -99 -49 -55 -196 164 9 74 53 -181 -6 120 68 -15 -55 113 -37 -22 -87 -97 -23
7353 -23 24 -61 -188 162 -106 36 52 -15 -144 170 105 -143 -65 74 22 119 -27 30 101 20 -78 -56 61 66 -35
7378 -35 17 -29 -25 41 -99 15 -34 2 -44 50 -150 -130 -89 -66 -137 -70 4 -147 -14 79 44 52 -59 -97 6 159 -77
7405 -77 -69 37 24 105 64 147 47 120 11 26 15 51 61 43 43 70 -59 28 130 -18 130 -33 39 131 104 -46 -80
7432 -80 -68 -43 38 -58 -117 61 41 -116 -64 21 -37 -187 31 137 124 -54 -157 -100 -156 -106 -6 -46 157 34 -106
7457 -106 -13 -78 -88 -174 -64 -24 158 -116 -282 -39 4 15 25 -35 23 26 166 24 -12 5 -59 104 -3 -187 -16
7482 -16 118 85 73 21 161 -56 -100 169 -58 73 -48 -45 65 -53 13 28 236 -81 -47 87 -93 -210 168
7505 168 17 -123 9 13 25 -191 -57 -230 137 62 -195 -213 -92 -85 204 -33 -85 -1 93 -127 51 -67 -59 -63 5
$$ packed form
7327eQJ00j45j4P9K8j50N0oj41L60j55O5k1k34J75J26n2q3m0J68j50J5o5j0P4
7353b3M7q5j27L50k68J42J6o7j29L14o5k48P8J39n2R7j46N7P1q1r8K2J17Nj01
7378c5N2m6MO6j40J14m9L6m6R4k00K0M1K3p1O7P4j51J33R3l5Qj11l8J03J53k36
7405g7QJ06j3Q1m1Q3j00P3j09J5j1L6J0j8%K7j29Q7J02j48J48j63P2R2k7j50l4
7432h0J2K5Q1r6n9J78k0j57N2Q5n8j50K18J06j3j78j03N7n6N0J00m0K03j23j40
7457a06R3o5j0q6J10M0J82k74j66K43M3J1J0o0N8LJ40j42l6J7o4J63j07j84J71
7482a6J34l3j2n2J40k17m4K69k27J31j21LJ10j18O6J5K08l17L4J34j80j17L78
7505A68j51j40J32MJ2k16J34j73L67p5k57j8J21PK89k37n2Q4R4k20J78j18QmO8
$$ plain form
7530 5 73 48 -21 -18 109 118 -20 -123 95 17 -49 163 -97 -138 -109 171 74 222 68 -64 173 173 83 36 -148 36
7556 36 150 87 110 -61 116 -100 -136 -99 -49 118 -102 -73 9 -59 148 -10 -71 111 -56 -23 -21 -77 54 -38 87
7581 87 -161 78 -84 -130 -63 -12 -152 -49 24 -259 -184 102 161 -4 -23 -69 -36 -36 -21 -109 17 214 45 135 -53
7606 -53 -22 -47 -160 -6 -64 136 51 -1 -41 -244 44 49 -185 82 -4 68 -10 110 24 16 -41 -120 -19 7 109 -139
7632 -139 -9 -12 -141 -216 -66 -42 -28 -12 -92 -15 6 -195 13 -181 119 -209 -174 -78 72 48 -87 35 -118 106
7656 106 48 -170 69 -27 -24 176 131 30 -75 -45 -24 -16 28 29 -1 -108 -41 -20 83 18 -74 130 33 23 -61 10 34
7683 34 79 128 -17 -27 12 -180 30 74 0 -14 98 120 62 -1 -146 -87 107 -35 -143 103 3 61 -260 -62
7707 -62 -20 -107 -9 9 -8 7 -145 -114 66 -31 -64 -31 104 25 35 81 106 97 -14 125 53 -90 108 97 53 -72 59
$$ packed form
7530EO8k5o9LJ27Rj38j03K18p8o6K12k60m1K9K80r7J48j54j32K37%r0m7j84J84
7556C6J14o3K3j71J77k16l6L7N0J67k20K9Q2o8K07j58o1J82j67L3Kn6J31r2J25
7581H7k48K39j62m6O7N1j40J03P3k83P5K86N9j65j9m6L3%J5q8J26J97j69R0j88
7606e3L1k5j13J54n8K00q5n2m0k03K88Nk34K67q6P2p8J20q6qn7p9J01K6J02k48
7632a39J30lj29p5J50K4J4J6q0P7K1k01K08j94L00l28L5R6J50k4j35J22j53K24
7656A06n8k18K39r6LK00m5j01j05L0K1QM4Jl0j07O7K1J03o5r2K04r7j0q4P1K4
7683C4M5M9j45j0L9j92K10M4p4j4J12K2n8o3j45N9J94j42j08K46j00N8l21J98
7707f2M2q7R8J8j7J5j52L1J80r7l3L3J35p9J0M6K5rj11J39p2j43J98j1m4j25J31
$$ plain form
7734 59 87 7 43 74 135 -38 93 3 225 -45 32 95 -49 -28 -145 -27 90 13 -32 87 -9 -2 -161 -65 -8 137
7760 137 -105 -69 96 -67 22 32 -173 -54 -12 47 -208 7 -88 -76 95 -9 7 2 -57 33 -13 -51 54 15 153
7785 153 -13 -10 -189 -110 70 -3 54 -1 -30 -62 140 209 -107 265 55 87 9 52 103 99 17 107 56 -41 -17 -80 -6
7812 -6 12 -92 -128 73 -52 -39 -158 46 -64 81 111 -49 -9 -8 176 -180 -115 44 -98 7 10 -36 131 -9
7836 -9 35 -224 -59 57 22 25 118 27 -137 35 189 219 -131 0 -115 -85 -76 -8 -30 -47 -44 -203 4 30 -79 106
7862 106 -55 217 53 58 -26 32 39 108 50 -19 49 32 15 -95 64 -84 -56 35 36 84 43 -42 -95 -80 211 -144 62
7889 62 -90 119 -83 71 -77 85 108 121 -105 -96 -66 -122 68 -176 3 221 -139 -80 17 -91 -38 -173 55
7912 55 54 5 81 41 -35 3 205 -86 92 -107 1 249 141 -51 178 -10 92 0 -181 22 0 -51 147 99
$$ packed form
7734E9K8q0L6L1O1j73J31r0K22k70P7O3j44K1j17J18J17p7m5J19r6Pj59R6N7J45
7760A37k42L6J65j63Q9J0k05J19M2N9k55K15r5J2J71j04J6nn9R0m6l8J05l9J38
7785A53j66Lj79P9J80p3N7n5k9l2K02O9l16L72k10L2p8M3N1mq2R0n1r7K4o3P4
7812fJ8j04l6K01j25J3j19K04j10J45L0j60M0JJ84l56O5J59j42J05Lm6J67j40
7836iM4k59J65J16l5LR3r1j64J72J54L0l50J31j15L0RO8k2j7Lj59K07K6j09J85
7862A06j61K72j64Nq4N8PO9n8o9O8j7j7j10J59j48K8R1JM8m1q5n3J5K91l55K06
7889F2j52K09k02J54j48J62K3J3k26RL0n6J90k44J79K18l60N9R7j08N3j35K28
7912E5jm9P6m0p6L8K02k91J78j99J08K48j08j92K29j88J02r2j81K03k2n1J98m8
$$ plain form
7936 99 93 71 10 38 -101 52 -43 -72 152 67 16 -115 93 -131 -8 42 -26 -11 -167 89 10 30 -83 -308 -125
7961 -125 129 25 -55 -10 -107 -107 -34 -38 -59 -12 -80 39 144 236 -52 176 -170 121 46 -61 4 -58 94 171 60
7986 60 -36 -72 -76 41 -15 -169 -13 60 95 88 35 -21 -145 13 51 78 -157 13 222 35 -123 38 26 -200 27
8011 27 116 -17 37 -162 -50 -93 43 70 -96 -56 -49 -139 -49 56 -135 -26 67 40 51 2 16 80 30 26 -93 23
8037 23 -185 -113 -110 -178 -11 30 -49 -22 247 -17 -21 -29 146 33 70 51 -39 51 -68 194 43 127 53 -6 19 -5 147
8064 147 51 12 20 151 67 167 -38 -53 49 -70 -48 -37 -30 -90 -58 -44 -113 -15 61 2 -99 -75 71 122 14 -176
8090 -176 -60 -100 -165 -67 -4 105 96 22 170 80 65 103 -6 -23 -113 -55 121 51 46 -48 107 -219 48 -12 17 -109
8116 -109 54 70 144 17 -38 212 82 95 -64 -176 -62 -13 103 88 112 128 -90 19 -25 97 -46 -90 -45 -130
$$ packed form
7936I9ok2o1K8j39J53r5k9K24q5n1j31K08k24J23N0o8J5j56K56p9K0j13k25J83
7961a25K54j04q0M5r7%P3mk1M7o8J19J05R2k88K28l46K91p5j07O5o2J52P7j11
7986F0r6l6mJ17n6j54J56P3L5pn3n6j24J58L8K7k35J70K09j87j58J61j2k26K27
8011B7Q9j33N4j99J12m3J36K7j66M0Pr0R0J05j91J09R3k7J1m9J4O4n0mj19J16
8037B3k08P2Lo8J67M1p9K7K69k64mqJ75j13L7j9r0R0j19K62j51Q4p4n9K5k4J52
8064A47r6l9QJ31q4J00k05j5J02j19K2J1Po0L2J4o9R8P6n9j01K4J46N1j08j90
8090a76J16m0o5R8O3J09rp4J48r0j5L8j09j7r0N8J76p0nr4J55l26K67o0K9j26
8116a09J63J6P4j27n5K50j30J3j59j12J14M9J16j5K4J6k18J09m4J22j43m4M5q5
$$ plain form
8140 -130 125 -138 -254 139 0 -63 -171 -110 106 -161 -113 154 -178 89 178 -94 22 78 -203 -36 8 92
8162 92 -109 236 -245 3 198 -13 20 -79 -79 -107 139 -80 36 150 -99 -98 -81 76 -6 34 148 -63 -57 16 31
8187 31 -40 -25 102 -170
$$ packed form
8140a30K55k63j16L93j39o3j08O1K16k67M8K67l32K67Q9k72J16N6k81J67M4Q4
8162I2k01L45m81K48J95k11L3r9%k8K46k19J16J14k49JJ7J57q2M0J14k11OP3J5
8187C1p1J5J27k72
8191a70
$$ Imaginary data points
##PAGE= N=2
##DATA TABLE= (X++(I..I)), XYDATA
$$ plain form
0 0 0 0 0 0 0 0 16 0 0 -16 16 -16 16 -32 32 -48 48 -64 80 -96 112 -129 160 -180 220 -257 289 -337 393 -449
30 -449 513 -581 659 -746 842 -947 1062 -1190 1326 -1479 1644 -1827 2024 -2240 2479 -2735
46 -2735 3016 -3327 3664 -4034 4446 -4899 5405 -5968 6599 -7314 8129 -9070 10170 -11479
60 -11479 13063 -15024 17530 -20859 25494 -32427 43930 -66399 126752 -627771 -1687381
71 -1687381 74735 1356808 664719 -874464 -962060 76025 703375 275442 -153305
80 -153305 -156409 -104073 -110244 296949 646188 198742 -664793 -651571 314548 886723 146270
91 146270 -834199 -622805 407496 705157 49946 -466543 -264163 146690 287914 211003
101 211003 103629 -82221 -251831 -65421 379748 355308 -262598 -571310 -87875 416666
$$ packed form
0@%%%%%%J6j6%j6L2l2L2m8O4q0R6j12J44j76K08k41K89l40M00m77N46o26P30q42
30d49R62j094J240j405J588j789K009k252K516k805L123l471L851m264M719n214
46b735N751o343O991p698Q480r345J0304j1373J2567j3913J5443j7199J9240k1649
60a1479K4542k8087L2554l8389M6353n7921P6357j10329J93151p54523j059610
71a687381J762116J282073o92089j539183q7596J038085O27350m27933m28747
80a53305l104N2336o171M07193L49239m47446q63535J3222R66119N72175p40453
91A46270r80469K11394J030301K97661o55211n16489K02380M10853J41224p6911
101B11003j07374j85850j69610J86410M45169k4440o17906l08712M83435N04541
$$ plain form
111 416666 210333 -302927 -334421 60279 205873 -18974 -73262 121794 62098 -210058
121 -210058 -97941 316442 292811 -241822 -471576 -1874 438000 112318 -471365 -350256
131 -350256 247215 311591 -179823 -313250 112839 314646 -50643 -296303 76013 435980
141 435980 88629 -422842 -203217 391066 348884 -263499 -462717 20415 388419 109344
151 109344 -293661 -181641 172978 182282 -31269 -23222 111506 45708 -87506 19416 215730
162 215730 112667 -202016 -222590 118978 262868 -45935 -306394 -115286 189775 150146
172 150146 -99540 -140408 43524 117248 7298 -24373 66941 38449 -101466 -73277 103571
183 103571 95745 -131166 -210909 -259 152473 -10563 -199032 -77722 135940 74715 -116012
$$ packed form
111D16666k06333n13260l1494L94700J45594k24847n4288J95056n9696k72156
121b10058J12117M14383k3631n34633k29754M69702M39874l25682n83683J21109
131c50256N97471O4376m91414j33427M26089K01807l65289k45660L72316L59967
141D35980l47351n11471K19625N94283m2182o12383j99218M83132L68004k79075
151A09344m03005J12020L54619R304k13551Q047J34728o5798j33214J06922J96314
162B15730j03063l14683k0574L41568J43890l08803k60459J91108L05061l9629
172A50146k49686m0868J83932P3724j09950l1671R1314k8492j39915K8189J76848
183A03571p826k26911p9743K10650J52732j63036j88469J21310K13662o1225j90727
$$ plain form
194 -116012 -68435 134728 120915 -97626 -134310 92691 188194 -40317 -222474 -56744 168152
205 168152 80346 -152053 -139933 73452 124125 -37047 -85992 70789 130830 -22895 -93883
216 -93883 72957 188458 25260 -170646 -78431 154916 143597 -96054 -180477 -7200 121622
227 121622 44835 -56610 -37564 13282 9497 19886 83997 74591 -64295 -124962 35201 180700
239 180700 52584 -180610 -176048 53373 167310 4353 -183157 -123151 63460 102244 2707
250 2707 -52551 -34579 -12222 18395 65888 59904 -41630 -125150 -40966 118159 90784 -110813
262 -110813 -173892 -3059 131339 47878 -96706 -86366 44902 93501 15610 -24974 24508
273 24508 34588 -11686 1550 57640 38300 -46471 -69538 13938 83914 16682 -90109 -51175
$$ packed form
194a16012M7577K03163j3813k18541l6684K27001R5503k28511j82157J65730K24896
205A68152q7806k32399J2120K13385N0673j61172m8945J56781O0041j53725p0988
216i3883J66840J15501j63198j95906R2215K33347j1319k39651q4423J73277J28822
227A21622p6787j01445J9046N0846l785J0389O4111r406j38886o0667J60163J45499
239A80700j28116k33194M562K29421J13937j62957j87510O0006J86611L8784r9537
250B707n5258J7972K2357L0617M7493n984j01534q3520Q4184J59125k7375k01597
262a10813o3079J70833J34398q3461j44584J0340J31268M8599p7891m0584M9482
273B4508J0080m6274J3236N6090j9340q4771k3067Q3476O9976o7232j06791L8934
$$ plain form
285 -51175 70637 74819 -18483 -40851 24539 62772 24011 -18262 8329 43110 -1806 -47705
297 -47705 939 43868 -15348 -71904 -28983 36320 23288 -43299 -53920 20800 59136 -6837
309 -6837 -49575 6997 47311 1833 -39988 -18423 18167 6309 -44142 -50162 8051 22252
321 22252 -37187 -51501 7806 34073 -957 -23853 4 33702 24711 -14227 -7205 34031
333 34031 16422 -34234 -14995 33754 15225 -36156 -35469 17243 47729 6013 -43688 -6145
345 -6145 61381 44620 -12852 -11953 23843 32924 15035 -5022 -4978 5297 -5687 -14866 9338 14153
359 14153 -27129 -35447 12836 38750 7603 -31115 -22580 29277 46818 -6573 -42266 -5133
371 -5133 24347 -1187 -25353 -19782 -11812 -13257 -17409 -11623 2834 -6951 -30347 -9777 30792
$$ packed form
285e1175J21812M182r3302k2368O5390L8233l8761m2273K6591L4781m4916m5899
297d7705M8644M2929n9216n6556M2921O5303j3032o6587j0621P4720L8336o5973
309f837m2738N6572M0314m5478m1821K1565L6590j1858n0451o020N8213J4201
321B2252n9439j4314N9307K6267l5030k2896K3857L3698q991l8938P022M1236
333C4031j7609n0656J9239M8749j8529n1381O87N2712L0486m1716m9701L7543
345f145O7526j6761n7472Q99L5796R081j7889k0057M4J0275j0984r179K4204M815
359A4153m1282q318M8283K5914l1147l8718Q535N1857J7541n3391l5693L7133
371e133K9480k5534k4166N571P970j445m152N786J4457r785k3396K0570M0569
$$ plain form
384 30792 17934 -21833 -19911 12885 27233 6727 -24437 -21210 11162 12532 -16129 -18561 96
397 96 1471 -3091 3094 9865 10532 3673 1355 20601 32524 6112 -14108 9696 30154 10772
411 10772 -14737 -13279 7363 17190 -1249 -17545 -1929 15762 6963 95 8026 8061 2424 5328
425 5328 10450 8911 -1635 -14852 -9095 9206 2938 -22756 -26384 -6642 5617 -1653 -15851
438 -15851 -17024 -385 8312 -447 -3268 1434 -4309 -10407 -1036 7991 -1112 -19283 -23725 -5440
452 -5440 11941 1163 -20094 -18322 1116 13387 13324 4026 -5790 -3069 11132 22028 18889 -258
466 -258 -16929 -6887 18717 23777 1063 -22053 -18706 10394 30974 16960 -11258 -16921 3773
479 3773 28703 33379 8531 -19765 -17289 13080 33958 17441 -24004 -40375 -7552 29098 20396
$$ packed form
384C0792j2858l9767J922L2796J4348k0506l1164L227L2372J370k8661k432J8657
397I6J375m562O185O771O67o859k318J9246J1923k6412k0220K3804K0458j9382
411A0772k5509J458K0642R827j8439j6296J5616J7691q799o868P931L5n637K904
425E328N122j539j0546j3217N757J8301o268k5694l628J9742J2259p270j4198
438a5851j173J6639Q697q759k821M702n743o098R371R027r103j8171m442J8285
452e440J7381j0778k1257J772J9438J2271o3r298r816K721J4201J0896l139j9147
466b58j6671J0042K5604N060k2714k3116L347K9100K0580j4014k8218n663K0694
479C773K4930M676k4848k8296K476L0369K0878j6517m1445j6371L2823L6650q702
$$ plain form
492 20396 -17039 -36410 -19295 14457 28163 7394 -20676 -26698 -6843 22270 28222 -5604
504 -5604 -42224 -33365 8878 31867 7848 -39718 -50683 -3992 38980 22490 -23548 -39667
516 -39667 -10358 30002 35392 743 -26123 -17638 7045 25447 22306 -8031 -32887 -16629 19034
529 19034 31912 11564 -22806 -29654 8828 44700 30608 -9441 -26177 -4281 34273 40990
541 40990 1527 -30356 -14892 16115 24838 9243 -15624 -24080 -3835 15566 14287 4538 -9457
554 -9457 -19286 -3821 22620 22704 -3197 -27856 -25899 9998 35044 2555 -44057 -36803 7066
567 7066 27141 4594 -30271 -32301 2123 20899 4271 -7976 -5834 -9480 -7823 8892 17471
580 17471 4590 -20201 -31817 -1853 38981 22438 -33739 -44348 3940 46210 33108 -19208
$$ packed form
492B0396l7435j9371J7115L3752J3706k0769k8070o022J9855K9113N952l3826
504e604l6620Q859M2243K2989k4019m7566j0965M6691M2972j6490m6038j6119
516c9667K9309M0360N390l4649k6866Q485K4683J8402l141l0337k4856J6258L5663
529A9034J2878k0348l4370o848L8482L5872j4092m0049j6736K1896L8554O717
541D0990l9463l1883J5464L1007Q723j5595k4867q456K0245J9401j279r749j3995
554i457r829J5465K6441Q4k5901k4659J957L5897K5046l2489m6612P254M3869
567G066K0075k2547l4865k030L4424J8776j6628j2247K142l646J657J6715Q579
580A7471j2881k4791j1616K9964M0834j6543n6177j0609M8288M2270j3102n2316
$$ plain form
592 -19208 -41452 1255 46024 31655 -6318 -19324 -9326 11466 27413 17504 -6864 -20644
604 -20644 -16778 9878 38806 22393 -27849 -39853 3205 47697 42415 -14142 -56104 -19055
616 -19055 48684 50375 -11539 -54529 -34193 21897 45230 4069 -43921 -36294 1562 22491
628 22491 18412 -4524 -28531 -26166 397 25779 28697 -6760 -52165 -38112 30644 57348 1313
641 1313 -63909 -54407 22374 68222 16947 -57123 -48579 19068 50658 23362 -18115 -29413 -4821
654 -4821 20672 23863 15893 -1668 -28152 -24413 22286 51185 16744 -40362 -47054 13603 68361
667 68361 37736 -38978 -52898 8286 56230 37925 -16131 -42648 -14433 26964 30478 3979
679 3979 -20242 -28090 -12161 18591 28623 3649 -29479 -35570 -1879 39814 32723 -23284 -54147
$$ packed form
592a9208k2244M2707M4769j4369l7973j3006R998K0792J5947r909k4368j3780
604b0644L866K6656K8928j6413n0242j2004M3058M4492n282n6557m1962L7049
616a9055O7739J691o1914m2990K0336N6090K3333m1161m7990P627L7856K0929
628B2491m079k2936k4007K365K6563K5382K918l5457m5405J4053O8756K6704n6035
641A313o5222R502P6781M5848n1275p4070Q544O7647L1590k7296m1477j1298K4592
654d821K5493L191p970j7561k6484L739M6699K8899l4441n7106o692O0657N4758
667F8361l0625p6714j3920O1184M7944j8305n4056k6517K8215M1397L514k6499
679C979k4221p848J5929L0752J0032k4974l3128o091L3691M1693p091n6007l0863
$$ plain form
692 -54147 -18505 36713 42011 -11154 -57886 -35118 25826 41631 -2389 -42114 -31973 8531
704 8531 30283 10734 -16816 -18592 -4472 6696 15037 14864 -3390 -23375 -16278 15981 35255
717 35255 8681 -34377 -30443 19941 44960 11901 -29230 -23875 16954 37338 13608 -15428
729 -15428 -11980 8593 15295 8670 2214 -1404 -5130 -6093 3292 15821 9464 -14113 -19778 3387
743 3387 23337 12581 -13962 -21602 -407 19108 10243 -11671 -17441 -6499 4084 4640 -4061
756 -4061 -11245 -9678 -5654 -1687 2872 1941 -7224 -12849 -6222 7039 12400 -334 -18354 -14415 8775
771 8775 17903 1844 -18000 -17197 4169 20495 8210 -14074 -14106 4823 17076 12405 -1882 -8416
785 -8416 892 11131 10815 7019 744 -7275 -3303 11730 15394 2014 -11299 -9219 8251 20339
$$ packed form
692e4147L5642N5218N298n3165m6732K2768O0944J5805m4020l9725J0141M0504
704H531K1752j9549k7550j776J4120J1168Q341j73j8254j9985P097L2259J9274
717C5255k6574m3058L934N0384K5019l3059m1131N355M0829K0384k3730k9036
729a5428L448K0573O702o625o456l618l726r63R385J2529o357k3577n665K3165
743C387J9950j0756k6543p640K1195J9515q865k1914n770J0942J0583N56q701
756d061p184J567M024L967M559r31r165n625O627J3261N361j2734j8020L939K3190
771H775R128j6059j9844Q03K1366J6326j2285k2284l2J8929J2253m671j4287o534
785h416R308J0239l16l796o275q019L972J5033L664j3380j3313K080J7470J2088
$$ plain form
799 20339 7051 -13069 -9858 7466 14907 7659 -6134 -12072 -1204 9895 4614 -4760 -7926
812 -7926 -8211 -2985 4691 2012 -7064 -9771 -7030 573 7704 103 -13080 -9483 2446 4626 -177
827 -177 -6738 -11070 -4300 4480 857 -5612 -5415 -4363 -870 4679 2041 -3153 -747 1465 1158 5731
843 5731 5903 -1253 -1809 3199 3712 5127 4810 -1832 -3071 4860 7092 4807 2937 -2068 -988 8990
859 8990 10519 953 -2279 454 3012 7597 5754 -4843 -6227 1816 4184 1998 -1167 -7448 -5676
874 -5676 4464 4343 -3718 -5767 -4637 -2229 4175 1792 -8839 -8439 -572 805 -1317 -4697 -9310
889 -9310 -5367 2492 -233 -5520 -3648 -3711 -2258 4047 2667 -5021 -3654 1432 2772 3613 150 -5833
905 -5833 -1148 7102 3963 -1226 -1053 -92 3806 8107 3044 -2362 2352 6161 5087 5087 2474 -1720
$$ packed form
799B0339j3288k0120L211J7324P441p248j3793n938J0868J1099n281r374l166
812g926k85N226P676k679r076k707K741P603P131p601j3183L597J1929K180m803
827a77o561m332O770Q780l623o469J97J052L493N549k638n194K406K212l07M573
843E731J72p156n56N008N13J415l17o642j239P931K232k285j870n005J080R978
859H990J529r566l232K733K558M585j843j0597j384Q043K368k186l165o281J772
874e676J0140j21q061k049J130K408O404k383j0631M00P867J377k122l380m613
889i310L943P859k725n287J872o3J453O305j380p688J367N086J340Q41l463n983
905e833M685Q250l139n189J73R61L898M301n063n406M714L809j074%k613m194
$$ plain form
921 -1720 2480 7399 3988 101 -1104 -1591 3515 6580 -830 -5588 121 3742 2053 661 -2806
936 -2806 -3990 1507 2824 -2452 -3923 -3109 -3478 -643 -127 -5419 -6302 -2389 -1821 -2450 -2038 -4468 -4745
953 -4745 -9 470 -3264 -2760 -1710 -1699 93 -327 -3071 -1747 259 -568 119 1069 -1198 -633 3083
970 3083 2586 914 1977 2329 2541 4027 3159 1405 2720 3141 2143 3297 2996 540 1013 3558 2571
987 2571 1765 1589 833 1746 3616 1682 -364 478 889 838 833 -971 -2375 -932 -707 -2056 -1661 -2287 -3892
1006 -3892 -2300 -650 -1556 -3075 -3320 -2932 -1378 -970 -2448 -3081 -2589 -3055 -1943 245 -1755 -4695 -3511
1023 -3511 -179 1495 346 -3203 -3315 1690 4267 1375 -817 -569 509 3534 4543 1350 -381
1038 -381 172 1460 4815 5792 585 -2716 1238 6262 6686 2618 -2482 -1087 5730 7063 1695 -995
$$ packed form
921a720M200M919l411l887j205m87N106L065p410m758N709L621j689j392l467
936b806j184N497J317n276j471Q14l69K835N16n292q83L913N68o29M12k430k77
953d745M736M79l734N04J050J1J792m20k744J324K006q27O87R50k267N65L716
970C083m97j672J063L52K12J486q68j754J315M21r98J154l01k456M73K545r87
987B571q06j76p56R13J870j934k046Q42M11n1nj804j404J443K25j349L95o26j605
1006c892J592J650r06j519k45L88J554M08j478o33M92m66J112K188k000k940J184
1023c511L332J674j149l549j12N005K577k892k192K48J078L025J009l193j731
1038c81N53J288L355R77n207l301L954N024M24m068n100J395O817J333n368k690
$$ plain form
1054 -995 -986 -73 3464 4759 -15 -4596 -3879 350 4831 2841 -6210 -7898 768 4602 465 -3793
1070 -3793 -5768 -3879 749 1139 -2428 -3748 -5253 -6551 -419 4880 -1403 -9446 -7851 699 7210
1085 7210 2883 -9015 -9604 3548 7924 707 -3977 -3108 -709 2955 3640 1162 553 -1526 -3260
1100 -3260 3722 10477 3418 -5713 -3074 5084 10128 7169 -3564 -6537 4034 10002 5045 -188
1114 -188 -3504 -2858 4799 8547 1528 -4124 -3265 -257 4971 6050 -2215 -6601 -1209 1629 1357 2226
1130 2226 -2068 -8174 -5248 2211 4765 299 -9596 -12621 1270 11629 -286 -13926 -8892 3179
1144 3179 7499 -109 -9270 -6150 4051 2245 -4832 -738 3527 -2994 -6702 -319 7648 6499 -5867
1159 -5867 -12090 2626 17430 6159 -11112 -7401 7761 13089 4294 -6791 -4264 7452 7845
$$ packed form
1054i95RR13L537J295m774m581P17M229M481j990r051j688Q666L834m137m258
1070c793j975J889M628L90l567j320j505j298O132N299o283q043J595Q550O511
1085G210m327j1898n89J3152M376p217m684Q69K399L664O85k478o09k079j734
1100c260O982O755p059r131K639Q158N044k959j0733k973J0571N968m957n233
1114a88l316O46P657L748p019n652Q59L008N228J079q265m386N392K838k72Q69
1130B226m294o106K926P459K554m466r895l025J3891J0359j1915j3640N034J2071
1144C179M320p608r161L120J0201j806p077M094M265o521l708O383P967j149j2366
1159e867o223J4716J4804j1271j7271L711J5162N328q795j1085K527J1716L93
$$ plain form
1172 7845 -566 218 3926 335 -1427 3046 5900 4182 -2044 -6304 1152 10904 5250 -6872 -7273
1187 -7273 254 6728 6036 -3894 -11046 -3740 6192 4899 -2971 -8766 -7612 2161 6998 -2460 -9194
1202 -9194 -4061 630 -273 -1349 -1625 -1890 -3681 -6561 -1813 7947 3705 -12170 -11971 6210 14379
1217 14379 1374 -14376 -10385 9986 16209 -1568 -13547 -1880 10674 6519 -2595 -2612 3906
1230 3906 4368 -2315 -1251 9523 8858 -6243 -9257 6641 16052 5002 -10961 -8584 9081 15540
1244 15540 459 -11291 -3818 7007 6221 -436 -3886 -2155 -8 -19 113 2099 -503 -6401 -4835
1259 -4835 2606 3936 -1252 -6364 -6679 -935 3730 1199 -4682 -7405 -4981 1873 5942 -953 -9951
1274 -9951 -7045 3916 7240 -764 -8155 -4402 4935 4466 -3056 -2739 3157 1574 -3743 -864 6909
$$ packed form
1172G845q411P84L708l591j762M473K854j718o226m260P456R752n654j2122m01
1187g273P527O474o92r930p152P306R932j293p870n795J154R773M837r458o734
1202i194N133M691r03j076k76k65j791k880M748R760m242j5875J99J8181Q169
1217A4379j3005j5750L991K0371O223j7777j1979J1667J2554m155r114j7O518
1230C906M62o683J064J0774o65j5101l014J5898R411j1050j5963K377J7665O459
1244A5540j5081j1750P473J0825p86o657l450J731K147j1J32J986k602n898J566
1259d835P441J330n188n112l15N744M665k531n881k723K424O854M069o895q998
1274i951K906J0961L324q004p391L753R337m69p522L17N896j583n317K879P773
$$ plain form
1289 6909 6467 -4237 -8550 3687 14785 5291 -10127 -6265 9327 12723 709 -8260 -1249 9183
1303 9183 5701 -3491 -1254 5441 2015 -4022 -738 6524 4934 -5283 -8387 3164 10618 508
1317 508 -10495 -5397 5463 5260 -2917 -7270 -3130 1957 -152 -3558 -961 -899 -5374 -4194 1945
1332 1945 2186 -3635 -6524 -3020 3126 2701 -4240 -5706 441 2045 -1290 -606 754 -1445 -2256 411
1348 411 3660 3594 -2161 -5491 2871 9419 1950 -5748 -848 6248 5424 -78 -2138 2449 5892 604
1364 604 -2760 4287 6307 -1564 -3969 3141 6994 2357 -4504 -3788 5244 7184 -2905 -6880 1619
1379 1619 4994 -1282 -4254 -1101 1710 154 -4673 -3872 3393 2007 -7424 -5902 3479 3125 -4548
1394 -4548 -6353 -1853 3019 915 -6263 -4779 2995 1082 -5595 -2433 2795 180 -3360 -2432 1629
$$ packed form
1289F909m42j0704m313J2237J1098r494j5418L862J5592L396j2014q969P011J0432
1303I183l482r192K237O695l426o037L284P262j590j0217l104J1551P454j0110
1317E08j1003N098J0860k03q177m353M140N087k109l406K597O2m475J180O139
1332A945K41n821k889L504O146m25o941j466O147J604l335O84J360k199q11K667
1348D11L249o6n755l330Q362O548p469p698M900P096q24n502k060M587L443n288
1364F04l364P047K020p871k405P110L853m637o861P16R032J940j0089l975Q499
1379A619L375o276k972L153K811j556m827Q01P265j386r431J522R381l54p673
1394d548j805M500M872k104p178J484P774j913o677L162N228k615l540R28M061
$$ plain form
1409 1629 4151 -488 -5530 160 7101 1822 -4088 -190 4330 2988 16 -836 2270 4967 490
1424 490 -2629 3614 6264 -644 -2623 2981 5182 2089 -1828 -1256 3688 4512 -2127 -3408 3390 3134
1440 3134 -2766 -2373 1713 1581 -1301 -3519 -1336 3003 555 -6130 -3403 3345 523 -5282 -4025
1455 -4025 207 1013 -2170 -5494 -2098 3028 -736 -6642 -1763 3499 -174 -4365 -2502 1638 2398
1470 2398 -1776 -4638 912 5064 -572 -4327 1135 4708 903 -1991 -405 3372 4119 -595 -2091
1485 -2091 3650 5495 -175 -1758 2883 4435 1511 -837 315 3577 3259 -1667 -1396 3762 3219 -2011
1501 -2011 -1724 2204 2374 -567 -2473 -317 2776 163 -4121 -1665 2469 -363 -4194 -2485 708
1516 708 201 -3088 -3979 -782 1494 -2118 -4714 -962 1668 -1533 -3850 -1681 949 473 -2597 -3119
$$ packed form
1409A629K522m639n042N690O941n279n910L898M520j342k972q52L106K697m477
1424D90l119O243K650o908j979N604K201l093l917N72M944Q24o639j281O798k56
1440C134n900L93M086j32k882k218K183M339k448o685K727O748k822n805J257
1455d025M232Q06l183l324L396N126l764n906M879N262l673m191J863M140P60
1470B398m174k862N550M152n636l755N462L573l805k894J586L777P47m714j496
1485b091N741J845n670j583M641J552k924k348J152L262l18m926K71N158n43n230
1501b011K87L928J70k941j906K156L093k613m284K456M134k832l831J709L193
1516G08n07l289q91L197K276l612k596L752K630l201k317K169K630m76l070n22
$$ plain form
1532 -3119 952 2122 -2037 -3108 1149 2751 -218 -1973 295 3159 2157 -1476 -634 3767 3281
1547 3281 -934 -435 3046 3322 561 -617 1463 3836 1669 -1437 650 3911 2150 -1344 -381 2346
1563 2346 2476 -276 -2100 399 2721 -110 -2689 -311 1318 -537 -2215 -1420 191 -17 -2081 -3057
1579 -3057 -81 843 -2478 -3368 -756 172 -1469 -2527 -2131 -539 -257 -2068 -1827 466 -306 -2331 -727
1596 -727 953 -155 -1080 -738 163 1637 714 -1350 142 2733 1100 -191 998 1631 1113 1165 750
1613 750 1882 2834 627 -567 2550 3711 494 -639 1456 2298 1921 411 -1290 942 2316 104
1629 104 -1184 1134 573 -1141 -380 171 -207 -208 -1580 -2158 218 567 -2444 -2584 -683 -762 -842 -1008 -2465
1648 -2465 -2124 -264 -1104 -1661 -455 -1570 -2368 108 531 -1479 -1339 -534 -608 782 924 -1383 -540 1318
$$ packed form
1532c119M071J170m159j071M257J602k969j755K268K864j002l633Q42M401m86
1547C281m215M99L481K76k761j178K080K373k167l106K087L261j761l494R63K727
1563B346J30k752j824K499K322k831k579K378J629j855j678P95J611k08k064r76
1579c057K976R24l321q90K612R28j641j058L96J592K82j811K41K293p72k025J604
1596g27J680j108r25L42R01J474r23k064J492K591j633j291J189O33n18N2m15
1613G50J132R52k207j194L117J161l217j133K095Q42l77j510j701K232J374k212
1629A04j288K318n61j714P61N51l78jj372n78K376L49l011j40J901p9q0j66j457
1648b465L41J860q40n57J206j115p98K476M23k010J40Q05p4J390J42k307Q43J858
$$ plain form
1666 1318 155 219 1906 392 -673 1609 1981 1328 1568 440 -166 2685 3191 450 27 1446 1213
1683 1213 2259 2082 -570 -299 1815 1279 332 996 -151 -663 1049 878 -468 45 -558 -1965 -244
1700 -244 955 -1069 -1796 -1193 -1626 45 838 -2296 -3774 -819 526 -939 -1476 -2693 -1877 698 93
1717 93 -2338 -1313 21 -1376 -896 333 -222 -411 -296 -1141 367 2857 283 -2040 56 2157 2070
1734 2070 971 -731 -712 2622 3403 256 -543 1093 1688 1991 1355 175 763 2013 886 2 1790
1751 1790 1485 -159 -394 314 1369 2031 -573 -3083 -159 2889 706 -2751 -2668 -150 1848 298
1767 298 -3518 -2879 776 823 -2286 -2376 -894 -427 -1226 -2345 -1587 810 27 -3518 -2345 1362 1566 -1657
1785 -1657 -3393 -1251 2348 2380 -2147 -3308 956 3034 748 -1069 -736 1435 2416 457 -418 1141
$$ packed form
1666A318j163O4J687j514j065K282L72o53K40j128o06K851N06k741m23J419k33
1683A213J046j77k652K71K114n36r47O64j147n12J712j71j346N13o03j407J721
1700b44J199k024p27O03m33J671P93l134j478K955J345j465n37j217Q16K575o05
1717I3k431J025J334j397M80J229n55j89J15q45J508K490k574k323K096K101q7
1734B070j099j702J9L334P81l147p99J636N95L03o36j180N88J250j127q84J788
1751A790l05j644k35P08J055O62k604k510K924L048k183l457Q3K518J998j550
1767B98l816O39L655M7l109r0J482M67p99j119P58K397p83l545J173L707K04l223
1785a657j736K142L599L2m527j161M264K078k286j817L33K171R81j959q75J559
$$ plain form
1801 1141 2120 640 7 1290 2198 1743 142 -691 2028 3633 1150 -1532 -690 2233 2916 787 -1704
1818 -1704 -1183 2053 2310 -824 -2056 -322 1194 429 -1321 -1842 94 668 -2071 -2551 156 854 -1346
1835 -1346 -3401 -2108 1290 1374 -3044 -4596 -332 2454 -257 -3440 -2732 516 1973 -605 -3009 -515
1851 -515 1940 -80 -1796 -117 1706 996 -928 -1320 1764 3500 164 -2272 786 3644 2309 -197
1867 -197 -931 1114 3226 1994 -432 251 1594 1360 653 841 450 735 989 -26 237 1345 198
1884 198 -840 -88 465 136 178 -1123 -2012 -318 946 -721 -2007 -1665 -856 397 15 -2941 -2580 389
1902 389 266 -1812 -1798 -766 -74 -627 -1879 -1231 1142 170 -2926 -1479 2017 863 -1334 -1510 -200
1919 -200 2166 1581 -1741 -1441 2412 2277 -685 -193 1439 1691 1177 170 464 2577 1857 -1012 30
$$ packed form
1801A141R79j480o33J283R08m55j601q33K719J605k483k682Q42K923O83k129k491
1818a704N21L236K57l134j232J734J516p65j750n21J936N74k739m80K707O98k200
1835a346k055J293L398Q4m418j552M264K786k711l183P08L248J457k578k404K494
1851e15K455k020j716J679J823p10j924l92L084J736l336k436L058K858j335k506
1867a97p34K045K112j232k426O83J343k34p07J88l91K85K54j015K63J108j147
1884A98j038P52N53l29M2j301q89J694J264j667j286L42Q09J253l82k956L61K969
1902C89j23k078J4J032O92n53j252O48K373r72l096J447L496j154k197j76J310
1919b00K366n85l322L00L853j35k962M92J632K52n14j007K94K113p20k869J042
$$ plain form
1936 30 3129 1868 -657 -220 819 1835 1326 -1090 -751 1632 1102 -1065 -197 706 -520 -619 36 -250
1954 -250 -225 -824 -1942 -584 892 -1130 -2242 -576 -346 -1191 -1019 -936 -1282 -676 -1070 -1325 197 -369
1972 -369 -2207 -1190 1042 -337 -1465 -734 115 937 625 -1172 -557 1847 562 -1268 743 1979
1988 1979 647 -290 514 1458 2145 627 -970 1136 3278 888 -884 825 1965 1195 212 -153 829
2005 829 1968 71 -1252 890 1891 -428 -1489 162 1040 308 -996 -1749 260 1129 -1363 -2305
2021 -2305 -130 363 -1340 -1339 -869 -502 -674 -1705 -1568 165 -132 -1944 -1446 338 -86 -1216 -792 -394
2039 -394 195 -150 -979 -440 844 -58 -1032 387 1391 136 -348 258 1112 1389 256 -336 1220 2385
2057 2385 364 -326 1301 1791 811 102 493 1588 1514 -34 -306 1664 1549 -393 -735 874 1058 338
$$ packed form
1936C0L099j261k525M37J039J016n09k416L39K383n30k167Q68R03j226r9O55k86
1954b50K5n99j118J358J476k022j112J666K30q45J72Q3l46O06l94k55J522n66
1972c69j838J017K232j379j128P31Q49Q22l12j797O15K404j285j830K011J236
1988A979j332r37Q04R44O87j518j597K106K142k390j772J709J140p70r83l65R82
2005H29J139j897j323K142J001k319j061J651Q78p32j304p53K009Q69k492r42
2021b305K175M93j703JM70L67j72j031J37J733k97j812M98J784m24j130M24L98
2039c94N89l45q29N39J284r02r74J419J004j255m84O06Q54K77j133n92J556J165
2057B385k021o90J627M90r80p09L91J095p4j548k72J970j15j942l42J609J84p20
$$ plain form
2075 338 -1084 -568 869 666 -1449 -1388 399 74 -1273 -1465 -381 164 -783 -1927 -1202 271 -384 -2049
2093 -2049 -1127 155 -435 -1551 -1253 -215 65 -719 -1654 -129 769 -463 -1152 112 916 147 -524 -254
2111 -254 988 1276 -101 -559 1141 1586 269 272 1133 1252 972 84 461 1749 1511 -203 64 1737
2129 1737 1261 -56 -9 628 956 486 -507 3 1185 263 -1274 -101 774 -185 -1063 -730 -186 57 -908
2148 -908 -1702 -550 715 -951 -1861 -566 169 -817 -1304 -1044 -280 -191 -1318 -1681 248 556 -1436 -1300
2166 -1300 235 717 -372 -781 -662 931 1181 -663 -798 1610 1511 -337 -26 1076 1124 577 38 311
2184 311 1814 1696 -749 56 1877 1236 17 311 833 1118 989 -194 -59 1135 545 -1026 194
2201 194 1033 -171 -764 -69 -84 246 -445 -1395 -379 572 -962 -1400 -196 -185 -1344 -899 -563 -586 -456
$$ packed form
2075C38j422N16J437k03k115O1J787l25j347j92J084N45r47j144P25J473o55j665
2093b049R22J282n90j116K98J038K80p84r35J525Q98j232o89J264Q04p69o71K70
2111b54J242K88j377m58J700M45j317LQ61J19k80q88L77J288k38j714K67J673
2129A737m76j317M7O37L28m70r93N10J182r22j537J173Q75r59q78L33N44K43r65
2148i08p94J152J265j666r10J295P35r86m87K60P64Q9j127l63J929L08j992J36
2166a300J535M82j089m09J19J593K50j844j35K408r9j848L11J102M8n47n39K73
2184C11J503j18k445Q05J821o41j219K94N22K85j29j183J35J194n90j571J220
2201A94Q39j204n93O95j5L30o91r50J016R51j534m38J204J1j159M45L36k3J30
$$ plain form
2220 -456 -1419 -1439 476 314 -2078 -1444 474 231 -835 -925 -568 540 650 -1091 -743 1455 662 -1171
2238 -1171 105 1242 822 -97 -161 348 1926 1260 -993 183 2255 1151 -168 413 1105 1079 904 76
2256 76 347 1487 355 -793 669 1280 47 -618 25 208 148 -143 -1093 -375 551 -749 -1232 -23
2274 -23 -362 -1239 -860 -305 -371 -790 -1310 -1245 209 -124 -1789 -1373 255 -80 -916 -764 -504 -145 -111 -969
2294 -969 -508 910 90 -1250 -41 922 674 -55 -345 225 1461 1145 -449 133 1450 1054 402 534
2312 534 710 956 766 383 450 1234 625 -132 725 1189 125 135 216 59 409 456 -354 -453 149 -120 71
2333 71 228 -865 -1052 -107 295 -586 -962 -906 -581 18 -800 -1269 -600 -159 -970 -944 -389 -318 -352 -818 -842 328
2355 328 562 -840 -1114 161 1134 125 -569 -464 456 1205 76 -580 186 943 578 61 422 745 875
$$ packed form
2220d56r63k0J915j62k392O34J918k43j066r0L57J108J10j741L48K198p93j833
2238a171J276J137m20r19o4N09J578o66k253J176K072j104j319N81O92k6j75q28
2256G6K71J140j132j148J462O11j233o65O43J83o0k91r50P18R26j300m83J209
2274b3l39q77L79N55o6m19n20O5J454l33j665M16J628l35q36J52K60L59L4q58
2294i69M61J418q20j340J209R63k48p29k90N70J236l16j594N82J317l96o52J32
2312E34J76K46j90l83O7P84o09p57Q57M64j064J0Q1j57L50M7q10r9O02k69J91
2333G1J57j093j87R45M02q81l76N6L25N99q18m69O69M41q11K6N55P1l4m66k4J170
2355C28K34j402k74J275R73j009o94J05R20P49j129o56P66P57l65n17L61L23J30
$$ plain form
2374 875 525 101 515 1389 650 -227 386 1205 1261 374 -431 122 1337 837 -460 -404 286 744 237 -494
2394 -494 -742 63 229 -663 -646 1 -177 -837 -715 -556 9 -68 -1259 -1450 -111 316 -888 -1211 -699 71
2414 71 290 -591 -1380 -261 410 -263 -763 -179 127 -72 74 -265 52 941 126 -493 701 1138 379 313
2434 313 130 374 1201 1014 -158 -127 1019 839 834 379 -17 605 1354 436 -272 607 775 27 2 -104 50
2455 50 707 -3 -1169 132 1130 -242 -1344 -689 50 165 -511 -1546 -769 912 -299 -1725 -830 107
2473 107 -263 -677 -872 -740 75 -243 -1507 -732 888 -143 -1217 -300 401 548 40 -698 -378 1489
2491 1489 728 -628 184 815 250 176 432 426 724 865 149 344 1199 435 -29 992 651 352 724 510
2511 510 -181 555 511 109 326 254 -481 305 867 -530 -850 122 174 -237 -609 -813 -372 199 -670 -1248 159
$$ packed form
2374H75l50m24M14Q74p39q77O13Q19N6q87q05N53J215n00j297N6O90M58n07p31
2394d94k48Q05J66q92J7O47j78o60J22J59N65p7j191j91J339M27j204l23N12P70
2414G1K19q81p89J119O71o73n00N84L06j99J46l39L17Q89q15o19J194M37p59o6
2434C13j83K44Q27j87j172L1J146j80nm55l96O22P49r18p08Q79J68p48k5j06J54
2455E0O57p10j166J301R98j372j102O55P39J15o76j035P77J681j211j426Q95R37
2473A07l70m14j95J32Q15l18j264P75J620j031j074R17P01J47n08p38L20J867
2491A489p61j356Q12O31n65p4K56oK98J41p16J95Q55p64m64J021l41k99L72k14
2511E10o91P36m4m02K17p2p35P86N62j397l20R72N2m11l72k04M41N71q69n78J407
$$ plain form
2532 159 441 -1007 -1195 -422 -195 -256 -1068 -1252 -6 817 -1147 -1393 151 598 -272 -692 -524 256 721
2551 721 -285 -813 672 1116 -322 -374 747 722 365 -28 92 1020 1178 96 -225 975 1020 290 364
2570 364 538 551 586 252 196 674 524 -152 217 815 -17 -217 84 94 -58 -216 -488 -120 281 -730 -913
2591 -913 -92 24 -950 -853 -79 -57 -540 -1051 -866 139 152 -1228 -1148 188 311 -961 -856 -130 338 -225
2611 -225 -881 -372 726 548 -831 -379 821 564 -23 -295 286 998 808 -291 -44 1324 641 -81
2629 -81 393 903 727 465 32 411 1052 431 -158 365 849 119 80 134 391 123 -185 -351 322 465 -613
2650 -613 -443 413 -54 -600 -723 -368 -169 -168 -873 -584 95 -274 -1069 -669 -1 -253 -795 -801 -226 195 -402
2671 -402 -1145 -307 717 -174 -986 -353 479 284 -353 -560 301 1015 320 -618 477 1020 133 -82 380
$$ packed form
2532A59K82j448j88P73K27o1q12j84J246Q23j964k46J544M47q70m20J68P80M65
2551G21j006n28J485M44j438n2J121k5l57l93J20R28J58j082l21J200M5p30P4
2570C64J74J3L5l34n6M78j50o76L69N98q32k00L01J0j52j58k72L68M01j011j83
2591i13Q21J16r74R7P74K2m83n11J85J005J3j380Q0J336J23j272J05P26M68n63
2611b25o56N09J098j78j379M52J200k57n87k72N81P12j90j099K47J368o83p22
2629h1M74N10j76k62m33L79O41o21n89N23M84p30l9N4K57k68l08j66O73J43j078
2650f13J70Q56m67n46j23L55J99Jp05K89O79l69p95M00O68k52n42oN75M21n97
2671d02p43Q38J024q91q12O33Q32j95o37k07Q61P14o95r38J095N43q87k15M62
$$ plain form
2690 380 954 673 162 -213 717 1187 142 -164 553 864 206 293 367 287 596 -29 -252 645 336 -606 -427
2711 -427 516 141 -542 -191 -202 -22 37 -736 -551 172 -280 -1007 -367 187 -564 -847 -338 -225 10 -475 -1314
2732 -1314 -276 524 -510 -982 -356 148 -48 -232 -470 89 451 -94 -350 401 787 -207 -169 625 532 594
2752 594 294 -40 793 949 12 57 1024 629 -47 306 589 424 201 118 43 706 506 -520 133 1121 36
2773 36 -283 -46 -49 172 -126 -668 -433 469 -603 -1014 -133 155 -536 -785 -498 -427 -102 -676 -1188 -153 357
2794 357 -725 -987 -93 -48 -581 -372 -326 -260 115 -320 -574 370 534 -243 -118 316 226 190 233 56 153 649
2816 649 260 241 903 448 134 527 435 63 510 252 367 768 410 -214 415 530 0 -90 507 421 -68
2837 -68 -4 -367 77 371 -493 -730 65 255 -701 -573 -195 22 -44 -597 -908 -237 250 -621 -864 -40 -109
$$ packed form
2690C80N74k81n11l75R30M70j045l06P17L11o58Q7P4q0L09o25k23Q97l09r42J79
2711d27R43l75o83L51j1J80N9p73J85P23m52p27O40N54p51k83N09J13K35m85q39
2732a314J038Q00j034m72O26N04j96j84k38N59L62n45k56P51L86r94L8P94r3O2
2752E94l00l34Q33J56r37M5R67l95o76L53K83j65k23q3p5O63k00j026O53R88j085
2773C6l19K37lK21k98n42K35R02j072m11Q81K88o91k49K87P1L25n74n12J035N10
2794C57j082k62Q94M5n33K09M6O6L75m35k54R44J64p77J25M34r0l6M3j77R7M96
2816F49l89j9O62m55l14L93r2l72M47k58J15M01l58o24O29J15n30r0N97q6m89
2837f8O4l63M44K94q64k37P95J90r56J28L78K17o6n53l11O71M87q71k43Q24o9
$$ plain form
2858 -109 -501 -255 -354 -102 62 -562 -455 192 -7 -654 -326 266 188 317 138 -166 282 208 84 135 443
2879 443 212 180 652 404 267 420 275 478 611 349 158 515 495 137 255 527 171 36 -31 116 304
2900 304 150 -537 -368 230 113 -499 -501 -126 -72 -60 -714 -566 149 37 -740 -470 34 -110 -494 -303 -411
2921 -411 2 -76 -717 -653 102 108 -338 -132 -102 -58 141 -156 -356 218 116 187 56 336 65 146 342 115 158
2944 158 432 342 178 421 451 415 596 134 116 631 529 66 -86 397 292 374 54 -39 294 566 -292 -386
2966 -386 3 59 133 -286 -438 -161 271 -480 -668 -330 22 -336 -523 -307 -282 -12 -288 -829 -322 211 -251
2987 -251 -611 -288 -386 44 -86 -368 -244 291 121 -315 76 209 118 327 50 20 339 660 -78 76 466
3008 466 347 367 407 69 516 647 102 -213 436 735 169 173 272 36 372 349 -305 -68 511 28 -463 201
$$ packed form
2858a09l92K46r9K52J64o24J07O47j99o47L28N92p8J29j79l04M48p4j24N1L08
2879D43k31l2M72k48j37J53j45K03J33k62j91L57k0l58J18K72l56j35o7J47J88
2900C04j54o87J69N98j17o12kL75N4J2o54J48P15j12p77K70N04j44l84J91j08
2921d11M13p8o41O4P55Om46K06L0M4J99k97k00N74j02P1j31K80k71Q1J96k27M3
2944A58K74r0j64K43L0l6J81m62j8N15j02m63j52M83j05Q2l20r3L33K72q58r4
2966c86L89N6P4m19j52K77M32p51j88L38L52l58j87K16K5K70k76n41N07N33m62
2987b51l60L23r8M30j30k82J24N35j70m36L91J33r1K09k77l0L19L21p38J54L90
3008D66j19K0M0l38M47J31n45l15O49K99n66MR9k36L36k3o54K37N79m83m91O64
$$ plain form
3030 201 -53 -84 -166 -346 -308 125 102 -648 -300 39 -344 -332 -459 -733 -106 22 -384 -523 -176 -179 -399 -268
3052 -268 -347 -387 52 -196 -598 94 133 -15 70 29 61 258 330 -314 280 624 346 119 138 251 350 460 -20
3075 -20 -8 599 658 -346 183 366 434 149 119 -53 611 691 -353 -34 379 110 -368 -306 -336 97 350 -214
3097 -214 -576 -88 116 -370 -505 -120 -216 -65 -324 -602 -127 -59 -599 -566 279 -163 -350 -242 -276 -304 -115 -57
3119 -57 -257 -32 -26 -115 131 189 -84 23 583 73 -48 204 246 341 433 -63 14 628 279 2 350 441 298
3142 298 143 31 124 618 172 -215 166 683 137 -249 -103 200 363 -148 -390 -42 395 301 -493 -249 285
3163 285 -275 -547 -453 -224 90 -436 -822 -336 145 -316 -605 -327 -295 -254 -196 -388 -165 -17 -134 -280 -74
3184 -74 98 -97 -43 180 -22 12 87 26 324 222 62 221 576 141 -74 542 465 287 148 73 281 744
$$ packed form
3030B01k54l1q2j80L8M33k3p50L48L39l83J2j27k74O27J28m06j39L47lk20J31
3052b68p9m0M39k48m02O92L9j48Q5m1L2J97P2o44N94L44k78k27J9J13R9J10m80
3075b0J2O07N9j004N29J83O8k85l0j72O64Q0j044L19M13k69m78O2l0M33K53n64
3097b14l62M88K04m86j35L85r6J51k59k78M75O8n40L3Q45m42j87J08l4k8J89N8
3119e7k00K25Oq9K46N8k73J07N60n10j21K52M2R5R2m96P7O14l49k77L48R1j43
3142B98j55j12R3M94m46l87L81N17n46l86J46L03J63n11k42L48M37r4p94K44N34
3163B85n60k72R4K29L14n26l86M86M81m61k89K78L2M1N8j92K23J48j17j46K06
3184g4J72j95N4K23k02L4P5o1K98j02j60J59L55m35k15O16p7j78j39p5K08M63
$$ plain form
3206 744 72 -233 359 573 201 -57 141 419 366 -117 -155 215 478 -343 -392 202 187 -229 -524 -279 108
3227 108 7 -361 -630 92 226 -468 -589 -272 -88 -220 -544 -551 -119 32 -519 -516 7 52 -349 -277 160 138
3249 138 60 -110 -216 204 240 -284 15 434 158 49 262 224 176 175 -151 362 466 285 -129 566 491 -151
3271 -151 178 179 130 113 117 -131 367 260 -291 -362 343 163 -122 -339 -179 -83 110 -446 -542 122 9 -466 -364
3294 -364 118 -213 -307 -507 -566 0 49 -606 -348 70 -24 -390 -110 68 -74 -173 -307 -30 359 -21 -263 159
3316 159 411 88 -146 202 209 261 224 75 129 485 -12 -15 457 432 145 89 430 274 307 -31 77 440 544
3339 544 -86 -231 361 43 -179 14 80 120 76 -398 -300 295 41 -767 -278 2 -249 -339 -178 -231 33 25 -411
3362 -411 -320 176 -215 -624 -44 98 -324 -201 -202 -190 329 -196 -475 242 415 -127 -111 214 225 50 46 126 342
$$ packed form
3206G44o72l05N92K14l72k58J98K78n3m83l8L70K63q21m9N94j5m16k95K45L87
3227A08j01l68k69P22J34o94j21L17J84j32l24pM32J51n51LN23M5m01P2M37k2
3249A38p8j70j06M20L6n24K99M19k76j09K13l8m8jl26N13J04j81m14O95p5o42
3271a51L29Jm9j7Mk48M98j07n51p1P05j80k85k17J60R6J93n56r6O64j13m75J02
3294c64M82l31r4k00n9N66M9o55K58M18r4l66K80J78j42r9j34K77L89l80k42M22
3316A59K52l23k34L48PN2l7j49N4L56m97lM72k5k87n6L41j56L3l38J08L63J04
3339E44o30j45N92l18k22J93O6M0m4m74R8N95k54q08M89K80k51r0J61n3K64qm36
3362d11R1M96l91m09N80J42m22J23jJ2N19n25k79P17J73n42J6L25J1j75mQ0K16
$$ plain form
3385 342 390 -92 127 406 555 2 -55 403 401 344 156 98 370 266 -206 7 668 248 -207 -29 -35 10 -62
3408 -62 -211 50 216 174 -382 -186 90 -177 -348 -428 -274 -91 -30 -482 -98 41 -347 -488 40 -48 -257 -496
3430 -496 -388 -113 103 -96 -512 -2 118 -136 -242 -48 201 -204 -63 50 189 54 -41 147 462 309
3450 309 -73 117 365 315 189 -33 273 486 99 -13 161 375 68 -21 -31 269 313 -56 -125 280 479 105
3472 105 -429 -64 200 -140 -44 -105 -167 112 -265 -410 -271 128 -440 -190 -28 -333 -126 -240 -379 -215 -75
3493 -75 -263 -323 -93 -183 -138 -78 -165 -111 -172 21 -178 161 189 -182 94 212 4 -103 145 150 223 182 124 303 408
3518 408 70 -230 281 494 3 129 -8 324 216 58 -13 266 405 2 -178 313 194 -133 -104 -85 35
3539 35 130 -301 -269 91 20 -379 -302 -116 -172 -67 -266 -427 -120 -84 -462 -322 54 43 -114 -91 -66 -256 34
$$ packed form
3385C42M8m82K19K79J49n53n7M58kn7j88n8K72j04m72K13O61m20m55J78oM5p2
3408f2j49K61J66m2n56J96K76k67j71q0J54J83O1m52L84J39l88j41N28q8k09k39
3430d96J08K75K16j99m16N10J20k54j06J94K49m05J41J13J39j35r5J88L15j53
3450C09l82J90K48n0j26k22L06K13l87j12J74K14l07q9j0L00M4l69o9M05J99l74
3472A05n34L65K64l40R6o1o2K79l77j45J39L99n68K50J62l05K07j14j39J64J40
3493g5j88o0K30r0M5O0q7N4o1J93j99L39K8l71K76J18k08j07K48NP3m1n8J79J05
3518D08l38l00N11K13m91J26j37L32j08j58p1K79J39m03j80M91j19l27K9J9J20
3539C5R5m31L2L60p1l99P7J86n6J05j99j61L07L6l78J40L76j1j57K3K5j90K90
$$ plain form
3562 34 -22 -102 209 0 -17 223 132 -5 -48 196 81 87 182 79 164 327 -138 -9 434 254 130 20 269
3585 269 180 189 173 84 146 167 -134 -91 271 66 -121 1 76 43 -39 -133 -248 309 227 -431 -144 -139 44 -118 -207
3610 -207 -270 -104 -55 -382 -361 44 -183 -252 -179 -337 -111 34 -55 -300 -48 143 -93 -42 52 -121 -134 42 -10
3633 -10 -156 203 -3 25 266 117 243 230 184 -47 298 333 66 63 248 106 179 236 -112 105 283 74 104
3656 104 -5 -31 8 41 -184 -160 223 104 -129 -167 335 -115 -147 -90 -303 29 111 -165 -171 100 -154 -107 -124 -212
3680 -212 -270 -77 -166 -461 -104 62 -255 -302 -37 -135 -8 147 -278 -50 82 -35 85 54 51 6 200 11 23
3703 23 282 156 70 234 357 80 32 15 115 319 362 -43 71 275 44 159 46 114 145 173 -20 -224 62
3726 62 -25 -142 -37 -48 -256 -176 -95 -83 -113 113 -127 -91 22 20 -118 -214 -59 -176 21 122 -202 -243 -3 -180
$$ packed form
3562C4n6q0L11k09j7K40r1j37m3K44j15OR5j03Q5J63m65J29M43j80j24j10K49
3585B69q9Rj6q9O2K1l01M3L62k05j87J22P5l3q2r4j15N57q2o58K87NJ83j62q9
3610b07o3J66M9l27K1M05k27o9P3j58K26J45q9k45K52J91k36N1R4j73j3J76n2
3633a0j46L59k06K8K41j49J26j3m6k31L45L5k67lJ85j42P3N7l48K17J78k09L0
3656A04j09k6L9L3k25K4L83j19k33l8N02m50l2N7k13L32Q2k76oK71k54M7j7q8
3680b12n8J93q9k95L57J66l17m7K65r8J27J55m25K28J32j17J20l1lm5J94j89J2
3703B3K59j26q6J64J23k77m8j7J00K04M3m05J14K04k31J15j13O8L1K8j93k04K86
3726F2q7j17J05j1k08Q0Q1J2l0K26k40L6J13kj38r6J55j17J97J01l24m1K40j77
$$ plain form
3750 -180 101 -221 -242 -22 21 -161 -120 232 39 91 -95 -73 17 179 -93 -80 285 231 60 -42 197 99 187
3773 187 125 84 185 399 77 4 128 213 -11 62 -17 119 444 -154 -17 104 144 -89 147 124 -152 174 -131
3796 -131 -263 -42 -134 -425 -191 4 -178 -245 -108 -308 -239 -119 -27 -284 -102 -30 -109 -123 90 -424 -38 66
3818 66 -14 110 -100 -68 117 212 -101 -190 374 322 -79 79 32 62 398 142 36 270 280 -7 -75 317 356 124
3842 124 -41 115 243 249 45 99 331 72 -252 -63 122 -91 -74 -17 -128 28 -44 -286 -89 120 -167 -226
3864 -226 -196 -254 -232 -123 -90 -271 11 -36 -76 16 -154 -375 56 -173 -184 -33 -131 -139 169 -27 -121 2 137 310
3888 310 62 -42 190 -101 57 19 98 226 73 14 155 439 -92 147 143 166 206 263 -58 40 161 34 124
3911 124 64 -2 79 -41 99 -129 110 17 -408 -5 51 -159 -230 -42 -156 18 -20 -204 -163 136 -148 -247 66
$$ packed form
3750a80K81l22k1K20M3j82M1L52j93N2j86K2R0J62k72J3L65n4j71j02K39r8Q8
3773A87o2m1J01K14l22p3J24Q5k24P3p9J36L25n98J37J21M0k33K36k3k76L26l05
3796a31j32K21r2k91K34J95j82o7J37k00O9J20R2k57J82P2p9j4K13n14L86J04
3818F6q0J24k10L2J85R5l13q9N64n2m01J58m7L0L36k56j06K34J0k87o8L92L9k32
3842A24j65J56J28Ok04N4K32k59l24J89J85k13J7N7j11J56p2k42J97K09k87n9
3864b26L0n8K2J09L3j81K82m7m0R2j70k21M31k29j1J51r8qL08j96r4J23J35J73
3888C10k48j04K32k91J58l8P9J28j53n9J41K84n31K39mK3M0N7l21R8J21j27R0
3911A24o0o6Q1j20J40k28K39r3m25M03N6k10p1J88j14J74l8j84M1K99k84r9L13
$$ plain form
3934 66 -94 -206 -75 38 -89 -72 -110 -52 161 -207 -57 27 72 -78 -75 209 83 112 17 -37 92 151 29 -22
3958 -22 125 145 -131 176 173 54 16 60 -29 110 291 -249 16 280 127 -24 87 77 244 162 -66 -121 101
3981 101 207 -130 -62 -167 -161 23 -13 -104 -202 -229 -198 -172 137 -153 -355 -68 176 -156 -116 -223 -133 -44 -153 -207
4005 -207 -152 74 -241 -62 55 103 -162 -68 -23 138 102 80 -21 46 130 88 204 103 85 110 172 -51 181 38
4029 38 -9 134 307 215 -56 -73 -15 266 216 -159 -28 53 159 -84 130 112 -199 -126 -55 -178 -90 -72 -23 113
4053 113 17 -225 44 11 -165 -236 -37 -99 -103 -110 -379 -282 -158 -128 -287 -64 -93 -132 -266 -84 -134 -5 96 -128
4077 -128 6 76 106 5 157 262 -97 91 191 339 246 100 -66 43 368 158 121 207 39 132 287 -33
4099 -33 107 106 255 95 85 -2 -16 -90 31 -107 -105 -7 -155 -1 59 -144 -112 62 -291 -48 36 -84 -118 -95 -147
$$ packed form
3934F6j60j12J31J13j27J7l8N8K13l68J50Q4M5j50LK84j26K9r5n4J29N9j22n1
3958b2J47K0k76L07lj19l8M4q9J39J81n40K65K64j53j51J11j0J67q2k28n5K22
3981A01J06l37O8j05OJ84l6r1r8k7L1K6L09k90k02K87K44l32M0j07R0Q9j09n4
4005b07N5K26l15J79J17M8k65R4M5J61l6k2j01O7Q4m2J16j01j8K5O2k23K32j43
4029C8m7J43J73r2k71j7N8K81n0l75J31Q1J06k43K14j8l11P3P1j23Q8J8M9J36
4053A13r6k42K69l3j76p1J99o2mpk69R7J24L0j59K23k9l9j34J82n0J29J01k24
4077a28J34P0L0j01J52J05l59J88J00J48r3j46j66J09L25k10l7Q6j68R3J55l20
4099c3J40jJ49j60j0q7j4p4J21j38KR8j48J54O0k03L2J74l53K43Q4j20l4K3n2
$$ plain form
4124 -147 -42 48 -66 -130 -83 -55 -101 2 -130 -159 14 88 68 -26 72 -72 -11 -17 15 141 -7 85 19 184 4
4149 4 66 307 363 213 80 65 131 217 244 -90 42 204 -84 3 236 164 96 102 -141 -7 68 -80 -90 17 -42
4174 -42 -124 21 55 0 -109 -11 -106 -107 -86 -285 -4 31 -170 -207 -170 120 38 -30 -66 -211 -69 -84 -73 -264 -44 -11
4200 -11 -132 -65 28 85 105 -33 -16 184 77 -74 98 172 8 156 216 257 64 72 -141 84 254 135 -66 39
4224 39 48 -1 43 53 -160 108 103 -208 -42 71 -2 56 137 -166 -31 40 -54 68 -24 -157 -66 -7 -16 -181 -25 -102
4250 -102 -136 -118 -11 -151 -29 34 -50 -97 -32 -89 -50 15 98 -255 27 -50 -7 245 -71 -188 -80 81 -68 -14
4274 -14 -19 -10 169 15 42 88 199 9 132 133 182 38 228 57 13 95 155 156 252 123 -127 -128 -89 -28 20 42 -23 66
4302 66 148 15 -45 54 50 156 -181 -250 51 -130 -121 -201 -15 -58 -52 -40 -91 -84 35 -76 -192 -63 -54 202 -91 131
$$ packed form
4124a47J05R0j14o4M7K8m6J03j32k9J73P4k0r4R8j44O1oL2J26j48R2o6J65j80
4149DO2K41N6j50j33j5O6Q6K7l34J32J62k88Q7K33p2o8Ok43J34P5j48j0J07n9
4174d2q2J45L4n5j09R8r5jK1j99K81L5k01l7L7K90q2o8l6j45J42j5J1j91K20L3
4200a1j21O7R3N7K0j38J7K00j07j51J72P4j64J48O0M1j93Qk13K25J70j19k01J05
4224C9Rm9M4J0k13K68nl11J66J13p3N8Q1l03J35P1r4J22r2j33R1N9rj65J56p7
4250a02l4J8J07j40J22O3q4m7O5n7L9O5Q3l53K82p7M3K52l16j17J08J61j49N4
4274a4nRJ79j54K7M6J11j90J23JM9j44J90j71m4Q2O0JR6j29k50jL9O1M8K2o5Q9
4302F6Q2j33o0R9mJ06l37o9L01j81Rq0J86m3OJ2n1PJ19j11j16J29RK56k93K22
$$ plain form
4328 131 -168 -198 195 -67 -60 -163 -4 72 25 42 103 288 -152 35 -21 190 31 217 -38 190 317 59 -97
4351 -97 7 141 -72 -98 162 69 -44 165 21 -74 67 85 -96 -2 -136 -128 -133 6 -33 -107 -10 -25 -110 -20 -100 49
4377 49 -103 58 -351 -30 -94 -244 -177 114 92 -35 19 -239 93 -40 -128 -96 94 83 -23 32 11 -215 136
4400 136 194 3 204 27 -76 -26 91 211 133 15 -142 221 -46 146 -75 -39 -39 90 -38 -51 -47 22 32 -109
4424 -109 -169 142 -63 13 -87 -269 79 10 -31 -155 -33 -31 -105 34 -20 -77 13 -107 -235 35 -5 -142 -94 -23
4448 -23 131 7 -50 -1 -36 179 78 -198 65 -50 -38 -108 -69 63 141 -63 40 109 182 -128 -5 42 -137 10
4472 10 49 74 78 141 29 29 9 128 -82 34 41 174 156 0 63 41 22 -113 13 40 -49 -21 117 5 -113 -63
4498 -63 -217 -125 -36 -20 -174 -55 43 5 -1 -46 79 -45 89 -147 106 -130 -103 -275 112 -161 119 170 45 -32
$$ packed form
4328A31k99l0L93k62Pj03J59P6m7J7O1J85m40J87n6K11j59J86k55K28J27k58j56
4351i7J04J34k13k6K60r3j13K09j44r5J41J8j81R4j34QnJ39l9p4R7j5q5R0q0J49
4377D9j52J61m09L21o4j50O7K91k2j27N4k58L32j33q8L2J90j1j06N5k1k26L51
4400A36N8j91K01j77j03N0J17J20p8j18j57L63k67J92k21L6%J29j28j3MO9J0j41
4424a09o0L11k05P6j00j82L48o9m1j24J22Kp4J39n4n7R0j20j28K70m0j37M8P1
4448b3J54j24n7M9l5K15j01k76K63j15J2p0L9J32P8k04J03O9P3l10J23M7j79J47
4472A0L9K5MO3j12%k0J19k10J16PJ33j8j56O3k2j9j35J26K7q9K8J38j12j18N0
4498f3j54R2Q9J6j54J19R8l8om5J25j24J34k36K53k36K7j72L87k73K80N1j25p7
$$ plain form
4522 -32 -73 -63 84 -106 27 -61 -115 86 -28 162 67 -25 -60 66 133 112 98 83 65 110 -105 72 307 -78 6
4547 6 96 11 -28 -62 36 -122 -101 -12 -178 5 77 65 -39 -45 -109 -99 -136 -201 -129 -104 -94 -107 -114 -65 76 5 -109 -129 -166
4576 -166 -58 83 -182 42 46 40 -146 -159 -117 63 -64 -116 -229 96 85 153 108 -51 -42 -88 3 154 280 -39 14
4601 14 160 5 238 155 -42 42 -57 -16 77 1 81 53 -79 124 93 190 31 47 -8 -68 56 -32 56 2 -45 -28
4627 -28 -77 -54 -152 22 -47 -44 -57 -153 -28 -93 -69 -115 113 -74 24 225 -91 106 134 -78 -25 81 134 91 165 90
4653 90 -10 91 -100 -35 26 87 -50 22 90 74 -83 113 -135 195 101 55 76 91 -172 -114 9 100 34 -67 -14
4678 -14 -88 118 -176 -125 143 34 -121 71 -62 -78 -171 50 -152 90 -76 -40 -26 65 191 19 130 143 44
4701 44 -206 126 -176 119 37 18 5 86 145 -138 148 81 106 118 -53 -2 -26 58 24 -21 -26 99 97 215 64 193
$$ packed form
4522c2m1J0J47j90J33q8n4K01j14J90r5r2l5J26O7k1j4j5j8M5k15J77K35l85Q4
4547FR0q5l9l4R8j58K1Q9j66J83P2j2j04oo4J0l7o5P2K5J0j3pM9J41p1j14k0l7
4576a66J08J41k65K24Moj86j3M2J80j27n2j13L25j1O8m5j59Rm6R1J51J26l19N3
4601A4J46j55K33q3j97Q4r9M1R3p6Q0k8j32K03l1R7j59J6n5o0J24q8Q8n4m7J7
4627b8m9K3r8J74o9Lj3r6J25o5K4m6K28j87R8K01l16J97K8k12N3J06N3m3P4p5
4653I0j00J01j91O5O1O1j37P2O8j6j57J96k48L30r4m6K1J5k63N8J23R1o6j01N3
4678a4p4K06k94N1K68j09j55J92j33j6r3K21k02K42j66L6J4R1J26j72J11J3r9
4701D4k50L32l02K95q2j9j3Q1N9k83K86o7K5J2j71N1k4Q4l4m5nJ25kJ18j51J29
$$ plain form
4727 193 -49 -149 42 45 -31 -52 78 140 -88 45 23 -32 57 25 225 -18 1 21 -26 -33 140 63 -69 34 11
4752 11 -80 -123 -101 229 -42 -335 25 21 20 -130 -63 187 -38 55 -170 30 -12 34 -138 123 -7 -4 106 54 33
4777 33 -48 -71 -64 46 62 33 15 -81 36 -15 -60 40 -219 251 -80 21 23 53 -98 81 160 45 5 61 -23 -65
4803 -65 -23 2 -93 -67 24 8 45 -62 25 -49 -77 -16 -6 64 75 -124 -133 -167 -41 -92 -3 30 24 24 -46 -17 -14 -263 1 -30
4833 -30 -28 -108 34 -7 32 107 -124 97 -56 103 -3 175 78 103 221 93 45 60 64 15 61 107 -49 75 105 -71
4859 -71 -44 66 -51 207 -86 109 -47 26 38 -40 -42 -8 -23 -12 108 -37 -46 -1 -10 101 -38 -174 -113 34 -116
4884 -116 71 -161 -78 32 67 -95 -338 131 87 -74 18 -54 -96 -3 -65 15 -150 -160 -25 147 -108 46 154
4907 154 104 191 77 73 135 -29 202 -38 21 74 191 145 -1 179 44 175 21 62 371 36 25 134 -38
$$ packed form
4727A93k42j00J91Lp6k1J30O2k28J33k2n5Q9l2K00k43J9K0m7pJ73p7j32J03k3
4752A1r1m3K2L30k71k93L60mjj50O7K50k25R3k25K00m2M6j72K61j30LJ10n2k1
4777C3q1k3PJ10J6k9j8r6J17n1m5J00k59M70l31J01KL0j51J79P9j15m0N6q4m2
4803f5M2K5r5K6R1j6L7j07Q7p4k8O1J0P0J1j99rl4J26n1Q9L3o%p0K9Lk49K64l1
4833c0Kq0J42m1L9P5k31K21j53J59j06J78r7K5J18j28m8J5Mm9M6M6j56J24L0j76
4859g1K7J10j17K58k93J95j56P3J2p8kL4j5J1J20j45rM5rJ11j39j36O1J47j50
4884a16J87k32Q3J10L5j62k43M69m4j61R2p2m2R3o2Q0j65j0J35J72k55J54J08
4907A54n0Q7j14mO2j64K31k40N9N3J17m6j46J80j35J31j54M1L09l35j1J09j72
$$ plain form
4930 -38 -215 -104 -212 -55 18 106 46 -137 95 -111 -101 -124 -84 81 -74 -10 50 13 -73 -149 41 130 -189 -250 75
4955 75 96 -51 -105 60 -209 9 -108 11 -28 -59 5 81 193 -13 68 113 67 -94 163 28 14 44 37 -120 67
4980 67 173 -56 -22 20 64 75 -145 -15 -29 -55 32 -36 -51 -14 68 30 -95 -26 156 -8 50 67 195 52 -52
5005 -52 101 6 -44 -47 0 175 -82 -135 27 114 -58 146 24 119 -21 -42 -75 -43 4 32 -18 61 -15 47 39 18 172
5032 172 -45 -53 94 -56 30 -164 -23 -170 -186 57 -139 -110 -124 63 -147 -3 -149 -104 -129 116 147 -86 134
5055 134 107 118 48 27 -25 112 136 -208 44 13 -103 -65 99 -10 -6 -116 -16 46 3 -77 -1 56 -160 -9 134
5080 134 -43 -47 -119 110 71 32 -20 -57 70 -180 23 86 -90 -116 80 10 92 38 3 125 -46 -82 -4 -100 -259
5105 -259 -264 126 122 134 135 46 21 -37 87 8 15 -52 -60 35 226 -26 -173 29 8 54 21 -91 62 -105 -127 100 -270
$$ packed form
4930c8j77J11j08J57P3Q8o0j83K32k06J0k3M0J65j55O4O0l7q6p6J90Q9l19o1L25
4955G5K1j47n4J65k69K18j17J19l9l1O4P6J12k06Q1M5m6j61K57j35j4L0pj57J87
4980F7J06k29L4M2M4J1k20J30j4k6Q7o8j5L7Q2l8j25O9J82j64N8J7J28j43j04
5005e2J53r5n0lM7J75k57n3J62Q7j72K04j22R5j40k1l3L2M7K8n0P9p6O2qk1J54
5032A72k17qJ47j50Q6j94J41j47j6K43j96K9j4J87k10J44j46M5k5K45L1k33K20
5055A34k7J1p0k1n2J37K4l44K52l1j16L8J64j09Mj10J00O2m3q0P6N7k16J51J43
5080A34j77mp2K29l9l9n2l7J27k50K03O3j76k6J96p0Q2n4l5J22j71l6P8r6j59
5105b59nL90mJ2Jq9k5n8J24p9Po7qR5J91k52j47K02k1M6l3j12J53j67k2K27l70
$$ plain form
5132 -270 100 -88 145 -112 -28 26 -146 -32 -71 -142 79 68 -37 48 94 165 -43 -2 -7 84 1 91 152 -29 58
5157 58 -153 -65 70 121 49 -4 160 31 172 153 -14 -4 9 84 41 147 32 -105 5 -92 -38 105 28 -115
5181 -115 -67 -44 58 -43 -10 -21 108 15 70 -39 11 -132 -153 -24 16 -64 -5 -32 -85 -170 -43 -127 21 27 -157 -95
5207 -95 -54 -23 -104 -97 18 21 100 -183 229 31 17 -67 -8 -89 20 166 -79 -67 15 86 -79 18 -102 -55 140 49
5233 49 -55 -76 -25 -110 -50 -50 -19 -247 -5 87 59 51 29 -47 48 19 -29 11 78 65 47 -19 -37 -59 9 -86 -17 77 -5 -39
5263 -39 85 -80 97 -10 122 15 64 -82 -90 -13 -106 37 63 176 2 -90 89 126 -79 -198 -47 29 129
5286 129 47 -18 -3 -182 -33 -54 28 -209 -40 3 -13 18 66 -36 -122 -67 -15 48 -79 -50 -95 77 38 -19 145 -102
5312 -102 26 87 45 44 15 190 -5 30 -84 109 -157 -191 0 142 -84 -1 60 87 -27 67 137 8 -287 103
$$ packed form
5132b70L70j88K33k57Q4N4j72J14l9p1K21j1j05Q5M6P1k08M1nR1q3R0O1j81Q7
5157E8k11Q8J35N1p2n3J64j29J41j9j67J0J3P5m3J06j15j37J10r7N4J43p7j43
5181a15M8K3J02j01L3j1J29r3N5j09N0j43k1J29M0q0N9k7n3q5J27q4J48Oj84O2
5207i5M1L1q1PJ15LP9k83M12j98j4q4N9q1J09J46k45J2Q2P1j65R7j20M7J95r1
5233D9j04k1N1q5O0%L1k28K42R2k8qk2p6R5k9m8M0O7j3j8o6j8k2O8r5O9R4q2l4
5263c9J24j65J77j07J32j07M9j46qP7r3J43K6J13j74r2J79L7k05j19J51P6J00
5286A29q2o5J5j79J49k1Q2k37J69M3j6L1M8j02q6N5N2O3j27K9m5J72l9n7J64k47
5312a02J28O1m2jk9J75j95L5j14J93k66l4J91J42k26Q3O1K7j14R4P0j29k95L90
$$ plain form
5336 103 -34 211 -74 24 125 -54 129 -29 -39 104 126 160 66 -79 19 -95 4 48 -78 -46 63 -89 -104
$$ packed form
5336A03j37K45k85R8J01j79J83j58j0J43K2L4r4j45R8j14R9M4j26L2J09j52j5
$$ [...]
8191A7
##END NTUPLES=NMR FID
##END=
