##TITLE=1H ikalashn
1D2
17.10.2024
##JCAMPDX= 6.0         $$ Bruker NMR JCAMP-DX V2.0
##DATA TYPE= NMR FID
##DATA CLASS= NTUPLES
##ORIGIN= UXNMR, Bruker Analytische Messtechnik GmbH
##OWNER= root
$$ TOPSPIN		Version 1.3
$$ 2024-10-17 14:24:29.328 +0400  Irina@DPX200
$$ Compression mode = diff/dup
##.OBSERVE FREQUENCY= 200.131392401
##.OBSERVE NUCLEUS= ^1H
##.DELAY= (6, 6)
##.ACQUISITION MODE= SIMULTANEOUS
##.ACQUISITION SCHEME= undefined
##.AVERAGES= 16
##.DIGITISER RES= 18
##SPECTROMETER/DATA SYSTEM= spect
##.PULSE SEQUENCE= zg
##.SOLVENT NAME= CDCl3
##.SHIFT REFERENCE= INTERNAL, CDCl3, 1, 17.95386
##AUDIT TRAIL= $$ (NUMBER, WHEN, WHO, WHERE, WHAT)
$$ ##TITLE= Audit trail, TOPSPIN		Version 1.3
$$ ##JCAMPDX= 5.01
$$ ##ORIGIN= Bruker BioSpin GmbH
$$ ##OWNER= Irina
$$ $$ F:/spectra/data/iren/nmr/1H/4/audita.txt
$$ ##AUDIT TRAIL=  $$ (NUMBER, WHEN, WHO, WHERE, VERSION, WHAT)
(   1,<2024-10-17 14:24:02.218 +0400>,<Irina>,<DPX200>,<TOPSPIN 1.3>,
      <created by zg
	started at 2024-10-17 14:22:54.203 +0400,
	POWCHK disabled, PULCHK disabled
       configuration hash MD5:
       BE 6D 3F 07 2A EA 11 49 91 17 2B D3 AF B3 58 0D
       data hash MD5: 16K
       95 41 BA CC 8E 00 BF A9 1C 10 8D 88 C0 29 AA 5F>)
$$ ##END=
$$ 
$$ $$ hash MD5
$$ $$ 12 F5 19 93 36 66 58 EB 06 80 D2 A0 C5 91 26 DE
##$RELAX= 
##$RELAX= 
##$RELAX= 
##$RELAX= 
##$RELAX= 
##$RELAX= 
##$RELAX= 
##$RELAX= 
##$RELAX= 
$$ Bruker specific parameters
$$ --------------------------
##$DU= <F:/spectra>
##$EXPNO= 4
##$NAME= <1H>
##$PROCNO= 1
##$TYPE= <nmr>
##$USER= <iren>
##$AMP= (0..31)
100 100 100 100 100 100 100 100 100 100 100 100 100 100 100 100 100 100 
100 100 100 100 100 100 100 100 100 100 100 100 100 100 
##$ANAVPT= -1
##$AQSEQ= 0
##$AQ_mod= 1
##$AUNM= <au_zg>
##$AUTOPOS= <>
##$BF1= 200.13
##$BF2= 200.13
##$BF3= 200.13
##$BF4= 200.13
##$BF5= 200.13
##$BF6= 200.13
##$BF7= 200.13
##$BF8= 200.13
##$BYTORDA= 1
##$CFDGTYP= 0
##$CFRGTYP= 5
##$CHEMSTR= <none>
##$CNST= (0..63)
1 1 145 1 1 1 1 1 1 1 1 1 1 1 1 1 1 1 1 1 1 1 1 1 1 1 1 1 1 1 1 1 1 1 
1 1 1 1 1 1 1 1 1 1 1 1 1 1 1 1 1 1 1 1 1 1 1 1 1 1 1 1 1 1 
##$CPDPRG= <>
##$CPDPRG1= <>
##$CPDPRG2= <>
##$CPDPRG3= <>
##$CPDPRG4= <mlev>
##$CPDPRG5= <mlev>
##$CPDPRG6= <mlev>
##$CPDPRG7= <mlev>
##$CPDPRG8= <mlev>
##$CPDPRGB= <>
##$CPDPRGT= <>
##$D= (0..63)
0 2 0 0 0 0 0 0 0 0.06 0 0.03 0 0 0 0 0.0002 0 0 0 0 0 0 0 0 0 0 0 0 0 
0 0 0 0 0 0 0 0 0 0 0 0 0 0 0 0 0 0 0 0 0 0 0 0 0 0 0 0 0 0 0 0 0 0 
##$DATE= 1729160639
##$DBL= (0..7)
120 120 120 120 120 120 120 120 
##$DBP= (0..7)
150 150 150 150 150 150 150 150 
##$DBP07= 0
##$DBPNAM0= <>
##$DBPNAM1= <>
##$DBPNAM2= <>
##$DBPNAM3= <>
##$DBPNAM4= <>
##$DBPNAM5= <>
##$DBPNAM6= <>
##$DBPNAM7= <>
##$DBPOAL= (0..7)
0.5 0.5 0.5 0.5 0.5 0.5 0.5 0.5 
##$DBPOFFS= (0..7)
0 0 0 0 0 0 0 0 
##$DE= 6
##$DECBNUC= <off>
##$DECIM= 32
##$DECNUC= <off>
##$DECSTAT= 4
##$DIGMOD= 1
##$DIGTYP= 9
##$DL= (0..7)
0 120 120 120 120 120 120 120 
##$DP= (0..7)
150 150 150 150 150 150 150 150 
##$DP07= 0
##$DPNAME0= <>
$$ [...]
##$SW= 21.9925939549014
##$SWIBOX= (0..15)
0 0 2 0 0 0 0 0 0 0 0 0 0 0 0 0 
##$SW_h= 4401.40845070422
##$TD= 16384
##$TD0= 1
##$TE= 300
##$TE2= 300
##$TE3= 300
##$TEG= 300
##$TL= (0..7)
0 120 120 120 120 120 120 120 
##$TP= (0..7)
150 150 150 150 150 150 150 150 
##$TP07= 0
##$TPNAME0= <>
##$TPNAME1= <>
##$TPNAME2= <>
##$TPNAME3= <>
##$TPNAME4= <>
##$TPNAME5= <>
##$TPNAME6= <>
##$TPNAME7= <>
##$TPOAL= (0..7)
0.5 0.5 0.5 0.5 0.5 0.5 0.5 0.5 
##$TPOFFS= (0..7)
0 0 0 0 0 0 0 0 
##$TUNHIN= 0
##$TUNHOUT= 0
##$TUNXOUT= 0
##$USERA1= <user>
##$USERA2= <user>
##$USERA3= <user>
##$USERA4= <user>
##$USERA5= <user>
##$V9= 5
##$VALIST= <valist>
##$VCLIST= <CCCCCCCCCCCCCCC>
##$VD= 0
##$VDLIST= <DDDDDDDDDDDDDDD>
##$VPLIST= <PPPPPPPPPPPPPPP>
##$VTLIST= <TTTTTTTTTTTTTTT>
##$WBST= 1024
##$WBSW= 25
##$XGAIN= (0..3)
0 0 0 0 
##$XL= 0
##$YL= 0
##$YMAX_a= 1156426
##$YMIN_a= -1457699
##$ZGOPTNS= <>
##$ZL1= 120
##$ZL2= 120
##$ZL3= 120
##$ZL4= 120
##$ABSF1= 10
##$ABSF2= 0
##$ABSG= 5
##$ABSL= 3
##$ALPHA= 0
##$AQORDER= 0
##$ASSFAC= 0
##$ASSFACI= 0
##$ASSFACX= 0
##$ASSWID= 0
##$AUNMP= <proc_1d>
##$AXLEFT= 0
##$AXRIGHT= 0
##$AXTYPE= 0
##$AXUNIT= <>
##$AZFE= 0.1
##$AZFW= 0.1
##$BCFW= 1
##$BC_mod= 2
##$BYTORDP= 1
##$COROFFS= 0
##$CY= 7568.61572265625
##$DATMOD= 1
##$DC= 2
##$DFILT= <>
##$DTYPP= 0
##$F1P= 17.9538593292236
##$F2P= -4.03888763876832
##$FCOR= 0.5
##$FTSIZE= 32768
##$FT_mod= 4
##$GAMMA= 1
##$GB= 1
##$INTBC= 1
##$INTSCL= 1
##$ISEN= 128
##$LB= 0.01
##$LEV0= 0
##$LPBIN= 0
##$MAXI= 945.577
##$MC2= 0
##$MEAN= 0
##$ME_mod= 0
##$MI= -402.1523
##$NCOEF= 0
##$NC_proc= 0
##$NLEV= 6
##$NOISF1= 8.587773
##$NOISF2= 6.764455
##$NSP= 1
##$NTH_PI= 0
##$NZP= 0
##$OFFSET= 17.95386
##$PC= 1
##$PHC0= -18.31522
##$PHC1= -24.32496
##$PH_mod= 0
##$PKNL= yes
##$PPARMOD= 0
##$PPDIAG= 0
##$PPIPTYP= 0
##$PPMPNUM= 100
##$PPRESOL= 1
##$PSCAL= 0
##$PSIGN= 0
##$REVERSE= no
##$SF= 200.13
##$SI= 32768
##$SIGF1= 18.5376
##$SIGF2= -6.396296
##$SINO= 400
##$SIOLD= 32768
##$SREGLST= <1H.CDCl3>
##$SSB= 3
##$STSI= 0
##$STSR= 0
##$SW_p= 4401.40845070423
##$SYMM= 0
##$S_DEV= 0
##$TDeff= 0
##$TDoff= 0
##$TI= <>
##$TILT= no
##$TM1= 0
##$TM2= 0
##$TOPLEV= 0
##$USERP1= <user>
##$USERP2= <user>
##$USERP3= <user>
##$USERP4= <user>
##$USERP5= <user>
##$WDW= 1
##$XDIM= 8192
##$YMAX_p= 0
##$YMIN_p= 0
$$ End of Bruker specific parameters
$$ ---------------------------------
##NTUPLES= NMR FID
##VAR_NAME=  TIME,          FID/REAL,        FID/IMAG
##SYMBOL=    X,             R,               I
##VAR_TYPE=  INDEPENDENT,   DEPENDENT,       DEPENDENT
##VAR_FORM=  AFFN,          ASDF,            ASDF
##VAR_DIM=   8192,          8192,            8192
##UNITS=     SECONDS,       ARBITRARY UNITS, ARBITRARY UNITS
##FACTOR=    0.0002272,     1,               1
##FIRST=     0,             0,               0
##LAST=      1.8609952,     -172,            -105
##MIN=       0,             -1457699,        -1457699
##MAX=       1.8609952,     1156426,         1156426
$$ Real data points
##PAGE= N=1
##DATA TABLE= (X++(R..R)), XYDATA
0@%%%%%%%Oo%j6L2l2M8o4Q0j12J28j44J91k39K72l20L84m49N29o24P21q33R61
$$ 0 0 0 0 0 0 0 0 6 0 0 -16 16 -16 32 -32 48 -64 64 -80 111 -128 144 -176 208 -241 288 -336 385 -448 513
30E13j090J235j412J606j814K052k311K591k906L250l621M024m466M950n479O060
$$ 513 -577 658 -754 852 -962 1090 -1221 1370 -1536 1714 -1907 2117 -2349 2601 -2878 3182
46C182o694P383q141Q974r882J0883j1996J3228j4602J6149j7898J9891k2191
$$ 3182 -3512 3871 -4270 4704 -5178 5705 -6291 6937 -7665 8484 -9414 10477 -11714
59a1714K4884k8080L1945l6740M2872n1024O2464p9814J09541j73954N52210o44737
$$ -11714 13170 -14910 17035 -19705 23167 -27857 34607 -45207 64334 -109620 442590 -202147
71b02147j181088J110580J225298j08363j189241l87859N32376N53274j09516
$$ -202147 -1383235 -272655 952643 844280 -344961 -732820 -200444 352830 243314
80B43314j78160r3802j96788j96908M05329N87389j22402q47698l43804P07193
$$ 243314 65154 -28648 -225436 -422344 -17015 570374 447972 -399726 -743530 -36337
90c6337Q19828k79649r28122k31457P07833N05079k75948m86667p4963K00382
$$ -36337 783491 503842 -424280 -655737 52096 557175 281227 -205440 -280403 -80021
100h0021J59352N7341N280j67207k75952K1052M40299K30982l96783m37938J99800
$$ -80021 79331 136672 141952 -25255 -301207 -280155 160144 391126 -5657 -443595 -243795
111b43795M87856M0210l71096j52044K30475J46992j48541m9509K03946M983l22762
$$ -243795 244061 284271 -86825 -238869 -8394 138598 -9943 -59452 144494 149477 -173285
122a73285p2324M00653K36894l61883m25423J83250N17720K9978n01794k07588
$$ -173285 -245609 155044 391938 30055 -395368 -212118 305602 335580 -166214 -373802
132c73802L87902K74308k68943k60377K07374K48204j89884k86482J83530M03812
$$ -373802 14100 288408 19465 -240912 -33538 214666 24782 -261700 -78170 325642
142C25642r5204n05101o4496N29139K67600m14401m18885J96199M42831J6354
$$ 325642 230438 -274663 -339159 189980 457580 43179 -375706 -179507 263324 279678
152B79678l57302j48827K03828J30611j07423m2579R6397m6306j76967L7172K62976
$$ 279678 -77624 -226451 -22623 107988 565 -42014 54383 8077 -168890 -131718 131258
163A31258P8615k72711k28595J89493L39896l1699l29538r8399K32680J58364
$$ 131258 209873 -62838 -291433 -101940 237956 206257 -123281 -221680 11000 169364
173A69364j01533j26460K2539N4475l2384j5558R2772L1640j58595j07510J59869
$$ 169364 67831 -58629 -36090 18385 -13999 -29557 63215 94855 -63740 -171250 -11381
184a1381J74930j08533k04535L1336J88335K9864j50478m6649J43474N7492j54907
$$ -11381 163549 55016 -149519 -118183 70152 100016 -50462 -97111 46363 103855 -51052
195e1052p2832J82000J31534j61949j95536Q9551K35190J6290k20927j10206J52718
$$ -51052 -123884 58116 189650 27701 -167835 -78284 156906 173196 -47731 -157937 -5219
206e219J35002q8506j09127N1844N3164p4948m3065J12921R3096j21481j84106
$$ -5219 129783 41277 -67850 -16006 37158 -37790 -80855 32066 125162 3681 -180425
217a80425O6568K59958M7570k54396j56577J70363K15103l7751j83907o3265R6119
$$ -180425 -113857 146101 193671 -60725 -217302 -46939 168164 130413 -53494 -116759 -20640
228b0640Q3125j3459k6840j5451o4752m0214J07982J28167p6497k01245l2241
$$ -20640 62485 49026 22186 6735 -58017 -98231 9751 137918 61421 -139824 -172065
239a72065J97684J52981j16021k21084J47K08822R8688j17028j20740J9319Q0922
$$ -172065 25619 178600 62579 -158505 -158358 50464 149152 32124 -88616 -69297 11625
250A1625M3390k822k6368m6944m2561L9212J16898K2544j50240j09357J11805
$$ 11625 55015 52193 25825 -21119 -63680 -24468 92430 114974 -35266 -144623 -32818
261c2818J63446l1210j68525n9818J18930J10333n2580j07991O057P0577O354
$$ -32818 130628 99418 -69107 -128925 -9995 100338 47758 -60233 -54176 16401 22755
272B2755k4407J6898J0459l9401k5744M6160O4432k1634r6543k1583J00672N7044
$$ 22755 -1652 15246 25705 -13696 -39440 6720 71152 49518 -47025 -68608 32064 89108
284H9108q0507p9362L8029P1972p362o0272j4161M6994J4681m8499r860N7937
$$ 89108 8601 -70761 -32732 39240 31878 -28394 -42555 4439 19120 -29379 -39239 18698
296A8698J0254o2981j5923O2497L4333m3511m7951K4701O0846n434o1912l267
$$ 18698 28952 -34029 -49952 12545 46878 3367 -44584 -19883 40963 35529 -26383 -29650
308b9650N7276M710n1461p791M1487J3815l6742l0112K7748M5631j9654n7258
$$ -29650 27626 32336 -19125 -26916 14571 28386 -8356 -38468 -10720 34911 15257 -42001
320d2001J0548N8857J559m7148q646L5431J9893k1194k3130J9843K9234k2603
$$ -42001 -31453 27404 28963 -18185 -26831 8600 28493 7299 -15831 4012 33246 10643
332A0643l1901K8995L5185l1826m0867K0934M2818n698m8631j9764M4158L6665
$$ 10643 -21258 7737 42922 11096 -29771 -8837 33981 28283 -20348 -40112 4046 40711
344D0711l8368m6645K3696M1962q125k8158l220J5543J0197p658o292J3882K756
$$ 40711 2343 -44302 -20606 21356 13231 -14927 -18147 -2604 7593 -65 -6357 7525 10281
357A0281k5831j2L8742N556m2485k0663L0862L4895j1748m7802j2801M6570K5816
$$ 10281 -15550 -15562 23180 28736 -13749 -34412 -3550 31345 19597 -28205 -41006 5564 31380
370C1380l7087k8016K0693K0000o116p174K565L699l210n884J3503K0611j6468
$$ 31380 -5707 -33723 -13030 6970 854 -6320 -3755 -56 -3266 -9150 4353 24964 8496
383H496l1178J5194L7967l366l3137j1959J9426K4182o616l1325m973K6651N612
$$ 8496 -22682 -7488 30479 27113 -6024 -17983 1443 25625 19009 -12316 -17289 9362 14974
396A4974j9229l481R214j655m413L097O430J912j1487r384J9504J9556k0747k4554
$$ 14974 -4255 -7736 1478 -177 -4590 -1493 4937 6849 -4638 -14022 5482 25038 4291 -20263
410b0263J6281K5221n413k1179q658J2720J6442q215j9487K626J0987n089l109
$$ -20263 -3982 21239 15826 -5353 -14011 -1291 15151 6936 -12551 -9925 1062 -4027 -7136
423g136P394m085j0821J933J0820P664l805j7486l948K4697J4323j8271j6619
$$ -7136 258 -3827 -14648 -12715 -1895 5769 1964 -15522 -19470 5227 19550 1279 -15340
436a5340Q113J4566N885o412j2038K89Q768j505J2P741p853j8025O208K0968L347
$$ -15340 -7227 7339 13224 6812 -5226 -4937 3831 2326 2338 10079 2226 -15799 -9591 11377 14724
451A4724j5506j5109K489K1363J1851j5754j5290M746R529P717N744r081j5880
$$ 14724 -782 -15891 -13402 7961 19812 4058 -11232 -6486 3043 10760 16504 7423 -8457
464h457J730J4266R581j125j6374j7622R366K5101L203k0587j7533p56J8549J9267
$$ -8457 -6727 7539 17120 15995 -379 -18001 -8635 16466 19669 -918 -18451 -19207 -658 18609
478A8609q846k6085q145J3976K0098J0489j7160l0556K733L5159J8027j8639k8440
$$ 18609 9763 -16322 -24467 -10491 9607 20096 2936 -27620 -24887 10272 28299 9660 -18780
491a8780o307K3678K5587p389k6870r558Q326J4055J3965m092k6346j4921J6711
$$ -18780 -25087 -1409 24178 16789 -10081 -19639 -11313 2742 16707 12615 -13731 -28652 -11941
504a1941K7457R955k2218l5873J447M5650K6618k7341m0932m159L6716L5475j2792
$$ -11941 15516 25471 3253 -32620 -31173 14477 41095 13754 -27178 -31337 5379 40854 28062
517B8062m3290j2702K6759K4126K199j4776k3829q827K0113K4849L143k2523l1787
$$ 28062 -15228 -27930 -1171 22955 25154 10378 -13451 -22278 -2165 22684 25827 3304 -28483
530b8483k998M0309L2777k1441m7213j5612L3838M7655K243n3100l6836K8931
$$ -28483 -31481 8828 41605 20164 -27049 -42661 -8823 38832 41075 -12025 -48861 -19930
542a9930M9962Q903l3354l5727K41L4516K3576j1922k3592j5030j629K1549K6851
$$ -19930 30032 38935 5581 -30146 -29905 4611 28187 16265 -7327 -22357 -23986 -2437 24414
555B4414l045l3830k7355R779M6043L1463l4570o2007q55O3660M1914k9406o0887
$$ 24414 21369 -12461 -39816 -30037 16006 47469 12899 -49108 -49963 13697 55611 26205 -34682
568c4682j4754N0908M5596j8511m3591j0629J6980J8046J1460k921j8368j9924
$$ -34682 -49436 1472 47068 28557 -15034 -25663 -8683 9363 20823 17902 -466 -20390
580b0390m131K6704L8488p508n9604k9136M7444O0891n247o5405m2392L9812O9700
$$ -20390 -24521 2183 40671 33163 -26441 -55577 -8133 52758 47511 -17894 -60286 -20474 49226
593D9226K149o0744l4178K4955L9925J2609k1147k8516n731J4002J5876J3108
$$ 49226 51375 -9369 -43547 -18592 21333 33942 12795 -15721 -21452 -7450 8426 21534
605B1534m184l2445k4350K3182M4608R519m0735m8299R846O5530L2788m8761o1165
$$ 21534 17350 -15095 -39445 -16263 28345 37864 -2871 -51170 -41324 24206 56994 8233 -52932
618e2932P812O0459L6528l0772n8402o046M9221L1022j9055l0241r073J0337J6663
$$ -52932 -45120 15339 51867 21095 -37307 -43353 5868 36890 17835 -12406 -21479 -11142 5521
631E521Q016j376r135k0798j2707K9594M2935j2445n8541k3433M6701N8792q204
$$ 5521 13537 12161 3026 -17772 -30479 -885 42050 29605 -28936 -52369 -5668 53124 44920
644D4920o9488l3825N1435N8464j3141n2078j9975K4126L0675L361j8351j1194
$$ 44920 -24568 -58393 -6958 51506 38365 -13713 -33688 -9562 21113 24474 6123 -5071
656e071k869o067R848L0232M058m1298l3666K2375N5273J7044n1882n5670K1260
$$ -5071 -7940 -14007 -4159 26073 30131 -11167 -44833 -22458 32815 49859 -2023 -57693 -36433
669c6433O8129J9860m6547m6063M945M4433K9835j8885l7122j0260J6216K1171
$$ -36433 31696 51556 5009 -41054 -36109 8324 38159 19274 -17848 -28108 -11892 9279
681I279J3334q372k8145j7296J4503L1894J8199k2591m6698q482M9319M2324k0364
$$ 9279 22613 14241 -13904 -31200 -16697 15197 33396 10805 -35893 -44375 4944 47268 26904
694B6904n5660k2186M1121N5206m031n7733l0128L2628M4986M270l2884k8921
$$ 26904 -28756 -50942 -9821 45385 41354 -16379 -46507 -13879 31107 35377 2493 -26428
706b6428Q291K8329J1045q210j1581j4073o591K0022K7296m441l5766k3154K2346
$$ -26428 -18137 10192 21237 13027 1446 -12627 -19218 804 28100 23659 -12107 -35261 -12915
719a2915M4913N467m6993l2309K8091M3033J343l3900k4123J3284K9612N127k0044
$$ -12915 31998 37465 -9528 -41837 -13746 29287 30630 -3270 -27393 -14109 15503 20630 586
732E86j1383L667L773M646P384j909j3025j0222N353J9405J0079j9458k4071Q488
$$ 586 -10797 -7130 -3357 1289 8673 6764 -6261 -16483 -11130 8275 18354 -1104 -25175 -16687
746a6687K6537Q005j5825j8851p51J9520J4622r457j6227j934Q376Q833K974o979
$$ -16687 9850 17855 2030 -16821 -17572 1948 16570 7113 -9114 -11048 -2672 6161 9135 2156
760B156q527J176M432L129N297o71j2545o416R857J3543J437j2901j5240N189
$$ 2156 -6371 -5195 -763 2366 7663 6992 -5553 -11969 -2112 11431 12868 -33 -15273 -10084
774a0084K2450P181j7092j5494L335J5449J1050p458j6674k347J1363O274J95
$$ -10084 12366 19547 2455 -13039 -9704 5745 16795 9337 -7337 -9684 1679 7953 8148
787H148l044r646o621Q380J3261J175j2653j4566K673K0784R444j7079j6921M257
$$ 8148 5104 -4542 -11163 -2783 10478 11653 -1000 -15566 -12893 7891 17335 256 -16665 -12408
801a2408J5403Q806o175j5077m100J2364Q923k983o375n137o30P799O231l817
$$ -12408 2995 11801 5626 -9451 -13551 -1187 7736 4753 -1622 -6759 -7389 410 6641 2824
815B824o174l145M78P232O704o488r396J659O445M075L39n531n857M050P654L70
$$ 2824 -3350 -6495 -6017 1215 7919 1431 -7965 -6306 139 4214 4553 -978 -6835 -2785 4869 5239
831E239k852l537k686M538O744k383n246j02J13R25M996j42o663k413L402K776
$$ 5239 2387 -1150 -3836 702 7446 5063 -183 -285 -172 753 5749 5607 -1056 -3469 -67 2709
847B709K437k071p274o03P175K014k622k259l792P53P107J796o039k913L92J651
$$ 2709 5146 3075 -4199 -4802 2373 4387 1765 -494 -4286 -3533 3574 5370 -669 -3582 -3190 -1539
863a539N284J207q100m337N060N186O18l543p303k22R510L410o612m245N4K628
$$ -1539 3745 4952 -3148 -7485 -2425 2761 3379 -164 -7467 -7689 1821 5231 -1381 -5626 -5572 -2944
879b944O296J350q437l680N365N525J056l257o749O48R406K335o361l433O40K561
$$ -2944 3352 4702 -3735 -7415 -2050 3475 4531 1274 -5475 -4827 4579 6914 553 -2880 -2240 321
895C21N304o4p823k011N611K695k36k128m883L93P291J255n557k028P27K319M168
$$ 321 5625 5561 -2262 -4273 1338 4033 3797 1669 -3214 -2821 4470 5725 168 -1860 -1133 1186 5354
912E354j363o922L64N625J64k093l21k776p4M444j73l648o58k25L05M119n72o125
$$ 5354 3991 -2931 -2567 3058 3222 1129 808 -1968 -2042 2402 2229 -1419 -2077 -2302 -1997 2122 1550 -4575
930d575k30M813P17j268j191k600J306N418j084m387N57J683K82J937j015l668
$$ -4575 -4805 8 725 -543 -1734 -4334 -3028 2390 1306 -3081 -2524 -841 -559 1378 363 -3305
946c305J554L015j101m47Q03k811Q40M344r28m044Q79J872K56J348j511k724K628
$$ -3305 -1751 1264 163 -284 519 -2292 -1452 2892 1964 -2080 -1201 671 927 2275 764 -1960 668
963F68L122k172j183R29q69J019K299k369k344K465R38j800Q23k68k107J360J318
$$ 668 3790 1618 435 1364 495 1514 3813 1444 -900 1565 2503 703 1526 1258 -849 511 1829
980A829j925k2M09j741O77K677j958k545J841O82q72J168n52k317J621J524j512
$$ 1829 -96 -118 291 -1450 -773 1904 -54 -2599 -758 -76 -948 220 -332 -2649 -1028 496 -1016
997a016m2Q73k222L23K597o17j685J50n24L39L153q48l756J092K635l90J22M84
$$ -1016 -1058 -185 -2407 -2084 513 -104 -1789 -1639 -2163 -1824 1329 481 -3275 -2183 452 62 184 668
1015F68k213j9K582J068m92n93k994M24N723Q95n471j899K432K408J615j711m314
$$ 668 -1545 -1564 1018 2086 1594 1001 -1993 -1569 4154 5049 -422 -2321 111 2519 4134 2423 -1891
1032a891J66L952M04q81O0k962j501M028L139j959l765k138J537O237J356p519
$$ -1891 -1725 2227 2631 1750 1810 -1152 -2653 1375 4514 2555 -1210 -3348 -1811 4426 5782 -1737
1048a737l935M459L961K79k022m190j312L814K776l45k132m265j776O698N644
$$ -1737 -5672 -1213 2748 3027 1005 -3185 -4497 -683 2093 1748 -384 -4649 -6425 273 5917
1063E917n509p037R22N363L869j055n854j970M629K395j065R58j410m483Q99O506
$$ 5917 408 -6629 -5707 -344 3525 2470 -3384 -5354 -725 1670 605 1563 153 -4330 -3431 3075
1079C075K510l728o439j979Q546P713o339j0642K252Q824K347l790m404n07M089
$$ 3075 5585 1857 -4582 -6561 1985 9698 3359 -7283 -5031 3793 6140 2350 -2054 -2561 1528
1094A528J518j859J414N10n473j521P261M437m943p246j307P175P566m503j0885
$$ 1528 3046 1187 2601 3111 -2362 -3883 3378 7815 2872 -4374 -5681 1494 9060 4557 -6328
1109f328n6P951L725k013m893m397K387O545R72l997l293k001K596O863O1p244
$$ -6328 -6384 1567 5292 3279 -1614 -6011 -3624 2921 3893 -104 -3397 -5398 -2802 4061 4122 -3122
1125c122k518L042K672K567L6n136l792K534N544M331l104j1121k600J3546Q936
$$ -3122 -5640 -2598 74 2641 2677 -2459 -6251 -3717 1827 6158 3054 -8067 -10667 2879 11815
1140A1815q999j2267N09J1638P341o561j0715K301R311m16m819K268K369m499
$$ 11815 2816 -9451 -8942 2696 10037 3476 -7239 -4938 4373 3957 -862 1406 3775 -724
1154g24m003M158R053P82j3093r127J3053J5968p317j7983j938J3612R947o447
$$ -724 -4727 -569 8484 9266 -3827 -12954 99 16067 8750 -9233 -11171 2441 12388 5941
1168E941j3298L7J0839J956o151k3K710l068l415L182N965J022p955q057O110
$$ 5941 -7357 -7320 3519 5475 -676 -699 2011 -1057 -4472 -1290 4675 5697 -2258 -10315 -4205
1183d205J2914r29j2589n336N627R396K891q444q943K988R264K540l578n823l123
$$ -4205 8709 7780 -4809 -10145 -4518 4878 7769 -675 -9618 -6630 2634 5174 1596 -4227 -7350
1198g350N385P233k231o149J21J871L76J614K054o11l471m769K760J1435K328
$$ -7350 -1965 5268 3037 -3112 -2991 -1120 -744 870 2924 2313 -1158 -5927 -3167 8268 10596
1213A0596j4762r029J2018J4575l544j6141o423J3328J3381p558j4975K508J1823
$$ 10596 -4166 -13195 -1177 13398 9854 -6287 -12710 618 13999 6441 -8534 -6026 5797
1226E797L71q110o52O017J140p751l579J0596Q545j1962j4188Q370J7129o45j6476
$$ 5797 6168 -1942 -2594 3423 4563 -3188 -6767 3829 12374 412 -13776 -5406 11723 11078 -5398
1241e398q583J1170J4477m360j5329j495J1280L215n493k277J436P48j582m63
$$ -5398 -13981 -2811 11666 7306 -8023 -9518 1762 4977 -516 -2793 -1357 -609 -2191 -2654
1255b654L511L288n089o938M537Q801m15p207m098K004O656L883m918o529K79
$$ -2654 857 4145 -944 -7882 -3345 5456 5041 -2166 -6264 -4260 2396 6279 1361 -5168 -4889
1270d889M921M920O29p450n843O053Q839k083p624j577M480L909j975l762K465
$$ -4889 32 4952 5581 -1869 -7712 -1659 7180 5097 -2527 -4104 376 4285 2310 -1452 1013
1285A013L103n211l969Q031O592p558j0644L043J2932M199j2327j1365Q711J3929
$$ 1013 4116 -1095 -5064 2967 9559 2001 -8643 -5600 7332 11531 -796 -12161 -3450 10479
1299A0479l149j3444r90R088L402n779m072M076M690n438o412P278Q389o322j1149
$$ 10479 7330 -6114 -7104 1984 5386 -393 -4465 -389 4301 -1137 -7549 -271 8118 1796 -9353
1314i353K645J1972K679r729q288O157J0378k044r421k6N994M82k691L16J713
$$ -9353 -6708 5264 7943 -1786 -10074 -3917 6461 4417 -5004 -5030 964 1446 -1245 -929 784
1329G84q30k665J36N084K301o390m233N744N359l061m169M17K253J312q89p49
$$ 784 -46 -2711 -2575 2509 4810 -1580 -5813 -69 5290 2229 -1940 -1523 730 2042 1153 404
1345D04J120o05l163K224N474j953p489L21O896K472n020n127K618O473r09o849
$$ 404 1524 919 -2244 -20 5454 3501 -3988 -3667 3229 5701 681 -4446 -1828 4645 3736 -3113
1361c113N60O028j079n623J385N230k87n562k854N700O049m908q890L031R226
$$ -3113 -2553 3475 2396 -3227 -1842 3388 3101 -2461 -5315 385 6434 1526 -7364 -4333 4893
1376D893j154p598j187N223K682l625l731L269M777m232n291M600O435l833o607
$$ 4893 3739 -3859 -5046 177 2859 -766 -4497 -1228 3549 -683 -5974 -1374 5061 1228 -5379
1391e379J674O426J890n691m650M978O091m007n621L585M308k522l391J623L756
$$ -5379 -3705 2721 4611 -1080 -5730 -752 5339 1332 -4289 -704 3604 1082 -2309 -686 3070
1406C070Q6m908j733O313K922o188m521N628M513k959m303N96L897J036l944j883
$$ 3070 3156 -1752 -3485 2828 5750 -438 -4959 669 5182 2223 -2080 -1484 2413 3449 -495 -2378
1422b378M701J265n585q02N262J000m578k457K926L842j364n409J29O214j72n719
$$ -2378 2323 3588 -1997 -2799 2463 3463 -1115 -3572 -646 3196 1832 -3577 -3448 2766 2594 -3125
1438c125j33M735Q7l606o29K624K160k279m347K751N495k695n775K137N230n39
$$ -3125 -3258 1477 1564 -2042 -2671 -47 2113 -166 -4513 -1762 3733 1038 -4737 -2600 2630 2091
1454B091m128j436L571L148l155m344L385N171l446m847K861M661j325l960p60
$$ 2091 -2037 -3473 98 3246 91 -4253 -868 4303 857 -3990 -1129 3532 2207 -1753 -2513
1469b513M300K841m236m234M478M479l952m131K962L313r62l330r14L773K156
$$ -2513 1787 4628 392 -3842 636 5115 1163 -2968 -6 3307 2345 -985 -1899 1874 4030
1484D030m608k903M594K956m305k642K732K682j347k822n86L681J272m649j346
$$ 4030 -578 -3481 1113 4069 -236 -2878 -146 2536 1189 -1633 -2219 1462 2734 -1915 -3261
1499c261M674R38m592r24L300J584k015k681Q80L724k66m584K17M854o24l698
$$ -3261 1413 2351 -2241 -3165 135 1719 -296 -2977 -2097 1627 1361 -3223 -3006 1848 1224 -2474
1515b474R2L105Q72k080k184J441L832j668m024J559M360j263l679R74K511R43
$$ -2474 -2382 723 1595 -485 -2669 -1228 2604 936 -3088 -1529 2831 1568 -2111 -1137 1374 2317
1531B317k096k242K084L613k516l910K618L529j666l288Q50K478P60k315k118
$$ 2317 221 -2021 63 3676 1160 -2750 -132 3397 1731 -1557 -707 1771 2531 216 -1902
1546a902K685K489k884k878K901K620k478k582J473J956K31k758j419L031K181
$$ -1902 783 3272 388 -2490 411 3031 553 -2029 -556 1400 1631 -1127 -2546 485 2666
1561B666l531k128K824J951k036j771Q34J486N03k263r60K609J266l344q04L100
$$ 2666 -865 -2993 -169 1782 -254 -2025 -1191 295 798 -1465 -2425 184 1450 -1894 -2698 402
1577D02O81j984j008R01K158k10k422l81K649O88k517j82J935k41q65K18M72P23
$$ 402 1083 -901 -1909 -1008 1150 940 -1482 -1863 786 1474 -1043 -1225 710 469 -396 -178 294 1017
1595A017n97j230R33K171j019k626J131K040l94j349m06N22J337k17j982Q61J428
$$ 1017 420 -810 123 2294 1275 -1351 -220 1820 1426 77 -329 193 1530 1313 -669 192 1620
1612A620j224j428J584J137j426j363L99J432J032j804k336J842K199j388j822
$$ 1620 396 -1032 552 1689 263 -1100 -701 731 1763 -41 -2377 -535 1664 276 -1546
1627a546R06O50o5m39l56M36N64j043j016J934J050k084q20J208J136k64p34j079
$$ -1546 -640 10 -55 -494 -850 -414 150 -893 -1909 25 1075 -1009 -1829 -621 515 251 -483 -1562
1645a562O83J683n24j140N81L61q71R78P79p16p68K65L11J035J47j675l51J811
$$ -1562 -879 804 280 -860 -279 82 -789 189 968 252 -516 -251 60 1095 1242 -433 -784 1027
1663A027K75j048J01J10o75Q04M80m12o5k57j008J105J687j535j517O04R32M12
$$ 1027 1302 254 355 465 -210 594 1074 662 597 340 -668 437 2124 589 -928 -324 608 1020
1681A020Q0j890o77J720J120j369o35K88l28M36N98o55n07K56l18k4J464n14j446
$$ 1020 1100 -790 -1467 253 1373 4 -631 -343 -671 -235 363 -292 -799 -543 -861 -885 579 65 -1381
1700a381J22O98M02P27r80j901J100K301j89j759o53O67J271R87j535j383J489
$$ -1381 -1259 -561 -159 568 -412 -2313 -1213 1088 899 -860 -1513 -846 425 1412 -123 -1506 -17
1717a7R77j189K63P02o14k09J6M26N81M48j640q65K310J058j293j671r8J421J893
$$ -17 960 -229 34 736 122 -87 -71 355 936 1384 -256 -1121 1189 2247 954 -717 -815 606 2499
1736B499j179k645L56K343J51j078m34n26M74J146q49r71J112r9j302K75J302
$$ 2499 1320 -1325 -969 1374 1525 447 13 -513 -39 1107 258 -713 399 300 -1002 -727 575
1753E75Lq38j229l56K432J563k944k308J868K740k23k065j864J221K996n13k968
$$ 575 578 -260 -1489 -1845 587 2150 -794 -3102 -1234 1506 1283 -782 -2646 -1425 1571 1058 -1910
1770a910J66K091J49j186k21R29P30p94j908R35L556p93l745r3L358J552j791
$$ -1910 -1744 347 496 -690 -911 18 748 -46 -1954 -1019 2537 1744 -2001 -2094 1264 2816 1025
1787A025k807L3L451J533l032k018K059J618p01j236l53J033Q48j164j099J489
$$ 1025 -1782 -1749 1702 3235 203 -1815 244 1862 1161 -75 -428 605 1453 289 -810 679
1803F79J479k088j645J417J635J69j818j898J103L149p17k744n43J531J301n4
$$ 679 2158 70 -1575 -158 1477 1646 -172 -2070 -967 2182 1465 -1279 -1822 -291 1010 956
1819I56j710j562J810J757j514j267P59J043j96r97l47J077J429j689k330K145
$$ 956 -754 -2316 -506 1251 -263 -1530 -771 272 76 -921 -1268 -191 1238 -451 -2781 -636
1835f36K778j436k757j59K414K294j532l517O87L731M44k997j055K086J298p43
$$ -636 2142 706 -2051 -2210 204 2498 966 -2551 -1864 1867 2311 -686 -1741 345 1643 900
1851I00j753M36K300m53k553Q6L173J14k717j297J867K332m14l052r87K917J428
$$ 900 -853 -417 1883 1430 -1123 -1037 2136 2250 -467 -1764 103 2435 2021 -1031 -2018 899 2327
1868B327j959j720Q07J364k4p57o36M98O17q67n31J210J97j242k56N05L04O01
$$ 2327 368 -1352 -545 819 795 38 -598 -100 517 -350 -881 329 526 -716 -972 -467 -163 438
1886D38m74j373M42J167J54p06o09j92O61J609p05j972L40J501N94r76p75L16
$$ 438 -36 -1409 -967 200 354 -352 -961 -1153 -492 1117 412 -1560 -1220 281 875 -101 -876 -560
1904e60J167L9j465J43K003n88j820M56J635N14j275j726J037K632l30k837m04
$$ -560 607 646 -819 -676 1327 739 -1081 -625 1010 1524 249 -1477 -440 2192 1862 -975 -1379
1921a379K801N98j803j092Q22J438j96j763j50K275j46k421j60K413rj481j125
$$ -1379 1422 2020 217 -875 -53 1385 1189 -574 -724 1551 1405 -1016 -1176 1237 1228 -253 -1378
1938a378Q38J904j28k551j58K179L94j789m83J064K36o30k67K08P00j61j403P63
$$ -1378 -540 1364 1236 -1315 -1473 706 1100 -689 -1172 -108 128 -502 -769 -561 139 -22 -1425 -662
1956f62J450p05j439M41J057K4m61l52J7J053l06o77Q81M45j199l98J424K73o88
$$ -662 788 83 -1356 -915 142 166 -295 -647 -630 423 117 -560 321 766 -433 -831 593 866 178
1975A78p02K86J134L58j347p47J823M52j921k9J584J6j165m65J007Q90k60j885
$$ 178 -524 -238 896 1254 -93 -840 983 1435 -486 -515 1069 1085 -80 -545 462 1352 1092 -793
1993g93j6K067J43j991o92J878L99q28r68k7J611O2k199K89J999m10j879P4J505
$$ -793 -809 1258 1401 -590 -1282 596 995 167 -801 -828 783 845 -1354 -1065 934 524 -1355 -1281 224
2012B24M71r96j311N59K025n34k074M52J929k76j537K18R92J59m45p49L91J524
$$ 224 695 -301 -1612 -1053 972 438 -1636 -1184 745 469 -1068 -850 142 301 -144 -893 -502 1022
2030A022r23j494J232J261p77q87L62N57L66l41r76Q24O96p34q72J269N25j174
$$ 1022 99 -1395 -163 1098 321 -566 -204 353 719 378 -598 226 922 188 -684 585 1110 -64
2048f4k72P91M12p4q41n25J441O19j814l34J452K88j165l98O20N81m56j041R7
$$ -64 -336 455 867 793 -48 -573 868 1487 -327 -661 791 1079 -86 -484 136 717 261 -780 -683
2067f83J305K25j886r6J727J48j526l43P92Q59k55j280j53J746k22j522k2J559
$$ -683 622 847 -1039 -1135 592 740 -786 -1129 -337 522 267 -1013 -1166 580 358 -1164 -1186 373
2085C73m5r48l09P35O47l54j172K42J680k71j533M80J104j12p64k64Q29N08m46
$$ 373 328 -620 -929 -194 453 99 -1073 -831 849 578 -955 -475 629 517 -247 -511 318 826 380
2104C80r92P20J224p96j160P02Q88j91q50j51O99N91p88j010R24J058j061r47
$$ 380 -612 108 1332 536 -624 78 966 775 -75 -226 473 1064 276 -734 190 1248 187 -760
2122g60J004O77o96m01j56P86N08j356p46J327O10j283n86J022M43p49k24K1O52
$$ -760 244 921 225 -176 -332 454 962 -394 -1140 187 797 -486 -1072 -50 393 -356 -580 -559 93
2141I3K31j278k06J556Q2j323k56J171K55p41n15M14R71j5j329L28J239j78j354
$$ 93 324 -954 -1160 396 478 -845 -1101 70 325 -416 -931 -517 454 439 -890 -562 677 499 -855
2160h55K80J235j3r59k60O59R44m10j521N66J627n34j239J16J146L64p66q55O88
$$ -855 -575 660 647 -312 -572 87 1031 621 -900 -334 1293 759 -480 -364 782 1146 380 -475 213
2179B13R89p14j278O97J587j031j189M21P36K45p05o34N19J054n58j266O28Q03
$$ 213 1202 488 -790 -93 1494 463 -726 -305 431 676 -29 -663 -144 910 352 -914 -286 517
2197E17m82p25K39N77K5o13o63J036O26r89q12J005O02p35j81M69J22m8l68j38
$$ 517 35 -690 -451 126 151 -462 -1125 -89 537 -452 -1264 -259 343 -392 -573 -104 18 -30 -398 -536
2217e36R04k5j036k3J436j99j206J5Q00N00k57p78j08J268J38j371J18J314j26
$$ -536 368 343 -693 -716 720 521 -685 -670 130 630 373 -405 -513 755 893 -478 -360 954 828
2236H28j068k9Q70M14o71j030M11J627j40j938J14J676Qj044m88N14N42M5j156
$$ 828 -240 -269 601 1015 344 -686 -275 1352 1212 -726 -612 1064 1072 28 -460 54 596 641 -515
2255e15k7J138m01r99N94O70l49o72n8M48N77l93r59M16P07l26o57O51kl47R6
$$ -515 -542 596 195 -804 -210 460 111 -561 -619 -171 406 13 -946 -530 177 -149 -806 -155 -157 -504 -408
2276d08J64L95j38m88j99R54L85j107o08J176L59m45m86J70O13K30o48j21Q92
$$ -408 -244 151 13 -475 -674 280 665 -442 -1050 126 485 40 -446 -276 337 567 -81 -202 690
2295F90L84j546N1J043L92q60m02j24J120M26j113q13J328N06r58l49K40L47j7
$$ 690 1074 -472 -421 622 1014 154 -248 -372 748 1174 61 -752 576 1082 124 -225 15 362 345
2314C45k11m15N27K92q71k01J003j73l47l45O2J05M73j72n13j3M08l05M25j86
$$ 345 134 -281 246 538 -333 -534 469 296 -51 -396 -334 -229 244 72 -441 -454 -46 -351 74 -112
2334a12n53R9Q29l43n48J22K72O7P9j53m35R24r5o01O1P04r1n45L0L48M71r1j073
$$ -112 -665 -566 263 -80 -628 -506 -234 -167 -88 -241 -676 248 153 -448 -387 317 226 -319 -289 59 530 439 -634
2357f34L8J285N63j252m44N09O59Q7p91l09L67R74r59m38O12K78l25l44J83L37
$$ -634 -596 689 1252 0 -444 65 724 811 20 -289 78 1052 93 -345 267 545 220 -124 59 396
2377C96K64o23o45N61Q88m49q70j32O31L85k19r13MJ015N7p21l27O51J62k7n91
$$ 396 660 37 -608 -47 841 392 -478 -610 21 406 187 -726 -722 293 350 -371 -698 -47 115 88 -503
2398e03l47R54M12j081m81J100N11p58o55J83P51N68r42q03Q49Q86k51o71L8K94
$$ -503 -850 104 516 -565 -1046 54 565 -193 -848 -665 86 654 -288 -1091 -242 644 393 -278 -240 54
2418E4K47r7m16K70M91k70m44K62O13k92m20L6kP29j44p10j12M81M22l85m52J14
$$ 54 301 204 -212 58 549 279 -165 97 710 418 -2 34 32 761 617 -93 -205 276 698 313 -139 -25
2440b5n0N23Kj003L26O61j39l09k92L8N52j88o83k2R41j90q80R3P55J19k98p27
$$ -25 -75 448 450 -553 -227 434 295 -14 -306 -268 284 96 -587 -609 332 142 -738 -645 110 229 -69 -796
2462g96k18J289M54j308o75J258M81l30o88j75O57L78n83n85R91O46q46o89R25
$$ -796 -1014 275 729 -579 -1254 4 485 155 -533 -708 -51 327 -256 -841 150 796 -50 -739 186
2481A86N65l34n30m58J024O25j022p29J025M61n05l16j47M53K41l47k07K36M19
$$ 186 751 417 -113 -571 453 1078 56 -673 352 813 308 -8 -155 298 539 192 -15 221 640
2500F40m14o63O12O6j29j38K2L7K01j93l98J70M49n28M0M14m22l03O27J33n04
$$ 640 226 -437 175 241 112 -26 -4 33 234 41 -357 -187 262 -266 -226 188 -234 -537 90 223 -281
2521b81j12J15L26J84m65o50R10K80p27k14O51J87k52l79n0P06K31o71o36J123
$$ -281 -393 -278 48 232 -233 -883 27 307 -420 -634 17 204 -48 -427 -477 229 460 -211 -847 276
2541B76O16j009o55P50N20r8p06k46Q28P36r10o87J058L53p55l92J35Q09J71p87
$$ 276 892 -117 -772 -22 498 400 -306 -552 276 1012 102 -585 473 826 71 -321 -186 623 794 7
2561Gn77Q20O92r74l35N27L10j89l76k8K29J85m27j29L87R4o39K1N38p7k60j03
$$ 7 -570 250 942 -32 -367 160 470 281 -95 -123 106 291 -136 -265 122 216 -423 -402 136 59 -201 -304
2583c04L88k43J02m76K59N48n20m44L51P75m91m03PL97J61k89n83O49R62j021
$$ -304 84 -159 -57 -533 -274 274 -246 -690 -339 436 -55 -458 -451 -54 107 -182 -765 -116 846 -175
2603a75p52Q85Q31p13n72K09P26j2n58m19P61Q88j048n20O47N90k96o27k5N64
$$ -175 -927 -42 789 76 -496 -287 439 427 -131 -550 211 1099 51 -469 178 768 472 -155 -180 384
2623C84N57q70n24N43P13n36n66L49L93l19j57k45M61L80n96m47M99N32q52J7
$$ 384 941 71 -453 90 803 267 -299 50 443 124 -33 -278 183 563 -33 -480 19 551 -301 -284
2643b84K47J44l92n3NM22k2n72P6O93k02p43K65N32l7m64k52P94J69m18n42L52
$$ -284 -37 107 -285 -338 -333 89 67 -505 -429 264 62 -681 -416 116 79 -385 -637 157 326 -92 -634 -282
2665b82Q75m38n54Q2P01o2m88k42N55N24m83o20O05O40n02p57N27K91J00m76m86
$$ -282 593 155 -399 -317 384 322 -166 -408 147 671 188 -432 173 813 311 -446 81 372 472 -4 -490
2686d90O10O36n92o39M97P22n33m53J48K18J28l37l17M78K90m76m10N80L15o57
$$ -490 120 756 164 -475 22 744 211 -242 -94 124 252 -85 -402 76 366 -110 -520 60 375 -282
2706b82k85L71L79k03k46k26O00J84o69k71Q08o7n92J27K48N5N3l60o6O28O5p63
$$ -282 -567 -196 183 -20 -266 -492 108 292 -377 -648 160 93 -499 -372 -124 -69 -16 -376 -442 186 251 -512
2728e12K08P47J0p95J20N18J93l20n56L99K70K9o95J50R24l15l95j36M44L2j69
$$ -512 -304 443 453 -342 -222 296 489 169 -387 12 282 311 -384 -234 690 375 -20 -156 288 320 151
2749A51l95J89O05j98n85J39O71l56k02j31L08L9r9j47P6L45m22n22M41L39m43
$$ 151 -244 -55 550 352 -233 -94 577 221 19 -112 196 235 136 -11 65 410 -12 -534 -93 246 -197
2770a97j90J77M6K46j74j85P7L56m82l4K95O5k34l29N74J65r3n08R2L58K66o45
$$ -197 -387 -210 -164 82 -92 -277 -200 156 -326 -360 -65 0 -234 -563 11 176 83 -425 -333 25 291 -354
2792c54j54N59K65j71j37q9L16O8n61j01O94J32p11M9O24p0l50m4m1L72rm70P4
$$ -354 -508 51 316 145 8 -81 235 303 -258 -359 335 467 -244 -195 429 359 9 -35 -76 296 287 -183 -109
2815a09L84k4k27Q4K62j43l71k4K43J55k63n1J98K61l75l57N31p2k23q9m4J41
$$ -109 275 251 24 108 370 227 -144 -168 75 230 -33 -84 114 375 0 -357 174 102 -121 -210 -254 -113
2837a13L91n60j07L20L24m93k69M47J97k31k37j34L91L46l49l91M29J70k89k97
$$ -113 278 -282 -389 -69 255 -238 -507 -60 137 -94 -331 -465 -74 272 -77 -468 -39 131 -158 -455
2857d55M88k9K3l2k58L44N12n57l67O57p5j08k0j18J3J51J9k66K33K64l14J03
$$ -455 33 4 27 -5 -263 81 593 36 -331 326 251 143 123 5 18 169 188 -78 155 419 105 208
2879B08Q3j56j38L37l4o7l30J28OM00m76p8K39P3m24p4K85M2l35J93j70J88K38
$$ 208 291 135 -3 334 300 233 -97 31 37 437 -39 -117 122 195 -229 -303 -18 24 -311 -118 -288 -100 138
2902A38m09j95K64M36n34p2K01K30p0k06k44K85L77l62k13L24R4N0k66j14L57
$$ 138 -271 -466 -202 234 -300 -372 -171 59 -11 -217 -461 -176 201 -161 -374 -50 44 94 -172 -286 71
2923G1j8J99o61J76O71k85l07J65K3K96l19N2K5J50kk9N1o8O9o1J26k80nL75k52
$$ 71 53 252 -409 -233 438 153 -154 11 34 330 11 63 88 238 236 207 258 190 259 198 324 44 39 414 162
2948A62j57J18l7o0o6n6NJ72J61k75k02K11P8k7l70J31Q5K99l02k08J37J35j42
$$ 162 5 123 86 26 -40 -96 -91 81 242 -33 -235 -24 54 27 -343 -212 -127 172 -130 -338 -201 -66 -208
2971b08p4J0K07M0l05j60L85L65l59j67Q5K82J1k31nK9N07k60k81M0M09k77j51
$$ -208 -282 -272 -65 -25 -330 -490 -105 260 -99 -266 -181 101 112 -119 -124 -95 412 152 -129 -89 320 43 -108
2994a08J44N5K31l6l19J92R6J35k31k16O0J14J64k80n2R4M57m03j51m3L93k96
$$ -108 36 91 322 286 -33 159 255 390 159 -57 3 117 281 1 -51 43 500 97 -54 -97 296 0
3016@p8p8K2L04j94j58r8M02p6l46J18Q2J14R4l30n4K54J60l76o6M47j65o9O1
$$ 0 -78 -156 -134 170 -24 -182 -280 122 46 -300 -182 -100 14 108 -222 -276 -22 138 -238 -304 143 -22 -91 -30
3040c0k60K08J37r0k49K43J12p2n8k9n0O2K46j65K0J38N4q2Kq2K52o0k17j26K86
$$ -30 -290 -82 55 -35 -284 -41 71 -1 -59 -88 -138 -76 170 5 25 163 217 135 137 55 307 247 30 -96 190
3065A90P5j07k77j6K72J91r8l37K08K99l19k83J12K34q1n4l07L63Q8J48n00L8
$$ 190 265 158 -119 -135 137 328 230 -107 101 400 81 -202 -90 144 63 9 -298 65 153 301 -199 -161
3087a61K85Lm49O4K83Oj0m24OM89l0k81j36L80J9k22J88l03L19J18r7k77K68l1
$$ -161 124 127 -322 -258 25 31 21 -403 -397 92 62 -219 -355 25 44 -178 10 -293 26 144 47 -230 38 7
3111Gj30Q5N0q2J86O2m4n8K5K1j15K9j05K92L1m1l25K92J36k10J60l64K02J95
$$ 7 -123 -38 12 -70 116 178 134 76 101 122 7 36 -69 223 254 213 -112 180 316 106 266 -98 104 299
3135B99p9l91M5L82j38l76J13J17L6P0k71m7M74j1n12j3K20J81K3l32l2M39n9
$$ 299 220 -171 -126 256 118 -258 -145 -28 8 78 -193 -240 234 223 -289 -302 -82 99 122 -210 -242 197 138
3158A38n26L1O33j26k35k51K68J16k03p0j17O22j15l16k12M90J44k74j80J85K8
$$ 138 -388 -357 276 150 -85 -336 -68 48 -155 -225 -342 280 165 -151 -363 127 271 -3 -183 2 30
3179C0J00j91L7J50j3q6p4K19j15J75n3r0j18K0K05O7j64p9R9j21J48k57j53M65
$$ 30 130 -61 -24 126 113 27 -47 172 57 232 179 89 -29 -9 196 263 99 20 119 -2 146 -111 -264 201
3203B01K7k08j77L9M96k64l28P3K12K0o8l31J17K94l1l22r2M04J06k47k90M65
$$ 201 228 20 -157 -118 378 114 -214 -141 71 91 23 -308 -191 103 72 -250 -342 62 168 -79 -369 96
3225I6Mj55j56KL75k6l24k0Q9J96k99j9M35J03l81l1k4M35r9k19k3L98K8n16O
$$ 96 100 -55 -211 -209 166 140 -184 -204 -115 81 -218 -237 198 301 -80 -111 -135 300 201 -18 -41 357 385 -131 -125
3250a25L46k9j65J50j9j99J71q9K03P4j74j81m2K61m7k08J64j03j72J49j83L62
$$ -125 221 192 27 177 158 -41 130 41 244 318 144 -37 -79 182 135 -73 91 -12 -184 -35 -218 144
3272A44R5k91k77M43J38m84O2j74N28r5l17j08J53J31j10k33L28R8m1j83RK78
$$ 144 239 -52 -329 114 252 -232 -170 -344 184 89 -228 -336 -183 -52 -162 -395 -67 31 -10 -193 -184 94
3294I4j2j28k66L06L27l31k75L17J52L1l61K85L2J0k09kK22L3q3l00L13J17j22
$$ 94 82 -46 -312 -6 321 -10 -285 32 184 215 -146 139 171 181 -28 -30 192 225 142 -158 155 272 150
3317A50j59J78j7J1j70K3J51J2l62J47Q6Q1j34j78K14K6o5j66P0M32l25l36Q0
$$ 150 -9 169 152 163 -7 16 167 179 -183 -36 50 131 -3 -181 33 59 -6 -172 -102 330 5 -331 -251
3340b51L69L4l15j64M05P0j81k20J97J81n9l61J43L03n0j87j23J04K62j47l27
$$ -251 118 152 -163 -327 78 148 -33 -253 -56 125 66 -295 -152 151 101 -86 -209 -105 157 10 -317
3361c17K41L03k48j84J52J7J59k44j10L49K23l16k75N33J2j89j8k29K60R0j90
$$ -317 -76 227 -21 -205 -53 -36 123 -121 -231 118 341 25 -250 283 295 106 88 -141 119 209 19
3382A9o1L09p8j33k20L51K90m68q9K61O3r3k92Q8Q6K7j58j23K95J61l50L7N8P6
$$ 19 -42 267 189 56 -164 187 477 9 -80 181 244 151 -141 -53 33 60 -98 -221 74 235 -115 -78 -20 56
3406E6J10m31J14Q6J00m37J68K72L1k74Lj6M63k27j60P8L6R5k81K86K14m7l64
$$ 56 166 -265 -151 -65 35 -402 -234 38 69 -205 -202 -218 245 18 -142 -64 -28 67 -214 72 286 239 -125
3429a25j2J45J51j57k26K95K06j27k60K12Q7j13j31J25L1J18j61k2J02L21m59
$$ -125 -137 8 159 2 -224 71 277 150 -110 102 189 76 -55 70 101 219 58 36 138 459 0
3450@k91M98n2m8k22J08j19J81o0k15L69q3j30j32K51K27j90k06J27M1K07m87
$$ 0 -291 207 155 107 -115 -7 -126 55 -5 -220 149 66 -64 -196 55 282 92 -114 13 54 261 -226
3472b26j69L69J67l24M8j11J45L63n73N4K34K68m44N0M26j70j63M8O7N7j66J02
$$ -226 -395 -26 141 -183 -135 -246 -101 262 -311 -257 -23 245 -199 -149 277 107 -56 -8 59 116 -50 52
3494E2p9K65m7k68K33m2o8j57L2K03Pj5j56J62p5j07M0L69k29q9l1n3J51q5o0
$$ 52 -27 238 191 -77 156 114 46 -111 -79 124 131 116 -40 122 47 -60 -20 349 120 31 0 -53 98 13 -47
3519d7j96L14J30k29k15K43K70l66j44J84J27j9k09m5J57P5j65k58M44J30k55
$$ -47 -243 71 201 -28 -243 0 270 -96 -240 -56 71 52 -157 -202 -45 30 -135 -393 51 181 -74
3540g4k3J80j09J73k97k05K68J84j42r5J52M4J15k95n7K03P2j07J36k6l8N5q3
$$ -74 -97 83 -26 147 -150 -355 -87 97 -45 -140 12 56 171 -124 -181 22 94 -13 123 97 59 114 31
3563C1J75r5j1j0J39j07K1j73J31o6l4j05K65r8r4K8J54j16mj8N7p0O5k40J19
$$ 31 206 111 100 90 229 122 143 -30 101 35 1 -104 161 63 -31 -3 151 35 31 13 70 0 65 -175 -56
3588e6J38R9k42r8J25k9K19k32k68M15J50k02k00P6J41r8j24J4J71J43k94o9K93
$$ -56 82 181 -61 -159 -34 -63 156 -76 -344 71 221 19 -181 -105 36 -62 -186 -172 -1 142 -152 -221 72
3611G2NJ06m13K42K8J92l02K1k0L28p9j67J25N4j59O0j04k0J88k42K03l2O5k7
$$ 72 77 183 -230 12 40 232 -70 -49 -69 259 180 13 138 192 33 93 -11 -31 157 -85 118 86 151 124
3635A24p4L6n1L1J64j92%r5K00k03K8j02p3J39LJ81q6m1R3k22p3K50J9j4m6k02
$$ 124 50 86 35 66 230 38 38 -57 143 -60 -32 -134 -207 -68 -65 116 30 -11 82 -140 -213 37 56 42 -4 -206
3661b06J80K33k01l01K01M8j9J85k66M1J64j00n6j6J08RlN4j29J3Q4j51J05J16
$$ -206 -26 207 6 -295 -94 -46 -65 120 -146 -105 59 -41 -97 -113 -5 4 1 55 -74 -61 23 -128 -23 93
3685I3j37p7K12J0K6j27J43l58J54K48j80J55j20r0qJ59j21m8K02R8j88O7j11
$$ 93 -44 -121 91 101 127 0 143 -215 -61 187 7 162 42 -48 -56 103 -18 -66 136 234 46 113 2
3708Bl3J02j81J29m8j3Rl3J58q7n8O5J23k91K46j50j01N9K13k76lK12k25rJ85
$$ 2 -31 71 -110 19 -29 -42 -33 -66 92 5 -53 12 135 -156 90 -60 -161 -102 111 -165 -168 44 -181 -190 -5
3733ej74J9R1R4j41j0J85j89P2M8k98L72o1kn8K19j81j00J74k19P9K94k05j54
$$ -5 -179 -160 -69 25 -116 -126 59 -130 -58 -10 -308 64 3 1 -57 162 -19 -119 55 -164 -85 209 4 -150
3757a50K73Q7l2k67Q1O0K2P7l48J53J34L8j25L9j5Pr5l1R7Q2J39k84j21O7R1k64
$$ -150 123 210 178 -89 -8 52 74 151 -197 -44 90 128 3 42 27 34 -61 -92 5 87 226 -58 -179 -112 -21 -285
3783b85J46L2J89j54p3j25J82P0k3j81K37k4j4j2j20n7J86J20k18J68j62J75l2
$$ -285 -139 -107 82 -72 -145 -270 -88 -18 -41 -222 15 -9 -23 -35 -155 -212 -26 94 -124 44 -118 57 25
3806B5J4j9j62J87q5n7N4J11J82j31o1J4K14j05j53M6k6J11m03J33J61O3J03m19
$$ 25 39 20 -142 45 -40 -97 -43 68 250 119 58 72 286 181 28 74 48 159 -244 -111 50 113 216 -203
3830b03K54M9j46J9o3J98rj52lJ5J96J13l84k04K04J26j55n7n5J10J97k60QK02
$$ -203 51 100 -46 -27 -90 108 99 -53 -56 -41 155 268 -116 -320 -116 10 -145 -202 -257 -147 50 -210 -202 0
3854@n8p3L4m2L2M5J60j52j10K22j76J34j09M9M2J16N9k05K35j56mm8KJ53j45
$$ 0 -58 -131 -97 -139 -107 -62 98 -54 -164 58 -118 16 -93 -44 -2 114 173 -32 203 47 43 -5 -3 150 5
3879EK11j06j33J09J43m04K5K00J08o2K5k33M6K78k92n5J53J48p1k02J45j09r3
$$ 5 216 110 -23 86 229 -175 -150 50 158 96 121 -112 -66 212 -80 -135 18 166 95 -107 38 -71 -164
3902a64J49j76O0K56r3n6j47M1Q4m2mJ08p3K1p0Q1K41k69k24K24J5K8l5J80o5
$$ -164 -15 -191 -131 125 32 -24 -171 -130 -46 -88 -92 16 -57 -36 -106 -25 216 -53 -277 -53 -38 -10 -45 135 70
3927G0J29j75j00J10k4j3j12J43l1J1L02j65j02j15k5J46J86o0j92J11R4k59J42
$$ 70 199 24 -76 34 10 -3 -115 28 -3 8 310 145 43 -72 -97 49 235 175 -17 94 188 -71 71
3950G1M0K3J11j02k70K35Q2k06j40L17j96J50m1PJ39k63O4j28K57j35j45j97M29
$$ 71 111 134 245 143 -127 108 190 -16 -156 161 -35 115 74 81 220 -43 21 -107 150 15 -130 -327 102
3973A02N3j30J51l74K20J8m9j16q1K90k78J15P0j71K09j50l9J42K43j70j01K74
$$ 102 155 25 176 -198 22 40 -9 -125 -206 84 -194 -79 -9 -180 29 -121 -160 -18 225 55 -46 228
3995B28j90p4j34J28K86j78L3k24R2j1K5N5j11n2K67j5N1j66p1O7N0P7k3j12J34
$$ 228 38 -36 -170 -42 244 66 99 -125 -33 -44 -19 36 -75 -127 140 125 176 10 -61 6 56 133 110 -2 132
4020A32r1j21p4J72k5J72l20K20K1l8j19j61K77J16r0M0l15J01N7N3k16Q3J60
$$ 132 41 -80 -154 18 -7 165 -155 65 86 48 -71 -232 45 161 71 111 -204 -103 -46 7 -209 -126 34
4043C4j41k4l3K13l1j12j75J30J36j31j8J5K82k21j47J98R7j70J1J23J38k45K20
$$ 34 -107 -131 -164 49 18 -94 -269 -139 -3 -134 -152 -137 145 -76 -223 -25 72 -98 -87 36 174 -71 149
4066A49m7Q1j80r1K55OJ6n9r5o5K13m7k12J53n2M8j1k10L52k45j44K86j29R9p4
$$ 149 102 183 3 -88 167 173 189 130 35 -30 183 136 -76 77 25 73 62 -148 204 -41 -185 101 -28 71 -3
4091cj78N3L29o7m78K94j78J63n5J26K5j0P2k71M9J8K39l87N7J38lN8o8j8Q0m5
$$ -3 -181 -128 201 134 -344 -50 -228 -65 -120 6 31 21 93 -178 -129 -111 128 -259 -202 -64 -67 -9 -77 -95 -15 -60
4117f0K2KJ66m5p7J71l5l79K29J80m3j77J41j05K84m4k59J90k3K5j42O7j18J47
$$ -60 -38 -36 130 85 8 179 144 -235 -6 174 131 -46 95 -10 274 230 -29 161 138 163 21 88 -30 117
4141A17j97N6k06K37J02l17P9J15K87l07J54j12j8K9J0q9K9J1j92j4K36j21j12
$$ 117 -80 -24 -230 7 109 -208 -129 -14 273 -34 120 8 -10 19 29 -60 -31 -20 -212 -226 10 -111 -223
4164b23K08p9O2n6J0L4q0nJ74j35k7M7J69k14n5J78o5O1o7K19k21K9J47j71J59
$$ -223 -15 -94 -32 -88 -78 -44 -124 -129 45 -90 -117 -70 99 -115 -170 8 -57 4 -63 156 -65 -36 111 -60 99
4189I9K1Mj32J11o5L9p3J13r0L7J18j79K08r5j22M1J04j66m7J78P6o5k18R3J82
$$ 99 120 124 -8 103 38 77 4 117 27 64 182 3 211 116 -6 35 139 -27 -74 104 180 115 -103 -10 172
4214A72n4j81j87K01j7p9KR8o0J99r6o3L2J8j0j27O3k8J06Jj05N6j76L33j65j7
$$ 172 118 -63 -250 -49 -66 -145 -143 -45 -105 94 -2 -65 -33 -15 -25 -152 -89 -117 -11 -10 -115 -59 -235 98 -67 -84
4240h4K33l3o2j63P0j25J36K5M2J1P5j08j05K51j12P3n4o5OJ79K1j68j48J52J8
$$ -84 149 116 54 -109 -39 -164 -28 -3 39 50 125 17 -88 163 51 124 70 5 11 190 211 43 -105 47 65
4265F5R6l3r0J02J23k40k70L06J81j48k32K10p9J86l42q4K35J22j80k10K46j08
$$ 65 161 128 38 140 263 23 -247 59 240 92 -140 70 -9 177 -165 -249 -14 108 -72 -282 -36 -144
4287a44kJ21l72K72L9J69l00K27j85k4K04n2J32k94J37Lk1J09K0j54K21l00R2
$$ -144 -146 -25 -397 -125 -86 83 -217 10 -175 -199 5 -47 85 -209 -72 -69 -90 19 39 -115 106 -194 -102
4310a02K51j25j66j1K00K2j05J01j43J06J52p5j04Q1J33l18J71N5j38N9K3j25
$$ -102 149 24 -142 -153 47 69 -36 65 -78 28 180 105 1 82 215 -103 68 123 -15 44 67 -58
4332e8M6J68l06J43Q8P8o0j93J08J9K66l33k0J54j16Q4j32J19Mj88K33l31n6L41
$$ -58 -12 156 -150 -7 81 159 99 -94 14 33 299 -34 -54 100 -16 68 -64 55 59 -129 104 -227 -283 58
4356E8r5j52K3Q9R5k7j88j5J49k0n6RK69j01j00m1lJ52J2%q0J08r1Q7j07n1J52
$$ 58 -37 -189 -166 -77 18 -9 -197 -212 -63 -83 -139 -130 139 38 -62 -103 -106 46 58 58 -22 86 -5 82 -25 -76 76
4383G6rlj31P3L28k61j43J39LJ78q9L2k25%K47j68%O6j9L8n6k32R6J1oj27QO8
$$ 76 67 64 -67 6 334 73 -70 69 72 250 161 193 -32 -32 215 47 47 113 94 132 76 -156 -60 -49 -55 -182 -174 -106
4411a06m0O3k2Lj26J31Mj98L17rq0k39J39J15M4M2j49l2L00k13PQ5o2j21L8K80
$$ -106 -146 -83 -105 -102 -228 -97 -93 -291 26 17 -63 -302 -163 -48 -4 38 -111 -143 157 -56 -49 36 -26 -147 -109 171
4437A71j34O3j64R0P6O3j45k8n8J15J64K6l35O9J56M5k77J43J9n4l8K3L7Q1N7
$$ 171 37 100 -64 26 102 165 20 -8 -66 49 213 239 -96 -27 129 174 -103 40 59 5 -33 -10 27 108 165
4462A65k40l2K21J51l42QJ23m7J72j31j20J17k1j77K09k92RJ62q8Q9OQo0K2o0
$$ 165 -75 -107 114 265 -77 -69 54 7 179 48 -72 45 24 -153 56 -236 -227 -65 -153 -64 -58 -50 -110 -88 -148
4487a48K08kn5o1k2J78j9k17M9J30k26K48M3k13J15J46m9k60J68J01J5l9J03j13
$$ -148 60 58 3 -58 -80 98 79 -138 -89 41 -185 63 106 -107 8 154 105 -155 13 114 129 90 193 80
4511H0j0j3j66N2K51j81j05N1J38N3j90P4J55j69P8j38M7j2j1j5J94k31J12r2
$$ 80 70 57 -109 -57 194 13 -92 -41 97 150 -40 34 189 20 98 -40 7 -5 -16 -31 163 -68 44 -48
4535d8O3k42L28k10j42J75l4N7L9j00L1K13q1k66J83J16J5k50K9K8k7J24M6K6
$$ -48 15 -227 101 -109 -251 -76 -110 -53 -14 -114 -83 130 49 -217 -34 82 97 -153 -124 -96 -123 1 47 73
4559G3n9k53J88N0L8j16n7L17j06j11J44r8m2J50k6k11K37m6k04K56J03k70k1
$$ 73 14 -239 -51 -1 37 -79 -136 181 75 -36 108 10 -32 118 92 -119 118 72 -132 124 227 -43 -64
4582f4O0J6J63k03J21j17K83l70p8K84K20k54r5j46M7K39j42k01J19L91j77l18
$$ -64 -4 12 175 -28 93 -24 259 -111 -189 95 315 61 -34 -180 -133 106 -36 -237 -118 273 96 -222
4604b22J42J45m8j64K1J15N0p8m1Q9J27j47k76L40j36J21j78p9K0K16k3o3Pk3
$$ -222 -80 65 17 -147 -126 -11 39 -39 -80 9 136 -11 -287 53 -83 38 -140 -219 -199 17 -6 -69 -62 -85
4628h5M5O4J20j93J58k47l1J86j2J28j58J29J53l28K12k6q3M9o1k6K54k03L7m7
$$ -85 -40 24 144 -49 109 -138 -169 17 5 133 -25 104 257 -71 141 115 32 81 20 -6 248 45 82 35
4652C5J36j16j79J54N3l5j3j11P4J32r3j86MK94l30j5l2O1R3Jj19J74m0Qk15L8
$$ 35 171 55 -124 30 83 48 35 -76 -2 130 37 -149 -145 149 -181 -196 -228 -167 -74 -73 -192 -18 -58 -50 -265 -227
4678b27K69n6k44J8K21j38L7O8o2J73q9j20K11p5j42J09pQ2N0j19p5K30M1j19
$$ -227 42 -14 -258 -240 -19 -157 -120 -52 -114 59 -30 -150 61 -14 -156 -47 -54 28 78 -41 -116 114 155 36
4702C6nJ26J31j55P2k47K98j84r8j10L61j77Pj31K78j04Kr9r2J26M4j12mL1o4
$$ 36 31 157 288 133 205 -42 256 72 -26 -136 225 48 55 -76 202 98 100 1 -91 35 79 -33 -37 -6 -70
4727g0q5JJ76j34N6k63K79JJ32l38J20J71j2k84J66J47j92p5j27L40j81K3K1Q
$$ -70 -155 -154 22 -112 -56 -319 -40 -39 93 -245 -125 46 34 -250 -84 63 -129 -204 -331 9 -172 -149 -128 -120
4751a20K65j54m2m6J36n8o1J32j31K20m6o5J5N3M7k38K67k4K6j06j09J8J45k30
$$ -120 145 -9 -51 -97 39 -19 -80 52 -79 141 95 30 45 98 145 -93 174 150 176 70 -39 -21 124 -106
4775a06J45J3J18j15l0K3M9j38j18J26J29p8j13%Q6K4k11n4L03k5Nr1J7N6r8q9
$$ -106 39 52 170 55 25 48 97 -41 -159 -33 96 18 -95 -95 -9 15 -196 -250 53 28 33 -58 -41 15 -83 -172
4801a72P9J09J8k94K79L7j63J9N9j20N1KRK0M31l01Nj23K3J17n8O2j40K15N1l46
$$ -172 -93 16 34 -260 19 56 -107 -88 -29 -149 -98 -96 -87 -67 364 63 68 -55 -32 85 27 89 -51 164 215 -131
4827a31P2J7K15j59m8J39LL6m6j48K38p6k08K67j68j03K31j6j00r5L1k6L3J04
$$ -131 -59 -42 173 14 -34 105 108 144 98 -50 188 112 -96 171 3 -100 131 115 15 -80 -49 -75 -42 62
4851F2q9J65p9l8l33L40Jo7l2N1p5p3J14k10J29K38j26k11L22l7j78J57l2r0L74
$$ 62 -27 138 59 21 -312 28 29 -38 -70 -19 -94 -167 -53 -263 -134 104 -22 -233 89 52 -126 31 -1 -91 283
4876B83l59j68n3K62Q8j9j46J79j64J26k41K41R3J29l18J77j69kJ92%rk8j39j02
$$ 283 -76 -244 -297 -35 53 34 -112 67 -97 29 -212 29 122 251 -67 110 -59 -61 131 131 122 94 -45 -147
4900a47J81J92j91j41J48R8J8k8Jo0p0J85k81J42o1J07Kj38O0j10K70k50j9J03
$$ -147 34 226 35 -106 42 140 158 130 131 71 1 186 -95 47 -14 93 95 -43 17 -93 177 -73 -92 11
4924A1j02K8j8L0j06L6J26j61j00L07j71J39j69j9k2K41r0k23J60J48j25J94j15
$$ 11 -91 -63 -81 -51 -157 -121 5 -156 -256 51 -120 19 -150 -169 -191 50 -40 -263 -103 45 -80 114 -1
4947aN4r4N8%KM4K09k77J11J0rQ0j69Q1J1J05q1k22J89n1j54K36n8j7%j43J12
$$ -1 53 -41 17 17 19 63 272 -5 106 116 107 187 18 99 110 215 134 -88 101 50 -104 132 74 57 57 -86 26
4974B6k1L6p6%K2j99K94m7k7k32J55p8M5m8j00K49o0J00k88P9J79p8qM3j4l9j3
$$ 26 5 41 -35 -35 -13 -212 82 35 8 -224 -69 -147 -102 -150 -250 -1 -61 39 -249 -170 9 -69 -77 -34 -48 -87 -100
5001a00J87j64M5J81j76j07K02n1j02J20j28J89l1j00J08P6r3k12J97J40k32K17
$$ -100 87 -77 -32 149 -27 -134 68 17 -85 35 -93 96 65 -35 73 149 56 -156 41 181 -51 166
5023A66j43O1p6J83k38k23K92m5O3l6p0kK18j18j45K21q3J2j95Q9N7P9p8j47r9
$$ 166 23 84 8 191 -47 -270 22 -23 40 4 -66 -68 150 32 -113 108 25 37 -158 -69 -12 67 -11 -158 -257
5048b57K15Q3k22K96j60j45k6N7RJ14J04m01L50j17K67l75K14n0K68k47k6r2J83
$$ -257 -42 41 -181 115 -45 -190 -216 -159 -150 -36 68 -333 17 -100 167 -208 6 -44 224 -23 -49 -141 42
5071D2k2k0M4o1mp0M1K7M7R8M3k49K51Ok04j23K34nJ56k06j70J87K1l3l05L46
$$ 42 20 0 44 -17 -21 -91 -50 -23 24 122 165 -84 167 173 -31 -154 80 75 231 25 -145 42 63 30 -275 71
5097G1J08j18j1L9j04K02j02k79J32J53j45K9n8j4J58P0l20J84R4n5p0j72m0J11
$$ 71 179 61 50 89 -15 187 85 -194 -62 91 -54 -25 -83 -97 61 131 -189 -5 89 34 -36 -208 -248 -137
5121a37J70J12p2l16K42j59L0q9rK39O5m1k13L18q0k6l9J7J32n7J35k06l0K20
$$ -137 33 145 73 -243 -1 -160 -130 -219 -228 11 76 35 -178 140 60 34 -5 12 144 87 222 16 -14 206
5145B06k39p9O0M8K01j34o6J47N7r9j55K22q7n7k49L91o3j50K5j41L34Mn0j55
$$ 206 -33 -112 -52 -4 197 63 -3 144 201 102 -53 169 82 25 -224 167 104 -46 -21 -162 172 176 126 -29
5169b9J38J6k64J27Q4j51j7O8j83J81K6l0j3L2o3q2J38q9k4PJ65k52J25M6k22
$$ -29 109 125 -139 -12 72 -79 -96 -28 -211 -30 -4 -34 -47 -15 -78 -160 -22 -111 -135 -128 37 -215 -90 -44 -266
5194b66P8J33j10Q2P4P5j05n1J32J20j44J36o7l9J54k22J06mJ2j18M3K10p3Q2
$$ -266 -188 -55 -165 -83 -9 66 -39 -90 42 162 18 154 87 48 202 -20 86 82 94 -24 19 229 156 238
5218B38k21j17J95j57Q0M1m5k2P1Pj12N4k3j47R3J92k30Q9j06J14Q2k41J77j14
$$ 238 17 -100 95 -62 18 59 14 -8 63 70 -42 12 -11 -158 -65 127 -103 -14 -120 -6 76 -165 12 -102
5242a02L4K07k40m9K01q3j45J44QK2j23j16J85L4q2m8J46J43j92P0%J3j17r4K04
$$ -102 -68 139 -101 -150 51 -32 -177 -33 -25 -3 -126 -242 -57 -23 -105 -153 -7 136 -56 14 14 27 -90 -184 20
5267B0q9K79K4lk88J23J02j37J9J03j15l5RJ20OJ75l03J93n4r5m6L5J21k78J17
$$ 20 -69 210 234 231 -57 66 168 31 50 153 38 3 12 132 138 313 10 203 149 54 8 43 164 -114 3
5292Cm6N7j03M2rJ01P6j58k38L00n0r6J55j54J3M8j46jL08kl14Q8P2R3k4j19P0
$$ 3 -43 14 -89 -47 -56 45 121 -37 -275 25 -25 -121 34 -120 -107 -59 -205 -206 102 100 -214 -126 -54 39 15 -104 -34
5319c4J65j02k02m1K83J9k02J80j33P2j69K29n1Np6QJ09L6j54r8K65J32Pj99R9
$$ -34 131 29 -173 -214 69 88 -114 66 -67 5 -164 65 14 19 -57 -49 60 96 -58 -156 109 241 248 49 148
5344A48o4N8k21J34N3%j55J51j19J12K9l6j09J35L0l01K2L39j96%k08J54K8Q7
$$ 148 84 142 -79 55 108 108 -47 104 -15 97 126 90 -19 116 146 -155 -133 206 10 10 -198 -44 -16 71
5368G1o4k30L34j26j81N4R1M1r1n9J15N3n3k19J42P9L6l35P0K47LM4N0r4k1J30
$$ 71 7 -223 111 -15 -196 -142 -51 -10 -101 -160 -45 8 -45 -264 -122 -43 -7 -342 -272 -25 -22 22 72 -22 -43 87
5394H7j30J17J96l85NJ13J4o4J86Qj43J41j43j98K34K27l56K44LM5k12J38p3J61
$$ 87 -43 74 270 -115 -110 3 17 -47 139 147 4 145 2 -196 38 265 -91 153 156 201 -11 127 54 215
5418B15j45m5K1lm5j0r1J90m0k69K70p5r8J27j26j25K47j11o3K9J39l6l6k2k8
$$ 215 70 25 46 43 -2 -12 -103 87 47 -222 48 -27 -125 2 -124 -249 -2 -113 -176 -147 -8 -44 -80 -102 -130
5443a30J07n2k51K39k7P9j6j50J52j19R5j46K52N4L6o1j34J74j46rJ11jk3j1J31
$$ -130 -23 -75 -326 -87 -114 -35 -51 -201 -49 -168 -73 -219 33 87 123 62 -72 102 -44 -53 58 57 34 23 154
5468A54j67K82p0j36n4K10j55MO8l52L96k76J81k38K18J2j83K37j89J25j84J28
$$ 154 -13 269 199 63 9 219 64 68 136 -216 180 -96 85 -153 65 77 -106 131 -58 67 -117 11
5490A1j12Q2jq9P8P3k86R7J67l2j29R9M1l6j1k37L8K82nk15K5K0P0J9J45P6l18
$$ 11 -101 -19 -20 -109 -31 42 -244 -147 20 -12 -141 -42 -1 -37 -48 -285 -247 35 30 -185 -160 -140 -70 -51 94 170 -148
5517a48K26q1j41J98P4j98J42n3K9O4n2J55q6J8j88k2J88J8n6mrm0L0j28J34M3
$$ -148 78 -3 -144 54 128 -70 72 19 48 112 60 215 129 147 -41 -63 125 143 87 83 74 34 64 -64 70 113
5543A13j90K36k76L30k22j92R0J20j4J6j71J63j6r8J73j34J18m1j10M5J27j44
$$ 113 -77 159 -117 213 -9 -201 -111 9 -5 11 -160 3 -13 -111 62 -72 46 5 -105 -60 67 -77
5565g7j35O2O5O1j35R2J19j14k42K46ol4J01mL5nj03J33lj00M6L1r5O6k6J50j28
$$ -77 -212 -150 -85 -24 -159 -67 52 -62 -304 -58 -64 -98 3 -1 34 29 -74 59 56 -44 2 33 -62 4 -22 128 0
5592@P3R6j01J6k10K22J65k25J61k9oo3J7k69K34O5o5q9k5J81k34JJ00j26K94
$$ 0 73 169 68 84 -126 96 261 36 197 168 162 99 116 -153 81 146 81 -8 -33 148 -86 -85 15 -111 183
5617A83pk49P5M8n4l7R5j78j6J13Q0j91J66k1r3J49K4k23N7J17l29J82J50m1l1
$$ 183 176 -73 2 50 -4 -41 54 -124 -140 -27 53 -138 28 7 -86 63 87 -136 -79 38 -291 -109 41 0 -31
5642c1M0j10J05J86j39J5P2l0j33n1K21j76Q1o2R0m8P9j13j10K41J28m11J47K47
$$ -31 9 -101 4 190 51 66 138 108 -25 -76 145 -31 50 -12 78 30 109 -4 -114 127 255 -156 -9 238
5666B38j88k6L7j43N9Q9j99J63J54J06k21r7J2P0J00k8j25n7L6%j33J03j99K23
$$ 238 50 24 61 -82 -23 66 -133 30 184 290 69 -28 -16 54 154 126 1 -56 -20 -20 -153 -50 -249 -26
5690b6q0J28k09J75R7k39J40R3j29Q1k21j7R7K11k45J32L5J07j75k8J11j99K92
$$ -26 -106 22 -187 -12 85 -154 -14 79 -50 31 -190 -207 -110 101 -144 -12 23 130 -45 -73 38 -161 131
5713A31r0j58K52Q7j95N7j00P8n9K40l93J51J35r4J89l79K00n9R9J75j31On3j36
$$ 131 41 -117 135 222 27 84 -16 62 3 243 -150 1 136 42 231 -148 52 -7 92 267 136 142 89 -47
5737d7j7L1P5p6oN8JJ14qk79L0p2K40J40m05J14J9l2M9j3j01J83j43o0J8JJ61
$$ -47 -64 -33 42 -34 -40 18 19 133 125 -154 -124 -196 44 184 -221 -107 -88 -120 -71 -84 -185 -2 -145 -205 -187 -186 -25
5764b5j85J05J14K7J19k56L9M5J04j71L9o6K39q3L5P6R1k43J6N8k02K51q8M2j93
$$ -25 -210 -105 9 36 155 -101 -62 -17 87 -84 -45 -111 128 45 80 156 247 4 20 78 -124 127 39 81 -112
5789a12M42j27r6K0J50k64q9K13j00j97J22o9P9J93j50N4j0j05Jk0J40n4NK5l26
$$ -112 330 203 107 127 277 13 -76 137 37 -160 -38 -107 -28 165 15 69 59 -46 -45 -65 75 21 26 51 -275
5814b75J92j71J78m3n7O3k6L8K0J73o0j63R2j39j28J82K13j52J1j21K53j68N7
$$ -275 -83 -254 -76 -119 -176 -113 -139 -101 -81 92 32 -131 -39 -178 -306 -124 89 -63 -52 -173 80 -88 -31
5837c1o9J57o6R5k8k9j7J68k57m2L36j41l6p5J38nL2j93L1o2K43j34r8J58j14
$$ -31 -100 57 -9 86 58 29 12 180 -77 -119 217 76 40 -35 103 98 130 -63 -32 -94 149 15 -83 75 -39
5862c9J57l7k5J45r0j6j20K7j87P5P6j22Q6N3Lj4k0R2l54L03K7O2j06j27j6J10
$$ -39 118 81 56 201 111 95 -25 2 -185 -110 -34 -156 -70 -17 -14 -28 -48 44 -310 -7 20 82 -24 -151 -167 -57
5888e7K0p8K82j13Pj36P8O5k00J03J06r1rR1J2j40j1N9o5j2J30q4j4qQ1Q8K8l2
$$ -57 -37 -115 167 54 61 -75 3 68 -132 -29 77 -14 -23 68 80 -60 -71 -12 -77 -89 41 -43 -57 -65 16 104 132 100
5916A00M7o3K3Q4j11k10L44j86j0Q6j20R0k40P9J80j25J66l2j82j39K86o4k23
$$ 100 147 84 107 191 80 -130 214 28 18 104 -16 74 -166 -87 93 -32 134 102 -80 -219 67 3 -220
5939b20K61j1j4q1J51l17P1O7P1N8K6N2l1l4k52%J34l6rl4J30J89k60L3o9K23
$$ -220 41 30 16 -65 86 -231 -160 -93 -22 36 62 114 83 49 -203 -203 -69 -105 -114 -148 -18 171 -89 -56 -125 98
5965I8j9j00P9J66j52j32Q8j9M5KJ65j86J16j77M4J47nk31r9L30n1K6M1j58K1
$$ 98 79 -21 58 224 72 -60 28 9 54 56 221 35 151 -26 18 165 160 -71 -170 160 109 135 176 18 39
5990C9K9j86J41J68j89J69j72J5q6Q3r9p8P7Q6m4J00J19m34J26N7k7p8K32j41
$$ 39 68 -118 23 191 2 171 -1 14 -72 11 -88 -166 -89 -3 -47 53 172 -262 -136 -79 -106 -184 48 -93
6014i3k8J46k8k17M1M7J22Nl3p3N0j43K70j7k10K4J0M3J37n0ko2K21j61K3K90
$$ -93 -121 25 -3 -220 -179 -132 -10 -5 -38 -111 -61 -204 66 49 -161 -137 -127 -84 53 3 1 -61 160 -1 22 312
6040C12l42J17K35j71p5J35k75J96K6j54J4M0o3L02n1l30K1N8P1J52l63K37k31
$$ 312 -30 87 322 151 76 211 -64 132 158 4 18 58 -5 297 246 -84 -63 -5 66 218 -145 92 -139
6063a39L4K66l00R9q7K45j33k4n7K11l46L10p4j78K72l68J76r8J13j06Q6J92j85
$$ -139 -105 161 -139 -40 -127 118 -15 -39 -96 115 -231 79 5 -173 99 -269 -93 -191 -78 -184 -98 94 -91
6086i1J2L0M2PM9k61M9J83o4PRp0P3J99o7J28k37R8o0J27J04k27m1O9j88K49j33
$$ -91 -79 -49 -7 0 49 -212 -163 20 -44 -37 -28 -98 -25 174 107 235 -2 96 36 163 267 40 -1 68 -120 129 -4
6113dJ74J5j95j16q4L45q3j05J04j38N4k18K70M5k86K29j15M8Mk0m5J40m6j17
$$ -4 170 185 -10 -126 -210 135 52 -53 51 -87 -33 -251 19 64 -222 7 -108 -60 -56 -76 -121 19 -27 -144
6137a44J65j36P7j22K18p8j00J44j50L0N4J14j60qj06L7K70j78n7K74j99M5K9
$$ -144 21 -115 -38 -160 58 -20 -120 24 -126 -96 -42 72 -88 -96 -202 -165 105 -73 -130 144 -55 -10 19
6160A9j26n7J79J09j02O8J22k48J25KR9k79K37j37o1N8j02M7J06j1m9k2J86k40
$$ 19 -107 -164 15 124 22 90 212 -36 89 91 190 -89 148 11 -50 8 -94 -47 59 48 -1 -23 163 -77
6184g7q9K17o6J0j49J67l7P4J00k32J07M0l2j70J31K3j3j0j98N9K09j45J7K4j95
$$ -77 -166 51 -15 -5 -154 13 -24 50 150 -82 25 65 33 -137 -6 17 4 -6 -204 -145 64 -81 -64 -40 -235
6209b35J69O1o0%K28j26r8M4oNo8L5k1K73k31J22o6k5m6p0J68M1J79j50j2l16
$$ -235 -66 -5 -65 -65 163 37 -61 -17 -23 -18 -86 -51 -72 201 -30 92 26 1 -45 -115 53 94 273 123 111 -205
6235b05J93J85p2j73J75Kr3q5J7l7L66m05J48n6J91j67j45J34L0K03j34L4k18
$$ -205 -12 173 101 -72 103 105 12 -73 -56 -93 273 -132 16 -40 151 -16 -161 -27 3 206 72 106 -112
6258a12P9M0m2m4o4j20L03k5j81J19J8n3L1o3J84m9j72J42j91L75l4l20J73K11
$$ -112 -33 7 -35 -79 -143 -263 40 15 -166 -47 -29 -82 -51 -114 70 21 -151 -9 -200 175 141 -179 -6 205
6282B05k38K69k27OM7j25L0N8K8J50j49j39J87M7K7n8k24L26j7j42l6k24J59N7
$$ 205 -33 236 9 15 62 -63 -33 25 53 203 54 -85 102 149 176 118 -106 220 203 61 25 -199 -40 17
6306A7m3n0J49l5J68k63J68l4l2p0j01J53L5o2j36j02L24Pj47k0r1J79k09O1j52
$$ 17 -26 -76 73 38 206 -57 111 77 45 -25 -126 27 62 0 -136 -238 86 93 -54 -74 -165 14 -195 -134 -286
6331b86J78K87q7k68J34J63j5k43o6N9K24j15p9O8l0J14K2j77K56k30L6LJ12J26
$$ -286 -108 179 92 -176 -42 121 106 -137 -203 -144 80 -35 -114 -46 -76 38 60 -117 139 -91 -55 -52 60 186
6355A86j86nj6K13j52J95j97N7J46k84J8M8J31M4k2m6k58L22l9j60k03J63K1Q
$$ 186 0 -5 -21 192 40 235 38 95 241 -43 -25 23 154 198 176 130 -128 194 155 -5 -208 -45 -24 -16
6379a6M9M2j64l6J62j83qK74lk51JJ76M3j02j5m3Q3j7l7k43O5K65n5J08k32J50
$$ -16 33 75 -89 -125 37 -146 -154 120 117 -134 -133 43 86 -16 -31 -74 9 -8 -45 -288 -223 42 -13 95 -137 13
6405A3j81J30j55J55Q9Ln6R7m3K8j68P4J88J1j87pQ3J5j0O8j24P6Q5n9N6M4k36
$$ 13 -168 -38 -193 -38 51 54 -2 95 52 80 -88 -14 174 185 -2 -9 74 89 79 147 23 99 184 125 181 225 -11
6432a1n9J40j06m3J98J03k28m7J31rq2q2J67j09J30j86j36J08L1K00j65j28J75
$$ -11 -70 70 -36 -79 119 222 -6 -53 78 69 -13 -95 72 -37 93 -93 -229 -121 -90 110 -55 -183 -8
6455hPj42k6J29KQ1k30K93k8j52KK9J6Mo8jJ59k5j13qJ82K9p1%j01N3qj4m5R3
$$ -8 -1 -143 -169 -40 -38 43 -187 106 78 -74 -72 -43 -27 -23 -91 -92 67 42 -71 -79 103 132 61 61 -40 13 5 -9 -54 39
6485C9J22j64J43r5j24Q8Q1l7K5K9j70j10K52p2o8J55K8r3l3K38k28j1J09j69
$$ 39 161 -3 140 45 -79 9 90 53 78 107 -63 -173 79 7 -61 94 122 29 -4 234 6 -5 104 -65
6509f5k6J14r9J51O5j67J2m3j4Q8n2o6k3R7j81J33L0j01R0lR5j21J0M8Q3r0j48
$$ -65 -91 23 -76 75 140 -27 -15 -58 -72 16 -36 -102 -125 -28 -209 -76 -46 -147 -57 -60 35 -86 -76 -28 55 -35 -183
6536a83K71k62PK67l32K27J18p1k3j42K29j68J20Q5L6m3j10P3k8j26J03M7L2K2
$$ -183 88 -174 -167 100 -232 -5 113 42 19 -123 106 -62 58 143 179 136 26 99 71 -55 48 95 127 149
6560A49r6J08l5m3j69J2Q2l7J18k05RK1K36l51K62j0j23J53j28q6l8J45j28K53
$$ 149 53 161 126 83 -86 -74 8 -29 89 -116 -107 -86 150 -201 61 51 -72 81 -47 -133 -171 -26 -154 99
6584I9j2j61N0j31J4J26j70K99k45nL3j11j4J55j4r0K01l5n6O6R0L6j72J27J0
$$ 99 87 -74 -24 -155 -141 -15 -185 114 -131 -136 -103 -214 -228 -73 -87 -177 24 -11 -67 -1 89 125 -47 80 90
6609I0l0j41R2k22J42L1J40o5J44q7J2j29j1J59J15k47K7RK57j83j49J7j59K42
$$ 90 60 -81 11 -211 -69 -38 102 37 181 94 106 -23 -34 125 240 -7 20 29 286 103 -46 -29 -188 54
6633E4k1j75K32k1k5k01R6%o5J49k81J92o8K49j20j31P7j19J24J05j50Q4l5Qj72
$$ 54 33 -142 90 69 44 -157 -61 -61 -126 23 -258 -66 -134 115 -5 -136 -59 -178 -54 51 -99 -15 -50 -42 -214
6658b14K98j71J05j42k1K30j30N0N8j80J95k35K71N1j84J96j16L6j45J66o4j0
$$ -214 84 -87 18 -124 -145 85 -45 5 63 -117 78 -157 114 165 -19 177 61 97 -48 118 54 44
6680D4K3m4O3j6j68m1J02J6oJ66k6k4j66K2R9p2P9q1k31J16M5j8J12j52J78j80
$$ 44 67 23 86 70 -98 -139 -37 -21 -27 139 113 89 -77 -55 44 -28 51 -30 -261 -145 -100 -118 -6 -158 20 -160
6706a60K74k78j22J61K4N0K65l80J67n3M0j54K04j56L78j84k04K16j32Q9k36K86
$$ -160 114 -164 -286 -125 -101 -51 214 -166 1 -52 -12 -166 38 -118 260 76 -128 88 -44 45 -191 95
6728I5j52K11j25M0q1P4m1O2j42R7M3J17k14K37k92r5J5J72R3j35r0l7K68k10
$$ 95 -57 154 29 69 -12 62 21 83 -59 38 81 198 -16 221 -71 -166 -151 21 114 -21 -111 -148 120 -90
6752i0J03k08L88k42O2r2J37M4k1o6n5O2P8k02k4J72j18RM8p4p5L2N9J66j16L3
$$ -90 13 -195 193 -49 13 -79 58 102 81 15 -40 22 100 -102 -126 46 -72 -63 -15 -89 -164 -132 -73 93 -23 10
6778A0j55K44j58m3NL9J89j31P9k19J73j05j2K10o2j71P3J32j14M7j36kR3J46
$$ 10 -145 99 -59 -102 -97 -58 131 0 79 -140 33 -72 -84 126 64 -107 -34 98 -16 31 -105 -107 -14 132
6802A32k01J19j04K5q0J55K0r4K44j43j78J55J29P6j16J37k23M7j75J38o7n0J94
$$ 132 -69 50 -54 -29 -109 46 66 -28 216 73 -105 50 179 255 139 276 53 100 -75 63 -4 -54 140
6825A40k08QJ13J7o2J14j1j34j44K23K8j87O1j2O6lO9r8j85J64k8J40Ok61J88
$$ 140 -68 -60 53 70 8 122 111 -23 -167 56 84 -103 -42 -54 12 9 78 -20 -205 -41 -69 71 77 -184 4
6850Do4L4j00N2o6R4K19k05k76J46Q3J06j31J12J88k53R4p0K16M2k96J38n3r8
$$ 4 -60 -26 -126 -74 -140 -46 173 -32 -308 -162 -79 27 -104 8 196 -57 37 -33 183 225 -71 67 14 -84
6874h4M0j13J12K87k24J25j51J13r7J41j07r6n3J91l27K43L9M0J51l37J81m2N7
$$ -84 -44 -157 -45 242 18 143 -8 105 8 149 42 -54 -107 84 -243 0 39 79 230 -107 74 32 89
6897H9mo4j33l1L9l9P6j86K85q1L3m15K91K47l12J3J47J84l7j77RJ76Mo1q1O2
$$ 89 85 21 -112 -143 -104 -143 -67 -253 32 -49 -16 -431 -140 107 -205 -192 -45 139 102 -75 -66 110 114 53 -28 34
6923C4N2j8N1j87l4J10K58m20L91k48mL8J33j87J69p4l9N9k05J93Q4j78j66L21
$$ 34 86 68 119 -68 -102 8 266 -154 237 -11 -15 23 156 -31 138 64 25 84 -121 72 156 -22 -188 133
6947A33j64l6j46J39N1O9j25K7J30j93J70jj49J31j15n5J25M5j66rJ27O9j85J48
$$ 133 -31 -67 -213 -74 -23 46 -79 -52 78 -115 55 54 -95 36 -79 -134 -9 36 -130 -139 -12 57 -128 20
6971B0R5j75j4R2n2QJ21j78o2K5N1%J65j19JQ3Q2j47N1J08q6M8l2k0m5r2O8N1
$$ 20 115 -60 -74 18 -34 -26 95 -83 -145 -120 -69 -69 96 -23 -22 61 143 -4 47 155 69 117 85 65 20 -72 -4 47
6999D7oJ14r1j09P4j13K37m9j25P2pO3j1j16J04O6j57L0q5P9l5m1j5J02q0K2l1
$$ 47 41 155 64 -45 29 -84 153 104 -21 51 44 107 96 -20 84 150 -7 23 -62 17 -18 -59 -74 28 -52 -30 -61
7026f1P2NJ28j83l5J51k21J84q6M7mK9Qk47J87M0q2J20J17j90nr2P9n9J70k45
$$ -61 11 16 144 -39 -74 77 -144 40 -46 1 -3 26 34 -213 -26 14 -68 52 169 -21 -26 -118 -39 -98 72 -173
7052a73R0J78o2J52j58J33r4j56K29L6j65j95P0J44q4k4Q8q5K21k58J8Q1Qj6j03
$$ -173 -83 95 33 185 27 160 66 -90 139 175 10 -185 -115 29 -55 -79 9 -76 145 -113 -95 -14 -6 -22 -125
7077a25J82N0k96J77r8K38j35j76O9K34j34l3q4k5K39j90j02J53kJ42j28r8M9
$$ -125 57 107 -189 -12 -110 128 -7 -183 -114 120 -14 -47 -131 -156 83 -107 -209 -56 -58 84 -44 -142 -93
7100i3k9K03k18p0J35p0N4K6K38l41J33J76r9J7j02Pmp1N9M4J08l03K11R2J7J7
$$ -93 -122 81 -137 -207 -72 -142 -88 -62 176 -165 -32 144 45 62 -40 -33 -37 -108 -49 -5 103 -200 11 103 120 137
7126A37n2Q6l44L76l35L03j9j64M4m4m3P7L4Qk51K25j12O3J11k00J83q4N4r1J78
$$ 137 85 171 -173 203 -132 171 152 -12 32 -12 -55 22 56 64 -187 38 -74 -11 100 -100 83 -1 53 -38 140
7151A40l09J56r6nJ3M9o5M2P2k29J74K08k22L2M2k5k9N9kj42J65p3l9M9J14j49
$$ 140 -169 -13 -109 -114 -101 -52 -117 -75 -3 -232 -58 150 -72 -40 2 -23 -52 7 5 -137 28 -45 -84 -35 79 -70
7177g0j2J57p0O8l4n8Q1K0n1R2L4k38J25J3l3N4j01jj4K75k63N1J28j85q5Q2K40
$$ -70 -82 75 5 73 39 -19 62 82 31 123 157 -81 44 57 24 78 -23 -24 -38 237 -26 25 153 -32 -117 -35 205
7204B05k34r8L01j56j85K60j87kJ8j15J45J14o9o3O7k2j08L3O6l3m3pM8j5p0J01
$$ 205 -29 -127 174 18 -167 93 -94 -96 -78 -193 -48 66 -3 -66 1 -21 -129 -96 -30 -63 -106 -113 -65 -80 -150 -49
7230d9P0K0j52J12q6J13j19J14r6J23M8J18j40j14J23J4j58J63J5K33l01o5P4
$$ -49 21 41 -111 1 -85 28 -91 23 -73 50 98 216 76 -38 85 99 -59 104 119 352 51 -14 60
7253F0j85K02R3j51l0j12Q6J51q0J25L3j82K16k60R8mk69J40J37p6p0J61J7o7
$$ 60 -125 77 170 19 -11 -123 -37 114 34 159 192 10 226 -34 64 60 -209 -69 68 -8 -78 83 100 33
7277C3p5Lo3J42P9o5K9j94J41J49k38K14m2k44J96m5p3k10L11o2N7Q7j54J13M9
$$ 33 -42 -39 -102 40 119 54 83 -111 30 179 -59 155 113 -131 65 20 -53 -263 48 -14 43 130 -24 89 138
7302A38j04j5Q6p5j5K1O4O8q1r1J75q4j43K58k01k4o9J42j54lO6o5J35r6N5J7
$$ 138 34 19 105 30 15 36 100 168 87 -4 171 87 -56 202 1 -23 -92 50 -104 -107 -41 -106 29 -67 -12 5
7328Er6pJ03M3J9m29L53j20J45j61K46j21j26J89n4l6j02J12j38J39R1q2j15J02
$$ 5 -91 -98 5 48 67 -362 -9 -129 16 -145 101 -20 -146 43 -11 -47 -149 -37 -175 -36 55 -27 -142 -40
7352d0J92j65m8M6n3O3N7j86J53J5o8J29K5k06R5k9rp3J7J77j58n9N4J11O4Qk4
$$ -40 152 -13 -61 -15 -68 -5 52 -134 19 34 -34 95 120 -86 9 -20 -29 -102 -85 92 -66 -125 -71 40 104 112 88
7379H8l0po0K8l6P0J5J00k04J54p1oj86K48j29J02K2l7j6J08j29j4l9j00J55r
$$ 88 58 51 -9 19 -17 53 68 168 -36 118 47 41 -145 103 -26 76 98 61 45 153 24 10 -29 -129 26 17
7405A7m1j47J8K34j25j1P8k00J01k08J38j1P3j27K08o7qJ7r8K27j47M4%PR3k11
$$ 17 -24 -171 -153 81 -44 -55 23 -177 -76 -284 -146 -157 -84 -211 -3 -70 -78 -61 -159 68 -79 -35 -35 -28 65 -146
7431a46J16j8J7N2l8m8j05J46m9O8L9o3J4j85K33QN6k22J73P3j56L9J07o6Q0q8
$$ -146 -30 -48 -31 21 -17 -65 -170 -24 -73 -5 34 -29 -15 -200 33 41 97 -125 48 121 -35 4 111 45 125 37
7457C7j0o9J26q6N7j32J75K8m1Q4k75K01j43P7Jk51J4Q0j56K12L7LM7j20O1o9
$$ 37 27 -42 84 -2 55 -77 98 126 85 169 -106 95 -48 29 30 -221 -207 -127 -283 -71 -34 -31 16 -104 -43 -112
7483a12N5k5J95j14J3J97k92J42j98J36j04K85j55L9J91k21Q5Q7j45LK3K3j76
$$ -112 -57 -82 113 -1 12 209 -83 59 -139 -3 -107 178 23 62 253 32 117 204 59 62 85 108 -68
7506f8m4J63j13J39j14J13%p0O5L2l0j22l4J60J01k23QJ64r0k8R4rj79J23r7m5
$$ -68 -112 51 -62 77 -37 76 76 6 71 103 73 -49 -83 77 178 -45 -37 127 37 9 103 94 -85 38 -59 -104
7532a04J06j36N1K64k95J18m1M3J28n8j82L47j48q5n7n5Q1K7J48q4j70J01j8q6
$$ -104 2 -134 -83 181 -114 4 -37 6 134 76 -106 241 93 8 -49 -104 -23 4 152 68 -102 -1 -19 -105
7556a05j5J79j30J32K6K4O3k75J65N5r3l8j20J15j3N1J03j72J19l0q9K20K1k90
$$ -105 -120 59 -71 61 87 111 174 -101 64 119 26 -12 -132 -17 -30 21 124 -48 71 41 -48 172 193 -97
7580i7J70k3J7j17O4J2K7Om2j60J08RO5m8Q9j29K1n4J1OJ04j77Q6l4O8j05J14
$$ -97 73 50 67 -50 14 26 53 59 17 -143 -35 -26 39 -9 80 -49 -28 -82 -71 -65 39 -138 -52 -86 -18 -123 -9
7607ij9K3n1J51k9j87j25L82j66N3l1n2N0Kr8j23K82k26K80J28J5j23j74J51q2
$$ -9 -28 -5 -56 95 66 -121 -246 136 -30 23 -8 -60 -10 -8 -106 -229 53 -173 107 235 250 127 -47 104 22
7632B2P3j23J6jj25J8J08%OJ26k80J35M3O4j5o0OJn3K6J43p3n9n0j4M5M7J3j47
$$ 22 95 -28 -12 -13 -138 -120 -12 -12 -6 120 -160 -25 18 82 67 7 13 14 -39 -13 130 57 -2 -52 -66 -21 26 39 -108
7661a08J66k24J12%J69j23J55j20q2K7n7J46j36k0L6L4o2p2J01K77j32K3j64j09
$$ -108 58 -166 -54 -54 115 -8 147 27 -55 -28 -85 61 -75 -95 -59 -25 -87 -159 -58 219 87 110 -54 -163
7685a63J14Q9j95K38O1k03J20lj7P1j76J02j12R2j03M1L0M3L4J15k09q8J82J6
$$ -163 -49 40 -155 83 144 -59 61 58 41 112 -64 38 -74 18 -85 -44 -14 29 63 178 -31 -119 63 79
7709G9Q2j21M9j48Q6%l3k5L7J77k37J3K8o3J40N1k19M6j68K31j39K2j10J38R7
$$ 79 161 40 89 -59 27 27 -6 -31 6 183 -54 -41 -13 -76 64 115 -104 -58 -226 5 -134 -112 -222 -84 13
7734A3L6N9k12J75j57Kl6M6oQ9j01J48n6J31j08p4M1M1l6l2J17k40J3L97k25J4
$$ 13 49 108 -104 71 -86 -84 -120 -74 -80 9 -92 56 0 131 23 -51 -10 31 -5 -37 80 -160 -147 250 25 39
7760C9M5O5j63P9N6j89o6J54R9j24M8K3PM6k0j0k5n2L3o9Q4q8j24J70j0o3qQ1
$$ 39 84 149 -14 65 121 -68 -134 20 119 -5 43 66 73 119 99 89 64 12 45 -24 60 -28 -152 18 8 -55 -63 18
7788A8j14J07k29J56J12j7m8o9N0K6m6M7p1J43k5o2r7J9K6R4lp1Q1k03J39m4Q3
$$ 18 -96 11 -218 -62 50 33 -15 -84 -34 -8 -54 -7 -78 65 40 -22 -119 -100 -74 20 17 -54 27 -176 -37 -81 2
7815BO0J0n0J18k66OJ21R8J44j5q7lj45l4LQ5N2o1J45k07P4j58J23k1r1J56n4
$$ 2 62 72 22 140 -126 -120 1 99 243 228 141 138 -7 -41 -38 47 99 38 183 -24 50 -108 15 -6 -97 59 5
7842Em6klJ54j34J2J23mj73l4r3K03q4J3j15J89j47J52n9J16J1p9j07O5k0j48
$$ 5 -41 -43 -46 108 -26 -14 109 105 -68 -102 -195 8 -76 -63 -178 11 -136 16 -43 73 84 5 -102 -37 -57 -205
7868b05K74J44j82k45J96M3o6M2K15k0j63l3j3K5l2K14j79O3j52K72k32nJ02q
$$ -205 69 213 31 -214 -18 25 -41 1 216 196 33 0 -13 12 -20 194 15 78 -74 198 -34 -39 63 55
7892E5J12ml6o9o5J5q0N8r5K16kj58J09P1L8j76J97j45j64M3j8MK7k2kp3R7o2
$$ 55 167 163 127 58 -7 8 -72 -14 -109 107 105 -53 56 127 165 -11 186 41 -123 -80 -98 -94 -67 -89 -91 -164 -67 -129
7920a29Q8l5k6L11j31m7l7n4l1Q1k82L28l5q3j44J77J25o5m6jK6p5J26l4q6R7
$$ -129 -41 -76 -102 209 78 31 -6 -60 -91 -10 -292 36 1 -82 -226 -49 76 11 -35 -36 -10 -85 41 7 -79 18
7946A8N6r9M7K8j32K18p0j8J4k42NL06j08j49J09K19j93k0J1o3Ok1NJ42l1n0K7
$$ 18 74 -25 22 50 -82 136 66 48 62 -180 -175 131 23 -126 -17 202 9 -11 0 -63 -57 -78 -73 69 38 -12 15
7973A5Pj59J41o0K13k36J13P1q8j33J01r3K11r9m2K17l25n4N6J54k9k52J64k4
$$ 15 22 -137 4 -56 157 -79 34 105 17 -116 -15 -108 103 4 -38 179 -146 -200 -144 10 -19 -271 -107 -131
7997a31R0J4J77Q2l75J35o5Q9J29k08J47l3r9M4j39L51m12J53J31j00M4j63J03
$$ -131 -41 -27 150 232 -143 -8 -73 16 145 -63 84 51 -48 -4 -143 208 -204 -51 80 -20 24 -139 -36
8020c6P5j29j42L24k5n5L6m8o6J58k15R1J32l19K80j3l8r4J13P6j06k1J2k12J95
$$ -36 39 -90 -232 92 67 12 48 0 -66 92 -123 -32 100 -219 61 48 10 -84 29 105 -1 -22 -10 -222 -27
8045b7Nlp0Q6K8J09k93J55l1n3K08j46J82r7n6N4p4L5n6Q4n9m2J12J04j7m4M1
$$ -27 -22 -25 -95 -9 19 128 -165 -10 -41 -94 114 -32 150 53 -3 51 -23 12 -44 40 -19 -61 51 155 138 94 135
8072A35l02N26k83j75K0K18m2j72J10j07R6j38K05j14N4K1J42l71P2J0j25K55
$$ 135 -167 359 76 -99 -79 139 97 -75 35 -72 24 -114 91 -23 31 52 194 -177 -105 -95 -220 35
8094C5n2K1j14J27Jn3j2m2J3Q5k2Pj27J56O5Jk10L5k6J20O7j09n4L7J04O0K3p7
$$ 35 -17 4 -110 17 18 -35 -47 -89 -76 9 -13 -6 -133 23 88 89 -121 -86 -112 8 75 -34 -88 -51 53 113 136 59
8122E9J1j59P1J12j84R8J8j37N5J3J10l3j34R5J7N1j16J24kK9M2L2j27J8K49l53
$$ 59 70 -89 -18 94 -90 8 26 -111 -56 -43 67 34 -100 -5 12 63 -53 71 69 98 140 172 45 63 312 -41
8148d1N6r4J03p0O8l5n1J01k1k07K50N1J6k3j01J44k99O0q6K87j15N1p6nq5nK44
$$ -41 15 -79 24 -46 22 -13 -64 37 16 -191 59 110 126 103 2 146 -153 -93 -179 108 -7 44 -32 -37 -122 -127 117
8175A17j47K7j22K01j60R0r5n7J03l7J83Lj60J27p3j72
$$ 117 -30 -3 -125 76 -84 6 -89 -146 -43 -80 103 106 -54 73 0 -172
8191a72
$$ Imaginary data points
##PAGE= N=2
##DATA TABLE= (X++(I..I)), XYDATA
0@%%%%%%%%%j6L2l2L2l2M8o4Q0r6J12j44J76k08K40k73L21l84M48n13N94o89P85
$$ 0 0 0 0 0 0 0 0 0 0 -16 16 -16 16 -16 32 -32 48 -48 64 -80 96 -112 128 -145 176 -208 240 -273 321 -368 417
31D17q92J014j147J295j458J635j832K049k282K540k825L132l467L837m240M677
$$ 417 -475 539 -608 687 -771 864 -968 1081 -1201 1339 -1486 1646 -1821 2016 -2224 2453
47B453n159N686o263O901p605Q382r248J0219j1315J2562j3991J5655j7623J9980
$$ 2453 -2706 2980 -3283 3618 -3987 4395 -4853 5366 -5949 6613 -7378 8277 -9346 10634
61A0634k2871K6524l1293L7809m7298O2443r0433J59009o26448r35775J460262
$$ 10634 -12237 14287 -17006 20803 -26495 35948 -54485 104524 -521924 -1457699 2563
72B563J153863n24834j323294j46627Q48808N68126l12029l76220o1041j59k1459
$$ 2563 1156426 631592 -691702 -838329 10479 578605 266576 -109644 -170685 -170844 -192303
83a92303L67031L84433k98655p65894q7301Q17129O13747n28775r20465L070Q57225
$$ -192303 174728 559161 260506 -505388 -592689 224440 838187 309412 -611053 -607983 249242
94B49242L96969m99857n43371P5263L54115J54958o1356r9466j43147j38301J19795
$$ 249242 646211 146354 -397017 -321754 32361 187319 125963 26497 -116650 -254951 -135156
105a35156L84713J02132m40502l48234L14798M87258p1381m42868j13684K95821
$$ -135156 249557 351689 -88813 -437047 -122249 365009 293628 -149240 -262924 32897
115C2897J63377j77613j02970J58074J2300k64982k6494L69927J43621m01553
$$ 32897 196274 18661 -84309 73765 86065 -178917 -205411 164516 308137 -93416
125i3416l37045K84232M86338p4774n21868j26906M54544K58285l20502k69366
$$ -93416 -430461 -146229 340109 265335 -256533 -383439 71105 329390 8888 -260478
135b60478K33317K53366j91456k55546J93412L40904j50448m61075K3093N30684
$$ -260478 -27161 226205 34749 -220797 -27385 313519 163071 -298004 -274911 255773
145B55773J64429m91067l57532L10441M45258q5109m13617r9605K80473J55832
$$ 255773 420202 -70865 -428397 -117956 327302 242193 -171424 -271029 9444 165276
155A65276j44775r0317R0977p462j27632N8468K27160J2041k78958j53113K43437
$$ 165276 20501 -69816 21161 13699 -113933 -55465 171695 183736 -95222 -248335 -4898
166d898K95530j14857l50730m1944K87133J37392j68073j54366M8864Q8131j9647
$$ -4898 290632 175775 -174955 -216899 70234 207626 39553 -114813 -65949 22182 2535
177B535l0076N7345J4547j30729o6127J68540J45729j38239j94078P2016K03411
$$ 2535 -27541 29804 44351 -86378 -152505 16035 161764 23525 -170553 -98537 104874
188A04874O143j66859m0221J43878N3099j45627o1199J70136R7784j79720j66014
$$ 104874 111017 -55842 -96063 47815 100914 -44713 -105912 64224 162008 -17712 -183726
199a83726J31145K19750l9531k36658o9742J89934J30974j17739j27451O5061
$$ -183726 -52581 167169 127638 -109020 -178762 11172 142146 24407 -103044 -37983
209c7983Q1382n6453l8633R6818O2196j22129j34943J04325K29629j3098k67871
$$ -37983 43399 -13054 -51687 45131 107327 -14802 -149745 -45420 184209 171111 -96760
220i6760j06115K20693J94889j06625k11502k2439J41907Q2298n2128o4923j1991
$$ -96760 -202875 17818 212707 106082 -105420 -127859 14048 96346 44218 -20705 -32696
231c2696k1096n040R4707Q2816j02987j70976K9048K11308R6421j63792j95448
$$ -32696 -53792 -58832 35875 118691 15704 -155272 -126224 85084 181505 17713 -177735
242a77735N9901K26769N6401j68324j19818O5609J07549J9520m3857m4991k9368
$$ -177735 -117834 108935 165336 -2988 -122806 -57197 50352 69872 26015 -18976 -48344
253d8344n244N0015Q1324j4569j41750o6873J39278J42821p4371j72099j5284
$$ -48344 -53588 -3573 77751 63182 -78568 -145441 -6163 136658 62287 -109812 -125096
264a25096J49726R3459q3176j14018K6780R3854N913m4734L582J3249k9487j4803
$$ -125096 24630 118089 34913 -79105 -52325 41529 47442 2708 6290 19539 -9948 -24751
276b4751M5926M3215l8523q3925k67J01489L9984r4567p2333O0037P7718k1097
$$ -24751 21175 64390 25867 -58058 -58325 43164 83148 -11419 -83752 -23715 54003 32906
288C2906o6130n220N3060J6707m5253j1548N3374R681o0838j1688O4402K4552
$$ 32906 -33224 -38444 14616 31323 -13930 -25478 27896 37577 -23261 -34949 29453 54005
300E4005n5043m2418L3063N4073j5294o3648j951N8975L416n5545o541M5915R631
$$ 54005 -1038 -43456 -10393 43680 28386 -35262 -37213 21762 25178 -30367 -36908 9007 18638
313A8638l9098k1084L3151L8854k2905n1397J6641O0543l191n2755m632M2176
$$ 18638 -20460 -41544 -8393 30461 7556 -43841 -27200 33343 30152 -22603 -27235 14941
325A4941J5251k7219k1828J9381K6114k0982l0998K5144L2587l1802l8352K7443
$$ 14941 30192 2973 -18855 526 26640 5658 -25340 -196 32391 589 -37763 -10320
337a0320M1634j4327m5561o814M7710K9914m1385m2253L2830M6417j4934l4828
$$ -10320 31314 16987 -28574 -35388 12322 42236 851 -41402 -8572 37845 22911 -11917
349a1917K163K1481P827j0025r477Q628L718k0035j866L1822N69m3347j3692L7418
$$ -11917 -9754 11727 19554 9529 52 8680 12398 -7637 -9503 22319 22888 -20459 -34151 3267
363C267K7112k2748m2998j172M8743K0705m2554k8047K9754K5305j2036j2343
$$ 3267 30379 7631 -35367 -36539 12204 32909 -9645 -37692 -7938 17367 5331 -7012
375g012L537M887k126l382Q483J2641j5973k6928J6285L5442j0433l7365m763
$$ -7012 -3475 1412 -714 -4096 4387 17028 1055 -25873 -9588 25854 15421 -21944 -26707
388b6707K6570J8676j3133k8628K42L0597O812k2529m255J5026J850n141L979
$$ -26707 -137 18539 5406 -23222 -22980 7617 14429 -8100 -12355 2671 4521 -620 3359
401C359N257n43p823n038J6230J4482k1236k2891J9144K4885j1906k4626k557
$$ 3359 8616 8073 250 -4788 11442 25924 4688 -18203 941 25826 13920 -10706 -13263
414a3263J6479J2693j0634j9851M624J6205l560p284O465r18r389M569J1792K211
$$ -13263 3216 15909 5275 -14576 -9952 6253 2693 -4591 1874 956 -8433 -3864 7928 10139
428A0139p710j2554L15K1671R324k3066j6780J3430J5553j381j1578j0735K397
$$ 10139 2429 -10125 -9810 11861 21185 -1881 -18661 -5231 10322 8941 -2637 -13372 -10975
441a0975J0962n47m972M080m797j2819Q621K0922j283j9018q347J0162K0128O316
$$ -10975 -13 -560 -5532 -1452 -6249 -19068 -10447 10475 9192 -9826 -18173 -8011 12117 18433
455A8433j9183j4610J1326J4220K187k150r711j1877N987J6378L953r164j4510
$$ 18433 -750 -15360 -4034 10186 12373 10223 512 -11365 -5378 11000 14953 5789 -8721
468h721q615J3776K3261l805k4688j0584J0809K0069J1093j4570k4540O87K2521
$$ -8721 -17336 -3560 19701 15896 -8792 -19376 -8567 11502 22595 8025 -16515 -15828 6693
481F693J5711k272k0950k1700J0949L5063P392k9646k5419N695K7290J6909j7206
$$ 6693 22404 20132 -818 -22518 -11569 23494 30886 1240 -24179 -18484 8806 25715 8509
494H509k9328k313J8603J3393L003j0770k2567m867K4327K3430m384k6860k3828
$$ 8509 -20819 -23132 -4529 8864 11867 1097 -21470 -26337 -2010 21420 17036 -9824 -33652
507c3652J4150M3931J3145l9176l5920J2733M1877K1497k6536m2752j000L7300
$$ -33652 -19502 24429 37574 -1602 -37522 -24789 17088 38585 12049 -30703 -31703 5597
519E597K1114j2729k1965j5203L761K5236J8927r633k6402j8349J2393L9942J9212
$$ 5597 26711 13982 -7983 -23186 -19425 5811 24738 15105 -11297 -29646 -17253 22689 41901
532D1901l3781m2540M370M3974L4108j7050n4455k1189M3899M6738j0586m5121
$$ 41901 8120 -34420 -30050 13924 48032 30982 -23473 -44662 -763 45975 35389 -9732
544i732k5770J6773L8174J3764k5560k7363l314J2818K1181J5471j5063l4020
$$ -9732 -35502 -18729 19445 33209 7649 -19714 -23028 -10210 10971 26442 11379 -22641
556b2641j2090K5193L9585J0612m4057m9808J9150O7360K2436m9804n5488O848
$$ -22641 -34731 -9538 30047 40659 -3398 -53206 -34056 33304 55740 5936 -49552 -42704
568d2704N9365L3280l5938m9314J870L2001J7605j254j2762j8544q871J0581K6727
$$ -42704 16661 49941 14003 -35311 -33441 -1440 16165 14911 2149 -16395 -25266 -14685 12042
581A2042K1777k0000n1629r511N8454M8033k8739o6613j9332N6139O0371j9301
$$ 12042 33819 13819 -37810 -47321 11133 59166 30427 -36186 -55518 621 60992 41691
593D1691o9430k0825M4745M0622n008l2928k4290O837K4106J3529p29j2974k5662
$$ 41691 -27739 -48564 -3819 36803 31795 -1133 -25423 -18586 5520 19049 18320 5346 -20316
606b0316r618L1943L6661q922m6380k9907K8246O0689J1716o1595m9953K9974
$$ -20316 -29934 2009 38670 29748 -16632 -46539 -18293 42396 54112 -7483 -57436 -27462
618b7462O4288J5791m8672n1741J1804N6874K1076l6008l4118L099K1425J5521
$$ -27462 36826 52617 3945 -47796 -35992 20882 41958 5950 -28168 -25069 -3644 11877
630A1877L29j1283j1547r848N72K8273K8174k3949n3032l951N6632M3173k9406
$$ 11877 12206 923 -10624 -20472 -19900 8373 36547 12598 -40434 -44385 12247 55420 26014
643B6014o7618j3626O3926M9879l3024n8938n491L9563K8571q656k6716j0633
$$ 26014 -41604 -55230 8696 58575 25551 -33387 -38878 685 29256 20600 -6116 -16749
655a6749P160N057R529J8646n335l8629j8167L5597M7119m076n6902l8078L8978
$$ -16749 -9589 -4532 4997 23643 18308 -20321 -38488 -2891 44228 40152 -16750 -54828 -15850
668a5850O6474m31o1180l6320K6431M8706J4682l3824l7939K961K9017J8371j328
$$ -15850 50624 50193 -10987 -47307 -20876 27830 42512 8688 -29251 -26290 2727 21098 19770
681A9770j7611k4406m593K4835K6689O18l0402l4832R159N1835K6836l7926n2631
$$ 19770 2159 -22247 -26840 -2005 24684 25302 -5100 -39932 -30773 21062 47898 9972 -42659
694d2659o13N2020M1654k3810o0936j4430M7809M0833j3975m1712j9440K0930
$$ -42659 -43272 8748 50402 26592 -34344 -48774 -965 39868 25893 -15819 -35259 -14329
706a4329L1825L583j9894j3789l823M051K0026J8052j4334l3705q325L1797L6330
$$ -14329 17496 21079 1185 -12604 -16427 -12376 7650 25702 11368 -22337 -30662 1135 37465
719C7465r295m8794j9489L9811M0138j3278m0577j4643K4057K9108k986k6333
$$ 37465 28170 -20624 -40113 -302 39836 26558 -14019 -28662 -4605 24503 21517 -4816
731d816j0506J1433Q879J624J931n099j1964l581J0678J5709J817k1284j7873
$$ -4816 -15322 -3889 4990 6614 8545 3446 -8518 -12099 -1421 14288 16105 -5179 -23052
744b3052J4976K6933k96k2735j4628P729K0530Q588j5461j7039K918J3145O200
$$ -23052 -8076 18857 18561 -4174 -18802 -11073 9457 18045 2584 -14455 -11537 1608 7808
757G808k622r069o787M001P309J570N28l021r653k391J3018J0731m984j4246q181
$$ 7808 5186 -3883 -10670 -6669 640 2210 2738 -283 -9936 -12327 691 11422 6438 -7808 -15989
772a5989J0356K0233J405k1105j2054J0871J6828M785j2058j5283K315J5406N188
$$ -15989 -5633 14600 16005 -5100 -17154 -6283 10545 15330 3272 -12011 -9696 5710 10898
785A0898n565n691o179j509J0631J0984m665j4173q074Q559J9081L475k0276j4031
$$ 10898 5333 -358 -6537 -8046 2585 13569 8904 -5269 -13343 -4784 14297 17772 -2504 -16535
799a6535J1358J7406K380j1401j3309M86J4560P418q345q798j714K634P090L879
$$ -16535 -5177 12229 14609 3208 -10101 -9615 4945 12363 4018 -4780 -6494 -3860 3230 7109
813G109o556p406J59L540N776L202p550q858M457Q484J651l104n071l673N500
$$ 7109 553 -6853 -6694 -3154 2622 5824 -1726 -10584 -6127 2357 4008 904 -4167 -7840 -2340
828b340P620j837n655k191j61M617N261l602o614J378K970P93K872o79o403p46
$$ -2340 5280 3443 -2212 -4403 -4564 53 5314 1712 -4902 -3524 -554 239 3111 2432 -3971 -4717
844d717N596K751j97k176n156J048P818J740m977k685m20J712N954N51p324k751
$$ -4717 879 3630 3433 1257 -3899 -2851 4967 6707 1730 -955 -1375 337 6291 6842 -482 -3233
860c233L431K797K500j038p284l043P182M903k797m830m398J450R039J780q667
$$ -3233 198 2995 5495 4457 -2827 -5870 1312 6215 3418 -1412 -5810 -4360 4679 6459 -2208
875b208m225L491L563L361n93p935k948P286N261k894m669m342K070Q595J071
$$ -2208 -6433 -2942 621 3982 3389 -4546 -7494 -208 5053 2159 -2510 -6852 -4782 3813 4884
890D884q592l170L738K877K939j194o973j149P583K705k864k620k228J752O573
$$ 4884 -3708 -6878 -3140 -263 2676 1482 -5491 -6640 943 3648 784 -1836 -4064 -2312 4261
905D261P65o783j727L607K647J802j552o337J068O685m0l833m38n45L04L767j92
$$ 4261 5026 -1757 -3484 123 2770 4572 3020 -3317 -2249 4436 4396 563 125 -420 -116 3651 3459
922C459m339k66J718N09K224m21n434O7N880L52l551j161p31J483M045j614n329
$$ 3459 -880 -1146 572 1081 3305 2884 -2550 -2483 3397 3749 198 -963 -1694 -211 3834 2220 -3109
939c109O57L125j45Nj095l096J165L507j424j977Q21j314K26L893j028m366J245
$$ -3109 -2452 673 528 533 -562 -3658 -2493 1014 -410 -2387 -1566 -2880 -2654 1239 211 -4155 -2910
956b910L121j98k11o64k248K337L289k351k145J649J80oK216j841k475K767J801
$$ -2910 211 13 -198 -862 -3110 -773 2516 165 -1980 -331 -151 -157 2059 218 -2257 510 2311
973B311k388J86Q47j576J206J925j524r16J437q36J89K506j622k718K279J396
$$ 2311 -77 109 956 -620 586 2511 987 71 1508 672 861 3367 1745 -973 1306 2702
989B702j503J58K02k174J173K055j960j153J113j184n48K396n49k543M91M24l0
$$ 2702 1199 1357 1559 -615 558 2613 653 -500 613 -571 -1119 1277 728 -1815 -1324 -900 -930
1006i30K075o30m028R69L592q65j285L48j376k20K858L13j775o74j483P04M515
$$ -930 1145 515 -3513 -2544 1048 183 -1102 -754 -2130 -2350 508 821 -954 -1628 -3111 -2407 2108
1023B108L88n794j566M345K276j54k070l137J147M639M56k570k79q26o23M062
$$ 2108 2496 -3298 -4864 -519 1757 1603 -467 -3604 -2457 2182 2638 68 -211 -1037 -1660 2402
1039B402K791l655l590K48K788M646j69p505k753O330M248k131l376k486r7M538
$$ 2402 5193 1538 -2052 -1804 984 5630 5461 -2044 -4797 1533 5781 3650 274 -2212 -2309 2229
1055B229K387k588k991k303M74N988L688o485o968L309O454J661l486n354p43
$$ 2229 4616 2028 -963 -3266 -2792 3196 6884 399 -6569 -3260 3194 4855 1369 -3985 -4728
1070d728N383K660l363p71p22k764J277N821N85n536m503R82P887N094p782r587
$$ -4728 655 3315 -48 -819 -1541 -4305 -3028 2793 3378 -2158 -6661 -5679 2208 7302 -480 -10067
1086a0067M875R947L19o111l879J570M853J450k701l29J048l253q63P057K796
$$ -10067 -5192 4755 5074 -1037 -4916 -3346 1507 2957 256 -73 975 -2278 -3141 3916 6712
1101F712o463o060K175P750M519o148r665K145R998K724n424m995j256L893O014
$$ 6712 249 -5811 -3636 4114 8633 2485 -7180 -5035 4963 7687 2263 -2732 -3988 -95 5919
1116E919p60n702k422Q68L265M616j404p663j654N460K670L5j967m566k158M429
$$ 5919 5159 -543 -2965 -2097 1168 5784 4380 -3283 -4937 523 3193 3228 1261 -3305 -5463 -1034
1132a034N183J93m731q334N04J2967N905j1867j1320N216J2658L730r254r842
$$ -1034 4149 4342 -389 -8723 -8219 4748 10653 -1214 -12534 -7318 5340 9070 -184 -10026
1146a0026M329J0464n71p189J162L027l471k436M960O247k020j1607m806J4326
$$ -10026 -5697 4767 4196 -2993 -1831 1196 -2275 -4711 249 6496 4476 -7131 -11937 2389
1160B389J3072j1181j7271K728J6868O669j0314j2267K803J2639J877q547j519
$$ 2389 15461 4280 -12991 -10263 6605 13274 2960 -9307 -6504 6135 8012 -535 -2054
1173b054M203j499k681L591M296j493p249m504P226J1133m060j3516k632R793
$$ -2054 2149 650 -2031 1560 5856 4363 -2886 -7390 -164 10969 6909 -6607 -9239 554
1187E54P586j371r505o738O161R638k03o947m897J73O018N748l947p472R85M294
$$ 554 8140 6769 -2736 -9474 -3313 6325 6122 -825 -5722 -5549 469 6217 2270 -5202 -4217 77
1203G7L92P4N28j795k759j802L632Q243m55j3674n736J4167J2479q374j5913j405
$$ 77 469 543 1071 -724 -3483 -5285 -1653 6590 6135 -7539 -13275 892 13371 4997 -10916 -12321
1219a2321J5136J0709j0169j4969M931J4083q28r571l87O415P40o423j878R318
$$ -12321 2815 13524 3355 -11614 -6683 7400 6572 -2999 -3386 3029 3769 -2654 -4532 4786
1233D786N643j1645j1415J0598J6464m744j8004l974J4501J1862p644j5612R08
$$ 4786 10429 -1216 -12631 -2033 14431 9687 -8317 -12291 2210 14072 6428 -9184 -8276
1246h276J3700K744q292l233L102J241j243k6K158J523m903n214N290Q155k769
$$ -8276 5424 8168 -124 -3357 -255 986 -257 -283 1875 3398 -1505 -6719 -1429 6726 3957
1261C957q538k128M653O048J017o518n689K812O122K591k328o561l531P251P987
$$ 3957 -4581 -6709 -2056 3992 5009 -1509 -7198 -4386 1736 4327 1999 -4562 -8093 -842 7145
1276G145m055q659l6O176L416k704m257J905L450l457l123O677N079q094q780
$$ 7145 3090 -5569 -5605 571 3987 1283 -2974 -1069 2381 -1076 -4199 2478 7557 -537 -9317
1291i317N893J2338N57j3110p955J0640J3470n780j4463Q71J1742K556p421m044
$$ -9317 -3424 8914 9471 -3639 -11594 -954 12516 6736 -7727 -6856 4886 7442 21 -4023
1305d023M774M270m528n526O261P437p291r969M857J1625k01j1189n759Q056R612
$$ -4023 751 5021 493 -5033 1228 8665 1374 -8595 -3738 7887 7686 -3503 -9262 -1206 8406
1320H406m146j0609O66Q258L44m525J7J671q07j881P73L742J198o045l273O032
$$ 8406 4260 -6349 -5683 2575 2919 -1606 -1589 82 -725 -2606 -1833 1909 3107 -2938 -6211 -179
1336a79N055m500m796J682L202P23j412j360J180J70k047J738M591k498o636J598
$$ -179 4876 376 -4420 -2738 464 1187 -225 -1585 -405 -235 -2282 -544 4047 1549 -5087 -3489
1352c489P525J141o052m043L930O016j301o615N13O413q88n686J528N361j184
$$ -3489 4036 5177 -875 -4918 -988 5028 3727 -2888 -2375 4038 3150 -2536 -1008 4353 3169
1367C169n524r88N618M593n329q072M275Q949k151q309k44O033K127m317l474
$$ 3169 -2355 -3343 2275 6868 1539 -6533 -2258 6691 4540 -3769 -4013 2020 4147 -170 -3644
1382c644L192M267l658n083M285O034m764o508K784O571Q9o353l585N647N540
$$ -3644 -452 3815 157 -4926 -641 5393 629 -5879 -3095 3476 3565 -2788 -6373 -726 4814
1397D814m607o030L787N271l180l698K161L485q70m322o74N919K486o352l753
$$ 4814 207 -5823 -2036 3235 55 -3643 -1482 2003 1133 -3189 -3863 2056 4542 -1810 -5563
1412e563O365M223m123m524K119M115L33l989j446M487J657n156r55N548Q83n224
$$ -5563 802 5025 902 -3622 -1503 2612 2945 -1044 -2490 1997 3654 -1502 -2457 3091 3974 -1250
1428a250j304L628L177k293m656N76N866M9n998k08N250K6m163l72K919J099k297
$$ -1250 -2554 1074 4251 1958 -2698 -2122 3744 3793 -2205 -2413 2837 2863 -1300 -1672 1247 2346 49
1445D9l412K231N139k960n747K350N773j725m728n28L865K224l265l948L363M853
$$ 49 -3363 -1132 4007 1047 -4700 -2350 3423 1698 -3030 -3558 307 2531 -734 -4682 -1319 3534
1461C534l426n042L382M763k327m386N36M191J764m102l563M422M589m241m332
$$ 3534 108 -4934 -1552 3211 884 -3502 -2966 1225 2989 -1113 -4676 -254 4335 94 -4238
1476d238L557L837j895l462L58L619J529m070k498M599L115m492k806L598K579
$$ -4238 -681 3156 1261 -2201 -1843 1776 3305 -765 -3263 1336 4451 -41 -2847 751 3330
1491C330j812k745J88L362Q42m124j205M469J315m814r70L702J258k658k154J051
$$ 3330 1518 -1227 -1039 2323 3165 -959 -2164 2305 3620 -1194 -2164 1538 2796 138 -2016 -965
1507i65L330n10m420K04M678m22m437J79L600J53k460j428J590K933j539m027
$$ -965 2365 1855 -2565 -2361 2317 1895 -2542 -2363 1237 1390 -1070 -2498 -908 2025 486 -3541
1523c541J756M110j524l992J256K810J28k287j314K119K840k256l597K799L359
$$ -3541 -1785 2325 801 -3191 -1935 875 1003 -1284 -2598 -479 2361 105 -3492 -693 2666
1538B666j941l403J312L152j2k500j392K759K279k578l033L349K702k762k158
$$ 2666 725 -2678 -1366 1786 1774 -726 -2118 641 2920 342 -2691 658 3360 598 -1560
1553a560J704K201n26k403q86K971J840l336k295L041J972k266j775J227J706
$$ -1560 144 2345 1819 -584 -1470 1501 3341 5 -2290 751 2723 457 -1318 -91 1615
1568A615j31k257o60K460Q94l161p31K914P70k865r48J810J207l01k355o45L065
$$ 1615 1484 -773 -1433 1027 1921 -1240 -1971 943 1713 -1152 -2100 -290 917 616 -1739 -2384 681
1585F81N48k908k60K051J21j555K92Q20J18m48r49P64K033j041k378J110K653
$$ 681 1229 -1679 -1939 112 233 -1322 -1030 -210 -92 -540 -1489 -725 1308 267 -2111 -1001 1652
1602A652r06j671k5J008J029l26j487N20J721j101j486J697J392j771j242J066
$$ 1652 746 -925 -950 58 1087 761 -726 -206 1515 414 -1072 625 2017 246 -996 70
1618G0J392L66j646j663J846K396j869j939J092J317o51m78p6J89J48m19p61J477
$$ 70 1462 1828 182 -1481 365 2761 892 -1047 45 1362 711 233 157 346 494 75 -686 791
1636G91P68k403r87J978R61j165o23n64M43J523m00j843O86R26q62R3J064j049
$$ 791 1559 -844 -1831 147 1108 -57 -680 -1244 -801 722 322 -1521 -835 91 -771 -678 386 -663
1654f63q70R20M00K36J76j566k78K006L95j403j66O08l75M47R66p49m09K14j73
$$ -663 -1533 -613 -213 23 199 -1367 -1645 361 756 -647 -813 -205 -580 -133 833 84 -325 -111 -284
1673b84P23J336j346j709J339J281Q8o04j084m63J744J056j742q69J161j58n2
$$ -284 439 1775 429 -1280 59 1340 1428 824 -260 -723 1021 2077 335 -534 627 469 417
1690D17O14p79m69M72N3l09P53l0j610R6J269N4k48m97j483J014K154p77k192
$$ 417 1031 252 -217 255 308 -1 752 722 -888 -792 477 531 283 -214 -1697 -683 1471 694 -1498
1709a498j35J222Q05J68j372j349J575J332j251l43O31m15l08N93J57L25N7j394
$$ -1498 -1633 -411 394 562 -810 -2159 -584 748 -503 -846 -215 -630 -938 -345 -188 137 194 -1200
1727a200m19K340J252k485q39O72J184J383j352k168O63K744q6j764j63P7P15
$$ -1200 -1619 721 1973 -512 -1351 -679 505 1888 536 -1632 -969 1775 1689 -75 -238 -161 554
1744E54R26q07j009Q36M62j173K77J402m08j145p31M90J817Q43k877k198K730
$$ 554 1480 673 -336 500 962 -211 66 1468 1060 -85 -816 -326 1491 2334 -543 -2741 -11
1761a1K511j044k668p97J626K278p19l258J44K643l4j601q4P98M20p47j190R06
$$ -11 2500 1456 -1212 -2009 -383 1895 1176 -2082 -1938 705 671 -930 -1014 -216 204 -543 -1733 -827
1779h27K498r51l588L00L748J035k812k254R38L369R07l404j915K896J785j199
$$ -827 1671 720 -2868 -2568 1180 2215 -597 -2851 -1913 1456 2363 -1041 -2956 -60 1725 526
1795E26j436K12R44P14q39j213J732J185j955j210J714J586o30j661j146J527
$$ 526 -910 -698 246 960 121 -1092 640 1825 -130 -1340 374 1960 1330 -331 -1477 50
1811E0K747q91l003l84K385J096q87j543q78J905J535j722j650J216R40o90o24
$$ 50 2797 1906 -1097 -1481 904 2000 1113 -430 -1308 597 2132 410 -1240 -24 916 226 -398
1828c98k28R43P70j754j613K113K423j763l099O52K892J088k175k849R50L982
$$ -398 -626 317 1087 -667 -2280 -167 2256 493 -2606 -1954 938 2026 -149 -2998 -2048 1934
1844A934m5l779o21K655J142j351j590N65K252l05k662K59L148K6k832r11K199
$$ 1934 1889 -1890 -2511 144 1286 -65 -1655 -1090 1162 857 -1805 -1546 1602 1628 -1204 -2115 84
1861H4K162j027k821k70L182J433k686j633J637J303l39r58l36M47P99n18p14
$$ 84 2246 1219 -1602 -1872 1310 2743 57 -1576 61 1364 1025 67 -269 178 977 459 -255
1878b55J070K95j340k4R29J25j65m53r61M38J399o7j313n47L99O93R28j141j613
$$ -255 815 1110 -230 -254 675 800 635 182 -779 -341 1058 991 -322 -869 -470 223 1151 10 -1603
1897a603M42J892j26j218n95N27R76p2j274j35J792l03j871L44K140l46j578q31
$$ -1603 -1161 731 605 -613 -1208 -681 295 223 -1051 -1186 606 303 -1568 -1224 916 570 -1008 -1839
1915a839J269K124n55k861N7K882O36k272q10J423J141k51j690j35K137m4j980
$$ -1839 -570 1554 999 -1862 -1805 1077 1713 -559 -1369 54 1195 944 -746 -881 1256 1212 -768
1932g68P6K261J02k038q79J610J506n19k280j28K572K71k124l87J467P9p77m6
$$ -768 -692 1569 1671 -367 -1246 364 1870 1351 -929 -1057 1515 1786 -338 -725 742 821 44 -2
1950bQ3M21k37j097M87J420q72j404O49J108m68n75j89K38N87k18q56N03O10r75
$$ -2 81 502 265 -832 -345 1075 203 -1201 -552 556 88 -487 -676 -438 149 -69 -925 -422 188 -787
1970g87l93J322O46j748l96P58R56J25j215p45J667Q00j473m79J540P3j240OP58
$$ -787 -1180 142 788 -960 -1356 -598 358 483 -732 -1477 190 990 -483 -962 578 651 -589 -583 175
1989A75R64o64j430L49K028k02k039j86K165M02j220q51O11J282m02j553r9K107
$$ 175 1139 475 -955 -606 1422 1220 -819 -1005 1160 1562 342 -509 102 1384 982 -571 -670 1437
2007A437j84k099J88J583K92j300p70N18J513l01k029Q5K113k33j575J1R66P2
$$ 1437 1253 -846 -658 925 1217 -83 -853 -335 1178 877 -1152 -1067 1046 813 -762 -751 215 287
2025B87o49o56P76Q84q73j284Q09J489r24j214Q86O27j78k80n57N59P01m46q52
$$ 287 -362 -1018 -242 642 -231 -1515 -706 783 -141 -1355 -469 158 -20 -300 -857 -298 403 -43 -895
2044h95Q91P01q50p43J099N39m32o33L5R40L88j452m62J635M43j440j91R44M05
$$ -895 -4 697 -153 -896 203 742 310 -323 -288 652 1040 -412 -874 761 1204 -236 -427 517 922
2063I22m61p50J18J368l6j699k05J782L03j696k53R76N91m78j013j11J594k5j881
$$ 922 461 -289 -171 1197 1161 -538 -743 1039 1342 -354 -607 369 960 482 -531 -642 952 927 -954
2082i54K0J601k01j074k06R95K98n77j191K29J791m82j493L18J275n29o68L1Q24
$$ -954 -934 667 466 -608 -814 181 479 -98 -1289 -1060 731 249 -1244 -926 349 -180 -848 -817 7
2101GK75m59r80P95J097p13j182Q62J023o47o71K25O84M48q01o82R74R65j143
$$ 7 282 -177 -1157 -362 735 22 -1160 -298 725 78 -593 -368 316 764 -37 -719 255 1220 77
2120G7p74R50Q88p50p00L94O66M52j133n80J113P63j332n08J019N07p73n15K32
$$ 77 -697 253 1141 391 -309 85 751 1203 70 -510 603 1366 34 -474 545 1052 279 -236 -4
2139dO33j57r52j58J340Jj352q2J281J08r06m28J92Q08j30j133J71J262l58j336
$$ -4 629 472 -480 -638 702 703 -649 -731 550 658 -248 -676 -484 324 194 -939 -768 494 136 -1200
2159a200K74J337k32q16k86R06N50m46j304M31J759l81j585K81J321p6r58l87
$$ -1200 -926 411 179 -637 -923 -17 533 87 -1217 -786 973 592 -993 -712 609 533 -425 -812
2177h12R40P49o46j346Q21J550q86j049M15J165M8r97n06O51J076o32j090N55
$$ -812 128 877 231 -1115 -294 1256 370 -679 -264 901 949 -48 -554 97 1173 541 -549 6
2195FJ037l98j055M84M95j71m80j58N30O68j059p75R55O70q21m86N66K32j29p03
$$ 6 1043 645 -410 74 569 398 -82 -240 290 958 -101 -876 79 749 -72 -558 8 240 111 -592
2215e92J2N31L38j233R8J536l57j414k6J120J73n50p48L19J117N0j066j33J262
$$ -592 -580 -49 289 -944 -846 690 333 -1081 -1107 13 186 -364 -1112 -793 324 374 -692 -825 437
2234D37J8j191MR45M46p66o02K12J510l17j606K89J706j19j179j47N84O21k68
$$ 437 455 -736 -732 213 659 -107 -709 -497 1013 696 -910 -621 1085 966 -213 -360 224 845 577
2253E77p50J08J046k41j113N16R59n50o90K0N75J99k09j085L46J105m01r51N83
$$ 577 -173 -65 981 740 -373 143 1102 552 -138 -118 457 656 447 -638 -292 813 412 -539 44
2272D4K93l22j04L2K65k48m28k65J014J1r45l91J159M93j006l54K57N64J98p19
$$ 44 337 15 -89 -57 208 -40 -468 -733 281 292 -653 -1044 115 608 -398 -752 -495 69 267 -452
2292d52l36R16L58j342K2J207J37q82l17L64P68L94j223n02J258Q09j359j16M85
$$ -452 -788 128 486 -856 -834 373 510 -372 -689 -325 443 837 -386 -888 370 1179 -180 -296 189
2311A89K27j78r4j93M68L27q53m9R39R9q70q9L40o6M04k73p97K92N01k06n5k53
$$ 189 416 238 144 -49 419 746 -107 -156 783 882 12 -77 263 197 601 328 -469 -177 324 118 63 -190
2333a90j74J54O55q8p32J05J82Op9j63l69O14K97p78k4P54j03o90K04L28L23k08
$$ -190 -364 -210 445 357 -375 -270 -88 -82 -161 -324 -693 -79 218 -560 -584 170 67 -623 -419 -91 232 24
2355B4q92j45J338N15j497k38P79O34j42n94n68P05R29r02m13N65M62m19l72L87
$$ 24 -868 -1013 325 840 -657 -895 -116 518 376 -218 -786 -81 848 -54 -467 98 560 141 -231 156
2375A56L19J99n88o55O00J152p05r91L58P23J89l45p51o3J106K69j006m65R01
$$ 156 475 674 86 -569 31 1183 478 -513 -155 568 757 412 -339 -402 704 973 -33 -498 403
2394D03L3m86O4m18P26K64o11n10Q61K43o38p06K14Q84J96p60j083P29J364p54
$$ 403 436 -50 14 -404 322 586 -25 -535 326 569 -69 -775 -561 323 519 -241 -1324 -595 769 15
2414A5q81L41M42K48k87n78K56O25j97o34L16O35j92n91K55L45K01Ro02l24Q84
$$ 15 -866 -525 -83 165 -122 -700 -444 181 -16 -650 -334 301 109 -482 -227 118 319 328 -274 -598 286
2435B86M21n91k68N8L30K93j08o04M6O52R8n01p1J84K64J07p01rO50M1j021J81
$$ 286 707 116 -152 -94 236 529 421 -183 -137 515 613 112 41 225 489 596 -105 -114 536 577 -444 -263
2457b63Q52l3m24p00M9J028J31j044m00R02N91q41n56K42Q57K46r95m84P68O34
$$ -263 589 556 132 -568 -519 509 640 -404 -804 98 689 -152 -708 -466 391 637 -358 -842 -74 560
2477E60j051o42J049N53k70q63l5Q18L72p86q11R29Q12l97q94L76K54K82j17m26
$$ 560 -491 -1133 -84 469 199 -664 -699 119 491 -295 -1106 -177 635 238 -656 -280 -26 256 139 -287
2497b87L16L61l56l94N46M06l39j49K60k72M03j68j64N9K70l32J23J87m55l21
$$ -287 29 390 34 -360 186 592 253 104 364 92 495 327 163 222 492 160 283 470 15 -306
2517c06O64R6m57j40K03K35O5n72k85M00P02r09m73R01K66o36l30K77L33O4o67
$$ -306 358 454 -3 -143 60 295 360 -212 -497 -97 605 -304 -777 124 390 -246 -576 -299 34 98 -569
2538e69l75Q74P59j147l61N83O43k44q75j75J055N48r56o50Q91O86p71n57N96
$$ -569 -944 -70 689 -458 -819 -236 407 163 -712 -887 168 716 -240 -890 1 687 -84 -641 -45
2557d5M51L0o61k32Q45L25o26n06N05O61n74l31J67K14M49m62j31L43R8n92p0
$$ -45 406 436 -225 -457 388 713 87 -419 86 747 173 -158 9 223 672 210 79 422 520 -72 -142
2578a42O38k73l70K97Pq6J51l15o6N02k62n94M86N19n63m72L00N23l17k04m15
$$ -142 496 223 -147 150 157 71 222 -93 -159 343 81 -513 -27 492 -71 -543 -243 280 -37 -241 -656
2599f56N02N38n51o98Q39O07p06o45N48O45k9p76m14R71L24p13p19P72Q49q01
$$ -656 -154 384 -167 -865 -26 581 -125 -770 -222 423 394 -382 -796 175 499 -214 -933 -161 688 -113
2619a13l33J27N55M96q47n01O73R24r43m56O97K40k63k58j39M87L74o89k16M52
$$ -113 -446 -319 236 732 -115 -616 57 981 38 -418 279 519 256 -2 -141 346 720 31 -185 267
2639B67L51n66k20M39J40k69l6o6K12k8l39j36P19k60o97K67N13l43k35K1L04
$$ 267 618 52 -168 271 411 142 106 40 252 224 -115 -251 468 208 -489 -222 291 -52 -287 -266 38
2660C8K08l29m07K55N33l94n96N06L80l9n77r2N32L26n16o53P77P09o58p42M57
$$ 38 246 -83 -490 -235 298 -96 -692 -186 194 155 -422 -514 18 344 -172 -825 -48 661 3 -739 -282
$$ [...]
8191a05
##END NTUPLES=NMR FID
##END=
