##TITLE=1H ikalashn
1D
17.10.2024
##JCAMPDX= 6.0         $$ Bruker NMR JCAMP-DX V2.0
##DATA TYPE= NMR FID
##DATA CLASS= NTUPLES
##ORIGIN= UXNMR, Bruker Analytische Messtechnik GmbH
##OWNER= root
$$ TOPSPIN		Version 1.3
$$ 2024-10-17 11:08:44.687 +0400  Irina@DPX200
$$ Compression mode = diff/dup
##.OBSERVE FREQUENCY= 200.131392401
##.OBSERVE NUCLEUS= ^1H
##.DELAY= (6, 6)
##.ACQUISITION MODE= SIMULTANEOUS
##.ACQUISITION SCHEME= undefined
##.AVERAGES= 16
##.DIGITISER RES= 18
##SPECTROMETER/DATA SYSTEM= spect
##.PULSE SEQUENCE= zg
##.SOLVENT NAME= CDCl3
##.SHIFT REFERENCE= INTERNAL, CDCl3, 1, 17.95386
##AUDIT TRAIL= $$ (NUMBER, WHEN, WHO, WHERE, WHAT)
$$ ##TITLE= Audit trail, TOPSPIN		Version 1.3
$$ ##JCAMPDX= 5.01
$$ ##ORIGIN= Bruker BioSpin GmbH
$$ ##OWNER= Irina
$$ $$ F:/spectra/data/iren/nmr/1H/4/audita.txt
$$ ##AUDIT TRAIL=  $$ (NUMBER, WHEN, WHO, WHERE, VERSION, WHAT)
(   1,<2024-10-17 11:07:47.734 +0400>,<Irina>,<DPX200>,<TOPSPIN 1.3>,
      <created by zg
	started at 2024-10-17 11:06:39.734 +0400,
	POWCHK disabled, PULCHK disabled
       configuration hash MD5:
       BE 6D 3F 07 2A EA 11 49 91 17 2B D3 AF B3 58 0D
       data hash MD5: 16K
       12 D2 04 AD B6 B3 9F 9C 3F 6B CC C5 65 BE D7 78>)
$$ ##END=
$$ 
$$ $$ hash MD5
$$ $$ B4 91 CF 38 DF 3D A6 08 78 35 C1 4F D4 A9 01 BC
##$RELAX= 
##$RELAX= 
##$RELAX= 
##$RELAX= 
##$RELAX= 
##$RELAX= 
##$RELAX= 
##$RELAX= 
##$RELAX= 
$$ Bruker specific parameters
$$ --------------------------
##$DU= <F:/spectra>
##$EXPNO= 4
##$NAME= <1H>
##$PROCNO= 1
##$TYPE= <nmr>
##$USER= <iren>
##$AMP= (0..31)
100 100 100 100 100 100 100 100 100 100 100 100 100 100 100 100 100 100 
100 100 100 100 100 100 100 100 100 100 100 100 100 100 
##$ANAVPT= -1
##$AQSEQ= 0
##$AQ_mod= 1
##$AUNM= <au_zg>
##$AUTOPOS= <>
##$BF1= 200.13
##$BF2= 200.13
##$BF3= 200.13
##$BF4= 200.13
##$BF5= 200.13
##$BF6= 200.13
##$BF7= 200.13
##$BF8= 200.13
##$BYTORDA= 1
##$CFDGTYP= 0
##$CFRGTYP= 5
##$CHEMSTR= <none>
##$CNST= (0..63)
1 1 145 1 1 1 1 1 1 1 1 1 1 1 1 1 1 1 1 1 1 1 1 1 1 1 1 1 1 1 1 1 1 1 
1 1 1 1 1 1 1 1 1 1 1 1 1 1 1 1 1 1 1 1 1 1 1 1 1 1 1 1 1 1 
##$CPDPRG= <>
##$CPDPRG1= <>
##$CPDPRG2= <>
##$CPDPRG3= <>
##$CPDPRG4= <mlev>
##$CPDPRG5= <mlev>
##$CPDPRG6= <mlev>
##$CPDPRG7= <mlev>
##$CPDPRG8= <mlev>
##$CPDPRGB= <>
##$CPDPRGT= <>
##$D= (0..63)
0 2 0 0 0 0 0 0 0 0.06 0 0.03 0 0 0 0 0.0002 0 0 0 0 0 0 0 0 0 0 0 0 0 
0 0 0 0 0 0 0 0 0 0 0 0 0 0 0 0 0 0 0 0 0 0 0 0 0 0 0 0 0 0 0 0 0 0 
##$DATE= 1729148864
##$DBL= (0..7)
120 120 120 120 120 120 120 120 
##$DBP= (0..7)
150 150 150 150 150 150 150 150 
##$DBP07= 0
##$DBPNAM0= <>
##$DBPNAM1= <>
##$DBPNAM2= <>
##$DBPNAM3= <>
##$DBPNAM4= <>
##$DBPNAM5= <>
##$DBPNAM6= <>
##$DBPNAM7= <>
##$DBPOAL= (0..7)
0.5 0.5 0.5 0.5 0.5 0.5 0.5 0.5 
##$DBPOFFS= (0..7)
0 0 0 0 0 0 0 0 
##$DE= 6
##$DECBNUC= <off>
##$DECIM= 32
##$DECNUC= <off>
##$DECSTAT= 4
##$DIGMOD= 1
##$DIGTYP= 9
##$DL= (0..7)
0 120 120 120 120 120 120 120 
##$DP= (0..7)
150 150 150 150 150 150 150 150 
##$DP07= 0
##$DPNAME0= <>
$$ [...]
##$SW= 21.9925939549014
##$SWIBOX= (0..15)
0 0 2 0 0 0 0 0 0 0 0 0 0 0 0 0 
##$SW_h= 4401.40845070422
##$TD= 16384
##$TD0= 1
##$TE= 300
##$TE2= 300
##$TE3= 300
##$TEG= 300
##$TL= (0..7)
0 120 120 120 120 120 120 120 
##$TP= (0..7)
150 150 150 150 150 150 150 150 
##$TP07= 0
##$TPNAME0= <>
##$TPNAME1= <>
##$TPNAME2= <>
##$TPNAME3= <>
##$TPNAME4= <>
##$TPNAME5= <>
##$TPNAME6= <>
##$TPNAME7= <>
##$TPOAL= (0..7)
0.5 0.5 0.5 0.5 0.5 0.5 0.5 0.5 
##$TPOFFS= (0..7)
0 0 0 0 0 0 0 0 
##$TUNHIN= 0
##$TUNHOUT= 0
##$TUNXOUT= 0
##$USERA1= <user>
##$USERA2= <user>
##$USERA3= <user>
##$USERA4= <user>
##$USERA5= <user>
##$V9= 5
##$VALIST= <valist>
##$VCLIST= <CCCCCCCCCCCCCCC>
##$VD= 0
##$VDLIST= <DDDDDDDDDDDDDDD>
##$VPLIST= <PPPPPPPPPPPPPPP>
##$VTLIST= <TTTTTTTTTTTTTTT>
##$WBST= 1024
##$WBSW= 25
##$XGAIN= (0..3)
0 0 0 0 
##$XL= 0
##$YL= 0
##$YMAX_a= 833169
##$YMIN_a= -996364
##$ZGOPTNS= <>
##$ZL1= 120
##$ZL2= 120
##$ZL3= 120
##$ZL4= 120
##$ABSF1= 10
##$ABSF2= 0
##$ABSG= 5
##$ABSL= 3
##$ALPHA= 0
##$AQORDER= 0
##$ASSFAC= 0
##$ASSFACI= 0
##$ASSFACX= 0
##$ASSWID= 0
##$AUNMP= <proc_1d>
##$AXLEFT= 0
##$AXRIGHT= 0
##$AXTYPE= 0
##$AXUNIT= <>
##$AZFE= 0.1
##$AZFW= 0.1
##$BCFW= 1
##$BC_mod= 2
##$BYTORDP= 1
##$COROFFS= 0
##$CY= 7568.61572265625
##$DATMOD= 1
##$DC= 2
##$DFILT= <>
##$DTYPP= 0
##$F1P= 17.9538593292236
##$F2P= -4.03888763876832
##$FCOR= 0.5
##$FTSIZE= 32768
##$FT_mod= 4
##$GAMMA= 1
##$GB= 1
##$INTBC= 1
##$INTSCL= 1
##$ISEN= 128
##$LB= 0.01
##$LEV0= 0
##$LPBIN= 0
##$MAXI= 945.577
##$MC2= 0
##$MEAN= 0
##$ME_mod= 0
##$MI= -402.1523
##$NCOEF= 0
##$NC_proc= 0
##$NLEV= 6
##$NOISF1= 8.587773
##$NOISF2= 6.764455
##$NSP= 1
##$NTH_PI= 0
##$NZP= 0
##$OFFSET= 17.95386
##$PC= 1
##$PHC0= 315.0576
##$PHC1= 10.05189
##$PH_mod= 0
##$PKNL= yes
##$PPARMOD= 0
##$PPDIAG= 0
##$PPIPTYP= 0
##$PPMPNUM= 100
##$PPRESOL= 1
##$PSCAL= 0
##$PSIGN= 0
##$REVERSE= no
##$SF= 200.13
##$SI= 32768
##$SIGF1= 18.5376
##$SIGF2= -6.396296
##$SINO= 400
##$SIOLD= 32768
##$SREGLST= <1H.CDCl3>
##$SSB= 3
##$STSI= 0
##$STSR= 0
##$SW_p= 4401.40845070423
##$SYMM= 0
##$S_DEV= 0
##$TDeff= 0
##$TDoff= 0
##$TI= <>
##$TILT= no
##$TM1= 0
##$TM2= 0
##$TOPLEV= 0
##$USERP1= <user>
##$USERP2= <user>
##$USERP3= <user>
##$USERP4= <user>
##$USERP5= <user>
##$WDW= 1
##$XDIM= 8192
##$YMAX_p= 0
##$YMIN_p= 0
$$ End of Bruker specific parameters
$$ ---------------------------------
##NTUPLES= NMR FID
##VAR_NAME=  TIME,          FID/REAL,        FID/IMAG
##SYMBOL=    X,             R,               I
##VAR_TYPE=  INDEPENDENT,   DEPENDENT,       DEPENDENT
##VAR_FORM=  AFFN,          ASDF,            ASDF
##VAR_DIM=   8192,          8192,            8192
##UNITS=     SECONDS,       ARBITRARY UNITS, ARBITRARY UNITS
##FACTOR=    0.0002272,     1,               1
##FIRST=     0,             0,               0
##LAST=      1.8609952,     -5,              -1
##MIN=       0,             -996364,         -996364
##MAX=       1.8609952,     833169,          833169
$$ Real data points
##PAGE= N=1
##DATA TABLE= (X++(R..R)), XYDATA
0 0 0 0 0 0 0 0 0 0 0 0 -16 16 -16 16 -32 32 -32 48 -64 64 -80 96 -113 144 -160 192 -224 256 -289 337 -385
31 -385 447 -503 575 -641 722 -817 913 -1025 1139 -1270 1412 -1569 1737 -1922 2125 -2344
47 -2344 2586 -2849 3139 -3456 3809 -4201 4632 -5118 5665 -6283 6994 -7821 8788 -9951
61 -9951 11368 -13141 15444 -18562 23040 -30057 42661 -72292 286974 -193784 -980396 -169113
73 -169113 682586 554953 -297151 -531072 -119286 262650 174841 47097 -29223 -167317
83 -167317 -264403 58660 446295 282137 -344328 -511870 66559 594179 273266 -406999
93 -406999 -476537 90435 409174 138389 -224082 -227804 -31048 98277 125050 95407 -50059
104 -50059 -209758 -112235 211922 284643 -59655 -317636 -97100 233240 177578 -117229 -179148
115 -179148 8289 78060 -36073 -35558 99787 49011 -169025 -136433 174621 261669 -58874
126 -58874 -296157 -65048 276200 186335 -178334 -226086 76069 185765 -42240 -153266
136 -153266 38046 138193 -64052 -190491 44766 269911 57483 -282827 -166616 248327
146 248327 289686 -106954 -310176 -37752 247788 132066 -144891 -157729 32774 85170
156 85170 -11071 -18676 42474 -14365 -105760 -16216 153308 111795 -114937 -179563 37765 206480
168 206480 60656 -166248 -130973 70709 116576 -11878 -82781 -27302 16794 -4919 3051
179 3051 53997 24617 -78314 -65418 80914 118591 -32199 -125819 -14047 106873 41580
190 41580 -85266 -58211 59469 47013 -68539 -59363 72498 84311 -57421 -106338 30635
201 30635 132163 33955 -104868 -64922 75235 80732 -36672 -63766 19193 32947 -40294
212 -40294 -37644 55512 63314 -59399 -112708 23810 150547 49960 -131909 -106605 80901
223 80901 138854 1350 -110665 -58830 44630 56991 3587 -23501 -29677 -43732 -12873 67966
235 67966 71750 -45691 -118126 -18088 123109 97740 -66341 -133404 -7346 119497 67090
246 67090 -64444 -86562 -6702 46553 32669 -104 -23674 -39362 -24417 37148 76611 10932
258 10932 -86691 -57925 70027 101820 -11562 -97629 -37918 65902 62509 -26253 -59488 -6602
270 -6602 28340 6759 -4602 10366 -74 -26150 -9644 38573 41777 -18599 -55811 -3617
282 -3617 60603 29333 -47365 -46414 19473 39150 -6710 -35265 -6861 22070 2355 -21571 2969
295 2969 28511 -1417 -31976 -1134 36951 14104 -31031 -25971 17724 27643 -12431 -33258 170
308 170 23683 -3414 -23628 1989 22589 1357 -21635 -4743 27633 20247 -20872 -26611 16373
321 16373 33068 -5435 -31605 -6649 21068 10053 -14668 -12380 8993 9436 -8905 -3249 18938
334 18938 8569 -19362 -8733 25292 22329 -15672 -29226 3395 31883 8378 -31330 -21836
346 -21836 17737 21191 -7927 -17943 -1831 9907 5477 -1671 1001 4017 -5523 -8789 9702
359 9702 17211 -8776 -26952 -4808 22488 12356 -19941 -26347 4842 26021 4118 -21263 -8397
372 -8397 13667 9257 -3343 -1711 2848 -1271 -5199 1513 10305 1495 -16944 -10977 14295 15378
386 15378 -9552 -18036 1344 17570 9882 -8763 -10435 7437 14491 -88 -8005 1087 4699
399 4699 -1658 -2741 2269 2030 -4667 -7284 2334 11401 564 -13656 -3347 15283 9663 -8719
413 -8719 -10009 3851 10989 1977 -9666 -6735 3894 2713 -4497 -2362 307 -4343 -4338 2954 5810
428 5810 269 -6579 -5152 6166 11097 -1265 -11737 -3308 7707 4847 -3807 -6734 -2817 1797
442 1797 920 -996 2155 1209 -6214 -3239 9873 10268 -3293 -9713 -1485 9728 10132 -1988 -10832
457 -10832 -4397 5604 6443 2075 -3852 -8523 -3365 8079 10377 1238 -8093 -8406 3135 15227
471 15227 9137 -9240 -14556 -1785 11879 11631 -3007 -16721 -11456 6744 14846 5546 -11071
484 -11071 -18055 -3454 18967 17513 -7889 -22145 -8007 14465 18813 203 -18972 -14994 4295
497 4295 14611 8545 -5999 -17770 -11775 10111 21544 6889 -16425 -21415 443 26655 21491
510 21491 -12834 -30216 -7070 24116 24517 -4762 -27574 -15369 14510 22730 4551 -13278 -15390
523 -15390 -3491 14089 19370 3491 -15951 -17421 1862 23103 19382 -10436 -29425 -11199 20777
536 20777 26634 -175 -28890 -22710 12876 30530 8167 -20952 -21383 1025 19498 15290 -4935
549 -4935 -17081 -10458 2915 12342 11783 -3520 -20213 -15709 8111 24244 11760 -19453 -30940
562 -30940 -450 34153 23146 -18302 -33197 -4952 27581 23365 -9331 -25465 -8009 12006
574 12006 12077 3844 -2769 -10154 -11342 1593 18726 18211 -7398 -30251 -12319 29663 35313 -7585
588 -7585 -40417 -18857 27808 37639 -2582 -37357 -20400 18999 27216 3710 -16541 -16151 -1664
601 -1664 12194 14127 4861 -9414 -18787 -8075 18672 25939 -2521 -32244 -23208 16398 37550
614 37550 9058 -35687 -34306 12823 40525 14007 -27705 -31958 3120 30868 17110 -14781
626 -14781 -22074 -4270 10349 11361 5009 -4586 -13037 -12014 3689 22606 16790 -17467 -34514
639 -34514 -1833 38896 28238 -21085 -42027 -5128 39524 29371 -18965 -35930 -3992 25180
651 25180 17525 -5832 -14598 -6416 2006 4943 9393 10391 -5981 -23406 -8956 25187 29050 -8360
665 -8360 -38059 -17748 28514 37113 -5704 -39988 -20063 21708 30674 2414 -24644 -20466 5379
678 5379 20132 10918 -5692 -14334 -11675 1962 16491 13939 -6450 -23353 -14942 14039 29567
691 29567 6093 -29568 -27945 11089 35948 14621 -25233 -32098 3655 33569 18221 -17663
703 -17663 -25875 -2135 18993 14943 -3774 -12834 -6868 1267 6413 11010 6036 -11724 -18420 1650
717 1650 24230 16474 -14751 -27739 -1937 28078 18935 -15489 -25737 -1961 19885 13441 -7799
730 -7799 -15618 -3393 8422 6097 -109 -1093 -3451 -6189 -777 8382 8117 -3950 -13682 -6465 10675
745 10675 13223 -3638 -15314 -6863 7791 11111 1163 -9730 -8075 3022 8315 3478 -2887 -5094
759 -5094 -2825 2274 4924 2717 -1121 -4758 -5278 1971 9554 4750 -7373 -9931 743 11607 8992
774 8992 -5651 -12993 -1591 12320 9403 -4175 -10515 -3352 7280 7967 -1064 -6420 -3107 857
788 857 2885 4506 1617 -5354 -6287 1205 8131 5318 -5108 -10019 -1191 9580 6170 -5178 -8723
803 -8723 -2469 5263 6049 -1219 -6870 -3462 2550 3706 1494 -1741 -4095 -1755 2568 3161 545 -2422
819 -2422 -3872 -743 4147 2892 -2241 -3248 -907 1341 2837 1627 -2055 -2449 694 2420 2218 711
835 711 -1917 -1733 1395 2204 1052 397 -1570 -2495 1064 4039 1498 -2022 -2857 -745 3430 4169 -961
852 -961 -4668 -1559 2817 3727 1018 -3691 -4414 894 4399 1494 -2676 -3781 -1886 2669 4220 -799
868 -799 -5047 -2601 2045 3968 1156 -3866 -4463 1146 4072 997 -2335 -3269 -1685 2342 3800 -845
884 -845 -4172 -1789 2046 3363 1201 -2823 -2983 1588 3745 1057 -1531 -2307 -594 2810 3116 -1166
900 -1166 -3175 -445 2124 2463 922 -2207 -2188 1951 3460 684 -1812 -1798 304 2881 1739 -2345
916 -2345 -2366 827 1735 589 -429 -1808 -1175 1302 1816 -539 -1508 -1158 53 1876 688 -2386 -1886
933 -1886 834 1183 -103 -1110 -1726 -598 1536 616 -1717 -1067 293 377 564 -12 -1005 -116 872 200
951 200 -25 239 -771 -468 1358 633 -927 -275 486 408 558 282 -631 292 1279 348 -123 230 -4 373
971 373 1089 -64 -639 531 592 -328 175 503 -456 -401 446 244 166 -57 -735 -129 961 -19 -1118 -203
991 -203 40 -424 130 -12 -1064 -659 87 -340 73 179 -1165 -1125 495 871 -144 -814 -1165 -198 1587
1010 1587 777 -1398 -974 246 256 605 929 -793 -1614 304 1888 1594 -192 -2350 -935 2812 2707
1027 2707 -1108 -2303 -307 1527 2169 688 -1768 -1445 808 1579 1176 373 -1716 -1968 1320 3172
1043 3172 832 -2242 -2598 88 3377 2022 -2625 -3243 208 1830 964 -58 -1760 -2282 -53 2097
1059 2097 1550 -910 -3373 -2260 2736 3751 -1294 -4143 -1269 1869 1987 -72 -2065 -1607 514 594
1075 594 539 1361 -473 -3201 -1180 3665 3461 -1169 -4489 -1738 4427 4778 -2135 -5073 -41 3908
1091 3908 1870 -1055 -1391 -325 662 357 797 2018 -97 -3619 -1357 4312 3904 -2043 -4770 -1377
1107 -1377 3948 4425 -1361 -5381 -1616 3310 2899 150 -2538 -3018 64 2923 1852 -1206 -2815 -2095
1123 -2095 1024 3168 643 -3038 -2368 -210 1104 2315 1021 -2962 -4153 133 4804 3957 -3002
1138 -3002 -7317 -1046 7722 5016 -4926 -6696 815 6019 2727 -3405 -3526 1675 2485 -1271 -358 3319
1154 3319 880 -4740 -2841 5010 7063 -1443 -9112 -3056 9114 7797 -5116 -9288 359 7986
1168 7986 3846 -4260 -5031 1204 3743 -228 -1527 1410 817 -3194 -2124 3091 4393 -896 -6204
1183 -6204 -3476 4800 6422 -1771 -7297 -3101 4110 5424 188 -5504 -4465 2183 5145 1209 -3435
1198 -3435 -3787 18 3502 1973 -2137 -1975 616 205 -838 1464 2687 -788 -4531 -2103 5367 6590
1214 6590 -2829 -9376 -1017 9864 6065 -6253 -8566 1814 9188 2598 -6993 -4270 4969 4355
1228 4355 -3258 -3274 3378 3595 -3297 -5134 2656 7732 3 -9285 -3872 8350 7159 -5190 -8983
1243 -8983 265 7899 3249 -5584 -5286 2458 4230 -1030 -2906 453 1142 -1263 -1654 1082 2501 -229
1259 -229 -3800 -2073 3077 3458 -1217 -3675 -1672 1758 3349 1072 -3114 -3502 784 4174 2404 -2646
1275 -2646 -4391 278 5131 2204 -3611 -2573 2407 2459 -1101 -1442 1671 2163 -1986 -3568 2480 6317
1291 6317 -514 -7500 -2157 7304 5615 -4408 -7795 726 8025 2499 -6404 -4008 4009 3848 -2408
1306 -2408 -3032 1706 2570 -2018 -3744 1697 5181 -939 -6911 -1584 6276 3540 -4583 -5499 1194 5153
1322 5153 1027 -4127 -2365 2179 1518 -1230 -193 1086 -928 -1792 519 2435 921 -2499 -2504 1900
1338 1900 3360 -487 -2588 -92 1624 321 -110 624 493 -925 -1160 1305 3069 -50 -4047 -937
1354 -937 4264 2483 -2989 -2970 1588 3251 -167 -2940 -189 2935 139 -3119 -113 3421 324 -3756
1370 -3756 -1715 3050 2851 -2290 -4333 521 4438 279 -4332 -1352 2993 1314 -2514 -1742 1730
1385 1730 1794 -1995 -2720 1738 3363 -1499 -4153 669 3969 584 -3397 -1696 2451 2530 -1661 -2730
1401 -2730 1476 2704 -1243 -2123 1430 2582 -659 -2344 181 2967 1306 -2803 -1930 2881 2765 -1766
1417 -1766 -2460 1225 2250 -313 -1810 46 2031 364 -2365 -365 2850 570 -2870 -1116 2482
1432 2482 1512 -1724 -2255 749 2348 -389 -2698 -20 2276 -138 -2530 -181 2068 154 -2302
1447 -2302 -1193 1747 1734 -1719 -2737 1197 2739 -992 -2849 160 2367 352 -2185 -931 2204
1462 2204 1676 -1952 -2095 2025 2567 -1472 -2414 1000 2687 218 -2271 -648 2485 1556 -2060 -1554
1478 -1554 2125 1890 -1498 -1702 1228 2100 -340 -2085 -132 2430 737 -2339 -1001 2177 1340 -1704
1494 -1704 -1406 1127 1412 -787 -1771 260 1849 -282 -2344 -116 2177 9 -2185 -757 1646 874
1510 874 -1501 -1637 863 1660 -805 -2083 475 1919 -470 -1828 39 1619 328 -1427 -812 1459
1526 1459 1379 -1282 -1605 1282 1902 -644 -1612 452 1767 425 -1443 -612 1769 1266 -1521 -1205 1642
1543 1642 1532 -995 -1209 795 1572 -62 -1524 -282 1725 524 -1801 -633 1761 701 -1481 -985
1559 -985 934 1206 -434 -1697 -150 1642 298 -1830 -595 1309 449 -1151 -673 510 575 -611
1575 -611 -1202 332 1294 -488 -1607 282 1423 -26 -1195 -511 718 862 -356 -1040 248 885 -290
1592 -290 -549 656 560 -544 -383 566 783 78 -812 -371 1225 868 -724 -700 882 746 -254 -303 189
1611 189 453 3 -513 110 1106 33 -1327 -108 1382 445 -1020 -800 311 910 142 -1124 -571 768
1629 768 239 -824 -210 459 -275 -578 -185 300 418 -445 -1068 -50 992 5 -985 -454 197 338 249
1648 249 -305 -535 98 216 6 342 144 -638 -268 796 588 -210 -343 -18 397 790 -56 -400 210 339
1668 339 15 360 467 -331 -358 302 678 499 -95 -902 -106 1093 596 -614 -598 -73 473 600 -165 -897
1688 -897 -116 414 47 -219 -56 -326 -273 109 80 -28 0 -456 -663 375 628 -223 -728 -538 129 1037 304
1709 304 -1167 -930 764 904 -127 -698 -323 427 721 -43 -443 201 358 -277 -82 674 497 -150 -332
1728 -332 -40 1033 1071 -502 -1153 283 1519 605 -713 -1007 122 1330 651 -853 -804 532 707 61
1746 61 -329 -172 108 241 -408 -288 602 360 -1012 -844 556 1106 116 -1551 -1132 854 1688 -501 -2168
1765 -2168 -555 1561 1047 -800 -1521 -99 1287 324 -1188 -426 1035 360 -944 -421 852 1002 -549
1782 -549 -1553 91 2131 877 -1734 -1381 1230 1898 24 -1542 -702 1351 1413 -523 -1138 424 1057
1799 1057 -38 -615 -1 742 429 -738 -760 823 1206 -483 -1529 -121 1163 925 -640 -1520 -257
1816 -257 1484 818 -1190 -1222 147 1073 341 -877 -867 315 785 -484 -1059 300 764 -385 -1146 -167
1834 -167 1141 840 -1155 -1750 707 2101 6 -2020 -797 1516 1616 -610 -1714 -80 1830 592
1850 592 -1445 -514 1161 863 -665 -782 758 1339 -163 -1539 47 1981 764 -1583 -1033 916
1866 916 1555 -31 -1440 -603 1158 1014 -684 -760 182 425 9 -208 -193 130 107 -456 -310 489 295 -628
1886 -628 -429 -81 232 222 -187 -732 -347 611 478 -297 -760 -478 450 932 -429 -1153 -33 989 102
1905 102 -760 -297 602 517 -507 -717 581 1077 -453 -1216 412 1465 272 -1153 -632 1034 1393 -374
1923 -374 -1318 306 1522 293 -1001 -110 837 454 -637 -570 627 978 -576 -1161 456 1322 -131
1940 -131 -1155 -393 892 666 -618 -898 223 705 -314 -761 179 314 -351 -433 110 344 -124 -610 -279
1959 -279 565 442 -621 -544 350 348 -268 -168 70 66 -218 -256 247 654 -200 -808 238 992 60 -748 46
1980 46 750 382 -321 -487 506 686 -209 -680 544 1006 -323 -797 327 1042 328 -837 -657 708 837
1999 837 -667 -1108 327 889 -294 -867 -110 707 224 -769 -557 734 609 -883 -926 569 791 -452
2017 -452 -940 -85 673 269 -746 -668 651 485 -641 -490 441 315 -475 -495 262 581 -36 -659 -76 812
2037 812 169 -679 -205 666 317 -364 -171 415 421 -282 -388 358 768 -174 -704 353 814 -48 -593 -102
2057 -102 651 439 -414 -517 500 680 -410 -668 443 704 -309 -688 50 729 144 -841 -526 637
2075 637 577 -665 -816 376 635 -239 -744 -112 650 98 -706 -402 710 327 -785 -492 600 498 -320
2094 -320 -541 109 627 143 -604 -173 688 298 -689 -75 641 243 -374 -182 374 674 -117 -615 151 824
2114 824 130 -620 53 591 163 -450 -156 463 518 -316 -664 327 752 -327 -687 161 596 -26 -528 -266
2134 -266 398 352 -512 -547 402 386 -415 -457 327 377 -324 -533 -146 567 173 -794 -297 662 350 -665 -374
2155 -374 431 398 -239 -465 157 637 -94 -783 86 877 173 -688 -185 680 539 -407 -583 295 775 -8
2175 -8 -792 167 834 102 -525 -72 610 350 -435 -407 386 785 -202 -847 89 811 -42 -561 -212 375 423
2196 423 -272 -454 230 398 -392 -476 274 411 -398 -529 -5 296 -37 -415 -307 508 227 -543 -279 356
2216 356 40 -406 -188 262 180 -338 -490 147 696 -20 -841 -16 818 265 -513 -244 493 406 -146 -498 323
2237 323 765 -119 -689 202 865 66 -673 -162 673 587 -338 -631 245 826 33 -573 65 456 49 -317
2257 -317 -108 257 170 -294 -429 356 475 -389 -586 213 294 -121 -358 -195 138 80 -248 -166 276 79 -468
2278 -468 -103 336 52 -475 -273 261 398 -108 -595 0 565 126 -528 -166 474 149 -272 -136 388 311
2298 311 -150 -523 122 732 102 -559 -165 496 335 -122 -422 65 496 90 -345 -45 255 97 -271 28
2318 28 302 77 -61 -226 3 221 -26 -285 -28 79 68 -5 -134 -366 -106 243 -25 -226 -266 -102 151
2339 151 228 -232 -419 52 299 -58 -332 -67 133 65 -183 -211 202 343 -120 -430 212 593 54 -451 -175
2360 -175 413 618 27 -575 -15 689 214 -369 -197 265 446 112 -249 -35 272 189 -418 -84 407 221
2380 221 -195 -303 -40 497 339 -528 -471 334 490 -228 -489 -196 305 330 -202 -413 0 405 -140 -444 -45
2401 -45 253 140 -258 -421 131 503 -6 -593 -136 563 210 -305 -318 81 454 200 -409 -225 362 284 -342
2422 -342 -83 134 326 85 -65 -98 350 335 -210 -169 202 324 -5 -216 -109 134 426 26 -427 -84 297
2443 297 264 -20 -219 -99 295 178 -311 -235 206 240 -167 -363 -58 293 130 -450 -313 332 401 -364 -614
2464 -614 70 469 67 -500 -372 330 517 -274 -553 132 464 -61 -392 -96 337 342 -340 -339 367 602 -176
2485 -176 -469 106 548 143 -304 -270 230 398 40 -328 92 369 24 -113 73 152 43 -48 -51 81 237 -78
2507 -78 -128 93 161 -17 16 86 -141 -78 82 -17 -153 -148 -113 165 207 -293 -335 200 243 -309 -339 -62 234 165 -412
2532 -412 -168 303 337 -400 -394 264 308 -177 -416 18 497 213 -457 -380 453 519 -188 -352 135 473 77 -348
2554 -348 -117 402 369 -259 -300 385 487 -240 -393 186 337 76 -211 -111 290 243 -173 -117 182 131 -169 -29
2576 -29 59 34 -89 -169 -9 129 -88 -290 21 291 -149 -162 64 231 -52 -230 -65 178 154 -248 -183 276
2598 276 290 -336 -426 242 395 -85 -296 -6 421 232 -314 -234 427 382 -336 -267 317 420 69 -430 1 420
2620 420 274 -375 -300 388 481 -140 -193 39 382 151 -224 -89 230 100 -335 -227 353 190 -199 -232 91
2641 91 131 -2 -197 -72 221 9 -245 -69 266 -86 -198 -3 131 -42 -199 -139 128 271 -176 -332 131
2662 131 284 -202 -222 32 190 5 -272 -109 357 257 -340 -237 367 423 -216 -339 154 453 190 -351 -157
2683 -157 383 269 -300 -234 279 248 -141 -195 104 278 19 -291 -105 323 214 -231 -196 308 185 -181 -167 16
2705 16 155 13 -313 -12 186 -68 -245 135 200 -22 -240 -121 169 117 -191 -323 135 186 -196 -207 200 185
2727 185 -149 -249 61 214 186 -258 -163 238 305 -196 -240 208 168 -89 -217 3 236 56 -223 -51 360 141
2749 141 -268 -135 237 206 -100 -96 8 195 65 -216 -60 250 19 -265 -40 136 83 -159 -101 90 166 -105
2771 -105 -232 54 258 -75 -276 71 146 -45 -198 -158 132 129 -89 -300 99 244 -193 -337 29 196 26
2792 26 -149 -125 140 206 -222 -248 128 276 8 -121 52 120 -16 -112 -89 159 189 -130 -189 294 155 -107 -111 86
2816 86 158 56 -37 36 117 7 -144 58 199 -85 -160 25 159 36 -74 -70 83 41 -190 -169 74 174 -145
2839 -145 -229 25 108 -125 -322 -112 62 173 -118 -214 93 198 -98 -168 12 159 -27 -183 -126 48 245 -54
2861 -54 -217 62 139 -51 -123 65 104 54 24 -5 80 85 -4 -23 93 83 17 4 75 -25 90 20 72 53 -18 -62 35
2888 35 148 -114 -61 30 84 -156 -187 -80 128 67 -157 -253 79 140 -141 -210 61 168 -55 -137 -110 115 88 -160
2912 -160 -223 8 161 -79 -189 -62 154 81 -69 -179 45 245 -29 -234 -5 231 -12 -71 -51 -23 107 54
2934 54 -103 -19 199 140 -33 -55 114 96 42 14 -98 105 116 -79 -92 -42 159 156 39 -106 -53 123 110 -55 -63
2959 -63 49 73 25 -152 2 145 -3 -181 -147 116 185 -67 -171 -60 151 281 -128 -232 118 156 -58 -180
2981 -180 -18 83 127 -54 -206 115 149 -52 -156 87 61 54 -4 -106 74 109 1 -65 -2 139 137 63 -141 7
3005 7 191 50 -164 -41 73 72 -71 -36 49 43 -54 -154 -215 64 176 24 -110 16 76 52 -71 -178 81 202
3029 202 -71 -175 -34 179 -24 -125 -41 -16 168 36 -157 56 171 36 -94 -76 -45 126 16 -48 -97 113
3051 113 109 -96 -71 89 109 22 -17 -141 10 154 100 -1 -12 87 139 7 -69 -26 151 184 -135 -80 142 130 81
3076 81 -35 55 196 125 -110 -99 108 175 -45 -243 20 129 44 -153 -143 35 81 -51 -247 148 136 -67 -109
3099 -109 -94 75 75 -131 -164 11 64 -22 -191 -3 75 63 -42 -92 46 148 -58 -108 81 28 51 -29 93 29 -57
3124 -57 83 52 -24 -18 36 96 59 -101 -34 125 66 -66 -38 28 125 -10 -74 56 134 85 -145 -109 128 178 -36 -233
3150 -233 0 10 16 -170 -130 126 155 -161 -152 19 163 -103 -267 -84 197 127 -88 -107 -11 238 -81 -167 20 165
3174 165 -4 3 -11 55 89 -21 -72 56 67 45 -9 21 34 29 14 69 31 58 63 -5 142 -35 -167 53 40 -81 -32
3201 -32 79 130 17 -67 -128 115 229 -143 -155 65 97 -17 -124 10 78 22 -186 -91 130 128 -195 -186 111 103 -32
3226 -32 -223 -58 56 59 -170 -150 126 88 -108 -83 93 161 1 -138 88 75 37 -49 -19 154 100 -63 -40 37 149
3251 149 -20 -92 4 25 96 -101 113 144 -68 -144 104 60 15 -128 -44 41 71 -174 -143 20 64 -96 -111 103 44
3276 44 -101 -148 -31 90 104 -200 -140 29 216 -121 -53 34 54 -62 -80 -125 79 136 -125 -86 227 136 -132 -80
3300 -80 -11 68 57 -213 -95 114 186 -114 -85 131 93 -48 -12 30 106 8 -114 -8 95 42 10 -68 122 -15 -117
3325 -117 -53 92 108 1 -24 35 104 -54 -12 40 147 -39 -77 -71 135 81 -180 -165 160 59 -104 -102 -18 102 -101
3350 -101 -66 -31 75 34 -155 -114 202 84 -62 -28 -6 163 -65 -94 97 58 38 -73 -97 141 70 -68 -49 55
3374 55 143 -37 -79 120 1 -52 -127 44 125 93 -120 102 57 41 -10 -156 123 50 -78 -71 50 178 -11 -185
3398 -185 3 77 64 -64 -65 9 69 -83 -68 136 149 -66 -114 -25 108 -33 -119 2 74 28 -51 41 41 38 -98 -143 50
3425 50 22 11 -88 -33 43 37 -121 -109 49 1 -77 -19 94 75 -50 -16 86 -11 2 -98 37 197 61 -74 30
3450 30 203 -13 -36 -11 25 132 40 -115 84 143 -79 -62 114 62 -27 -78 14 92 152 -107 -95 -84 140 -1 -80
3475 -80 -36 74 27 -41 -42 -11 82 -147 -65 42 124 -65 -84 75 79 -41 5 -52 63 120 -7 -26 75 -42 -52 -41
3501 -41 121 -34 31 54 -34 88 82 -106 -29 26 37 2 84 68 -59 48 -12 16 80 -75 -98 75 138 13 -93 52
3527 52 111 -39 -82 -23 3 94 -97 -72 26 167 -89 -68 5 120 59 -78 -26 -8 94 -47 -100 -44 98 53 -76
3552 -76 -22 92 8 -4 -50 76 3 -10 30 59 -48 -7 49 67 49 7 14 -14 48 -3 48 50 28 20 -31 -25 0 49 57 -14 54
3583 54 108 -144 -18 132 39 -77 -67 39 98 -12 -38 -24 45 54 -29 -86 97 88 -28 8 18 90 65 -19 -76 63 77
3610 77 -1 -44 -41 64 60 -94 -27 29 -33 7 -40 8 -7 -8 -17 -73 14 23 -35 17 57 -33 5 76 72 -123 -36 38 -25 -35 7 -7
3642 -7 39 -28 64 52 10 49 -55 -80 65 -3 -12 24 86 70 -16 22 -59 123 46 -68 -67 13 61 76 28 -70 36 83 -41
3671 -41 -19 -4 -48 39 82 83 25 41 -42 30 -59 61 -73 -99 -33 77 -80 -49 53 -80 28 39 38 21 14 52 11 38
3699 38 -40 -9 13 -38 31 62 18 -4 -18 72 -39 49 20 -14 -64 75 35 -56 71 -21 10 -13 -17 -54 37 18 -44 12 -33
3728 -33 -80 14 16 -18 57 -31 -42 -30 3 66 -47 -9 -25 -74 -30 27 -138 -10 81 -45 -13 -50 14 24 42 67 -67 -5
3756 -5 41 17 46 96 58 -103 -61 74 37 27 -22 -49 10 -54 13 -56 26 125 115 -158 -39 -39 57 -23 15 77 39 78 -18
3785 -18 -51 13 4 -60 -72 44 55 16 -42 -54 23 -60 51 12 61 7 -34 27 58 -85 -52 99 -44 -35 -79 -34 12 -29 23
3814 23 68 91 -17 -78 91 94 21 -37 63 67 140 71 -40 42 13 41 -32 -90 88 10 -55 -87 -83 77 41 3 -73 29
3842 29 68 0 -1 1 7 -4 30 -83 -51 68 21 74 55 50 -23 60 -59 17 49 23 -23 -20 -35 -100 -81 59 6 31 36 -46 61
3873 61 79 109 11 -21 -42 48 27 83 -89 -10 -4 -41 -58 -50 29 -26 -56 -76 -13 62 -58 -101 -29 -7 15 -31 -83 24 -40 6
3903 6 -89 -115 44 -37 5 41 -32 22 72 -67 15 8 15 -15 -46 86 -37 -55 -32 26 -29 41 40 -16 -37 26 -83 24 23 54
3933 54 -46 -19 6 33 -16 -70 117 -124 28 21 42 18 16 45 9 29 -16 -102 -44 25 -32 26 -46 50 56 -47 -38 35 59 68
3963 68 43 -62 -47 -33 33 -72 -8 -137 -15 11 31 38 -45 -53 75 35 -25 63 -54 16 -24 -36 -51 21 -37 30 -54 -56 -1
3992 -1 2 -40 -36 152 -61 -40 34 -12 14 34 -15 -2 22 -65 32 -62 -34 -12 24 66 -65 75 24 14 41 21 136 -18 47
4021 47 22 -27 -27 -21 22 -49 25 22 7 -40 -26 43 81 8 -64 -22 -44 -19 21 72 -116 17 114 -6 -18 113 28 -29 37 51
4051 51 -8 -74 -49 -33 -30 -2 -14 -16 -5 -1 145 -81 -38 3 25 -35 77 35 -11 68 41 133 15 26 -17 -5 18 163 66
4080 66 16 87 25 -15 20 51 20 22 28 29 -29 47 -71 20 10 -124 73 13 -15 -1 -4 -29 7 65 -24 16 8 -151 -86 25
4110 25 -36 -49 -77 -53 -59 1 -7 33 -65 -48 85 -67 24 125 24 -68 -28 -10 -13 -67 -10 39 73 47 -8 54 163 -47 3
4139 3 85 19 -13 12 5 13 61 6 -52 33 63 -18 -25 4 20 11 -42 -46 29 -46 39 -105 -69 -56 14 0 -94 59 -49 -24 -73 9
4171 9 -50 -55 -28 -20 59 10 -7 7 -2 57 -40 -99 83 75 12 63 -8 46 -34 -9 11 26 79 -69 -33 54 60 96 12 -33 85 21
4203 21 25 -1 54 -25 58 20 73 -17 -48 -31 -25 30 32 12 -69 -30 15 30 -9 46 -11 -93 40 19 96 17 67 47 -17 29 29 9
4235 9 -67 -15 -13 81 -23 40 -53 58 -56 85 -21 -13 7 -12 -7 22 72 -52 -27 17 6 -1 -10 -14 -13 32 -1 -19 -44 102 -49
4266 -49 -20 -107 44 34 58 -21 -21 -67 -10 -99 -15 128 -27 55 58 43 -20 70 -17 -24 -12 -25 107 29 9 38 -100 13 49
4295 49 68 28 67 52 4 11 24 -21 -96 70 -94 81 38 -24 46 -97 -50 -8 -44 -4 -36 32 -74 -8 -10 -20 -45 -13 41
4324 41 6 -61 -33 5 60 -11 -76 17 -28 -81 -12 41 -19 -11 24 20 99 -13 76 75 -37 -11 -3 66 -18 39 63 5 5 0 -8 145
4356 145 95 84 -1 119 37 -5 19 -67 18 -9 120 23 28 -32 -56 -66 -3 -4 -7 90 -22 -46 66 4 53 73 32 18 8
4385 8 13 69 -20 -37 -10 88 39 -4 57 22 32 62 6 6 5 -22 63 -13 -29 5 66 39 -60 -71 66 -57 -63 -18 73 17 -105
4416 -105 -22 -36 -7 -65 -54 4 -12 20 -29 -12 -18 1 -42 -36 34 30 -16 4 17 2 44 -21 -29 60 -44 -25 3 -11 -73 12 19 -7
4448 -7 19 119 38 83 20 -30 -5 41 39 39 38 10 94 -58 83 0 79 -50 -47 -74 -11 -45 -7 -93 -92 34 64 1 -9 87 -3
4479 -3 -40 5 0 -81 63 50 5 25 -18 -31 4 102 -47 -12 -36 28 52 28 21 20 -11 -32 26 -13 49 25 43 2 43 -38 33
4510 33 10 -67 5 -61 78 40 62 -44 48 -63 14 -18 11 61 51 -5 58 7 89 20 142 85 2 7 1 41 -84 45
4538 45 6 -20 -25 -19 -26 35 -15 -22 115 -37 23 32 12 -55 13 -94 94 51 79 -21 60 -28 -22 31 3 -89 -13 13 33 59 -19
4569 -19 -3 -14 41 13 -8 0 3 -45 23 -29 3 27 -10 18 40 57 -39 33 46 16 -47 12 -84 36 -55 67 48 51 44 32 76
4600 76 4 17 -23 98 -20 58 32 26 33 -59 15 66 5 -4 19 61 -33 -22 23 54 12 -10 -35 43 20 -25 -15 -14 -24 10 79
4631 79 8 -55 -64 68 -41 13 -126 28 -102 -15 -5 -11 48 36 12 65 -1 99 2 -18 59 -15 17 31 82 46 38 -11 21
4660 21 45 6 39 51 -82 64 -62 -15 14 -9 20 68 -28 8 62 19 -35 57 -23 -102 41 20 -59 0 46 -3 -17 -12 -45
4689 -45 34 22 -10 -56 16 9 -69 43 -43 29 35 -67 10 -36 34 71 33 73 57 10 -4 0 -27 32 33 -14 60 55 -78 14 67
4720 67 -25 72 -48 -7 -28 42 -33 -43 76 -46 45 -71 16 -17 26 10 -63 -26 -20 55 8 52 29 -72 46 67 -1 15
4748 15 -98 18 -27 17 62 -9 -19 -75 44 85 -59 -37 52 -24 15 118 -64 -102 -40 17 66 -55 10 -16 16 10 13 49
4776 49 15 64 -4 -29 -43 2 -81 3 11 33 8 -49 -56 53 1 -22 -18 -50 -4 15 10 -14 -89 70 9 56 -74 -64 -33 50 32
4807 32 -6 34 22 90 -103 17 -51 -9 37 2 0 42 105 -10 89 27 31 58 -33 73 -20 69 -72 -79 -8 -79 20 39 74
4836 74 83 65 43 -45 44 -77 -23 -32 -95 -103 -17 15 44 -58 -116 -4 -20 -24 56 67 -9 -24 44 -65 -14 -4 14 -25 82 26
4866 26 -9 -49 2 103 -30 -14 59 -31 -50 29 5 -43 19 -68 -79 -120 -26 -1 12 -109 -7 32 -45 -14 -32 43 -35 55
4894 55 -89 12 -61 -36 -24 16 105 -57 95 -17 23 -17 -49 12 -49 -36 79 27 -47 -1 56 -35 -9 -21 -41 22 -30
4921 -30 -44 -13 12 18 53 105 -18 -66 -28 57 -64 49 31 -13 -29 10 -5 33 -63 -56 -10 2 -126 -66 -33 31 19 17 -35 27
4951 27 -33 -56 59 -12 -12 -40 -18 -3 6 -63 -9 9 -81 -29 13 39 50 -42 -44 55 39 8 38 -34 -35 -25 -30 7 -70 35 40 -36
4983 -36 -4 20 -39 15 -61 53 -15 -25 -51 -88 43 -11 -34 2 2 -106 -5 -23 9 -57 -44 -61 12 -24 -51 59 -56 -4
5011 -4 -3 -20 -100 -31 -6 54 28 53 91 59 68 -35 -2 70 14 53 4 -60 22 -18 10 34 -18 27 13 103 -68 -109 -28 -61 -22
5042 -22 0 42 71 -70 51 12 -78 -20 -60 54 34 -5 -65 -84 -64 -41 -6 -89 -71 23 63 -88 38 -90 -73 54 28
5069 28 15 39 77 -17 54 36 28 -42 35 -3 -3 69 20 -88 -20 -16 -58 -24 46 -31 -9 61 23 34 -31 16 -27 37 13 31 14
5100 14 -41 41 -10 -91 36 -13 -35 25 2 -4 -95 -17 -58 -113 -9 10 -3 -20 -21 -16 -32 87 3 92 -36 47 -23 2 36 -32
5130 -32 -30 37 18 -19 -15 -28 -37 14 -50 -47 0 -20 99 -13 28 30 61 -9 10 -55 20 -46 13 -28 -45 -34 -39 80 -18 -37 -125 43
5162 43 34 22 12 -24 -1 52 -2 -18 19 37 51 -18 34 -1 10 46 -17 -62 24 -24 37 -19 -92 5 -73 -63 -43 3 -17 100
5192 100 77 30 63 -14 5 42 27 -53 -7 -51 -41 -33 -35 -22 -34 -58 65 -36 -15 -11 27 -123 -35 37 -47 -46 -37 16 102 22 -39
5223 -39 -10 24 -43 -6 55 -15 -10 31 -17 -10 94 -4 2 18 39 -17 19 54 -52 40 66 -12 26 4 -11 31 86 74 -12 -116
5253 -116 -63 -28 -42 -10 23 0 19 -37 28 29 32 37 77 32 28 -65 5 45 -18 19 -16 -31 -8 -43 -20 14 70 40 31 -101 51
5284 51 -15 -14 97 15 -39 57 79 5 -19 19 4 -16 -6 -67 34 29 7 -32 -23 -47 46 9 9 -31 15 -83 -11 31 114 -32 -60
5315 -60 -1 10 -38 29 -12 82 -19 -14 -54 -30 -3 92 27 -55 17 13 45 52 6 -1 -4 -94 -18 47 52 32 44 -105 -89 -7 -15 62 33
5348 33 -37 -5 43 -12 24 22 22 46 32 37 -9 -28 -82 -16 -36 -9 41 -18 -31 46 -57 16 35 121 -34 64 -32 -89 -24 39 29
5379 29 45 -29 -21 -3 8 3 33 -7 -39 -25 8 13 7 -34 25 8 -81 43 -9 -7 47 99 25 0 39 49 14 37 -52 31 -10 -11 19
5412 19 13 11 -40 -31 -26 49 26 14 5 -19 -42 -1 38 20 84 32 -19 -25 111 15 69 43 80 37 78 40 -10 13 75 84 35 28 -68 -10
5446 -10 74 5 -29 18 16 31 70 64 -25 -13 78 -22 -41 -2 78 18 64 9 -40 -104 41 20 -61 -81 -4 151 -62 96 -28
5475 -28 3 -39 10 125 -12 -14 16 -1 -79 56 96 95 26 47 -51 65 24 43 157 13 -17 28 -6 -72 -42 119 2
5502 2 9 -55 10 -78 -108 100 31 -32 19 -27 -46 65 6 -48 28 2 -17 -23 -76 -24 -31 -16 -12 -82 -57 -21 -59 -61 -54 -113 -60 7 -77
5535 -77 31 21 42 -34 0 -31 -34 35 48 -36 -33 45 -49 49 22 37 -35 41 59 29 84 21 20 -17 -7 93 17 -23 -9 -49 -32
5566 -32 -23 68 16 17 -104 -28 -22 -5 -39 -17 41 -81 -82 -66 -8 21 -27 -49 -3 24 34 -15 23 24 -90 -17 44 -69 -1 36 -24
5597 -24 38 88 -18 28 17 70 47 -54 -26 24 -1 44 24 -37 -4 -58 33 25 -2 17 49 -50 -45 -56 22 -67 -36 -41 55 -50
5627 -50 41 28 -52 73 -20 73 24 -109 -25 -63 12 21 1 18 41 -71 -72 -59 -25 27 57 55 27 30 -10 11 -89 27 31 67
5657 67 39 47 -10 -22 56 -47 -22 48 44 -4 41 -51 37 81 -74 23 41 36 -78 -45 -17 -19 -29 55 13 -78 -73 -22 16 -25 -44
5688 -44 80 17 -12 23 47 -39 58 -29 -84 167 74 -27 65 -37 0 58 34 24 12 46 59 0 22 10 29 32 31 1 3 42
5718 42 -10 83 71 -38 -81 -57 -49 54 -14 9 -4 -82 133 32 -24 50 -57 -2 -73 -11 -86 -84 9 -34 -35 -27 23 3 39 -4
5748 -4 -54 30 11 -42 63 30 -19 -74 27 -1 -17 0 15 18 11 -6 -38 39 -55 -6 70 76 100 -24 -12 21 -103 -37 -10 7
5778 7 7 35 18 -59 -75 -12 -12 -6 -83 56 16 -4 -86 -128 52 -12 -16 -89 45 55 38 -7 1 42 110 28 75 -16 5 119 1
5809 1 84 -105 64 -43 45 -38 -17 74 17 103 -44 -37 -3 34 10 -40 -23 -7 -53 -27 24 -44 -50 -15 -32 -3 -16 -17 -36 -120
5839 -120 -9 -63 16 -60 -73 -22 28 27 -82 24 -11 36 -25 -57 -25 0 -34 55 163 -56 -5 -7 46 26 35 -19 21 11 24
5868 24 0 -8 -2 -29 -30 -10 -2 4 58 -23 -121 22 -51 -51 -87 -11 24 -58 46 66 25 -57 -126 -12 95 -4 -48 10 -60 11 68
5899 68 25 -42 -48 9 -83 -85 -39 48 -13 58 41 -46 41 29 -7 24 12 49 62 15 33 50 -24 -77 -79 20 -38 -91 16 -24 -10
5930 -10 68 42 35 -14 -18 -59 19 -91 -10 -19 -46 75 5 48 -83 -81 11 -48 32 4 -61 47 92 -59 60 123 56 -13 -18 -15
5960 -15 13 67 62 -13 27 63 -52 -7 0 30 62 27 51 77 0 -51 4 34 53 62 -32 91 20 -34 -11 -24 98 -65 -74 -87
5990 -87 15 -4 -29 -72 4 34 -127 -20 60 30 -41 -45 46 -20 53 33 -96 -35 80 7 -31 52 70 33 33 7 -5 -13 -57
6019 -57 -131 30 -52 4 12 110 54 45 22 -87 -49 -31 30 -21 -14 66 -17 -64 7 -5 -19 -45 -90 -69 35 -45 -112 -6 -96 -65
6049 -65 -46 59 37 -3 42 4 97 -40 -11 -51 -38 10 2 71 96 -29 -26 -38 -33 -11 -35 25 -29 16 52 24 16 -88 -44 51
6079 51 70 4 27 16 -54 -16 -26 15 -82 15 -43 4 -54 34 -129 -81 -2 -31 -45 18 -133 -56 54 -12 41 -76 7 -40
6107 -40 35 14 24 48 7 -75 3 26 -53 -103 49 48 -11 27 -6 26 10 -40 -39 43 110 -16 8 32 37 71 6 45 -91 15
6137 15 -109 -2 -16 -111 30 -40 19 -40 -83 20 -8 -63 -3 2 70 -30 15 -79 30 -46 -8 -78 51 -31 -29 -73 -8 -29
6165 -29 -4 -14 12 1 13 -13 -60 44 85 30 -25 2 43 40 28 -55 38 63 0 28 12 10 -27 -5 -42 8 5 -20 -19 62 -1 -33
6197 -33 -82 -8 -13 -50 -81 -4 22 -70 8 -39 -39 -51 13 -99 38 44 -22 -55 39 32 19 -43 4 9 23 -53 -11 2 -17 -52 30 0
6229 0 43 35 -15 47 -33 29 -34 56 50 -16 2 -54 -48 29 -73 45 5 14 -17 -54 19 -44 -70 -30 -20 41 -2 -56 7 5 7 -57 4
6262 4 -5 36 -11 143 26 19 35 -6 7 -15 -28 -101 14 14 -9 -80 -17 82 63 -29 33 18 65 53 37 34 -4 -8 -64 -7 13 -83
6294 -83 10 12 -50 -3 68 -60 45 42 22 83 -38 -19 -16 -26 -48 -47 5 62 15 -108 -72 -47 -43 32 -51 -127 6 84 -5 15
6324 15 -37 -61 -17 30 30 51 31 27 -57 1 35 -3 -62 -46 -6 17 -41 9 -19 -45 18 15 -65 54 68 67 16 -39 -4 -16 -54 -132
6356 -132 -37 12 22 -75 2 31 -17 -52 13 -16 14 31 8 -13 -28 29 -22 18 4 -25 92 -67 -76 22 -10 -14 33 -18 -3 62
6386 62 25 33 48 19 -36 11 -7 34 -88 2 18 -46 83 -4 36 -85 14 76 -33 9 -20 -55 66 83 46 -26 64 72 27
6415 27 -30 6 -25 -84 -66 1 -36 -27 -83 -27 38 28 19 47 -10 29 18 -27 29 51 13 0 -30 87 13 35 -10 -59 25 29 -1
6446 -1 -17 -2 87 -30 -79 -5 48 -56 20 -1 -65 -44 19 -24 58 9 -94 62 27 6 -1 -61 -36 -4 -64 27 -25 28 -12
6475 -12 -57 6 -29 97 -14 -51 53 -108 -107 2 -40 26 40 -8 78 77 63 5 -8 -9 -28 -27 -75 -6 -8 -33 -8 47 31 -20
6505 -20 -24 16 -26 -39 -46 -64 22 10 -1 12 6 -62 2 17 -104 -17 -4 -55 -60 -15 32 -46 59 14 1 -32 -55 -21 19 43 -82
6536 -82 -7 -7 71 35 15 39 47 -10 115 53 85 67 6 26 -39 -27 -36 85 -48 2 46 -57 13 31 39 -96 -44 41 1 7
6566 7 89 -45 -33 73 -53 -10 -6 -82 -13 -40 -39 -3 6 -73 20 67 21 20 -16 70 39 -12 -19 46 -14 -54 -4 -41 25 18 51 23
6598 23 16 68 43 -4 -32 -54 4 57 20 27 -20 -5 -51 40 -96 -28 1 -28 -30 -7 -97 -24 -58 -39 -84 -42 54 17 -22 2 -25
6629 -25 -105 26 -49 13 -122 19 -114 -33 -10 -56 69 0 12 -55 19 87 -32 -41 8 -125 -26 -28 -11 145 -63 20 -32
6656 -32 -71 -76 74 -2 -25 35 49 -8 35 7 -51 -7 -34 12 -9 40 56 -57 9 17 -41 -18 -84 6 -29 -60 13 3 -56 6
6686 6 57 3 29 -54 19 -57 -18 -13 4 -57 19 27 60 -36 20 70 85 55 0 -66 54 38 -69 -59 32 -59 -12 143 18 -19
6716 -19 9 20 -5 -49 -39 -93 -58 22 -5 -115 25 22 2 15 30 0 -51 -59 -19 -32 -25 -1 4 -73 -35 13 -17 51 -29 29 -55
6747 -55 20 -41 40 21 45 -40 -5 22 11 15 39 48 -38 -17 14 103 63 17 -7 -112 -71 21 33 16 -60 -22 -81 -75 1 -6 43 -101
6779 -101 -69 -40 22 23 -19 0 18 -17 62 33 -17 -3 -1 35 67 41 94 -103 -22 20 34 124 15 -40 26 41 83 -24 29
6808 29 106 -8 -25 77 124 -74 54 -100 8 -70 82 54 5 2 12 1 37 34 -46 42 22 5 -44 9 52 16 -89
6835 -89 -31 -65 -9 66 78 15 12 -18 12 -36 4 -23 -56 10 18 -55 25 -11 35 -6 24 6 80 23 26 -38 -11 80 -40 20 -20
6866 -20 21 -47 -73 -61 16 43 -21 -42 -21 -50 -40 12 3 -10 -77 48 -39 -7 3 -21 8 -5 13 -32 22 1 3 -30 84 75 -76
6897 -76 -19 3 -27 57 79 40 10 41 -32 -50 25 -99 2 -73 149 -59 18 -5 42 30 -17 113 37 19 -30 50 49 -25
6925 -25 69 31 39 -48 5 51 -68 3 26 24 19 54 -4 -30 31 21 10 -90 62 -50 22 -30 17 -24 22 40 39 97 2 -52
6955 -52 -39 -47 30 8 -36 76 53 -7 41 -52 13 -10 67 74 81 -22 70 12 7 -16 -4 44 -23 -11 0 12 -1 -53 61 -80
6985 -80 -5 9 -10 25 8 2 28 82 41 -134 36 45 -54 -110 -78 -64 34 -14 -51 41 30 -2 18 28 28 5 -5 8 -54 31 57
7016 57 -37 8 114 45 16 81 -11 -34 58 3 -24 47 -51 36 30 18 33 21 67 18 -6 -17 -37 -28 4 45 -90 10 -99
7045 -99 -69 -48 31 -1 69 19 -46 23 60 35 94 -26 -58 35 44 46 89 16 12 2 -87 72 0 27 -26 66 13 -18 62 54 -44
7076 -44 -47 -96 -53 48 87 -34 -7 -83 -126 16 -11 40 12 -40 45 7 20 -27 -18 44 -16 4 -55 -5 -39 -7 41 -93 -34
7105 -34 -38 -69 -6 0 65 27 -55 74 -67 101 -26 -56 13 7 17 -49 22 17 27 -37 -38 -12 48 -58 66 1 44 8 31 16
7135 16 31 -14 0 -23 -74 -74 -13 12 -31 11 14 78 78 -46 16 -20 -9 15 -29 -56 -90 16 -86 -73 -9 -2 56 41 27 16 57
7166 57 -11 2 60 -33 5 -62 44 -65 -108 -3 65 -5 -73 13 41 16 22 5 -10 -82 26 -53 51 -127 36 37 28 -12
7194 -12 -4 -26 123 44 40 -10 0 -9 -35 30 -35 5 -98 -57 -59 -24 -1 -8 -25 -57 -42 26 -11 40 -22 -39 -22 15 -45 12 -27 -27
7226 -27 -51 -112 29 -39 -21 42 -3 -8 -4 -34 -31 64 -7 12 -7 7 -31 -1 -13 -43 32 -44 35 -49 63 4 41 35 -53 23 -84
7257 -84 7 -9 -77 51 -59 -36 -109 41 31 -38 97 35 -96 -3 -5 72 28 -68 48 41 20 65 16 -2 63 -88 -23 9
7285 9 92 -2 -9 37 94 0 -89 -14 -50 6 -97 35 -13 -1 -91 -119 -33 2 -135 -26 92 -50 -25 -95 -9 4 8 36 -19
7314 -19 22 20 79 30 24 -7 -111 60 41 72 34 -12 17 -63 35 -25 11 -14 12 53 66 107 33 -7 58 -6 -7 43 -66 -3
7344 -3 -26 7 15 -20 -79 32 0 0 -35 -58 12 13 -27 -26 51 -17 20 -68 35 -1 52 -75 36 14 -57 53 58 9 -13 125
7374 125 53 -57 52 73 13 -10 23 -65 101 57 -87 -3 14 77 5 -6 50 1 -58 -30 15 3 -42 64 -53 40 19
7401 19 55 -90 -102 17 -31 48 -63 -56 -76 -12 4 9 32 14 -44 -1 33 18 -64 9 1 -10 -13 -27 42 -35 -30 -35 30 38 80 96
7433 96 34 7 -8 -44 74 -16 30 -5 65 -10 -18 -71 -55 -33 27 -51 78 -24 -55 102 -20 -39 -10 23 22 38 0 44 25
7462 25 50 51 63 12 49 -10 56 -34 22 43 19 75 -34 13 -7 19 -49 5 42 -12 22 65 8 -9 91 37 45 -21 -10 -34
7492 -34 19 -97 39 -48 6 16 -31 -8 31 -18 62 102 -3 -29 24 9 18 -24 43 -51 -2 8 25 13 -25 38 -30 20 14 -38
7522 -38 -88 -47 -3 -8 41 -105 19 -12 11 66 -23 -23 -45 -4 -62 0 25 -61 -38 -23 59 -14 31 -11 17 -24 45 14 -24 -2
7552 -2 28 55 -32 -45 37 -63 -89 61 -61 27 19 -34 -21 -27 -56 50 -78 14 5 -24 26 108 43 -54 -16 60 48 17 19 3
7582 3 -75 70 -24 -13 -21 84 5 97 18 -15 70 -4 61 87 -61 -46 -11 3 -16 35 82 -86 60 -5 -44 -13 -34 -40 -23
7611 -23 -35 26 -15 -8 -2 5 27 2 -62 14 36 23 2 -78 28 56 -40 -37 -32 74 -16 -58 3 -41 101 -37 81 -13 -13 42 -20
7642 -20 42 84 68 72 -81 49 -35 47 -64 -11 -15 20 21 -17 -56 -70 77 -29 54 -53 -52 -104 -47 -12 -93 32 -38 42 6
7671 6 13 -12 21 73 -71 -80 29 15 -91 30 44 -33 -28 -75 9 -17 18 11 14 113 -10 40 103 45 -35 13 -5 25 34 33 53 -14
7703 -14 -81 -26 -17 41 21 77 66 60 42 -20 -16 18 21 20 -125 9 -67 32 -14 26 -38 51 -87 3 -36 -118 21 -3 47 56 -15
7734 -15 -35 7 -21 -21 24 43 -53 -53 -22 83 -3 43 31 9 -41 -21 22 10 87 8 54 -91 -21 -35 16 53 -63 -19 27 5
7764 5 -42 19 -64 -8 13 -67 -22 24 -22 61 78 -45 6 -6 24 16 15 -54 0 2 -30 -43 46 -47 -20 -6 -77 -5 6 33 2 88
7796 88 55 6 106 35 33 -34 51 61 84 -16 -6 -18 -28 -36 -150 57 17 58 69 65 -47 8 -38 23 42 1 -26 -62 -37
7825 -37 109 -38 62 -18 -29 30 7 -38 -94 17 64 8 -79 92 -37 -23 -46 -16 31 -55 -12 63 4 -50 -45 64 51
7852 51 -42 -11 110 -27 -24 2 34 -9 -4 51 33 -19 125 21 -34 -59 64 0 -11 -85 -11 -25 63 8 -49 -23 -68 -22 68
7881 68 8 67 54 46 -6 -8 -108 9 -68 -13 82 -33 -26 -8 -26 -5 -5 25 15 62 52 -82 49 44 78 -40 31 15 25 -12
7911 -12 -41 45 -6 -65 -40 -18 26 9 87 61 -16 -20 44 -24 6 28 -21 -3 54 -13 18 40 62 -3 -69 -57 37 -127 -26 -65
7941 -65 6 26 -47 -5 -30 1 -101 -26 -17 91 89 34 3 33 19 -55 5 0 -117 84 77 -65 28 120 40 -76 -26 -11 -35
7970 -35 -13 18 43 -98 3 -3 11 -37 -7 26 -69 100 -24 37 -46 -86 -49 -14 -23 -11 -18 16 -15 -24 -16 -14 -11 2 14 0 20 -56
8002 -56 -55 -79 -60 -46 47 -57 -29 63 -83 -21 60 25 47 51 -9 -28 7 52 -2 -55 39 -85 -42 -39 -20 14 42 45 19 -93
8032 -93 38 -93 -49 11 60 13 17 -4 24 23 -34 -35 52 -75 -4 -83 14 17 35 -47 -41 -29 -16 28 0 -9 -4 3 2 91 -24 10 1
8065 1 40 4 23 10 -59 29 97 32 29 -34 -112 -30 79 -32 59 16 -67 -37 -73 -13 19 -26 13 -70 -50 -37 -9 -23 38 37 -1
8096 -1 -117 -72 4 46 33 -37 8 12 -37 -36 -37 -50 -35 63 -79 -12 23 -23 135 5 83 25 -30 22 8 0 -21 -18 -22 -30 -35 32 -75
8129 -75 -46 22 -2 34 -31 -59 -26 30 -46 -44 9 -12 -50 5 -23 25 -116 -14 -4 -26 -14 48 -24 -43 -66 75 13 42 73
8158 73 14 -28 -117 44 -30 16 -14 27 41 34 -87 53 40 23 26 -13 58 17 -15 -1 -71 -18 -22 -11 -8 -49 20 -40 -4 61 4
8189 4 -55 -5
8191e
$$ Imaginary data points
##PAGE= N=2
##DATA TABLE= (X++(I..I)), XYDATA
0 0 0 0 0 0 0 0 0 0 0 0 9 0 16 -16 16 -32 32 -32 48 -48 64 -80 96 -112 128 -144 176 -192 225 -257 290 -337
32 -337 384 -433 483 -545 611 -689 769 -853 949 -1057 1171 -1292 1432 -1579 1740 -1921
48 -1921 2115 -2332 2569 -2831 3121 -3444 3810 -4223 4696 -5238 5875 -6636 7549 -8682
62 -8682 10134 -12059 14748 -18769 25445 -38507 73664 -364791 -996364 49519 833169
73 833169 420262 -513445 -568412 58046 432979 184062 -83045 -127807 -125438 -114992 156175
84 156175 384185 110740 -429701 -411932 218512 583515 104186 -529178 -408330 251265
94 251265 468214 42818 -328534 -203727 93443 190119 107812 7897 -100162 -160980 -21705
105 -21705 231709 206932 -149348 -324525 -29773 279305 142893 -182191 -195556 48977
115 48977 130184 -9680 -46953 67120 35527 -135967 -82018 186911 203533 -126903 -291926
126 -291926 -6952 290160 125571 -239392 -224040 116964 206928 -54454 -168288 36368
136 36368 141359 -48722 -153254 67996 236929 3358 -281422 -108434 277297 233813
146 233813 -187000 -315107 28646 285041 91222 -200843 -156480 84315 130570 -7781
156 -7781 -44163 26015 331 -68028 12684 140161 63503 -142134 -150852 79351 198604 9356
168 9356 -198051 -106843 117216 129444 -37842 -102879 -12944 50653 19870 2214 32155 7825
180 7825 -69107 -43801 83272 91963 -63301 -131429 2901 113933 25851 -100230 -55799
191 -55799 67713 51792 -61724 -49538 73754 72930 -65236 -93344 48935 123337 1058
202 1058 -123420 -54452 89024 74440 -56915 -77290 22408 46417 -26770 -29763 51108 49971
214 49971 -57656 -83153 51084 139912 14530 -145288 -79687 111651 128562 -40954 -132633
225 -132633 -37235 78043 63410 -18023 -44734 -22496 -9575 16050 64126 43976 -61104
236 -61104 -97025 18962 128338 59598 -101431 -124133 27232 129971 38100 -98947 -86586
247 -86586 24538 69530 24283 -23733 -33496 -22818 3293 45130 53968 -15925 -86601 -35312
259 -35312 82229 82103 -44852 -107186 -17815 82289 52439 -47027 -65273 7346 46300 11884
271 11884 -12502 2895 2123 -16434 -137 36754 26819 -30128 -50303 7892 59899 16431 -56785
284 -56785 -40584 33359 44592 -11083 -36094 300 30334 8045 -18485 2594 26163 -1927
296 -1927 -29980 881 34478 6009 -36603 -22563 22587 25600 -16401 -32517 4858 28447
308 28447 -1005 -22775 3606 23413 -245 -21619 -2526 24411 11184 -26412 -25743 17058
320 17058 28459 -13414 -35237 -2498 25558 8451 -17672 -11356 12076 12554 -6702 -4525 14903
333 14903 6287 -18722 -7677 23097 14786 -22010 -26815 9494 30949 2626 -32282 -15302 26198
346 26198 24075 -10845 -18280 4537 16086 6446 -3727 -1699 2523 -3248 -6137 7616 12052 -11184
360 -11184 -23656 1877 25143 8310 -22031 -19829 12990 27927 822 -23961 -6665 17786
372 17786 9239 -8728 -6835 684 -1893 -5333 48 5909 -2080 -15308 -7105 15869 13442 -12366
386 -12366 -16959 6111 19018 5131 -13023 -10552 8022 12656 -3944 -12189 -549 5579 -1859
399 -1859 -3607 1958 2215 -2989 -3314 5100 10957 634 -11273 -309 16411 7777 -11576 -9542
413 -9542 6724 10902 -937 -10852 -5109 6540 5004 -3936 -2306 2659 -591 -1323 4951 5933 -1171
428 -1171 -6089 -2508 6494 7927 -4779 -12991 -2341 8825 3103 -7034 -7347 -912 3710 1985
442 1985 -1359 258 681 -4212 -1856 8591 6512 -7508 -11023 345 9509 5258 -7140 -12122
456 -12122 -2026 8465 5893 -1784 -5642 -5283 1301 10398 8640 -2910 -9252 -4132 7054 13288
470 13288 3360 -13071 -12572 4366 14531 7395 -7884 -15097 -3981 13668 15223 -23 -13360
483 -13360 -11711 5348 20824 11675 -14347 -21390 -209 19302 14000 -8322 -21445 -9441 11864
496 11864 15894 1992 -11954 -14996 -3108 15438 18006 -2454 -21119 -15447 9029 25433 10310
509 10310 -22411 -28762 2178 28436 16286 -16084 -28822 -6397 22463 21154 -4601 -19336
521 -19336 -11109 5754 17289 13192 -5660 -19446 -10967 10435 22341 9278 -18443 -26276 180
534 180 27727 20944 -10809 -29220 -11189 23391 29940 -1258 -26886 -15702 12004 22873 8799
547 8799 -13083 -18466 -3752 11023 12989 4565 -9709 -18091 -6312 16268 21606 1280 -23930
560 -23930 -22688 10563 34765 12089 -28605 -30816 6015 31776 14759 -20093 -27536 -1123 19281
573 19281 11366 -4131 -9077 -8960 -4579 7801 16810 8055 -15085 -25615 -1606 32271 24820 -20461
587 -20461 -40365 -5825 36345 30230 -15769 -39818 -9851 30272 26865 -6462 -22996 -11185
599 -11185 8353 16899 10185 -3770 -13480 -12644 1942 21234 17979 -12246 -31331 -10334 26779
612 26779 32452 -4225 -39008 -22702 26161 40277 1081 -36185 -25078 15740 33499 7980
624 7980 -24649 -22511 3890 16938 9113 -3011 -10275 -11350 -3840 10025 18396 5562 -22503
637 -22503 -26943 9228 38931 15093 -32437 -37519 8232 42811 18431 -31000 -35356 6829 32289
650 32289 12755 -15360 -17544 -1381 9343 8146 5443 2448 -9179 -17297 413 26937 19780
663 19780 -18406 -35279 -4286 35916 29464 -17894 -40860 -7526 33222 28137 -9120 -29410
675 -29410 -12786 16030 22781 4023 -14097 -14746 -3861 9259 15814 5906 -13853 -20905 -4282
688 -4282 20450 23441 -5271 -32308 -18102 21847 33845 1535 -33168 -25477 14788 34864 7820
701 7820 -27520 -24515 6992 23640 9737 -11942 -15878 -2859 7778 8312 5919 -862 -12709
714 -12709 -12406 8119 23100 7545 -20681 -23050 7178 29898 11515 -22673 -23596 7041 24472
727 24472 9195 -13715 -15445 2046 13224 6334 -3469 -3825 -2159 -2440 2292 8257 4529 -7094
741 -7094 -11636 -1150 12917 10292 -7775 -15325 -1953 12123 9711 -3453 -11232 -5542 6307
754 6307 8779 223 -6449 -5427 -694 3550 4118 -169 -4053 -4708 -2407 3662 7838 1025 -9410
769 -9410 -7808 4449 11508 4333 -9304 -11741 2218 13548 5869 -8845 -10502 264 9519 6605
783 6605 -4022 -7639 -1053 4320 4094 2668 -527 -5133 -3631 4359 8089 2326 -6732 -7935 2336
798 2336 10738 4117 -7765 -7877 1510 7631 4839 -3179 -6983 -1342 5152 4166 -562 -3163 -3395 -369
814 -369 3455 2563 -1628 -3493 -2860 420 3921 1579 -3829 -3790 409 2311 1871 -67 -3014 -2563 1191
831 1191 2400 682 -1071 -2678 -1566 1707 2165 -171 -1179 -1417 -1459 1702 3754 525 -3145 -2066
847 -2066 1227 3867 3046 -2053 -4446 7 4439 3191 -637 -3668 -2720 2725 5059 578 -3552 -2514
863 -2514 661 3799 3693 -1688 -4799 -856 3937 3483 -495 -4285 -3206 2442 4256 -252 -3784 -2673
879 -2673 10 2898 2683 -1970 -4552 -656 3148 2406 -755 -3650 -2540 2034 3368 -576 -3232 -2178
895 -2178 197 2482 1903 -2270 -3533 358 2787 1588 -591 -2426 -1372 2362 3216 -465 -2644 -1154
911 -1154 1278 2636 1033 -2529 -1951 1944 2510 202 -796 -902 -59 2023 1897 -691 -1444 -123 1060
928 1060 1822 489 -2115 -1419 1723 1581 -616 -1198 -1077 122 1652 473 -1818 -1110 793 617 -10
945 -10 -513 -1261 -397 700 -189 -801 -385 -795 -650 742 317 -1494 -708 648 227 -151 -99 -642 30 1008
965 1008 28 -746 68 15 20 692 -126 -779 418 844 -301 187 817 -107 -105 899 539 177 184 -178 180
986 180 1212 313 -942 11 800 85 200 261 -537 -326 762 281 -62 290 -546 -783 828 980 -606
1005 -606 -1093 -761 -3 1137 204 -1861 -1198 549 363 5 91 -1146 -1571 480 1628 473 -1368 -2262
1023 -2262 -477 2663 1795 -2200 -2883 410 2040 1347 -354 -2078 -1188 1612 1914 507 -494 -1350
1039 -1350 -927 2008 3152 -59 -2597 -1527 1512 3505 1378 -2906 -2569 1709 2973 571 -855
1054 -855 -1459 -1053 1221 2624 900 -1636 -2740 -813 3181 3094 -2158 -4245 -285 3008 1671 -1134
1070 -1134 -2521 -1266 1204 1108 -82 -8 -942 -2670 -397 3420 2038 -2909 -4427 -333 4541 3191
1086 3191 -3601 -5409 855 4622 932 -2642 -1878 309 1104 683 378 866 -557 -2679 -205 4431
1102 4431 2872 -3192 -4410 527 4837 3413 -2519 -4993 88 4815 2872 -1321 -2805 -1573 1601
1117 1601 3581 1204 -2232 -2584 -435 2285 2880 -242 -3441 -1795 1392 1925 1231 -278 -3155 -2879
1133 -2879 1681 4662 1615 -4430 -6045 826 7615 2851 -6914 -6351 2648 6436 945 -4945 -3640
1148 -3640 2203 3022 -1311 -1471 2047 228 -4247 -1588 5176 5002 -3643 -8391 -694 9668 5694
1163 5694 -7291 -8843 2860 9120 2136 -6014 -4604 2806 4868 -90 -2303 941 1129 -2125 -967
1178 -967 3727 3475 -2074 -5416 -1107 5972 5246 -3429 -7325 -655 6044 4549 -1917 -5920 -2622 3971
1194 3971 4994 -610 -4774 -2877 1472 3746 996 -3146 -2472 981 959 -696 578 1269 -1633 -3915
1210 -3915 -562 5195 4230 -4574 -8452 955 9911 3631 -8482 -7733 4206 9200 555 -8156 -3634
1225 -3634 6009 4675 -3698 -3654 3377 3369 -3126 -3952 3254 6670 -1245 -8551 -1666 9203 5820 -6787
1241 -6787 -8168 2898 8918 1845 -6795 -4377 4032 5034 -1422 -3531 487 1797 -828 -1269 1182
1256 1182 1941 -901 -3401 -938 3444 2601 -2518 -4006 -431 2742 2466 -566 -3751 -2662 2005 3886
1272 3886 523 -3786 -3839 1260 4834 921 -4748 -2689 2907 2495 -1627 -2060 1236 1714 -1916 -2656
1288 -2656 2549 5041 -1653 -6983 -610 7870 4062 -5956 -6824 2847 8323 1192 -7123 -3376 5347
1303 5347 4320 -2899 -3225 2067 2865 -1637 -2901 2197 4638 -1438 -6151 -260 6858 2590 -5513
1318 -5513 -4815 2836 5452 43 -4858 -2033 2981 1906 -1696 -1104 777 -639 -1565 628 2035 -127
1334 -127 -2808 -1957 2002 2855 -1243 -3334 30 2052 160 -947 18 87 -883 -680 1130 2141 -812
1351 -812 -3612 -343 4458 1893 -3629 -2754 2461 3401 -644 -2797 151 3041 424 -2866 147 3412
1367 3412 410 -3523 -706 3684 2413 -2522 -3642 1466 4639 -83 -4388 -748 3691 1316 -2692
1382 -2692 -1476 1908 1559 -1947 -2283 1712 3017 -1888 -3938 941 3875 -340 -3898 -1413 2794
1397 2794 2025 -2219 -2849 1267 2557 -1464 -2488 1247 2145 -1214 -2516 420 2673 518 -3026 -1741
1413 -1741 2841 2538 -2293 -2493 1552 2423 -501 -1868 242 2001 312 -2041 -135 2812 721 -2776
1429 -2776 -597 3010 1503 -2043 -1794 1449 2418 -412 -2359 278 2582 -51 -2453 141 2251
1444 2251 108 -2164 -828 1923 1425 -1946 -2355 1295 2642 -1147 -3075 395 2470 -110 -2544
1459 -2544 -825 2107 1285 -2278 -2056 1858 2208 -1862 -2743 1111 2501 -552 -2548 -445 2499 1125
1475 1125 -2355 -1575 2225 1826 -1784 -1764 1530 1906 -710 -1919 295 2289 639 -2122 -777 2417
1491 2417 1334 -1845 -1213 1656 1577 -832 -1530 725 1925 -134 -2088 149 2391 61 -2153 -340
1507 -340 1956 635 -1631 -1282 1128 1618 -958 -2025 603 1936 -702 -2084 173 1555 24 -1704
1523 -1704 -838 1334 1059 -1575 -1736 1186 1654 -1064 -1860 450 1579 -150 -1593 -542 1594 858
1539 858 -1661 -1193 1624 1307 -1245 -1394 913 1571 -260 -1425 105 1772 574 -1531 -433 1870
1555 1870 832 -1384 -730 1350 1292 -506 -1382 332 1810 248 -1761 -336 1649 575 -1198 -460
1571 -460 747 616 -581 -935 315 1113 -502 -1617 264 1445 -309 -1516 -377 828 565 -712
1587 -712 -1031 64 798 -526 -905 405 432 -676 -489 509 530 -291 -779 -240 1005 610 -1037 -793 826
1606 826 883 -482 -422 302 431 42 -338 199 840 77 -1105 107 1572 471 -1053 -540 831 1166
1624 1166 83 -1049 -315 1048 533 -763 -83 631 -3 -474 129 382 276 -395 -871 97 1037 86
1642 86 -1157 -341 443 283 -69 -530 -590 96 312 -125 -191 9 -641 -373 642 266 -658 -567 -19 362 388
1663 388 -292 -630 40 388 -16 109 135 -342 -369 482 602 86 -258 -517 109 1175 643 -695 -453 309
1683 309 735 533 -204 -636 145 876 198 -275 -4 44 -74 251 239 -152 -108 -312 -360 488 576 -368 -883 -313
1705 -313 465 699 10 -1286 -763 925 816 -689 -1009 -248 382 378 -370 -784 35 248 -352 -275 374 223
1725 223 -524 -486 50 662 532 -833 -1216 503 1493 204 -1065 -804 558 1307 450 -1013 -630 878
1743 878 914 5 -352 99 250 201 -86 -190 642 392 -674 -508 871 1121 -282 -1283 -622 1313 1527
1762 1527 -815 -2025 -38 1744 677 -1278 -1373 217 1253 60 -1399 -489 926 305 -1119 -462
1778 -462 832 525 -897 -1420 270 1799 223 -2231 -1286 1607 1696 -671 -1885 -488 1530 1199 -930
1795 -930 -1297 562 1194 -178 -752 119 737 337 -538 -449 987 1124 -513 -1222 291 1542 704 -850
1813 -850 -1132 217 1709 705 -1307 -1045 712 1189 101 -879 -602 722 933 -401 -961 401 877
1830 877 -302 -1033 -38 1080 476 -1391 -1446 1004 1858 -524 -2317 -542 1813 1126 -1118 -1827 46
1847 46 1760 230 -1731 -630 1273 629 -1013 -747 722 1055 -427 -1443 170 1869 424 -1719
1863 -1719 -829 1345 1472 -349 -1397 -290 1432 1000 -827 -896 614 725 -84 -242 53 279 262 -152
1881 -152 -113 514 372 -437 -308 332 548 188 -196 -627 -123 694 398 -621 -733 -232 554 740 -512 -1124
1901 -1124 122 875 -71 -957 -367 504 337 -564 -678 399 803 -729 -1270 393 1278 -111 -1403 -520
1919 -520 1076 1072 -697 -1422 261 1536 73 -1176 -190 980 342 -615 -453 756 819 -596 -1066 664
1937 664 1426 -138 -1134 -4 1099 623 -624 -694 432 909 -155 -627 249 592 -362 -505 309 374 -159
1956 -159 -476 -271 460 291 -698 -630 356 227 -352 -335 105 52 -258 -332 11 337 -318 -726 179 759 -181
1977 -181 -1025 -186 734 230 -529 -442 430 637 -372 -763 510 884 -435 -755 421 940 50 -752 -306
1996 -306 991 872 -627 -870 590 1087 -286 -756 233 833 233 -700 -260 826 632 -749 -858 794
2014 794 1012 -504 -957 134 911 223 -870 -536 631 396 -766 -593 536 306 -587 -532 186 448
2032 448 -258 -737 -191 679 95 -791 -233 551 174 -537 -231 339 165 -340 -315 306 524 -249 -689 259
2052 259 853 -125 -720 -28 688 332 -471 -429 631 625 -438 -647 504 705 -244 -594 280 751 156 -682
2072 -682 -407 799 679 -585 -764 584 717 -360 -714 85 569 61 -761 -377 610 299 -827 -503
2090 -503 645 460 -506 -585 144 489 -70 -802 -175 597 147 -687 -258 591 189 -611 -365 355 368 -251
2110 -251 -684 98 739 -52 -621 51 759 121 -512 -172 345 443 -254 -406 411 707 -287 -580 305 669
2130 669 -42 -588 -43 606 415 -467 -443 528 568 -498 -444 509 373 -341 -428 111 543 144 -729 -330 539
2151 539 253 -752 -433 499 326 -401 -458 115 450 -182 -749 -36 753 -23 -889 -341 638 277 -579 -538
2171 -538 268 659 -148 -845 38 855 -107 -719 8 572 227 -447 -406 437 729 -284 -762 274 882 -99
2191 -99 -657 -35 579 316 -302 -233 304 474 -350 -496 457 494 -318 -430 203 459 -37 -520 -154 419 267
2212 267 -504 -267 435 141 -450 -195 401 155 -355 -519 174 618 -194 -834 -29 653 92 -729 -298 362
2232 362 244 -325 -498 114 568 -209 -672 192 708 -104 -755 -33 630 419 -470 -604 325 789 -89 -656
2252 -656 130 604 56 -330 81 365 253 -181 -195 354 391 -282 -459 332 468 -131 -302 -84 290 162 -226
2273 -226 -99 189 75 -408 -15 372 8 -611 -331 260 195 -203 -635 -115 424 -2 -669 -267 449 79
2293 79 -415 -286 269 333 -274 -452 160 586 24 -728 -80 681 322 -319 -397 203 430 109 -422 -35 339
2314 339 120 -188 49 298 8 -132 -19 122 258 138 -241 -68 220 93 -83 -54 -40 -15 192 142 -287
2335 -287 -210 -20 120 141 -117 -338 65 329 -170 -456 -14 176 54 -190 -141 133 222 -332 -411 128 408 -60
2357 -60 -671 -114 373 287 -245 -620 -42 709 99 -475 -229 276 275 -6 -294 61 282 122 -439 -60 363
2378 363 207 -298 -216 171 490 233 -312 -285 436 550 -262 -408 -49 305 273 -199 -404 153 486 -62 -483
2399 -483 22 345 150 -375 -275 189 330 -176 -645 -158 527 56 -461 -443 106 370 35 -467 -326 404
2419 404 214 -324 -255 234 122 -88 -228 -155 228 229 -290 -184 218 231 -121 -190 -122 165 370 -46 -408 18
2441 18 376 212 -188 -198 104 280 279 -264 -177 368 214 -228 -213 100 304 160 -301 -361 440 397 -393 -457 235
2464 235 592 99 -534 -412 373 405 -380 -561 60 483 -203 -552 4 370 142 -471 -456 141 513 -228 -639
2485 -639 124 391 -61 -464 -191 224 366 -185 -426 69 377 -23 -244 16 204 21 -13 -69 45 183 -38
2506 -38 -180 157 119 88 64 123 -70 -5 153 3 -2 -5 99 249 69 -219 -267 247 312 -197 -325 149 255 -2
2530 -2 -335 -89 350 210 -341 -316 310 304 -300 -519 114 440 -31 -541 -350 390 349 -374 -404 221 395 -204
2552 -204 -387 -45 416 162 -431 -385 296 361 -218 -297 219 319 66 -235 -102 429 235 -124 -175 277 177
2573 177 -116 -40 251 186 -17 -68 99 147 69 -142 -82 186 -95 -171 90 178 -77 -258 -53 206 41 -253 -232
2596 -232 363 249 -350 -406 231 382 -145 -394 46 348 94 -419 -294 316 175 -322 -416 279 396 -154 -431
2617 -431 -65 352 139 -385 -310 304 368 -231 -304 87 395 21 -206 38 414 203 -244 -178 261 228 -245 -150
2639 -150 174 231 7 -130 47 246 72 -216 -89 170 -128 -212 -18 195 -89 -193 -32 120 261 -189 -242
2660 -242 221 225 -170 -285 67 311 -94 -239 -81 302 53 -410 -275 303 289 -392 -380 123 279 -68 -320
2681 -320 -83 295 167 -337 -162 308 251 -247 -314 171 268 -47 -171 -67 381 248 -344 -139 271 140 -151
2702 -151 -125 42 214 -132 -112 26 250 -22 -164 22 277 -31 -250 -1 153 145 -150 -220 153 287 -175 -305
2724 -305 120 219 -142 -268 44 190 17 -311 -218 165 260 -242 -232 196 237 -137 -227 -17 150 34 -237 -168
2746 -168 219 121 -206 -174 334 182 -189 -110 92 191 101 -233 -77 208 12 -178 -13 274 26 -185 -61 220
2768 220 149 -1 -165 106 243 46 -214 78 143 87 -162 19 116 100 -148 -196 188 271 -127 -283 168 226 -149
2791 -149 -327 -109 131 135 -219 -180 30 242 -127 -250 113 127 -99 -215 -40 124 111 -200 -99 185 71 -176
2813 -176 -95 117 101 -56 -52 86 57 -45 0 143 248 24 -87 84 166 25 -154 10 212 8 -46 -82 68
2836 68 225 -14 -205 105 153 -88 -199 38 158 78 -142 -257 37 172 -132 -185 52 101 59 -206 -90 42
2858 42 45 -102 -227 -29 125 -107 -168 27 14 2 -65 -160 12 154 -45 -64 -23 87 -58 -36 59 -40 -42 -25 62 63
2884 63 -40 1 121 139 84 -13 128 184 13 -88 7 138 31 -164 -92 134 217 -92 -179 55 165 -82 -181 -119
2908 -119 80 94 -93 -214 43 166 -121 -257 -22 104 6 -110 -170 75 193 -158 -224 -32 192 -19 -92 -88
2930 -88 -30 123 -6 -35 8 131 -34 -93 15 70 -4 48 -73 -122 110 83 48 -96 -6 84 75 64 -148 61 165
2955 165 21 -101 -79 150 89 62 43 14 177 184 -72 -113 229 59 3 -110 -98 74 110 -127 -196 88 110 -60
2979 -60 -185 31 67 55 -101 -134 30 185 -68 -166 22 94 13 -118 -162 59 116 -10 -177 10 243 30 -101
3002 -101 -78 -22 97 111 -80 -73 209 136 -31 -108 44 103 52 -80 -127 32 203 9 -112 48 207 -12 -40 -97
3026 -97 88 207 -37 -74 76 72 56 -157 -46 31 86 24 -105 -38 108 7 -141 -66 -18 45 15 -172 0 139
3050 139 109 -130 -162 -13 60 -87 45 -88 41 73 -85 -102 -1 82 11 -28 -32 -78 53 134 -39 -58 110 108 -166
3075 -166 -97 15 227 77 -147 -115 170 122 -151 -166 29 191 31 -131 -75 75 226 -119 -100 159 142 -65
3097 -65 -113 -52 89 135 -108 -228 69 102 -30 -145 21 81 16 -87 -58 42 81 26 -135 67 62 7 -26 -81 -33
3122 -33 -27 65 0 -15 -25 34 60 -23 -102 -17 73 103 -86 -40 114 97 -10 -106 10 154 146 -67 14 180 87 -177 -202
3149 -202 109 153 -24 -97 -68 167 153 -109 -174 186 174 -51 -181 -11 114 40 -77 -196 60 88 -137 -104 16
3172 16 137 -23 -88 -33 12 90 -4 -124 -29 77 -75 -180 70 3 -52 118 20 0 -53 10 -21 72 -57 -86 59
3197 59 63 19 -50 50 67 119 -102 0 145 123 -85 -60 25 199 -60 -65 100 184 31 -67 -91 167 99 -151 -24
3222 -24 164 201 -67 -137 -4 140 61 -109 -48 110 150 -140 -198 -24 106 -12 -18 -4 52 10 -133 -44 143 28
3246 28 -143 -74 38 44 8 -66 17 65 86 -59 -56 61 10 -76 64 62 11 -6 101 16 51 -4 59 149 117 -50 -65 98
3274 98 59 -10 -87 33 190 177 -137 -98 121 208 -55 -144 106 125 -89 -74 -42 60 55 -173 -45 147 80 -165 -192
3299 -192 70 198 34 -114 -48 31 80 -71 -54 148 97 -71 -47 -1 91 -1 -139 40 95 -46 -156 18 140
3322 140 -5 -74 -37 78 95 -9 -124 45 75 9 -19 55 102 -1 -77 72 1 -5 -138 51 163 94 -63 -173
3346 -173 103 159 -94 -104 55 136 36 -68 -23 70 66 -155 -116 74 29 -18 -133 -1 96 -38 -122 12 179 24
3370 24 -33 -18 58 32 -47 -4 50 58 -91 -14 -54 124 37 -148 24 136 19 -126 -31 53 120 -133 -128 41 64 14 -56
3397 -56 57 197 128 -28 -3 153 0 -103 -25 140 188 -22 -135 28 139 97 -144 -17 79 33 -28 -85 45
3420 45 39 -6 -39 34 140 -51 -107 60 45 57 -153 -41 66 41 -25 -34 2 49 -73 -44 33 14 37 -4 -8 24 26 -218
3448 -218 4 142 9 -83 8 30 58 23 -85 49 160 -72 -58 37 130 -17 -114 -26 126 116 -138 -86 20 147
3472 147 5 -83 69 133 -11 -51 -102 -14 41 -43 -185 45 64 -111 -169 -15 92 -22 -140 39 -31 -27 -18 -12 83 23
3498 23 -45 30 1 -28 58 -9 -72 72 -71 -51 -49 66 -21 -13 51 102 30 42 7 12 58 -98 -45 54 32 -99 -111 147 197
3527 197 37 -27 -70 65 97 -108 -26 11 145 -4 -148 51 65 -18 -25 54 37 51 -37 -79 55 54 -16 -83 -25 -17 -44
3554 -44 -28 -21 38 -29 -135 -81 24 -12 8 -83 15 18 8 -56 -22 59 2 11 -72 92 -13 -28 58 57 -89 -47 16 -28 18 -1
3584 -1 -13 32 113 -104 43 65 44 124 -67 12 84 19 -84 -50 81 163 -38 -46 59 56 42 19 -57 69 92 -16 -118
3611 -118 1 44 -126 -79 -53 37 -35 -110 19 -21 -20 -64 -32 64 -6 13 -15 -114 0 34 -14 -107 -27 -22 14 -64 31 4 -18
3640 -18 -2 -50 -35 55 27 4 -28 20 58 61 22 -151 6 134 66 -30 38 -53 -42 72 -108 -89 68 39 37 -50 -4 79
3668 79 -11 -17 -70 4 -7 23 -27 6 40 19 -24 -40 48 -71 -3 -46 -46 169 -91 12 -6 -9 -14 47 -108 -26 81 79 -34
3697 -34 29 19 38 73 -92 46 -36 -9 41 -64 84 28 -20 1 13 4 83 -15 -39 78 76 -20 -67 -9 -18 84 33 20 -35
3726 -35 4 90 57 125 -51 -33 -11 -32 2 31 9 -57 -22 3 -72 78 41 -45 5 87 -36 -6 5 30 -21 -2 -109 -102 41
3755 41 0 -59 -9 46 -19 83 -113 43 -44 -56 19 -31 50 56 -59 32 37 9 59 -43 -39 72 34 19 -9 24 102 -27
3783 -27 19 -23 13 -23 19 65 -28 -23 82 -75 90 -11 37 54 -81 -24 -54 0 -100 -79 -119 11 -33 3 -27 -53 -26
3810 -26 1 -5 42 -25 -3 5 -48 -19 57 -16 -67 -20 42 -20 67 65 -54 78 -53 -90 -87 39 26 -10 -15 -15 -30 -3 10 -106 84
3841 84 17 -62 -52 -30 35 98 -73 -33 32 -10 -72 -82 5 -16 -3 -3 -2 39 37 -4 43 -39 27 55 -40 -29 98 -49 14 31
3871 31 -52 -51 40 -25 11 31 -103 17 58 -25 55 33 26 71 -9 -20 -29 31 2 -107 101 16 -51 -31 4 67 -84 2 8 137
3901 137 52 -53 13 158 84 44 -84 32 75 -53 10 44 108 89 -96 -23 22 67 -2 6 63 8 -23 -56 -32 90 0
3928 0 47 -49 80 -2 -29 90 -13 -72 -74 -18 -32 -39 -8 -33 -25 -64 -45 -17 23 -58 -12 5 -39 -48 19 -46 38 33 30 -47 -12 85
3960 85 -48 -4 -15 -1 -16 29 77 44 35 46 -38 26 72 -4 20 52 20 31 35 -77 75 49 37 -9 -109 3 -47 -20 6
3989 6 -3 -11 -6 18 5 -31 -17 -54 -65 51 27 48 -16 34 -53 18 -59 87 37 -76 85 4 7 7 -70 -9 84 85 11 -23 -29 12
4021 12 -63 6 41 79 -9 15 -2 78 -26 11 -46 29 74 -74 15 36 99 -43 2 -53 -50 -20 80 -59 -14 49 -42 13
4049 13 0 136 -5 -66 -22 48 -16 25 20 19 -25 -55 -25 -8 -12 -42 -62 -4 16 -62 -93 -66 9 43 -19 17 69 91 -113 10
4079 10 12 21 -37 -24 64 -32 56 -96 -33 20 -69 -18 -4 -51 40 -7 -19 73 -19 34 -25 71 24 23 60 -56 -75 -32 -102 3
4109 3 54 45 101 -55 -55 -4 -14 -67 13 80 -63 -1 26 72 -85 -26 21 5 17 39 18 -29 39 -40 -39 -25 32 -63 -27 33 82
4140 82 22 -55 15 -90 43 31 -4 -44 -21 33 -17 64 57 15 92 -5 41 -45 -52 -32 -53 -23 17 -63 -38 47 2 -56 -53 44 98
4171 98 9 32 66 -30 39 -45 0 -15 -3 76 27 -92 115 -2 -38 -44 17 -45 -21 -18 -4 63 -59 -34 46 -43 8 59 116
4200 116 -51 32 43 29 0 -4 -17 -13 -40 -21 -39 -49 -5 2 1 -22 32 -8 -85 -59 -38 -79 -23 -22 -4 -76 53 46 -59 -37 18
4231 18 -12 22 50 62 68 -15 -15 -12 34 20 2 -23 -14 -62 2 -41 26 100 -31 27 18 50 45 114 -73 8 -46 -17 104 -9 -13 -46
4263 -46 45 -92 -58 -33 70 80 -90 -3 -56 -5 28 -41 -49 39 12 25 50 31 18 18 69 31 83 -17 5 -60 -11 -44 -72
4292 -72 -27 -6 50 39 -3 29 27 -51 54 -13 25 78 60 20 37 44 -1 -74 118 -50 -24 -4 55 20 16 76 -12 0 -46 -12
4322 -12 -9 32 -55 -27 -1 -8 -9 27 -31 -5 -19 -50 -133 -17 14 -32 -8 11 89 34 -45 81 -55 4 -68 26 10 -54 -17 -95
4352 -95 63 34 22 5 28 69 59 -66 91 4 101 13 4 26 6 19 -57 -110 38 47 11 49 -27 43 32 -23 -36 -85 -5
4381 -5 4 67 -22 -24 18 -3 -35 34 -44 13 -15 7 1 20 24 -32 0 -117 -59 31 25 3 8 39 -3 -72 0 -21 43 30 42 78 9
4414 9 -7 24 57 59 45 59 55 -67 46 52 -14 -12 -62 -58 19 -1 -108 -44 32 -19 83 -33 -41 -21 1 -117 -64 40 -28 -3
4444 -3 10 -11 -72 -5 17 15 -91 27 85 -28 -9 10 -33 -35 -63 53 -47 -50 0 -29 54 17 -31 -34 -53 -90 26 -4 86 -24
4474 -24 -17 -8 58 40 -26 126 25 -6 18 17 -23 46 -21 32 -40 80 -19 0 -96 -7 -44 58 -13 -26 -12 -28 -9 -75 74
4503 74 -23 -12 26 -80 17 -32 -27 -127 -31 -59 -11 36 -9 -89 34 -71 -9 -1 -60 -10 2 68 12 43 23 -34 -40 37 64 54
4533 54 -2 -7 -2 68 -36 -74 6 6 65 -72 3 -7 -13 41 36 26 3 83 -16 -70 -56 -20 25 -8 -39 -53 -81 29 17 26 29 -69
4565 -69 -16 38 -54 28 -31 -46 -43 -6 -54 18 4 32 -2 27 38 -42 -17 -8 -81 16 -55 12 -10 -64 34 24 43 -27 -40 52 11
4596 11 -9 75 -27 -35 53 20 -23 31 -30 -76 -32 -29 -11 53 -54 -114 84 19 -57 -36 41 47 -33 -13 89 34 -11 30 21 14 -14
4627 -14 103 -8 -38 -44 -77 7 -34 85 -68 -46 -108 -19 21 2 -157 -71 51 -45 -1 49 132 12 -1 18 35 11 19 13
4655 13 -68 -18 -15 39 4 69 -38 -30 -42 -3 44 63 4 -8 -129 75 4 15 113 24 40 -16 -12 55 13 -112 5 -57 -1
4684 -1 179 -38 -91 -48 -27 31 37 32 53 13 -96 -18 35 -11 -5 -46 38 -79 41 -69 32 79 -13 6 -8 68 -19 80 20
4713 20 23 5 -4 17 46 2 40 40 12 52 65 -34 70 -41 27 37 7 -36 22 39 1 -25 -57 31 15 -2 10 -32 -29 -50 -26
4744 -26 -20 -52 -8 24 -56 61 -15 -3 -15 -57 9 88 42 23 15 10 -36 78 40 1 -81 45 -33 15 42 31 48 -6 55 -5
4774 -5 -15 -54 -94 39 -54 -15 45 -46 -80 28 -8 -41 -9 -16 -16 89 -55 47 -15 20 9 79 60 26 55 23 -10 60 -20
4803 -20 -99 28 -38 -3 -29 -80 -24 -16 29 59 -8 49 39 -39 14 -9 -19 -55 8 94 -63 17 78 33 -3 5 33 29 51 3 14
4834 14 47 93 -28 21 -6 15 -1 -2 -7 -33 29 44 61 -100 25 78 -11 27 -10 15 -17 -58 -40 17 15 85 -35 94 58
4863 58 -28 -57 17 77 -19 42 51 63 81 13 47 -18 -64 40 -59 5 15 42 23 -12 98 15 5 -3 44 -1 -54 -44 -65 53
4893 53 -86 6 -63 -24 -43 41 -16 -53 -44 2 -29 24 57 71 -18 13 -9 -37 -3 -72 18 -44 37 -11 36 40 23 90 51 63 3
4924 3 15 33 -9 -42 143 79 -4 0 2 34 65 32 60 31 17 54 -48 81 44 73 22 -7 33 26 -17 -52 31 -68 -92 68
4954 68 24 -22 16 103 -15 -8 50 37 9 -10 -64 13 17 28 -49 -22 -36 -52 -61 24 -4 -29 48 -53 17 36 32 37 -2 -75 1 -21
4986 -21 53 10 41 33 71 -2 -30 50 -23 25 77 52 51 -31 -58 -7 -11 -9 77 -73 -19 -37 -72 46 -47 -27 12 33 -54 67 -56
5017 -56 5 10 -5 67 -44 24 -46 -7 0 10 6 2 2 -60 -21 19 10 -6 -49 -80 110 18 31 41 25 -5 68 -6 17 1 33 -22
5049 -22 6 8 -25 -12 58 89 -63 -2 -35 -43 -12 -36 -21 -98 -8 -8 60 -5 46 -63 -4 9 -27 4 -14 -18 -32 -24 16 -28 -26 -54
5081 -54 56 38 -71 16 -1 -12 -53 -26 17 18 21 4 36 18 12 29 -75 -16 -13 24 -27 -2 -3 -8 -71 -7 -44 -9 -25 -78 42
5112 42 -16 16 -63 71 -97 27 66 53 -7 -37 -11 60 23 -20 -39 -4 90 45 -97 17 8 -78 68 113 -23 -38 4
5139 4 105 45 -27 -38 -91 -22 -55 33 -2 36 78 105 -18 -17 10 -21 -45 66 -41 -15 -20 -37 28 22 -85 -1 42 13 36 70
5169 70 -53 38 12 32 30 48 -36 10 69 -20 -7 4 -22 0 30 -57 43 20 25 34 -25 -10 8 54 41 -80 29 -101 99
5198 99 -8 17 -8 -23 -6 28 -2 13 41 -16 88 77 52 -6 -34 12 -17 -28 -51 -69 63 -16 -37 73 -41 30 31 -37
5226 -37 -50 -51 91 31 51 -65 -40 16 -11 74 36 11 15 24 6 -27 20 -97 -20 -21 -12 -58 -7 107 -3 39 7 17 -8 -23
5256 -23 8 30 7 54 -39 -26 -118 4 -39 19 -48 6 -49 -22 -38 -10 -23 62 27 -106 -57 10 -103 70 -66 -43 33 75
5284 75 78 0 12 -33 21 8 56 -18 -29 -48 -13 -81 16 37 70 6 -67 15 -78 -52 -32 -73 16 -17 45 15 -17 -59 38 -18 41
5315 41 21 12 -2 -31 -36 -50 -5 -50 20 45 2 -60 21 25 -62 52 -31 -29 24 21 43 1 44 -27 -45 15 40 -10 -61 85 -20
5346 -20 29 59 -79 69 -31 27 -10 14 20 -145 -5 -3 19 125 -100 41 30 -14 -87 14 -43 -1 1 23 -8 -23 3
5373 3 21 -12 16 6 51 -14 -8 76 30 10 0 -23 -68 -31 -44 3 38 9 19 20 -12 27 15 13 -3 22 20 30 32 72 -5 -18 37
5406 37 -24 -4 -53 33 4 -47 -75 39 28 -14 -5 27 105 -12 -87 -23 17 12 18 -33 -6 -71 -112 18 -2 -60 47 14 -7 -50
5436 -50 55 -3 -28 4 26 75 -4 33 26 -78 33 4 36 -67 -46 12 50 13 33 64 -72 -42 -57 38 61 51 35 -19
5464 -19 -7 36 39 -57 54 -36 3 -46 30 -24 -27 1 26 -36 19 40 -16 50 16 -69 114 49 5 15 89 -49 18 35 38 81
5494 81 -85 -17 37 -4 -26 -54 -12 39 -11 32 -15 -4 24 19 44 83 -6 0 33 1 58 -15 47 0 -51 6 -27 38 -5 -20 -52
5525 -52 -11 17 -21 -51 -22 8 44 -87 -28 61 -8 47 0 14 75 45 3 28 -48 14 70 -7 38 40 16 0 12 -6 29 5
5555 5 69 -41 8 4 -21 11 -39 -22 53 56 20 34 -5 13 100 48 -15 -36 24 37 59 103 -49 -40 -8 -97 56 -79 -31 159
5585 159 7 -58 -29 52 -70 -22 43 -34 35 -24 21 29 -5 16 38 -106 -27 91 -59 57 23 47 -37 38 43 -4 -46 40
5613 40 36 43 20 -82 -37 0 50 -24 -52 38 -39 -68 4 83 -71 -78 -4 35 4 35 42 -43 4 25 44 -23 -89 -45 66 -49
5643 -49 -17 -72 -49 -37 -32 64 -43 6 38 69 74 27 32 -30 -19 -56 -20 104 3 -2 -22 -21 -14 -18 -39 -19 88 -34 -20 -68 -88
5674 -88 -58 16 126 10 -12 -17 -31 20 -30 135 1 70 -53 21 57 52 -45 -38 -9 40 73 -3 59 -23 101 32 50 29 -7
5703 -7 107 47 -28 -34 89 -67 43 -90 -47 -67 -12 -12 -69 -26 65 11 44 -41 -41 -30 8 70 -49 -26 22 35 11 -46 -2
5732 -2 60 15 7 55 -13 39 -15 40 17 79 10 -50 -6 -12 30 69 -37 38 -11 -39 -75 32 17 -1 56 -6 8 -5 -9 17 -37
5763 -37 -17 -1 -81 17 22 -42 -41 36 29 24 37 39 -70 -57 12 -48 3 -5 13 -46 18 30 -89 27 -129 -8 37 21 -10 13 33
5794 33 28 64 -48 -22 74 -12 87 75 -66 21 -73 -45 -60 -46 -17 57 22 45 41 62 -106 -73 -44 -67 45 -29 -6 -57 111
5823 111 -43 -62 -22 41 8 6 92 51 105 27 -20 2 -36 -19 21 50 -59 -61 8 68 9 46 6 0 -73 55 16 -43 1 40
5853 40 32 64 -27 -24 54 -126 -58 -4 -35 -14 -5 -45 31 39 97 21 56 24 5 -61 -62 95 3 -19 119 109 -90 -112 -84 -60 -58
5884 -58 -79 62 -31 -68 -20 -19 50 -40 11 2 39 -6 0 2 20 44 -12 146 -28 43 30 23 46 -19 -19 6 -54 125 -24 -20 -42
5915 -42 -96 27 -34 5 99 -6 -24 -97 11 -40 8 -29 -45 -68 51 59 -35 132 5 -51 -17 4 -59 -19 -26 18 50 20
5943 20 -24 -9 33 -14 -73 -104 5 -35 17 42 -89 -78 -3 -76 -55 69 44 6 11 40 53 15 27 -28 48 -129 19 36
5971 36 3 -11 4 -81 7 51 10 -60 -38 -27 66 32 -38 39 59 40 26 68 56 -61 16 -59 24 52 -15 -2 31 -35 -9 -12
6001 -12 35 52 -71 -30 31 -6 -58 -43 16 104 27 12 -67 98 -31 6 32 -20 -26 14 21 60 68 -11 2 30 90 -42 21 102
6031 102 34 -4 8 58 -19 -95 29 28 67 46 3 5 20 95 -20 -57 33 -99 4 32 -16 -98 -30 -7 -12 33 -42 -50 10 19
6061 19 11 9 -52 -27 0 2 -50 61 9 28 -4 -47 63 53 -35 9 88 39 107 -51 18 -93 19 37 -47 10 34 -32 -2
6090 -2 -42 -47 -20 -122 13 -25 -26 -18 55 57 37 -53 16 -11 29 111 -30 33 -52 -68 -117 27 -5 6 99 -56 55 72 -20 -12
6120 -12 -73 -26 41 -24 -36 -90 -61 -93 3 39 -21 -60 -30 66 112 41 -31 -41 -60 89 70 -17 -45 61 -43 0 85 65 32
6149 32 -82 -29 -1 -4 29 -15 -47 -45 104 -7 31 58 2 62 -6 -36 52 -37 46 19 49 -34 -32 10 48 31 5 -32 -29 20 -27
6180 -27 19 -47 -37 54 59 30 -30 -9 28 19 -31 44 -38 -13 78 -97 -52 -21 -51 7 -69 -19 11 49 -28 -8 64 -5 -27 53 30
6211 30 -74 7 -62 -51 -17 31 37 -18 16 -67 15 -134 27 41 -16 42 -19 66 -28 -63 -76 19 46 -86 -40 17 29 40 69
6240 69 29 46 -29 56 49 -34 68 31 -11 -18 -25 83 -35 41 -23 4 -10 -32 27 -34 -27 22 27 -12 18 -14 -58 -26 3 36 44 113
6272 113 31 -46 30 -51 -47 7 0 9 -19 17 58 43 89 -90 -63 -20 26 93 -31 2 -1 6 40 19 -17 37 3 -35 13 8 -25 -16
6304 -16 77 -1 8 91 21 -54 22 -24 -37 20 -15 55 -18 68 -72 63 24 64 -21 12 -83 -18 -6 36 46 73 11 -44 66
6333 66 24 40 -43 -22 31 32 -71 -40 -2 -30 -36 -23 1 12 5 50 -59 -53 24 -18 -71 -96 -48 -1 58 -56 -62 39 1 -27 -83
6364 -83 37 -28 -13 11 0 -10 32 -68 46 7 103 89 -37 12 -84 -36 -12 27 86 -15 -46 -29 -75 -22 -24 14 71 29
6392 29 31 22 -4 -12 -68 -29 41 -12 37 -51 1 -25 -11 47 -10 21 -3 2 27 32 -42 -44 9 -18 6 19 -28 -44 4 -29 -2 35 -81
6425 -81 105 -57 -8 -42 12 0 -25 24 11 25 -2 -7 63 15 56 64 18 74 -28 41 106 32 49 51 11 27 13 82 9 -29
6455 -29 37 -38 37 -1 12 45 52 -21 -2 -51 -13 38 17 -24 -57 6 22 47 0 -39 82 -86 29 -62 -3 -12 37 -100 79
6484 79 39 -29 5 -69 -11 -4 45 24 23 -10 -51 -56 25 -73 -103 1 45 -74 -40 25 6 44 12 -36 20 -9 65 8 -32 -149
6514 -149 8 -49 119 -64 -24 -59 -12 -47 38 -11 8 13 117 -40 -81 43 92 -16 -28 -21 28 12 67 -33 43 -41 -36
6541 -36 68 -31 80 8 11 47 69 -14 67 11 67 80 -39 -10 120 -2 -3 29 9 -37 20 28 -8 39 -8 51 68 -76 20
6570 20 -47 34 92 22 29 -69 -17 -5 1 79 -27 -12 -113 -35 46 6 -20 -14 -5 -39 -30 61 28 -54 -71 0 -41 -9 -14 62 24 -46
6602 -46 -5 23 35 5 24 35 -2 26 28 -24 34 -38 13 52 81 19 -60 6 -3 -47 3 -44 25 55 1 -79 136 -11 45 0
6632 0 -9 -49 -11 -15 -113 13 -51 14 -2 -11 20 31 7 -35 11 50 -31 -72 -30 -24 5 58 57 56 15 41 -65 10 -26 15 -24 50 79
6665 79 35 63 5 24 8 -73 53 -11 -19 25 37 3 -31 -4 -2 82 82 -7 47 97 47 4 8 21 65 77 46 -44 -8 21 98 -3
6697 -3 -15 -15 8 -13 16 48 -84 -10 -31 51 46 -1 -24 34 8 -25 52 -59 17 9 72 -15 63 -16 -7 54 90 -76 35 -57 50
6728 50 29 -69 -14 26 49 12 -108 -58 -16 40 102 113 -10 24 25 -10 -67 0 1 -13 64 -47 84 99 46 -2 23 13 -17
6757 -17 -12 -57 14 74 -23 -6 -18 77 -75 13 45 49 7 -78 -88 123 -60 -97 27 -7 16 -10 31 -4 -9 17 37 -19 55 -54
6787 -54 4 0 -13 -72 32 84 78 39 37 70 -40 -87 89 45 -74 33 -15 39 25 113 4 76 -84 -5 -28 64 75 77 59
6816 59 32 24 12 4 35 -38 13 16 -20 32 56 -57 11 27 13 54 -73 64 -50 59 -37 113 8 59 9 -10 -5 -55 48
6845 48 -39 33 127 -1 36 -22 98 18 -147 67 -10 -25 40 -37 -50 78 17 11 -52 7 -79 72 23 18 -31 65 70 -16 -6
6874 -6 45 -57 -38 -84 21 4 -60 -79 41 -22 -26 72 -41 -19 11 17 26 -38 44 11 2 -78 -31 -2 27 26 19 -30 35 -56 11 -107
6906 -107 -96 -23 2 -53 54 71 -11 -71 -35 8 40 68 12 16 -34 -5 41 20 7 -10 -32 -15 -49 0 32 -5 -66 27 35 67
6936 67 41 -33 7 -33 53 51 24 -26 12 77 -14 16 54 -56 6 44 11 82 21 105 -2 1 -30 -59 -78 -39 39 72 92 -24
6966 -24 38 -34 -15 -11 -42 98 85 61 -30 -71 -18 -12 3 17 -18 -20 10 89 -7 -11 -33 -40 -5 5 -84 27 -46 -47 75 8 12 16 55
6999 55 -96 -9 -81 14 35 66 31 56 36 -3 57 -22 57 55 -55 -38 -54 89 -50 11 -16 -9 -11 -20 96 4 -48 -37 12 -1
7029 -1 -54 -60 -16 -18 6 9 47 36 -32 -23 53 -26 -49 -11 -25 -43 -7 63 87 5 -17 30 -5 -13 -35 -4 95 -36 9 -25 59 -24 98
7062 98 21 -14 -59 -42 29 58 75 -14 -14 -31 9 -23 -52 -112 8 42 -11 90 30 44 -24 -91 -21 -27 -75 -84 -68 54 61 -46
7092 -46 -12 51 70 29 11 51 26 -27 15 29 -13 -2 16 19 29 -51 -9 -27 61 -48 73 54 9 2 55 -8 -33 -53 21 -19
7122 -19 5 25 19 -24 -36 -40 -6 19 -59 26 114 33 9 -22 -61 -11 21 43 -94 -17 16 60 22 -9 -33 1 79 -25 11 10 76
7153 76 -16 10 -83 -27 -62 49 -48 22 24 53 64 13 -18 -120 28 -74 -34 19 -22 64 23 -74 -82 -11 -110 29 -52 -1 11
7182 11 -89 5 -14 -27 99 11 58 -69 55 12 77 -45 47 94 32 57 41 34 -71 -36 -95 37 -23 61 18 -12 31
7209 31 -9 -45 56 11 -119 -44 42 -31 16 -14 -63 31 -20 7 2 50 55 0 -79 4 6 -19 110 59 -4 43 -13 51 -16 44
7239 44 -65 -31 -86 30 55 -23 -1 19 33 -37 -2 -57 103 -13 -47 -54 24 35 -7 -2 4 9 36 31 4 26 -20 32 -48 -2 14
7270 14 33 39 -15 -12 -21 32 -65 78 -12 -17 -73 -34 -58 20 32 16 -36 -16 6 3 64 -64 -32 -30 -1 17 -2 46 -11 93 9 33
7302 33 -28 -82 36 24 -38 0 -48 -10 66 23 37 74 1 3 -1 21 -17 7 28 -64 -19 -44 2 53 -71 109 80 -43 -54
7331 -54 4 -18 -73 22 5 48 24 1 -105 42 -57 -32 -21 -59 -14 -51 7 -14 6 -49 -31 -14 18 37 38 37 -71 -45 -31 22
7361 22 22 -104 -16 -94 30 -5 -77 38 42 77 21 9 -53 15 -30 16 -23 -71 -49 111 85 -76 -28 -39 16 -11 29 -46 -55
7390 -55 35 -60 35 -8 14 28 15 -9 -6 24 35 -47 -6 -11 -22 16 -20 3 -9 -40 4 89 -45 -24 50 -15 11 17 -18 -1 -27
7421 -27 -10 -18 3 -71 -6 -17 -21 -14 20 31 -19 28 -41 -72 53 47 25 52 -71 43 -6 -9 15 -14 36 38 -71 29 -99 -77
7451 -77 37 1 12 38 99 33 49 -47 34 -11 6 -19 22 -3 35 -98 -17 0 59 9 -8 61 15 44 39 -65 -123 -60 -15
7480 -15 114 -58 -73 13 48 1 19 41 -5 40 15 -30 48 -35 35 -117 8 -20 48 -60 58 -20 -30 -9 65 -5 -67
7507 -67 -37 -148 -21 74 -19 17 18 -27 -19 -63 -30 -34 -9 -3 58 -13 -18 -66 -49 9 48 56 45 -33 1 10 -115 -36 -3 47 8 -90
7539 -90 54 -22 -9 7 -8 61 50 -26 99 -40 17 -36 24 74 -43 -95 -5 8 9 -52 7 -8 -16 -3 79 70 -121 -35 45
7568 45 43 29 74 -22 64 -6 -20 29 91 -1 -28 11 11 -34 -38 18 32 16 39 10 21 -28 35 -29 -8 -8 30 -68 -7 -8 82 -51
7600 -51 13 -54 15 -18 -18 62 18 -8 -8 62 -104 1 -19 11 25 8 66 -27 25 -54 -73 -73 -53 30 1 35 14 20 -4 7 67
7631 67 6 11 1 24 -59 -53 3 -9 19 15 36 8 -41 30 120 -87 -14 3 18 18 -33 -11 19 3 93 23 13 22 19 -34 54 -72
7663 -72 1 92 7 9 39 17 -59 50 -21 -62 -62 19 17 19 2 -81 16 -80 104 57 11 -22 33 52 28 -14 54 -23 75 -75 27
7694 27 28 -17 19 -29 7 102 -46 32 15 10 9 -6 41 53 60 32 87 -1 16 134 61 -39 32 8 -24 -28 62 -2 -108 36
7724 36 -85 -20 76 22 -18 4 -53 -47 30 87 10 -16 -7 -35 -46 -40 10 22 -48 -51 37 52 21 31 8 27 15 -19 21 8 62 65
7756 65 1 67 -35 -17 -25 -6 54 -74 55 -12 -29 32 61 15 15 -25 1 64 -82 34 9 -3 -35 41 4 20 16 0 10
7785 10 22 10 87 42 9 12 75 60 -43 -49 19 -23 -33 11 -22 28 -33 81 86 -28 -20 0 -77 3 36 -3 67 -44 -19 45
7815 45 -16 19 -97 -125 -77 -21 -51 -87 38 -13 -32 86 -71 -31 -11 79 13 -82 6 -37 8 25 -42 7 87 92 33 25 5
7844 5 29 67 3 77 56 40 -30 27 -48 37 49 35 112 57 18 35 -27 15 68 -7 -12 -26 -94 -20 -27 -94 63 -14 28 7 4 -21
7876 -21 -55 48 -23 31 103 11 -36 58 -2 -19 8 -35 -41 68 24 -4 -88 -12 -46 43 1 -8 27 0 100 21 34 -55 -16 -35
7906 -35 -35 -40 -54 -16 11 -108 -71 -54 -62 -29 -32 53 -23 76 45 -41 -28 -64 -12 16 -41 -24 -31 -20 9 -18 24 -6 37 21 4 7 42
7939 42 90 -9 64 20 53 34 -33 -27 57 -34 -39 -34 15 -47 43 -65 75 -1 33 -89 12 -25 13 -32 -18 5 45 39 30 -5 -2
7970 -2 25 -14 -17 16 -51 36 4 25 1 -20 -30 36 53 24 -28 31 24 16 -17 40 -39 77 33 46 31 0 -43 33 18 3 93 55
8002 55 54 -31 77 59 9 48 -18 69 -12 2 -85 42 -14 43 -4 -77 30 25 -35 -96 -59 46 31 -9 38 66 -19 13 -12
8031 -12 102 3 -33 76 -53 8 26 -6 90 117 -63 -47 -77 -67 40 66 -26 17 16 33 61 20 52 21 -21 51 82 3
8059 3 -34 1 -11 -8 17 -81 98 -12 -3 102 -55 14 51 -104 31 46 15 -19 -27 52 18 72 -34 -64 56 105 -10 -3
8087 -3 -36 -7 -40 -107 -10 64 5 -10 -3 -40 33 54 32 -29 10 -3 35 29 -23 26 88 8 4 70 -49 -52 -59 33 33 48 -26 16 37
8120 37 60 -6 -36 83 -29 9 64 19 -32 57 67 47 -56 23 -18 -49 -60 44 -37 40 33 26 -61 111 52 -2 62 -67
8148 -67 21 -44 6 -90 34 -7 -122 52 -17 -6 101 -1 60 -102 -41 9 -38 -73 -32 -43 7 41 -44 -84 59 -29 -95
8175 -95 -85 -21 26 -52 -1 -65 22 13 26 -22 -9 17 80 -74 -28 -1
8191a
##END NTUPLES=NMR FID
##END=
