##TITLE=1H ikalashn
 3754
16.10.2024
##JCAMPDX= 6.0         $$ Bruker NMR JCAMP-DX V2.0
##DATA TYPE= NMR FID
##DATA CLASS= NTUPLES
##ORIGIN= UXNMR, Bruker Analytische Messtechnik GmbH
##OWNER= root
$$ TOPSPIN		Version 1.3
$$ 2024-10-16 16:04:51.609 +0400  Irina@DPX200
$$ Compression mode = diff/dup
##.OBSERVE FREQUENCY= 200.131392401
##.OBSERVE NUCLEUS= ^1H
##.DELAY= (6, 6)
##.ACQUISITION MODE= SIMULTANEOUS
##.ACQUISITION SCHEME= undefined
##.AVERAGES= 32
##.DIGITISER RES= 18
##SPECTROMETER/DATA SYSTEM= spect
##.PULSE SEQUENCE= zg
##.SOLVENT NAME= CDCl3
##.SHIFT REFERENCE= INTERNAL, CDCl3, 1, 17.95386
##AUDIT TRAIL= $$ (NUMBER, WHEN, WHO, WHERE, WHAT)
$$ ##TITLE= Audit trail, TOPSPIN		Version 1.3
$$ ##JCAMPDX= 5.01
$$ ##ORIGIN= Bruker BioSpin GmbH
$$ ##OWNER= Irina
$$ $$ F:/spectra/data/iren/nmr/1H/4/audita.txt
$$ ##AUDIT TRAIL=  $$ (NUMBER, WHEN, WHO, WHERE, VERSION, WHAT)
(   1,<2024-10-16 16:04:28.734 +0400>,<Irina>,<DPX200>,<TOPSPIN 1.3>,
      <created by zg
	started at 2024-10-16 16:02:19.234 +0400,
	POWCHK disabled, PULCHK disabled
       terminated by command 'halt'
       configuration hash MD5:
       BE 6D 3F 07 2A EA 11 49 91 17 2B D3 AF B3 58 0D
       data hash MD5: 16K
       ED A4 33 1A 87 CC EF 30 74 4D 1D B8 3F DA 8F 89>)
$$ ##END=
$$ 
$$ $$ hash MD5
$$ $$ FC D2 63 56 DC 23 F9 39 87 AC 97 2B A7 A5 DD 62
##$RELAX= 
##$RELAX= 
##$RELAX= 
##$RELAX= 
##$RELAX= 
##$RELAX= 
##$RELAX= 
##$RELAX= 
##$RELAX= 
$$ Bruker specific parameters
$$ --------------------------
##$DU= <F:/spectra>
##$EXPNO= 4
##$NAME= <1H>
##$PROCNO= 1
##$TYPE= <nmr>
##$USER= <iren>
##$AMP= (0..31)
100 100 100 100 100 100 100 100 100 100 100 100 100 100 100 100 100 100 
100 100 100 100 100 100 100 100 100 100 100 100 100 100 
##$ANAVPT= -1
##$AQSEQ= 0
##$AQ_mod= 1
##$AUNM= <au_zg>
##$AUTOPOS= <>
##$BF1= 200.13
##$BF2= 200.13
##$BF3= 200.13
##$BF4= 200.13
##$BF5= 200.13
##$BF6= 200.13
##$BF7= 200.13
##$BF8= 200.13
##$BYTORDA= 1
##$CFDGTYP= 0
##$CFRGTYP= 5
##$CHEMSTR= <none>
##$CNST= (0..63)
1 1 145 1 1 1 1 1 1 1 1 1 1 1 1 1 1 1 1 1 1 1 1 1 1 1 1 1 1 1 1 1 1 1 
1 1 1 1 1 1 1 1 1 1 1 1 1 1 1 1 1 1 1 1 1 1 1 1 1 1 1 1 1 1 
##$CPDPRG= <>
##$CPDPRG1= <>
##$CPDPRG2= <>
##$CPDPRG3= <>
##$CPDPRG4= <mlev>
##$CPDPRG5= <mlev>
##$CPDPRG6= <mlev>
##$CPDPRG7= <mlev>
##$CPDPRG8= <mlev>
##$CPDPRGB= <>
##$CPDPRGT= <>
##$D= (0..63)
0 2 0 0 0 0 0 0 0 0.06 0 0.03 0 0 0 0 0.0002 0 0 0 0 0 0 0 0 0 0 0 0 0 
0 0 0 0 0 0 0 0 0 0 0 0 0 0 0 0 0 0 0 0 0 0 0 0 0 0 0 0 0 0 0 0 0 0 
##$DATE= 1729080266
##$DBL= (0..7)
120 120 120 120 120 120 120 120 
##$DBP= (0..7)
150 150 150 150 150 150 150 150 
##$DBP07= 0
##$DBPNAM0= <>
##$DBPNAM1= <>
##$DBPNAM2= <>
##$DBPNAM3= <>
##$DBPNAM4= <>
##$DBPNAM5= <>
##$DBPNAM6= <>
##$DBPNAM7= <>
##$DBPOAL= (0..7)
0.5 0.5 0.5 0.5 0.5 0.5 0.5 0.5 
##$DBPOFFS= (0..7)
0 0 0 0 0 0 0 0 
##$DE= 6
##$DECBNUC= <off>
##$DECIM= 32
##$DECNUC= <off>
##$DECSTAT= 4
##$DIGMOD= 1
##$DIGTYP= 9
##$DL= (0..7)
0 120 120 120 120 120 120 120 
##$DP= (0..7)
$$ [...]
##$SW= 21.9925939549014
##$SWIBOX= (0..15)
0 0 2 0 0 0 0 0 0 0 0 0 0 0 0 0 
##$SW_h= 4401.40845070422
##$TD= 16384
##$TD0= 1
##$TE= 300
##$TE2= 300
##$TE3= 300
##$TEG= 300
##$TL= (0..7)
0 120 120 120 120 120 120 120 
##$TP= (0..7)
150 150 150 150 150 150 150 150 
##$TP07= 0
##$TPNAME0= <>
##$TPNAME1= <>
##$TPNAME2= <>
##$TPNAME3= <>
##$TPNAME4= <>
##$TPNAME5= <>
##$TPNAME6= <>
##$TPNAME7= <>
##$TPOAL= (0..7)
0.5 0.5 0.5 0.5 0.5 0.5 0.5 0.5 
##$TPOFFS= (0..7)
0 0 0 0 0 0 0 0 
##$TUNHIN= 0
##$TUNHOUT= 0
##$TUNXOUT= 0
##$USERA1= <user>
##$USERA2= <user>
##$USERA3= <user>
##$USERA4= <user>
##$USERA5= <user>
##$V9= 5
##$VALIST= <valist>
##$VCLIST= <CCCCCCCCCCCCCCC>
##$VD= 0
##$VDLIST= <DDDDDDDDDDDDDDD>
##$VPLIST= <PPPPPPPPPPPPPPP>
##$VTLIST= <TTTTTTTTTTTTTTT>
##$WBST= 1024
##$WBSW= 25
##$XGAIN= (0..3)
0 0 0 0 
##$XL= 0
##$YL= 0
##$YMAX_a= 351708
##$YMIN_a= -201929
##$ZGOPTNS= <>
##$ZL1= 120
##$ZL2= 120
##$ZL3= 120
##$ZL4= 120
##$ABSF1= 10
##$ABSF2= 0
##$ABSG= 5
##$ABSL= 3
##$ALPHA= 0
##$AQORDER= 0
##$ASSFAC= 0
##$ASSFACI= 0
##$ASSFACX= 0
##$ASSWID= 0
##$AUNMP= <proc_1d>
##$AXLEFT= 0
##$AXRIGHT= 0
##$AXTYPE= 0
##$AXUNIT= <>
##$AZFE= 0.1
##$AZFW= 0.1
##$BCFW= 1
##$BC_mod= 2
##$BYTORDP= 1
##$COROFFS= 0
##$CY= 7568.61572265625
##$DATMOD= 1
##$DC= 2
##$DFILT= <>
##$DTYPP= 0
##$F1P= 17.9538593292236
##$F2P= -4.03888763876832
##$FCOR= 0.5
##$FTSIZE= 32768
##$FT_mod= 4
##$GAMMA= 1
##$GB= 1
##$INTBC= 1
##$INTSCL= 1
##$ISEN= 128
##$LB= 0.05
##$LEV0= 0
##$LPBIN= 0
##$MAXI= 945.577
##$MC2= 0
##$MEAN= 0
##$ME_mod= 0
##$MI= -402.1523
##$NCOEF= 0
##$NC_proc= 0
##$NLEV= 6
##$NOISF1= 8.587773
##$NOISF2= 6.764455
##$NSP= 1
##$NTH_PI= 0
##$NZP= 0
##$OFFSET= 17.95386
##$PC= 1
##$PHC0= 106.3061
##$PHC1= 13.53856
##$PH_mod= 0
##$PKNL= yes
##$PPARMOD= 0
##$PPDIAG= 0
##$PPIPTYP= 0
##$PPMPNUM= 100
##$PPRESOL= 1
##$PSCAL= 0
##$PSIGN= 0
##$REVERSE= no
##$SF= 200.13
##$SI= 32768
##$SIGF1= 18.5376
##$SIGF2= -6.396296
##$SINO= 400
##$SIOLD= 32768
##$SREGLST= <1H.CDCl3>
##$SSB= 3
##$STSI= 0
##$STSR= 0
##$SW_p= 4401.40845070423
##$SYMM= 0
##$S_DEV= 0
##$TDeff= 0
##$TDoff= 0
##$TI= <>
##$TILT= no
##$TM1= 0
##$TM2= 0
##$TOPLEV= 0
##$USERP1= <user>
##$USERP2= <user>
##$USERP3= <user>
##$USERP4= <user>
##$USERP5= <user>
##$WDW= 1
##$XDIM= 8192
##$YMAX_p= 0
##$YMIN_p= 0
$$ End of Bruker specific parameters
$$ ---------------------------------
##NTUPLES= NMR FID
##VAR_NAME=  TIME,          FID/REAL,        FID/IMAG
##SYMBOL=    X,             R,               I
##VAR_TYPE=  INDEPENDENT,   DEPENDENT,       DEPENDENT
##VAR_FORM=  AFFN,          ASDF,            ASDF
##VAR_DIM=   8192,          8192,            8192
##UNITS=     SECONDS,       ARBITRARY UNITS, ARBITRARY UNITS
##FACTOR=    0.0002272,     1,               1
##FIRST=     0,             0,               0
##LAST=      1.8609952,     -53,             -163
##MIN=       0,             -201929,         -201929
##MAX=       1.8609952,     351708,          351708
$$ Real data points
##PAGE= N=1
##DATA TABLE= (X++(R..R)), XYDATA
0@%%%%%%%%%%%%%%%%%%K8o0O4o4O4o4O7r9J28j29J60j92K05k37K72l04L51l98
36b08M37m89N52o16O88p70Q54r50J052j158J281j417J563j721J893k084K299k537
54a331K805l102L433l814M251m762N368o103P012q167R697j1838J5064k0569L2536
69B0480j10708Q0298M9033j86951M4470J27292M7308j20284j52867Q374J82382
80a1173o762j66040J6659J66888R108r7115n6262L7092R8043R042j41712j6472
92a58704J55293K8017j12529P239R9168N3887j3843p4951l6160R1387K3822j25136
104f2510j7240J34383M1321n9599k5233J6275M6818J3785r6038m4037J11544L6815
116I6284j17106l5330Q4852N4581o663m6768k5740P6213L4662j35686p5734J20012
$$ plain form
0 0 0 0 0 0 0 0 0 0 0 0 0 0 0 0 0 0 0 0 28 -32 32 -32 32 -32 35 -64 64 -65 95 -97 108 -129 143 -161 190 -208
36 -208 229 -260 292 -324 364 -406 448 -502 550 -608 673 -744 819 -902 991 -1093 1206 -1331
54 -1331 1474 -1628 1805 -2009 2242 -2520 2848 -3255 3757 -4410 5287 -6551 8513 -12056 20480
69 20480 -90228 -9930 39103 -147848 -103378 23914 71222 -49062 -201929 -193555 -11173
80 -11173 -17935 -183975 -167316 -428 8680 -88435 -144697 -107605 -9562 -520 -142232 -158704
92 -158704 -3411 24606 -87923 -80684 18484 72371 58528 -16423 -52583 38804 62626 -62510
104 -62510 -79750 54633 95954 36355 11122 27397 74215 88000 -8038 -52075 59469 96284
116 96284 -20822 -56152 28700 83281 76618 29850 4110 80323 114985 -20701 -96435 23577
128B3577P9009o6022m9714L0958O9897K8097r3374p1791J08442Q2364j19909r8999
140g7465O8479Q1341k146n2875l1258P6386P4614j07041j25379P1031R7085n1975
152B0797p7138L388N9643N0376n2798r0346N7839J02520p0781j20012K0030O7323
164b9159O335l6242l3087M4095Q4952l9033j07974L0919Q8887l0118o8643k81
176h9349L8446M0722p480n3477L3435R6911k5393r6828J1628O0691l086l2907
188b6687j8115K9459P0906p932q3230K2572R5531j8679q4451q105L9639K2855
200C3763j7958n0676K2195R8789m655j02369m271P6844M007n6306l6691J6600
212b0728O3114O795q3602l499J08166K1690q6995l6138L6888L2706j2169n8938
$$ plain form
128 23577 102586 36564 -13150 17808 87705 115802 22428 -49363 59079 141443 21534 -77465
140 -77465 -8986 72355 70209 17334 -13924 62462 137076 30035 -95344 -24313 72772 20797
152 20797 -56341 -52953 6690 57066 4268 -86078 -28239 74281 3500 -116512 -96482 -29159
164 -29159 -22824 -59066 -92153 -48058 36894 -2139 -110113 -79194 9693 -20425 -89068 -89349
176 -89349 -50903 -10181 -17661 -71138 -37703 59208 33815 -63013 -51385 9306 6220 -26687
188 -26687 -44802 -15343 55563 47631 -35599 -13027 82504 63825 -20626 -28731 10908 33763
200 33763 15805 -34871 -12676 86113 81458 -20911 -25182 51662 55669 -637 -37328 -20728
212 -20728 42386 49181 -34421 -37920 70246 91936 4941 -31197 5691 38397 26228 -32710
224c2710j2091R1497L8486q6648l3595P5579L6124m2607m7420q947M3612K6128
236D7408o4595l5728Q2328N1491n7758m3677K1687K4924k562m3862l6233M7146
248i431M5751n7136m4022N7071M2971k7931l4572j0626J9106J8581m5312m2665
260h8215N7672N4891m5310l7390L4915L1282o366l1363k6077L2767M0077m9613
272c2730m9113N8636O0915k4413l3763O888K8490J8712l9653n2101M4723O6874
284E3465l9311n7228L4159N4938M789l2645l1721K4677M8719l9223p4479L1351
296b2509P3507r295m4013m086L0153L1608k1742o1713J0193O5840j6767o8355
308c7179M938N1960J9511j6773l0332M486M7251q821p1968k587O1188M345m0432
$$ plain form
224 -32710 -44801 46696 85182 -1466 -35061 40518 76642 34035 -13385 -22332 21280 47408
236 47408 -17187 -52915 29413 80904 23146 -20531 1156 26080 23518 -20344 -56577 -9431
248 -9431 36320 -20816 -64838 -7767 35204 7273 -27299 -37925 -18819 -238 -45550 -88215
260 -88215 -30543 24348 -20962 -58352 -23437 7845 1479 -29884 -55961 -23194 16883 -32730
272 -32730 -81843 -23207 37708 13295 -20468 -13580 14910 33622 -6031 -58132 -13409 53465
284 53465 14154 -43074 -8915 46023 50812 18167 -13554 11123 59842 20619 -53860 -22509
296 -22509 50998 41703 -2310 -6396 23757 55365 33623 -28090 -17897 47943 31176 -37179
308 -37179 -32241 19719 39230 22457 -7875 -3389 43862 35041 -36927 -39514 21674 26019 -14413
321a4413q920K2347K9861J190m3294o542N1094l343o4195p616M3038J3757j2757
334B07j4604M034L6268L535n6573j0959N3068L546m8812j1108K6228K4778J132
347A0740k9977m370N1853P336o6895j9568M7810J7630k6277j9475R723M0536J5335
360C4401m9622k0393N7621K1526n4978l0289K4169K9729N234k8595j5157N0646
372B4292L2698n4144m0132L8934L0554k2215l1594o873L3377L1681l2042l5670
384c1134M3208M1363l8272m3380Q720K3266R176k0463k4986K9300M3400k7879
396A2319m2281K6042L2535j5697k8220j1895J4135K6226j3509l2216K9000M4800
408D1239k3307l8621J0100K0304l39j6840k0807J7023L7895j7787l8376K6433
$$ plain form
321 -14413 -23333 -986 28875 30065 -13229 -19771 31323 27980 -36215 -43831 -793 12964 207
334 207 -14397 -10363 25905 29440 -27133 -38092 14976 18522 -30290 -41398 -15170 9608 10740
347 10740 -19237 -23607 28246 35582 -31313 -50881 -3071 14559 -11718 -31193 -21470 19066 34401
360 34401 -15221 -35614 22007 43533 -11445 -41734 -17565 12164 17398 -11197 -26354 24292
372 24292 56990 2846 -37286 1648 32202 9987 -21607 -28480 4897 36578 4536 -31134
384 -31134 12074 53437 15165 -28215 -19495 3771 12947 -7516 -32502 -3202 40198 12319
396 12319 -29962 -3920 28615 12918 -15302 -27197 -13062 13164 -345 -32561 -3561 41239
408 41239 17932 -20689 -10589 9715 9376 -7464 -28271 -11248 26647 8860 -29516 -3083
420c083M2050j5540l1946o437J3055J7145j4697l3931K1463N1492j5007m4413
432a9849J0355L3038K078k3114k6401Q455L8226q696m8297J3299N5517J028l6841
445a202j3416J3874K1511q553m2417l53N1769N195m5949m296L6513J5835j4446
458A4065k8458p689L1190P574m5012j0270M7623J7345k7036j4889Q200K0004M718
471A7365l2501j7661L4866J5430l8183j1983L2634J8930p280j6124q706J9366
483F153J1132l4795j7248L6851J7924k5895j1616J6240J6772N235k1477j7138
495a7862K6168J5504l7997k0242L3483K2474j0816j5395j532K0327J4236l1642
507c294k7824L2636K4968l0280k4144J6926K4784P894j8166k0784K2998K6656
$$ plain form
420 -3083 38967 23427 -8519 -14956 -1901 15244 547 -33384 -11921 39571 24564 -19849
432 -19849 -9494 23544 25622 2508 -23893 -15438 22788 14092 -34205 -20906 34611 35639 -1202
445 -1202 -14618 -744 20767 12214 -30203 -30556 21213 26408 -19541 -23837 12676 28511 14065
458 14065 -14393 -22082 9108 16682 -28330 -38600 9023 26368 -668 -15557 -7357 12647 17365
471 17365 -15136 -32797 2069 17499 -20684 -32667 -33 18897 11617 -4507 -13213 6153
483 6153 17285 -17510 -34758 2093 20017 -5878 -17494 -1254 15518 20753 -724 -17862
495 -17862 8306 23810 -14187 -34429 -946 21528 10712 -4683 -6215 14112 28348 -3294
507 -3294 -31118 1518 26486 -3794 -27938 -11012 13772 21666 3500 -17284 5714 32370
519C2370l2666l6162K3234L0977p906j9504o257J9848K6531j7276l6076J7915
531d972L4633j9437l4077M923K3585J5186q298k2322J0945L4207j3975l9906Q008
544a1500K8989l363j8695r556R894K4796o86k9463M961L2289j1076l3270j554
557a8234J6553P681m558j5675L763K8080l088l3474L674K7874n492k3775o968
570b3639P887J7533O96k2699M553L4431m057l5917k198K1688N393j0710j5363
583b2402J974K9455N164l2043j544L6025M611k8409j4380Q343J8681M124k4944
596a5345n969L7514J2852l3626j3218K3218J3713r815k0864q504K5160J7138k6749
609d495j4546L2830J8279k0810j8990J637J4104R530j8357j8169K4347K2956k1431
$$ plain form
519 32370 -296 -36458 -13224 17753 9847 -9657 -15914 3934 30465 13189 -22887 -4972
531 -4972 29661 10224 -23853 -18930 4655 19841 11543 -10779 166 34373 20398 -19508 -11500
544 -11500 17489 14126 -4569 -14125 -4231 20565 19879 -9584 -4623 27666 16590 -16680 -18234
557 -18234 -1681 6000 1442 -14233 -10470 17610 14522 -18952 -15278 12596 7104 -16671 -23639
570 -23639 -15752 1781 2477 -20222 -15669 18762 14705 -21212 -23410 -1722 3671 -7039 -22402
583 -22402 -20428 9027 14191 -17852 -19396 16629 21240 -7169 -21549 -13206 5475 9599 -15345
596 -15345 -21314 16200 29052 -4574 -17792 5426 19139 9324 -11540 -20044 5116 22254 -4495
609 -4495 -19041 13789 32068 11258 -7732 -6095 8009 17539 -818 -18987 5360 28316 6885
622F885j6905J8487J4994m787j5258j3087J0861J7460j6355j8235K3117K0541
634B7718j5988j4627M535Q616M829j2913j8936J3887J9277j8506j8319K0096J7856
647A7525q203j3621q211P359J3022j5810k2896J8532K5462j5484j9887Q742J6045
660B575N020j2984k0312R351K4191j4709k7468J4821K8758j408j5533q526R584
673f640J9021q106k9390O780L0785m915k4162J982J9415J3488n162k1150r35K5187
687A6198j595l0455O26K6761M916j2433q469L660J8474L174k5093n818K3947O19
701A4512k3109k963J5142R579N48j2421n454J7336M068k4769n305K0980L331j4167
715b692m911N427J3009O077j7230p150K0862L257k5764o374J7415Q259l708j0147
$$ plain form
622 6885 -10020 8467 23461 18674 3416 -9671 1190 18650 2295 -15940 7177 27718
634 27718 11730 -2897 1638 10254 15083 2170 -16766 -2879 16398 -2108 -20427 -331 17525
647 17525 9322 -4299 -12510 -5151 7871 -7939 -30835 -12303 13159 -2325 -22212 -13470 2575
660 2575 7595 -5389 -25701 -16350 7841 -6868 -34336 -19515 9243 7835 -7698 -16224 -6640
673 -6640 12381 4275 -25115 -18335 12450 7535 -16627 -14645 4770 18258 13096 -8054 -8989 16198
687 16198 14603 -15852 -15226 11535 16451 4018 -4451 -791 17683 20857 -4236 -10054 13893 14512
701 14512 -8597 -11560 3582 13161 13709 1288 -4166 13170 17238 -7531 -12836 8144 11475 -2692
715 -2692 -7603 -2176 10833 16910 -320 -7470 13392 16649 -9115 -15489 1926 10185 6477 -3670
729c670k721J8014Q569k3871j0808K2528P495j9745j1403O425J4119Q312j5990
742b746j1870K1163J3346k5065j7211J4646J3777m148j3557q490J5991J8643j6363
755a884j9679J7437J7005j5019j7220O3J2019J2948q609j6828J3144K2027j2902
768B502j9699Q683J2984q37r790j0358P178J9398m212j7866J0477J8488q929j4730
782f711o84P382P510l258j3792N708K0118o543j7103Q665J4322m808r976p333
796f503L333J3720k190j7159Q326K1123o711j7619J705R619M600n904j5275K328
810f607K0928j903k1354N105K0859J84j4081r634K066J4176L92k1162l61K4035
824A2643K074j9468l885J1709Q446l430j7223o841J8527O387k0837m495J9171
$$ plain form
729 -3670 -6391 11623 20192 -3679 -14487 8041 15536 -4209 -15612 -9187 4932 13244 -2746
742 -2746 -14616 6547 19893 -5172 -22383 -7737 6040 1892 -11665 -20155 -4164 14479 -1884
755 -1884 -21563 -4126 12879 -2140 -19360 -19297 -7278 5670 -2939 -19767 -6623 15404 2502
768 2502 -17197 -8514 4470 3633 -6157 -16515 -9337 10061 5849 -12017 -1540 16948 8019 -6711
782 -6711 -7395 -13 7497 4239 -9553 -3845 16273 9730 -7373 1292 15614 10806 830 -6503
796 -6503 -3170 10550 8360 -8799 -473 20650 13939 -3680 -1975 7644 12244 6340 -8935 -6607
810 -6607 14321 12418 -8936 -3831 17028 17212 3131 -6503 -4437 9739 10131 -11031 -11392 12643
824 12643 14717 -4751 -8636 3073 11519 8089 -9134 -15975 2552 8939 -11898 -16393 2778
837B778P002r678j0122k531J2056O514j6868j0476J7184R037j4531n816R991Q076
851B616J651j0394j0005J0864R762j4360p563J5148Q686p828m480P27P353P546
865I723j0139j0857J2159R141j3758n982J2128Q405o86o310o849Q355J0069j3496
879A903j2065J4148J0539j0287p973L788Q863P190r356j3777R870J3159j3906
892B096j4149J0094J1750j79q247p925P520J4389r014j8870Q335J4923p246j2500
906i023K66Q794J0307l580j5649L510J6599o501j7026L089J1844J825m780q174
920h499J452J5397N4j6245Q87J3192l032j1744j337N114P697K039j0773j699J4090
935F593o37j4236P86R678m75n559m558R27J0863L539j2955m8J4394k369j3830
$$ plain form
837 2778 9780 102 -10020 -12551 -495 6019 -10849 -21325 -4141 4896 -9635 -15451 -5460 2616
851 2616 4267 -6127 -16132 -5268 4494 -9866 -17429 -2281 6405 -1423 -5903 -5176 2177 9723
865 9723 -416 -11273 886 10027 -3731 -9713 2415 10820 10134 3824 -3025 5330 15399 1903
879 1903 -10162 3986 14525 4238 -3735 53 8916 16106 6750 -7027 2843 16002 2096
892 2096 -12053 -1959 9791 9612 1365 -6560 960 15349 6335 -12535 -4200 10723 3477 -9023
906 -9023 -8757 37 10344 6764 -8885 -5375 11224 4723 -12303 -9214 2630 4455 -325 -8499
920 -8499 -7047 8350 8404 -7841 -6954 6238 3206 -8538 -9875 -4761 2936 4975 -5798 -7497 6593
935 6593 5956 -8280 -7494 2184 1709 -3850 -8408 -7481 3382 6921 -6034 -6082 8312 5943 -7887
950g887l11O696M639m76q856j660J4830L088j5951r11J3899O36r214o582J349
965f711J1391M716j3304m431J7056M168j4766n684Q233N999n37j0339o582J3955
979C164R802j3355p304J2774O256p585q273k969Q164R200r451j0491J1783J0520
993A2235r818p360N103M894J569o387r763O334J1599o869r051R211P595n848n263
1008a819j937K551P039m363j0723O236J1164p690p051O561N267j346m122p130
1022g363K614J0140n959j0698Q883J0261o480o985J247M868N040m854j2078M908
1036f456J2835o468j0933O738J0063m94n427p157K313J1803l324j4419M034J3955
1050G063k273r124n23N760P141r27j3015j472J4047m01j2757J021R965L039l217
$$ plain form
950 -7887 -8198 -1502 3137 2661 -6195 -7855 6975 10063 -5888 -6799 7100 7736 -1478 -8060 -6711
965 -6711 4680 9396 -3908 -8339 8717 12885 -1881 -7565 668 6667 6130 -4209 -10791 3164
979 3164 12966 -389 -7693 5081 11337 3752 -4521 -7490 674 9874 423 -10068 1715 12235
993 12235 2417 -4943 160 5054 6623 236 -9527 -3193 8406 1537 -7514 1697 9292 3444 -1819
1008 -1819 -3756 -1205 5834 1471 -9252 -3016 8148 458 -6593 -32 5235 3889 -233 -7363
1022 -7363 -4749 5391 -568 -11266 -2383 7878 1398 -5587 -4340 528 5568 714 -11364 -6456
1036 -6456 6379 -89 -11022 -4284 5779 5285 -142 -7299 -4986 6817 3493 -10926 -6892 7063
1050 7063 4790 -4334 -4857 903 8044 7117 -5898 -7370 6677 6276 -6481 -5460 4505 7544 4327
1065D327o842j474J0556L477j3811l040J1474R54p500j925L632N829K419q827
1079g51n782J0206L000j1373j710Q082J844l032l028j769P371M571r614n188R686
1094B513J168r286j089N310L972J513n925m808R211M551j1403l969R646L034o098
1109a660l755K43P410O316q741p169J0348N317j0434n451N961N406J434n849o332
1124f956Q159R936q994r118P473O773m904o036j852N531Q689m659j0397N622J0085
1139I352o464q070K399M831J945l473p346K686J0868k436r706L373O641l205m889
1154c494j937J410P057m70r563K518J0012l333p492K722L553r9k156m927N65R159
1170C525n94q951L105Q638l697n843K23K298M035K4q758R16J0927j291q978K721
$$ plain form
1065 4327 -2515 -3989 6567 10044 -3767 -6807 4667 5621 -1879 -3804 -172 5657 8076 -751
1079 -751 -6533 3673 6673 -4700 -6410 1672 3516 484 -2544 -4313 3058 7629 -1985 -7173 2513
1094 2513 3681 -5605 -6694 -1384 2588 4101 -1824 -6632 2579 7130 -4273 -8242 1404 4438 -1660
1109 -1660 -5415 -5172 2238 8554 -187 -7356 2992 8309 -2125 -7576 -1615 3791 5225 -624 -6956
1124 -6956 1203 11139 2145 -6973 500 7273 2369 -3667 -5519 12 8701 4042 -6355 -733 9352
1139 9352 2888 -5182 -2783 2048 3993 520 -6826 -4140 6728 4292 -5414 -2041 4600 1395 -3494
1154 -3494 -5431 -4021 3036 2566 -6997 -4479 5533 2200 -5292 -2570 983 884 -1272 -6199 -5634 3525
1170 3525 2931 -6020 -2915 5723 2026 -3817 -3594 -1296 2739 2763 -5995 -5079 5848 4557 -4421 -1700
1186a700P075l65l876n080l55R138J620j0761M24J0965K57q274j159L258M728
1201E895O90r625l567J0656L590r468j725P331K363k698n422l452P444N179r120
1216a929n189Q662L959o282k185J833L631K735o242p182O601O184o994l428N950
1231A24K471k120k091l313L954N683o313o491O838M164n367j723L013K939J196
1246B964l479n625M159O392n910n156O533M024m043j953K9K904N493m992p867
1261f527N859O163n747m912M191L936J732l595n389L160Q213m245r073M732O472
1276D970k943m035r58K536O730j038j0107J512R323l597o850J529M279K432j271
1291B512o191k03R257K64r170J1O284r84l299j592J037N371K040p574j934P979
$$ plain form
1186 -1700 5375 5010 1134 -3946 -4301 4837 6457 -4304 -3880 7085 7342 -932 -2091 1167 5895
1201 5895 6585 -3040 -6607 4049 7639 -1829 -3554 3777 6140 3442 -1980 -5432 2012 7191 -1929
1216 -1929 -7118 1544 5503 -779 -2964 -1131 2500 5235 -1007 -8189 -1588 4596 -2398 -5826 124
1231 124 2595 475 -1616 -4929 -975 4708 -1605 -8096 -1258 2906 -2461 -4184 -1171 1768 2964
1246 2964 -515 -6140 -1981 4411 -1499 -6655 -122 3902 -141 -2094 -2065 839 6332 1340 -6527
1261 -6527 -668 5495 -252 -5164 -973 2963 4695 1100 -4289 -1129 7084 2839 -6234 -1502 4970
1276 4970 2027 -2008 -2966 -430 6300 5262 -4845 -3333 5990 2393 -4457 -2928 1351 3783 2512
1291 2512 -3679 -3882 5375 5639 -3531 -3520 2764 1780 -1519 -3111 -2074 3297 5337 -2237 -4171 3808
1307C808k54o541P23L186N54j21l388j571O138K459p113q54O075j399m265L67
1323b196O92L158J867n898k043P669J121p308q0M869j10k300k483j664O501L445
1339E240p584k880P679J186n840k067K003L573J841n262m698P308N394p356l335
1354d798N711J672j635l474l012M672O127n015n912N712M773m041l209O63K211
1369D45L399k872o450L945P206l754m261L065K719r71j678l017J205N947j873
1384C055o790L330N447l576j954J164J085R70r86m958J301O392k692m833L490
1399D45K973k572j673p38P62L535j041o878J979O354k522m412K387K501M05j312
1415A93m803M44O881j234o816J857N841j390k701j038P08M798K09p014j204Q083
$$ plain form
1307 3808 3554 -2987 -2264 922 1476 1355 -2033 -3604 2534 4993 -2120 -2974 3101 1702 -2563 -2196
1323 -2196 -1504 1654 3521 -2377 -4420 3249 4370 -2938 -3018 1851 1741 -559 -3042 -4706 1795 5240
1339 5240 -2344 -5224 2455 3641 -2199 -4266 -2263 1310 3151 -2111 -6809 499 5893 -1463 -4798
1354 -4798 913 2585 950 -2524 -5536 -864 5263 248 -5664 48 4821 780 -2429 -1766 445
1369 445 3844 972 -5478 -1533 5673 1919 -2342 723 3442 2471 793 -2224 -1019 4928 3055
1384 3055 -3735 -405 5042 1466 -488 676 1761 2731 1745 -3213 -1912 4480 1788 -3045 445
1399 445 3418 846 -827 -1565 -803 2732 1691 -5187 -3208 3146 624 -3788 -1401 1100 1505 193
1415 193 -4610 -4166 2715 1481 -5335 -3478 2363 973 -1728 -2766 -2058 2740 2949 -4065 -5269 2814
1431B814j08n602P13K726K329m63m502k413P202J834o551j573N299R99k211j128
1447f35l59L722K486n667l873N601K734m853n65K408O15N71k186k963M102L710
1463D848n412k595M295N25k437J9j04J860K205l274l463M118K747n120j214L447
1479D45O37q67j167j909L062L681m473l916M810K211l909j416J213K071K079k752
1495b00m561M423M959m556l834L228J912r51j433k200K238N765k709o229L279
1510h69M549k749k530L80J391K695q18n444J478O514j479n184J627K212m47m11
1526I15k566k29N138K04n812P57M348j403k467P80M58Q85L61m015p3N433l22m604
1544b212J443J922j279r80l27k52K738Q79m865K9N255j170l370J188J717j87q1
$$ plain form
1431 2814 2706 -2896 -2183 543 2872 2409 -2093 -4506 2696 4530 -2021 -3594 1705 2704 493 -635
1447 -635 -994 2728 5214 -453 -4326 1275 4009 -844 -1409 999 1614 2185 -1 -2964 1138 4848
1463 4848 -564 -3159 1136 1661 -776 -757 -861 999 3204 -70 -3533 585 3332 -1788 -3002 445
1479 445 1082 215 -952 -2861 201 3882 -591 -4507 303 2514 -1395 -2811 -1598 473 2552 -200
1495 -200 -4761 -338 4621 65 -3769 -541 1371 420 -1013 -3213 -975 4790 2081 -4148 -869
1510 -869 3680 931 -1599 -1219 172 2867 2049 -3395 -1917 4597 3118 -2066 -439 1773 1326 915
1526 915 -1651 -1880 3258 3462 -2350 -1593 2755 1352 -1115 -335 123 1008 1369 -2646 -2719 2714 2392 -2212
1544 -2212 -769 1153 -126 -1106 -1433 -1685 1053 1932 -2933 -2904 2351 1181 -2189 -1001 716 529 448
1561D48k833q65N273R98n649L28M618q05k383l24k36K958J591n261j850O089J004
1578C101m207m22K708P52L08l072k884M853L020n054k087L831J497j859o59r25
1594a099J778K561l541l575L661L294l574j052J663K71Q62p60k924J739L599k767
1610A36l144K670J799j658k79J21M44K223j746l509K172L569l035j408K196O68
1626A219l96o15j191J178K604j747m102K778K670k616j011P06J584P81o80m064
1642b902J962M324k352m040K351K300o63r13j830O18M605j361n890J822M193j748
1658D76k285K05J313J621J23m295o8M995j49m105L84K308m48j70j240p06L454
1675A413J064m216j139L758J00k035M83J6Q06J403k512j186L442J105l594j91
$$ plain form
1561 448 -2385 -3250 2023 3021 -2628 -2300 2318 1513 -870 -1194 -1430 1528 3119 -2142 -3992 2097 3101
1578 3101 -1106 -1528 1180 1932 2240 -832 -3716 1137 4157 -897 -2984 847 2344 485 -174 -1099
1594 -1099 679 3240 -301 -3876 -215 3079 -495 -1547 116 387 1249 489 -2435 -696 2903 136
1610 136 -3008 -338 1461 -197 -476 -355 89 2312 566 -2943 -771 2798 -237 -1645 551 1219
1626 1219 823 208 -983 195 2799 1052 -3050 -272 2398 -218 -1229 -523 1061 1842 1162 -2902
1642 -2902 -940 3384 1032 -3008 -657 1643 980 67 -1763 -1145 3460 2099 -3791 -1969 2224 476
1658 476 -1809 -1604 -291 1330 1453 -2842 -2910 2085 1936 -2169 -1785 523 75 -95 -1335 -2041 1413
1675 1413 2477 -1739 -2878 880 980 -1055 -572 -556 250 1653 -859 -2045 1397 2502 -1092 -1283
1691a283K683q50q52L97n75J506J992l676p37L392L11k608J57J009L74K50j609
1708a19j161K523K213l717j167L230K53j967q66L63J460J516l224j830L338K204
1724C049l478j223J661L98M1j798j853K930K906l095k688K759J706j749q78p51
1740b063R88K652k164l220K284L286j909j652R05M58N62r5k753J201L354j252
1756E82k661J341J830q98k94N7n50J963K47l695R66L070r28k136J389Q88q63L50
1774F58j428J07K662m23l010Q25K778j458j184P91L10P45j4k637m8L590n66l492
1792a794J316J885n67k53j279j37K844k09l891K69L438k96k013k79J260Q47N48
1809A689k863j445L793J091l345n43K028J53j5j194q22J799J830k808k009K884
$$ plain form
1691 -1283 1400 550 -302 95 -480 1026 3018 -658 -1395 1997 2308 -300 -143 866 1240 1490 -119
1708 -119 -1280 1243 3456 -261 -1428 1802 2055 88 -778 -415 1045 2561 -663 -2493 845 3049
1724 3049 -429 -1652 9 407 448 -1350 -3203 -273 2633 -462 -3150 -391 1315 -434 -1312 -2063
1740 -2063 -1075 1577 -587 -3807 -1523 1763 -146 -1798 -893 -435 127 32 -2721 -1520 1834 582
1756 582 -2079 -738 1092 194 -100 -43 -593 1370 1617 -2078 -1112 1958 1030 -1106 283 1171 308 658
1774 658 -770 -663 1999 1576 -1434 -609 2169 711 -473 318 628 1373 1359 -1278 -1326 2264 1698 -1794
1792 -1794 -478 1407 840 587 -692 -829 2015 1806 -2085 -1816 1622 1326 -687 -966 294 1141 1689
1809 1689 -1174 -2619 1174 2265 -1080 -1623 405 558 543 -651 -1473 326 2156 -652 -2661 223
1825B23R71j584l55M67L29J425j532j808K380J568k718r73K062J73o66N2n37N33
1843A0J903k004k158K432J083j637m76R26J77K46o34j208J497J764k318j185J724
1860A42N03j483J97J6P42J105j576k328K355K357k184j282J285O05j14o91j325
1877a676J075K767j273k783J183J766n68o41n55N30J543l37k539P27L065j013
1893A271j776K46N29O62Q6j726K5K252J18k653L01J806o66m52j57l81J342K83
1911A110j923k60K226l65j472K40L71m40N31n53n95J619N03k161K95J493n48j003
1929i32O76l5L43L95j880k87K601R5k092N82J268k40p49j95o43J935P80k576n30
1948a484K538L84k112M15M24K82P09j571j062K475R02k376m84J389K73M7o12q21
$$ plain form
1825 223 1194 -390 -745 -278 51 1476 -56 -1864 516 2084 -634 -1607 455 628 -38 14 -523 10
1843 10 1913 -91 -2249 183 1266 -371 -847 79 256 502 -132 -1340 157 1921 -397 -1582 142
1860 142 645 -838 -641 -625 117 1222 -354 -2682 -327 2030 -154 -1436 -151 454 340 -351 -1676
1877 -1676 -601 2166 893 -1890 -707 1059 491 -150 -705 -175 1368 1031 -1508 -781 2284 1271
1893 1271 -505 -259 270 932 1018 -708 -683 1569 1687 -966 -665 1141 475 23 -134 -515 827 1110
1911 1110 -813 -1073 1153 788 -684 -444 -73 -513 18 -535 -1130 489 992 -1169 -874 619 71 -932
1929 -932 -256 -291 52 447 -1433 -1720 881 976 -1116 -534 734 494 -255 -450 -1093 842 1622 -954 -1484
1948 -1484 1054 1438 -674 -259 165 447 1156 -415 -1477 998 1900 -476 -960 429 702 749 137 -684
1966f84P36J804j909j975K184R17j049l96n7K61R42j53k001Q91K168j683r73Q73
1984a04L50j37P3r49L34J469o69j891J252J167r51m09Q61m87K77J58j291Q13J436
2003A302j009j287J612J53r43m0L73j73Q96l25j784J099J486q35j332J312M17
2020I22n09J17r67K68J878p53k361J144J533m18o39l7o3M87N13j857k55K297J7
2039A317j844M6M53K25J27j092j21J451M12k228j27J226L07l23o4l86L16O35j176
2058h46q61J780K93j275K06L07k93P30l05q03R71Q77j221o60J592k56r68M13J19
2077b00r4J060p36q78J713K10j512m5R99j54K73k25p70Q87J040j260p59J294K30
2096A073r00j62K78J56M77q11p88J361J066j069j163J030R3K29o25l71k35J505
$$ plain form
1966 -684 52 1856 -53 -2028 156 1073 24 -372 -429 -168 774 621 -1380 -489 1679 -4 -977 -104
1984 -104 246 109 182 -767 -433 1036 367 -1524 -272 895 -56 -465 396 -91 186 344 -947 -134 1302
2003 1302 293 -994 618 771 -172 -212 161 -12 884 559 -1225 -126 1360 525 -807 505 922
2020 922 413 530 -437 -169 1709 956 -1405 -261 1272 854 215 178 115 602 1115 -742 -997 1300 1317
2039 1317 -527 -481 -28 197 324 -768 -889 562 974 -1254 -1381 -155 152 -171 -235 -621 -305 330 -846
2058 -846 -1707 73 366 -909 -703 -396 -689 41 -264 -1067 -96 781 -440 -1100 492 236 -732 -319 -200
2077 -200 -294 766 30 -848 865 1075 -437 -482 517 363 636 411 -359 528 1568 308 -451 843 1073
2096 1073 173 11 289 445 922 111 -677 684 1750 681 -482 548 641 870 245 -126 -361 1144
2114A144p50j791Q53J528j149l5l71j08Q93%j233j75J499j20r55M00K02Q7R1m05
2134c95l26J101k31j285N81R63o38k78M25l90L66L16j044J86R29k52q86N08O97
2153C47q51L46l18j46R47j43j247L43J546k46j454J026K46k40M9p60q2J487k24
2172F26j406J34J396j69q05M52o25R06M73j400m81J856L3j139K48J12M55m7l76
2191B43o35P63J240j388n52J034j54m51L98n50n9J057j002o55J012Q56r18q17
2209e78J063l31N5L28q06L89M96j031m02R24J67m15M5J55l38P19m66r30N92J031
2229F67j169m57J120o41j38N54o72L49N18q18m75R99L95q52J66lJ5J53O6q87P99
2250c11P11p85q66J060K33l78M40m74o1J096k29j099O22Q26l63l30j39J37M50
$$ plain form
2114 1144 394 -1397 -544 984 -165 -200 -571 -679 214 214 -1019 -1194 305 185 -770 -370 -168 -81 10 -395
2134 -395 -721 380 149 -1136 -555 408 -230 -508 -83 -473 -107 209 -835 -649 280 28 -858 -350 347
2153 347 -504 -158 -476 -622 325 182 -1065 -722 824 578 -876 150 396 156 205 -555 -637 850 626
2172 626 -780 -646 750 581 -224 228 -397 509 982 -418 -899 957 990 -149 99 211 666 619 243
2191 243 -392 371 1611 223 -329 705 551 100 498 -52 -111 946 -56 -711 301 1157 239 -578
2209 -578 485 154 209 537 -269 120 616 -415 -817 107 274 -141 -96 59 -279 440 -26 -956 -364 667
2229 667 -502 -959 161 -480 -618 -64 -736 -387 131 -687 -1162 -163 232 -620 -454 -457 -442 -289 -223 -1110 -311
2250 -311 400 -385 -1251 -191 42 -336 104 -370 -431 665 436 -663 -41 785 422 92 -47 90 540
2269E40J70q96m3J224l26m96K79J90Q4k58M16p31L24Q77j249j94J168l08m05K82
2289F48m92K30N44o70l84O17M3n27L7L41o80J67K26o06K92O56q91l48O58R9o29
2310f69L64k01j41l4K45o04P75K41q87J48O13p8l24j1M2l2M47n60k53P85N88p53
2332b99n4L94l8L84l60m04L37M81j68j104Q25N95o14Q6k27J7O38j47q89N90P08
2353G51k40q20P54l12N0O88n47n55J066k88q66N52K65k28o4j04J81j46P39r15
2373c9JN28j83l55M38j33m15N74n18j85O87j37r82N17Q69p45l81J97m9L09M29
2394D27j175O4J371p08m78M09K30l68J08n3j23J21Q78j303J57R96m21k99r7n9
2414c23L47K33p41q2P67L45j082N86K90j76l39K64m72L95P33r15l57O64K40o41
$$ plain form
2269 540 710 -186 -229 995 669 173 452 642 726 468 884 153 477 1354 105 -89 1079 771 366 648
2289 648 156 386 930 260 -124 493 536 9 46 387 -293 -126 100 -506 -214 442 -449 -797 -139 -40 -669
2310 -669 -305 -506 -647 -681 -436 -1040 -265 -24 -911 -763 -150 -228 -552 -563 -521 -553 -106 -666 -919 -134 454 -299
2332 -299 -353 41 3 387 27 -377 -40 441 273 -831 -6 589 -25 61 -166 -149 489 342 -547 43 751
2353 751 511 -309 445 133 183 871 324 -231 835 547 -319 233 498 270 206 102 283 137 876 -39
2373 -39 -38 490 307 -48 390 257 -158 416 -102 -287 400 263 -719 -202 667 -78 -459 -262 -311 -2 427
2394 427 -748 -684 687 -21 -499 -90 140 -228 -120 -173 -296 -175 703 -600 -443 553 132 -167 -264 -323
2414 -323 24 257 -484 -566 201 546 -536 50 340 164 -175 89 -383 12 745 -170 -527 137 377 -264
2434b64L48k17k1M31m30l68P40M3p83J76N05K3n1j6o6l73L24j03k66N05K75j17
2456B95l36M97p61N11J14l36J93M45q13o0Q42L12j157L78L11j96L61j92o69K63
2476BM85q71K69K07J38J13l53j81k76J090k66q30J16O36l81Nj5k52O43j06p43
2497e70N5N28j10m07J91K13J52J22m52j16K62L80p75O1O12j2m14O6P7J13O7p0
2519b7k04L37o0k21J46J91m36N90k27k09R8L42p47K53M70l95J86J89J61l33N15
2540F19n89j63L18M28o81k05L21l4k41L86l16M7N34r06J72L78J23l07r0O87q62
2561c81M75qk90K38K42o2n79N43m04R2R1l61K82N08m59k79K22N03j41j27j72q8
2583a55K96M03r93J71M35p7m5j48K23k77L14l14j4M03J65m94M96J45q51J44L07
$$ plain form
2434 -264 84 -133 -154 277 -153 -521 219 262 -521 -345 160 183 132 116 50 -323 1 -102 -368 137 412 295
2456 295 -41 456 -305 206 320 -16 177 622 -191 -251 591 903 -254 124 435 239 600 408 -261 2
2476 2 487 -384 -115 92 230 343 -10 -191 -467 623 357 -473 -357 279 -102 -97 -112 -364 279 173 -570
2497 -570 -515 13 -97 -504 -313 -100 52 174 -278 -394 -132 248 -527 -466 146 134 -280 -214 -137 -24 43 -27
2519 -27 -231 106 46 -175 -29 162 -274 316 89 -120 -22 320 -427 -174 296 -99 87 276 437 104 619
2540 619 30 -133 185 613 -68 -273 48 14 -227 159 -157 -110 424 -482 -310 68 191 -116 -206 481 -381
2561 -381 94 86 -204 34 276 214 -365 178 -226 -134 -43 -404 -122 386 -73 -352 -130 373 232 105 -67 -155
2583 -155 141 544 -449 -278 157 80 35 -113 110 -167 147 -167 -181 222 387 -107 389 534 -317 -173 134
2604A34j52p9J65J23l41M74l05n30O19L89o30J88K38m65K56r6n94M46O44r97K08
2625c05K25K8R1J07Jn17M39p7l44L67L91n74J7L38j01N0K64o78K5O09k95l02L58
2648A17j45J7M52j47q23M88N25n62M0R4L73k60j0j29J4J07K40n75M21J85m37J33
2670A18O9j67o4L70j81N3M15o62K81K79k84n61O06L1n91K15M06o73N47P8o62J21
2692b56L56j20l25N55n81J53N70l19k85K09K46o86L38l9m6J46k69J44k8M38j15
2713H6k58K88n83N00l1k94O9M06k99k89K59M44k85k8J07j03M08k78%k48L34k58
2735e3P7L59j87k92K45m16k5M74km6J0J25l68l96K70j41M57j98j99k1L32J31k03
2758f7j27O40n82J53R3J48l4k78M0l73N95q4k43L05k41J19O4k09L47PM5l13j39
$$ plain form
2604 134 -18 -97 68 191 -150 324 19 -511 108 497 -133 55 293 -172 84 -12 -606 -160 484 -513 -305
2625 -305 -80 -52 39 146 147 -370 69 -8 -352 15 406 -168 -151 187 86 136 400 -278 -253 356 61 -241 117
2648 117 -28 -11 441 294 -529 -41 484 -78 -38 56 429 169 159 30 44 151 391 -184 237 422 -15 118
2670 118 187 20 -44 326 145 198 613 -49 232 511 227 -334 272 303 -288 -73 333 -340 207 285 -377 -256
2692 -256 100 -20 -345 210 -371 -218 352 33 -252 -43 203 -483 -145 -184 -230 -84 -353 -209 -237 201 86
2713 86 -172 116 -467 33 2 -292 -223 183 -116 -405 -146 298 13 -15 92 -11 397 119 119 -129 205 -53
2735 -53 24 383 196 -96 149 -267 -292 182 180 134 144 269 -99 -495 -225 -366 91 -107 -306 -327 5 136 -67
2758 -67 -194 446 -136 17 110 258 224 -54 -14 -387 208 124 -119 186 -55 64 128 -81 266 273 318 5 -134
2781a34M99o09N12j99k82R2L48j50j72K60L8K1l66J85l22O83n40j7P0R5j91j58
2803c37L2J68q9K16p4l21K10K0J44l6K94m52p1M58m25L35j54l08O5P98k72l10
2825a09P9j15J8K05K5j91J49o6Q2k63K46j41n0L8l22M44K36k75j71N80l34J65
2847B30j52J36k12j33N24j36j02%l9j87N12l81k73M33j92k02M21j86j83M3M46
2868C67n72M30J07k24Q9J5j37o4K23j45k94L8J56Kl8k48J42J15L12p47K44k40
2890d69L04j23M32m63K21k12M42k21N4K51n52M34j10k42R4oQ8K16J23k22m69Q37
2912D07m13L89k91R5j75lQj30J55J2k94L29L66m42j56L11l46J98k5J11j3k12K28
2935A09k43K7N83p37L44k50K34m11N31m13J3L00k28J6J58N9l02P9J59l9K26K36
$$ plain form
2781 -134 365 -244 268 69 -213 -121 227 77 -95 165 203 224 -142 43 -279 404 -136 -153 -83 12 -179 -337
2803 -337 -305 -137 -226 -10 -84 -405 -195 -175 -31 -67 227 -225 -296 162 -263 72 -82 -390 -325 473 201 -109
2825 -109 -30 -145 -127 78 103 -88 61 -5 77 -186 60 -81 -131 -93 -415 29 265 -10 -181 399 65 230
2847 230 78 214 2 -131 393 257 155 155 116 -71 441 60 -213 220 28 -174 247 61 -122 -79 367
2868 367 -205 225 332 108 197 212 75 11 234 89 -205 -167 -11 -9 -47 -295 -153 -38 274 -473 -229 -469
2890 -469 -165 -288 144 -319 -98 -310 132 -89 -35 216 -336 98 -12 -254 -160 -166 -78 138 261 39 -430 407
2912 407 -6 383 92 187 12 9 17 -113 42 54 -240 89 455 13 -143 168 -178 20 -5 106 93 -119 109
2935 109 -134 -107 476 -261 83 -167 67 -344 187 -226 -213 87 -141 -125 33 92 -210 -131 28 -11 215 451
2957D51m76j4J01J38l23L45o4j7k20K46l27l8K06j27K90j83j24LK91m0l8p6K01
2980B05o1n6m3l96K00j12K27j55Km8L84j61P9o26N91l4p9M8K4K29k1k80l87O78
3004B08M3l81J82k10K4K68q2l76L69K18m04R7M47n53L19k45K41j48K52k96j85
3025b12K40J98q2p4nk06j69N46k14Q0J49o4n35L04k8L57j88j14l11M97O4l73J19
3048b1r5O4n0L01k98Q5J78L49n43r1J3K56k33K05o54O30m7j22K04j56k03J99q1
3071a10j20J34K97m42L01k72J17j1k0mN8k63L78n7j10K17K0p6J19j80K27l93J94
3094Dn5r6N13m69J04p3j68K05O5Q5l3n7M2j54K25k51j04L68k19L24n61L38Q8k49
3118a28L64J14m80J40j80K44lJ08J9j97p0j4oK7R0k92K68P0J45m13N61k17K8k39
$$ plain form
2957 451 -25 -39 62 200 -123 222 158 141 -79 167 -160 -198 8 -119 171 -12 -136 -133 158 118 80 4 205
2980 205 144 88 45 -351 -151 -263 -36 -191 -189 -237 147 -14 65 -561 30 -4 -83 -35 -11 218 197 -83 -470 208
3004 208 251 -130 52 -158 -134 134 52 -324 45 263 -141 -44 403 -150 169 -76 165 17 269 -27 -212
3025 -212 28 226 144 70 65 -141 -310 236 22 102 251 187 -348 -44 -72 285 97 -17 -328 169 233 -140 -21
3048 -21 -116 -52 -102 199 -99 -14 164 513 -30 -121 -108 148 -85 120 -534 96 49 -73 131 -25 -228 -29 -110
3071 -110 -230 -96 201 -241 60 -212 -95 -106 -126 -130 -72 -335 43 -14 -124 93 113 37 156 -24 203 -190 4
3094 4 -51 -147 366 -103 1 -72 -240 -35 30 115 82 25 67 -87 138 -113 -217 151 -68 256 -305 33 121 -128
3118 -128 236 350 -130 10 -170 74 71 179 198 1 -69 -83 -89 -62 28 -264 4 74 219 -194 367 150 178 -61
3142f1K99l88L25m71L14j34L74l23j03J90j39J56j61j94M44J06k89L94l50mK1
3163FO9j63K74m77K38j77J88J51l61r4N67o05M22J06j61K89m09P3J74RN5k62L2
3186e6j36J01m4j32P00l96j84K19K74l68K30l33L24n01N03p5m14L76P6l60R1K82
3208A77k15j64M32j15O4o8j75j56J5p7L11n0P7k64J7m4R7J5K00K34m27Q8o0J08
3232B0Ok7j42K29N8l81P9M20m58L78k31r8K26j03K77l74J82J91j99K8O6R5l30
3255h8K00k70N0K39j46j01J56j40M75n88O1K39j17J34J5l05R6j11N04o03K11j86
3277b75Q9K9J66k3p8N5J8K54m44J72K18k01j87K37J88l42N40m7k36l13K34o6j87
3300a99L33j95J62K28l91R4j6M7Kj08o1O22n50K73n52J25O00n83J38K66L2m38
$$ plain form
3142 -61 238 -150 175 -296 18 -116 258 -65 -168 22 -117 39 -122 -316 128 234 -55 339 -11 -15 6
3163 6 75 -88 186 -291 -53 -230 -42 109 -252 -346 221 -384 38 144 -17 272 -137 -64 110 119 174 -88 -56
3186 -56 -192 -91 -135 -267 433 37 -147 72 346 -22 208 -125 199 -302 201 126 -288 88 164 -196 -105 177
3208 177 -38 -202 230 115 179 111 -64 -220 -205 -282 29 -21 56 -208 -191 -235 -138 -123 77 311 -116 -28 -88 20
3232 20 26 -1 -143 86 144 -237 -158 262 -196 182 -49 -147 79 -24 253 -121 61 252 53 81 147 242 -88
3255 -88 112 -158 -108 131 -15 -116 40 -100 375 -213 -152 87 -30 104 119 -186 -90 -201 303 -300 -89 -275
3277 -275 -186 -157 9 -14 -92 -37 -19 235 -209 -37 181 -20 -207 30 218 -124 416 369 133 -180 54 -12 -199
3300 -199 134 -61 101 329 -62 32 16 63 65 -43 -104 518 -32 241 -311 -186 414 -169 -31 235 267 -171
3322a71L16k7J39l77J84n0p9j3J17K15k93j70N1N7J24j14J61J04m65o2K06O8K00
3345A21M8l20L22k75l5J41P3j27j8J31L09l52lj78K46m31P2J80q8N08p0Kl21o9
3369a34O3O3j0K62j91k13L33j22j66M6J16K39l61j61K12k86M28J25l6o6KJ31l89
3392a15J33M50m68J53q4l1j47J34k39J49K2K99l89r0oO3K71K40j90k76K37J80
3414B96k78o2M5k84M43j75J80j44O8k90M41n0nj29j61l35K95K16K2%n6K9j75l26
3438d35M04P0J89j21j09J99l77J10L88m72r0M89K10l07k19J17o81O43k42R1j8
3459a61j09N13k36o0R4P5l65K59J97l56K13k50L93k65j05L54l8l84L69k02n1L61
3481B46J6Jr9l35K09Q1o7j42M56l21M2k76M13j23q8J54j80j07j80O14m9n41K06
$$ plain form
3322 -171 145 118 257 -120 64 14 -65 -78 39 254 -39 -209 -158 -101 23 -91 70 174 -291 -353 -147 -79 121
3345 121 169 -151 171 -104 -139 2 75 -52 -70 61 370 18 15 -163 83 -348 -276 -96 -184 324 254 256 -65 -134
3369 -134 -71 -8 -18 244 53 -160 173 51 -115 -69 47 286 -75 -236 -24 -310 118 243 207 141 143 274 -115
3392 -115 18 468 0 153 69 38 -109 25 -214 -65 -43 256 -133 -223 -229 -166 105 345 155 -121 116 296
3414 296 18 -44 1 -283 160 -15 165 21 89 -201 240 190 185 56 -105 -440 -145 71 93 93 37 66 -109 -435
3438 -435 -31 39 228 107 -2 197 -180 -70 318 -154 -244 245 455 148 -71 46 -635 8 -234 -143 -161
3459 -161 -270 243 7 -53 41 116 -249 10 207 -149 64 -186 207 -58 -163 191 153 -231 138 -64 -115 246
3481 246 262 263 164 -171 38 119 52 -90 366 45 87 -189 224 101 13 167 -13 -120 -300 314 265 -276 -70
3504g0j12J07K74N9Mj86K2k71K76P4l70J43k41P5K34k36J69o4j54J12Q8J6J00
3527D9Jj37j0j29L15K32n20J43J97k8k15K83m1j16P0k86M42k98K9j65J97K97j48
3550A62j85R9l59L40o6K07k98J71k39J23k99O22j39n3j79L7K14l19m4K98l69L26
3572E0k91K68L15n80J64R7l13M93j0l86K85j03Q3Q6L28m48Kk8nJ62k45J0o6Q1
3596e1J3K55k6l46K97m98J85k6J47j67L10m9J38q4j44M62k21q6m4n0k18N12l53
3619d4q9J6K06k0l4L68m36L04l19OP1N7l1j51l15J73m3M79j29j25M8Q5j89Q7K31
3644B06l24L04k37M12o49R6K99o0j20r8K64J4J32n32K69N4N3j73L42j25P7j03
3666A01o5J21Lo2j10J02l5l7n8j16L62m86M97m74Q7op3L40k39L32l82k03N10j36
$$ plain form
3504 -70 -182 -75 199 258 262 76 98 -173 103 177 -193 -50 -291 -216 18 -218 -49 -113 -267 -155 -67 -51 49
3527 49 50 -87 -97 -226 89 321 -199 -56 141 113 -102 181 140 24 94 -192 250 -48 -19 -184 13 310 162
3550 162 -23 76 -283 57 -9 198 -100 71 -168 -45 -344 278 139 86 -93 -56 158 -161 -205 93 -276 50
3572 50 -241 27 342 -238 -74 23 -290 203 193 -193 92 -11 72 158 486 38 40 12 7 169 -76 -66 -132 -51
3596 -51 -38 217 191 -155 142 -356 -171 -197 -50 -217 93 44 182 98 -46 416 195 109 65 15 -203 309 -44
3619 -44 -133 -117 89 69 35 403 -33 271 -48 -42 29 86 55 -96 -411 -238 -281 198 69 -56 -8 77 -112 -25 206
3644 206 -118 186 -51 361 -288 -192 107 47 -73 -171 93 107 239 -293 -24 30 83 -90 252 127 204 101
3666 101 36 157 160 98 -12 90 55 18 -40 -156 206 -280 217 -257 -170 -176 -249 91 -148 184 -198 -401 109 -27
3690b7j80L35k45j7l48L55N5k24K76m6jJ15j01m64P10K33m88J8L9K00q0K88n32
3713a29J48k29J79M0K98j31l16qK14N3K2m85L19R8%j12L7L22l68k2Q7k12J42N6
3737Cj70L46j22K8q0J38N4j07k36K74o29P49P8l12K09j61k33L39L4k83J53k23
3759a51M3M55m30K50k28Q9J45j89K61p5m84L22J29j98P5k62O2K42j49L04l85p7
3781b51K20j57J16N2n7k22N8K54M4k20K92K86j40l31q9K00q7l8O6K07j70l21K61
3804b7J17p2O0R9j59P8r8J74m44J02L62l75K57l51N76o10J80P2j75J33J70q0p2
3827h3L87l34k2J50k25J77J85k11NO5p7k48K63k93K02K5J91l7m65K05L02n07J66
3850a79R0o8j92M74o3k85N9K08r7J80j34Q3n7j30j88K42m3k99J36M46l21J6j56
$$ plain form
3690 -27 -207 128 -117 -134 -482 -127 -72 -296 -20 -66 -67 48 -53 -517 193 426 -62 -44 -5 195 115 403 -129
3713 -129 19 -210 -31 9 307 176 -140 -148 66 119 141 -344 -25 73 73 -39 -2 320 -48 -70 17 -195 -53 3
3737 3 -167 179 57 85 5 143 197 90 -146 128 -501 248 326 14 223 62 -171 168 202 -81 72 -151
3759 -151 -108 347 -83 167 -61 28 173 -16 245 170 -314 8 137 -61 14 -248 -186 56 -93 211 -174 -251
3781 -251 -31 -188 -72 -20 -77 -299 -241 13 57 -163 129 415 275 -56 -145 55 -32 -70 -4 203 33 -288 -27
3804 -27 90 18 78 177 18 96 -2 172 -272 -170 192 -183 74 -277 299 -311 -131 -59 -234 -101 69 -11 -83
3827 -83 304 -30 -52 98 -127 50 235 24 29 94 17 -231 32 -261 -59 -34 157 120 -345 -140 162 -345 -179
3850 -179 -89 -157 -349 125 62 -223 -164 44 -53 127 -7 76 19 -111 -299 -57 -100 -399 -263 183 -138 -122 -278
3873b78K31jO92p95j4L92l53R5K9L5k94K96Nl92M00J3m42K22k67O67m71N14l48
3896f4J78J52m3j93M65l12l80J60J89o5l04M31l73m9K46O3j75L63m64J35q2K31
3918A09j22l06K00J50J72j24k41J90o1m3j15K75O7k28M37m85J04K01j77j8j20
3939a35K48r5rj2L3j85L29J11o13K73J34m09J84l5J05L5L1J1j85K4K51j05L05
3962B91k73j27j07J41K25m4j09pK90l78M19n68K52j48L16j4p0j39N51n61M68j10
3984B98q44Q07m29J80J7l2L74k51J52J6j92K68k99m31K92l7j46o5K59j67M3M67
4006B80j17j26k94n0K31k75K23K02l85K95k29N01O0l94j99M31l5m99K25J0j26
4027b71L30N0k36K18J68l13mL32j8m79J01K20r3J38j91j91J95J78l8L19m35j85
$$ plain form
3873 -278 -47 -48 644 -151 -165 227 -126 -31 -2 33 -261 35 40 -352 48 61 -381 -159 -426 241 -230 284 -64
3896 -64 114 266 223 30 495 183 -197 -37 152 87 -217 214 -159 -208 38 101 -74 289 -175 -40 -122 109
3918 109 -13 -319 -119 31 203 79 -162 28 -33 -76 -191 84 151 -77 360 -125 -21 180 3 -15 -135
3939 -135 113 18 9 -3 30 -155 174 285 -328 -55 79 -330 -146 -181 -76 -41 -10 1 -184 -160 91 -14 291
3962 291 18 -109 -216 -75 150 106 -3 -10 280 -98 321 -247 5 -143 173 159 89 -50 501 -60 408 298
3984 298 -546 261 -168 12 29 -3 371 120 272 288 96 364 65 -366 -74 -111 -257 -322 -63 -230 -187 280
4006 280 163 37 -257 -307 -76 -351 -128 74 -311 -16 -245 256 316 -78 -277 154 119 -380 -155 -145 -271
4027 -271 59 109 -127 91 259 -54 -58 274 256 -223 -122 98 5 143 -48 -239 -44 134 96 415 -20 -205
4049b05Q12n08J85m61M24j41p4qJ57Q8j67K3M36o75M21j46P5P8n84L86n9q0mK58
4073B31l96o9J95j91P3J45K17k88J91j38J12K0k02M8J09K23l66P8j80J49J85M2
4095A88j61j4j95J05q9M23m01j2L69m60R6K18J78j71q9K04k8k4k1K8l50K94j50
4118f2j56M34m8l38M8L39j38j96M01n24L54J0j94J06j52j03J10n2K81l07K80M7
4140A40j12m02J58L31K7P8j27j37L23P4l27p0l3J89j01K49r1k17M1J28pp9J5l07
4164b57K91m9m35P84n16K42m61P52l80J60k00o8K05j02o9k0L29k30L98m26K43
4185A91l1j89J24j35k11J88j17Q6n0k2J48m5J64k91K30m30K57J72l17J89O1K95
4207B67o57O75l91n3j77N87q3l90M6K24k30N11l61j12K57j04l36L59j21N7K77
$$ plain form
4049 -205 607 99 284 -177 247 106 32 24 181 269 102 125 561 -114 307 161 236 314 -270 116 57 -23 -27 231
4073 231 -165 -234 -39 -230 -157 -12 205 -83 108 -30 82 102 -100 -52 57 280 -86 -8 -188 -39 146 188
4095 188 27 13 -182 -77 -166 257 -144 -156 213 -247 -151 67 245 74 -15 189 161 137 116 144 -206 88 -62
4118 -62 -218 216 168 -170 -122 217 79 -117 284 -240 114 124 -70 36 -116 -219 -109 -161 120 -187 93 140
4140 140 28 -374 -216 115 142 220 93 -44 279 353 26 -44 -77 112 11 260 169 -48 -7 121 114 35 50 -257
4164 -257 34 -15 -450 334 -182 60 -401 351 -29 131 -69 -137 68 -34 -103 -123 206 -24 374 -52 191
4185 191 160 -29 95 -40 -251 -63 -180 -94 -144 -166 -18 -63 101 -190 40 -390 -133 39 -278 -89 -28 267
4207 267 -390 285 -106 -159 -336 251 168 -222 -176 48 -182 329 -32 -144 113 9 -327 32 -89 -32 245
4228B45J54Q5k49O5l1k08K64j76n6K37l02j02K48k4o06L08k54M57J56j79J09j35
4250FL66j74J14k58j57l7j51M96m33L62j27K5j49j27K14o0r2L25k76K35o1k59
4272b18K37K18m80L51J28k95O2J8k85L17k07J46j17L24l05PK73L3l20J44l3O1
4294E9k47J21J3k54K21J25j32N2k31Q2M36k59j81L70k07k1q2K47r9K15P0k84l92
4317c78P85m64J80K93q44L60L09m55L62r0p3k27J89kk7J41j31j58ON54m64Q6P1
4340B3l14j76L89n9l2M27j56j13j77M16l04J37j75j87L83j86j84J08M90k77k35
4361b02K08L5j58K6L73j05m20L50j01P1r4J82q0j9J08R2Lk02l4M40j48k77Q5l60
4385b27K96j39L25k20q4K33j27k92L60p3J2n9P2j36N25p31L15j6Jj49k57N29r1
$$ plain form
4228 245 399 484 235 300 269 61 325 149 93 330 28 -74 174 150 -456 -148 -402 55 211 32 141 6
4250 6 372 198 312 54 -103 -140 -291 205 -228 134 7 32 -117 -244 -30 -90 -182 143 -133 102 41 -218
4272 -218 19 237 -243 108 236 -59 3 21 -264 53 -154 -8 -125 199 -106 -99 174 207 -113 31 -2 59
4294 59 -188 -67 -54 -308 -87 38 -94 -42 -273 -191 245 -14 -195 175 -32 -53 -135 112 13 228 298 14 -378
4317 -378 407 -57 123 416 -428 -68 241 -214 148 58 -15 -242 -53 -55 -82 59 -72 -230 -224 330 -134 -48 23
4340 23 -291 -467 -78 -137 -169 258 102 -11 -188 228 -76 61 -114 -301 82 -104 -288 -180 310 33 -202
4361 -202 6 41 -117 -91 282 177 -243 107 6 77 -17 165 85 66 174 266 269 67 33 473 325 48 133 -227
4385 -227 69 -70 255 35 -49 184 57 -235 125 52 64 5 77 -59 466 -265 50 34 35 -114 -371 158 67
4408F7k56l0M28P4k00J9j28M3k28K39M9J90l92Q3o0L74n21N46j30k01J13N1R5
4431B25j58p6j37J98K69o52K38K1n3JK55j95J9q4M19n53n8M15k78L52k28J17N1
4454A08k68J36p3K79k71J27k67K13m29M56K6Q5n1j98L54q3p9n8P6J69k18J43R0
4477B67k51K96m9j0k32J48O7m08rJ17n2K88l70J54J39Q6m93K15J5K64o1K82j78
4500B25l16L61l03p3M66l69j54Q4K49k41o2M3R8j7J91k92Q9L08l29L26o85M23
4522B2J8N5k12k77K06N7J47l86Q38o59K79k59j9K28M1k37k15M51K49k66r4N7M4
4545F8j44J63j13m36K27N33j63J67k37o0M48l11q8Q6r5j56L7J99k97L87K13o58
4567b30P6M22j83pj22J78m99M74O1r0k16J90j8K25L29o43K00k17Mr5%J25K09r7
$$ plain form
4408 67 -189 -219 209 283 83 102 -26 17 -211 28 77 267 -125 -42 -102 272 -249 297 167 -34 79 130 225
4431 225 67 -9 -146 52 321 -331 -93 -72 -125 -124 131 -64 -45 -129 290 -263 -321 94 -184 168 -60 57 108
4454 108 -160 -24 -97 182 -89 38 -229 -16 -445 11 37 122 71 -127 227 144 65 7 83 252 34 177 267
4477 267 16 312 263 253 21 169 236 -172 -181 -64 -116 172 -198 -44 95 181 -312 -97 -82 182 121 403 225
4500 225 -91 270 -33 -106 360 -9 -163 -79 170 -71 -133 -90 8 -9 182 -110 -21 287 -42 284 -401 22
4522 22 40 95 -117 -394 -188 -131 16 -370 468 -191 88 -171 -190 38 79 -158 -373 78 327 61 -33 24 68
4545 68 -76 87 -26 -462 -235 298 135 302 65 5 453 142 54 140 45 -111 -74 125 -172 215 428 -230
4567 -230 -154 268 85 78 -44 134 -365 109 170 80 -136 54 36 261 590 -53 147 -70 -66 -161 -161 -36 173 76
4591G6L5m63J48N54l20l21L69o6m6j74O2K93l09J64l76N17k94J86l05M27k29k18
4613b90L46j67J97j82Q7k09J44P4K04k20O0M3J35l38L4J33ok06M1O4N9j47L33
4636A89j63M15k11j46p4k17L38k36j00R4L86O0l14k27K45k09M72j88k36K97k02
4657b7n7P5o0L46k1L4j65m6J25M10o17p1k56L54J7k29K84j81Q6Kj97L04j20J53
4681A43n7J69m52K5L04k20J92n4l9J43k89P6kj37M03l24P4L00m70N2j4n3N33j93
4705A10P5m00L6J86M9L5l03LJ05Q0J99k33K46l61L6N0K96j3j40k50K75j56Q5q2
4729g2k15L20k88O7K66k19P3L28l9m34M32r5j97K42J25k93L28q5j10J8K46n68
4751a70N44j68K00k24k35J15k78j4K92O5K9l6j52l3K16m01K36n0o6L67k29r0j6
$$ plain form
4591 76 111 -352 -204 350 30 -291 78 12 -34 -208 -146 147 -162 2 -374 143 -151 35 -270 157 -72 -290
4613 -290 56 -111 86 -96 -9 -218 -74 0 204 -16 44 87 222 -116 -82 51 45 -161 -120 -56 3 -144 189
4636 189 26 441 230 84 10 -207 131 -105 -205 -111 275 335 21 -206 39 -170 302 114 -122 175 -27
4657 -27 -84 -9 -69 277 256 290 125 79 204 614 -3 -74 -330 24 41 -188 96 -85 1 3 -194 110 -10 143
4681 143 86 255 -197 -172 132 -88 104 50 11 154 -135 -59 -61 -198 205 -119 -45 255 -215 -163 -177 -230 303 110
4705 110 185 -215 -179 7 56 91 -212 -209 -104 -24 175 -58 188 -173 -137 -87 209 196 56 -194 81 -75 10 -72
4729 -72 -287 33 -255 -188 78 -141 -68 260 221 -213 219 124 -73 169 294 1 329 244 134 152 398 -170
4751 -170 374 206 406 182 -53 62 -216 -230 62 127 156 120 -32 -65 151 -250 -14 -64 -130 237 8 -82 -98
4774i8K06k07J19j69l6K80m78L94k03J50K45k92n2j07M60o5j42l93J50L18m5R9
4796A34k23P6l67K35J43j09R6j9k88K41J46j07j72J60J69J17j66j68R5K4j49J74
4818D2q8L41k8l60J20j22M3K95l88j11J85J57m82K22N38k65j30Q6j4K02R4n87
4840b50K93l00K87k57K77j79n2P7%L46m87L00k32L54Q8l00J88k71JN3k59K20J67
4863F4O5O4m66R3M26k57L13p30N67M0l8j56k60L34k78J62L86p1m39L89j59%j9
4886C0J8l57J33J38M6O9K12k48kj59J55j46m3M04j28P4k50L6J84j93n9J49j76
4909a13n6K83J50k11r2K9j05l9k6J62k08K21K3O1p9J26k82K60n9o8l1K80l58P1
4933f1L35k96k30M56j09L66l97q4j8L09l6p0j68J7j4J9K27j36n70O24P6l99r9
$$ plain form
4774 -98 108 -99 20 -149 -185 95 -383 11 -192 -42 203 -89 -141 -248 212 147 5 -388 -238 80 35 134
4796 134 -89 -13 -380 -145 -2 -111 -15 -34 -322 -81 65 -42 -214 -54 115 232 66 -102 -7 17 -132 42
4818 42 -46 295 267 -93 27 -95 -52 243 -145 -256 -71 86 -396 -174 364 99 -31 55 41 243 337 -250
4840 -250 43 -257 30 -227 50 -129 -181 -104 -104 242 -245 55 -177 177 265 -35 153 -118 -117 -64 -323 -103 64
4863 64 129 193 -273 -180 246 -11 302 -428 139 179 141 -15 -275 59 -219 -57 329 258 -181 208 49 49 30
4886 30 48 -309 -176 -38 8 77 289 41 39 -120 35 -111 -154 250 122 196 -54 -18 166 -27 -86 63 -113
4909 -113 -169 114 264 53 -39 -10 -115 -154 -180 -18 -226 -5 18 79 0 126 -156 104 45 -23 -54 226 -132 -61
4933 -61 274 -22 -252 204 95 461 64 -20 -38 271 235 165 -3 14 0 19 246 110 -460 164 240 -159 -258
4956b58J11k7j94K56J4K35j09o99N37j65K48M22j89Rm31P4L13K60k94K14o05L58
4978H0K21l88k47K97k55K23N0J9j92J19L13l69kJ04n0Q7%k56M39J35j36l24K0
5001a12L39m97K86J07kj7j2L57l64K28k17j71J00R9N4k8n57M76p8K47k22L55k89
5024H2m94L55J7k6K28k42j50O2j4J19j77L84m17J50K12N0k97L42o7k80J32J17
5046H6r2K96m12K89k4m21P7M26m44J16R8j97L49j04N4J23k53O8m9L0j62J76m6
5069a6o3K01p3J09j37K51m52J53K03N8k77j50K84J59j83l25K03j13J99k36L29
5090A24j07k65L19j93Q1Q4j37l08O09j82jL08k88j08P1J32m42L80j26L12l04R0
5112D9K9k44l9J45J5K08m13J12J79l7j85J42M4L48J8o76K63N5r2O5j79K15m4q9
$$ plain form
4956 -258 -147 -174 -368 -112 -98 137 28 -671 -134 -299 -51 371 182 191 -240 -166 147 407 113 327 -278 80
4978 80 301 -87 -334 -37 -292 -69 -19 0 -192 -73 240 -129 -131 -27 -77 10 10 -246 193 328 192 -132 -112
5001 -112 227 -270 16 123 121 104 92 449 85 313 96 -75 25 124 178 150 -407 69 -9 238 16 371 82
5024 82 -412 -57 -40 -66 162 -80 -230 -168 -182 -63 -240 144 -273 -123 89 139 -158 184 117 -163 -31 86
5046 86 -6 290 -122 167 143 -278 -201 225 -219 -103 -5 -202 147 43 97 220 -33 35 -14 16 -146 30 -16
5069 -16 -79 122 49 158 21 272 -180 -27 176 234 -43 -193 91 250 67 -258 -55 -168 31 -205 124
5090 124 17 -248 71 -122 -41 43 -94 -402 207 25 24 332 44 -64 7 139 -303 77 -49 263 -41 49
5112 49 78 -166 -205 -60 -45 163 -250 -138 41 4 -181 -39 5 353 371 -305 -42 13 -79 -14 -193 22 -22 -111
5136a11J27J03J01o93L96J30M1J47m7M7n4k76p9P3P0J98j78K9r5m1N30j58l9J4
5160B35m17K26j93K4o7O00l00o27P37m38M04l01p5m9L24p3j54n1J85N9J44nj50
5183C8RJ31J04n23K94Lq5L08m55J05J66k31l5K63K14m65r6M47k78j60P3K4J05
5206d4Q5L9K09n68N95n13K69J70j35k91N64n20JK84j97j12K75k66R7M84l58K09
5228B77j60j59Q9p8K24j99j02J15J30j86J76k77L44l9J09o8l18L34n2lKj25M2
5251G6J3j37l3L94j53m35K28q9K15j59L44L7j71l0J7J23j46Q7l40J55m3K1K4o3
5275f5K11k34P9L57l06L26o7k90p7K54p6j96p8N6J28m3l38M77l24L39r6P0k57
5298a50M24l32j49m3j04K46k24N18j34m1q7O1mj18K92l12M61j89k6L17n92K83
$$ plain form
5136 -111 16 119 220 -473 -77 53 94 241 194 241 187 -89 -168 -95 -25 173 -5 24 -71 -112 418 260 221 235
5160 235 -182 44 -149 -125 -192 408 108 -519 218 -220 184 -117 -192 -241 83 10 -144 -195 -10 49 193 188 38
5183 38 47 178 282 -241 53 56 -29 279 -176 -71 95 -136 -171 92 306 -159 -255 192 -86 -246 -173 -149 -44
5206 -44 41 80 289 -279 316 -197 72 242 107 -184 380 -140 -139 145 -52 -164 111 -155 -58 426 68 277
5228 277 117 -42 47 -31 193 -6 -108 7 137 -49 127 -150 194 155 264 196 -122 212 160 157 159 34 76
5251 76 89 -48 -81 313 160 -275 -47 -136 79 -80 264 301 130 100 117 240 94 181 -159 -4 -47 -26 -2 -65
5275 -65 146 -88 -9 348 42 368 301 11 -66 188 112 -84 -162 -106 22 -21 -359 118 -206 133 37 107 -150
5298 -150 274 -58 -207 -250 -354 -108 -332 186 52 11 -76 -15 -19 -137 155 -157 304 115 89 406 -186 97
5320I7kr9o4J8P2J55j59O0k55L10k89L71l83K44O1l7m0N15n74J2J62j48K94o73
5344c52J68J75K25K62p38J80j6j22J06L00m34j84M19M3k44K23On77P14j94O0K1
5366D1j90j92M96O8l63J14K59k00j0m5J62k66K6K89n79J87L26P1P7k64k67J86
5388g4N91p08J34J73L9k26L14j68j81L39l19m4K07R4m09L48K16l69Q7Nl71K15
5410a07r0l3K91j93K8M35j08o9m11K84k6J04N1k66k18J24J03q3o0M31j20p5K29
5433B21m55JM64k00j5N0R6J00l52R7j36L35k93K47j56R8j42k04J39l9j60K48l
5456e9K59j39J42p3k06j09l9J64J29N8k60K35j59L18k9l22J97J02l25M3M10n4
5478B83m72J11jj77L81N5k15n6J2J12p5O6J50l29L18k47j69o0N33k60k40M03j37
$$ plain form
5320 97 95 -4 -68 -50 22 177 18 78 -177 133 -156 215 -168 76 137 100 60 575 1 13 175 27 321 -352
5344 -352 -184 -9 216 478 -260 -80 -96 -218 -112 188 -246 -430 -11 32 -212 11 17 -560 154 -40 20 41
5366 41 -149 -341 155 223 -140 -26 233 33 23 -22 140 -126 -100 189 -390 -203 123 194 271 7 -260 -74
5388 -74 517 -191 -57 116 155 -71 243 75 -106 233 -86 -130 77 171 -238 110 326 -43 44 49 -322 -107
5410 -107 -197 -230 61 -132 -104 331 223 154 -257 27 1 105 156 -110 -328 -204 -101 -184 -244 187 67 -8 221
5433 221 -234 -233 231 31 16 66 162 262 -90 7 -129 206 -87 160 4 102 -40 -244 -105 -144 -304 -56 -59
5456 -59 200 61 203 130 -76 -185 -224 -60 69 127 -133 102 -57 261 232 -90 107 209 -116 -73 337 283
5478 283 -189 -78 -79 -256 125 180 -35 -91 -79 33 -42 24 174 -155 163 -84 -253 -313 220 -40 -280 123 -14
5501a4J65N2j10k38L14K6k36L4K18J8Lm22j3K99k26J59j34K75J00K66p31J01o7
5524a61K92k03k0P8L02m16j74K62Q7l2j43J58k38K75j26l59O64j90k16K60J97
5545B97n33J64nl3j32J82k05PN90Qj73j84J43l54K40K64j33l68M29k34K53l88
5567a65J24k76L98k86j09J67l8K89j26R7j27J08K7J92m6j22j97K32J2k53p3J15
5589e7K41j66Q5o4l02M66m54K97k75M90m91p5K17j84k7N8J47K19J45l61J46k68
5611b13K23l58K52K46m27J20J17k01J62J51k65J37J19Ml05K48k26L02k28K50j96
5632h8K33k02k01Q4OL10J14J37n76K42j64L29n02J71K62n2j61r4R5K55P9j20k48
5655i1L95n40M37j74O6M5j21K34l26K40M1m11L20j66J16J65m43J54r0j06L83k91
$$ plain form
5501 -14 151 203 93 -145 169 195 -41 -7 211 229 232 -190 -203 96 -130 29 -105 170 270 536 -195 -94 -161
5524 -161 131 -72 -92 -14 288 -128 -302 -40 47 15 -128 30 -208 67 -59 -418 246 56 -160 100 297
5545 297 -236 -72 -77 -110 -242 -60 -265 -258 332 340 167 -17 126 -228 12 276 143 -225 204 -30 223 -165
5567 -165 -41 -317 81 -205 -314 -147 -185 104 -22 75 -52 56 83 275 229 107 -90 142 154 -99 -172 -57
5589 -57 184 18 103 39 -263 203 -251 46 -229 261 -230 -305 -88 -272 -299 -241 -94 125 270 -91 55 -213
5611 -213 10 -348 -96 150 -277 -157 -40 -241 -79 72 -193 -56 63 67 -238 10 -216 86 -142 108 -88
5632 -88 145 -57 -258 -174 -168 142 256 393 -183 59 -105 224 -278 -107 155 103 -58 -152 -57 198 277 157 -91
5655 -91 304 -236 201 27 93 138 17 251 -75 165 206 -205 115 -51 65 230 -213 -59 -149 -255 128 -163
5677a63k28O80k77o7K42k89p0L25l11K80r1l52K77M8l32O17k58j78k13M50o1k31
5699b02k3J19o3O8o7J37J89m62K67K17m37L09o3j13kM5L9J86j52J44Pj01J65k06
5723Ak81J14N9k7M54l20k85Q8N09r1k90rK23k02L25r0p1k61ok1J56J61P5j76J06
5748A41l66j11N51o64K11J99j10J8K52K4k9m62K28j76L85K05j67J21j23k14j7
5769a04K88J51l95q6J62m55M23J74j43L5k26p4L55o4k84K42j08J75J63j60lo3
5791Ck46K39k9j26K80l58L94j11J49J3l01k19M82k84J23j4O9k8m76M01R4o5l4
5814d4J50k86K92m5qm00J82J51L5j04J56j13K44l99J45K71j80r8j94L42N6k45
5836i2K96p30N60K8k11r2L87P9j19K77k51k90P7K6j22K34q6l4j0n5M04o2m03l5
$$ plain form
5677 -163 -391 289 12 -55 187 -102 -172 153 -158 122 31 -321 -44 4 -328 289 31 -147 -360 90 29 -202
5699 -202 -225 -106 -169 -101 -168 -31 158 -304 -37 180 -257 52 -11 -124 -126 -81 -42 144 -8 136 143 42 207 1
5723 1 -280 -166 -107 -134 320 0 -285 -197 312 221 -69 -78 145 -57 268 178 107 -154 -160 -181 -25 136 211 35 141
5748 141 -225 -336 215 -449 -238 -39 -149 -131 121 145 116 -346 -118 -294 91 296 129 250 127 -87 -104
5769 -104 184 335 -60 -146 16 -439 -16 158 15 50 -176 -250 105 41 -243 -1 -109 66 229 69 66 3
5791 3 -243 -4 -33 -159 121 -237 157 46 195 208 -93 -312 170 -114 9 -5 64 36 -440 -39 55 -10 -44
5814 -44 106 -180 112 67 59 -341 -159 -8 27 -77 79 -34 210 -189 -44 227 47 -51 -245 97 153 -92
5836 -92 204 -526 34 62 -149 -241 146 225 106 383 132 -158 -81 -55 -177 57 -29 -63 -73 -128 276 214 -189 -224
5860b24J2K35p1R7N1K9k40j29J70J65K43l21J21l21J41Q7j43p3J30oL68j15l35
5883a29J07o7j2K36K25n48o9L92J59n25K04m30L38K44k60j08K08J76k01J76j83
5904f7K44P4p6n77J28L82j81r4J08J42l0l08L62p8j88J19j01pJ96l12J10j71K96
5927b9K1K3N1l60L50k2J94n8l6k49K33j04q0k94N60K50n38K91l16K1j16L01lJ92
5951B82l51j45M63m39j08L33J49k38O6O9l2j79L79k35M3l78O41o44K78J27o4r5
5973g8oj47K76K1k33L58j87j36J01J45k24k18K48j80K87q3k2J32m80L75J84k89
5995a56K39J36MJ13n43J40O6qo2K54n83J86N91m50L9J85l23Q8p1K15q4Kk86K7
6019b81M58j58J14m23L4L65k76J73j15j98Q6J07p2J15K6J26q9O8K4k18K29r9L8
$$ plain form
5860 -224 -212 23 -48 49 100 129 -111 -240 -70 95 338 17 138 -183 -42 45 -98 -171 -41 -47 321 206 -129
5883 -129 -22 -89 -101 135 360 -188 -257 135 294 -231 -27 -457 -119 125 -135 -243 -35 141 -60 116 -67
5904 -67 177 251 175 -402 -274 108 -73 -167 -59 83 53 -255 107 29 -159 -40 -141 -148 48 -264 -154 -325 -29
5927 -29 -8 15 66 -294 56 34 228 170 134 -115 118 14 -66 -360 200 450 -88 203 -113 -92 -208 93 90 282
5951 282 -69 -214 249 -190 -298 35 184 -54 12 81 49 -130 249 14 57 -321 320 -324 -46 81 17 -78
5973 -78 -84 -231 45 66 -167 191 4 -132 -31 114 -110 -328 -80 -260 27 -56 -78 54 -426 -51 133 -156
5995 -156 83 219 223 336 -207 -67 -1 -9 -71 183 -400 -214 377 -73 -34 151 -172 -84 -155 60 -24 -22 -308 -281
6019 -281 177 19 133 -290 -256 109 -167 6 -109 -307 -221 -114 -186 -71 -45 81 -8 60 84 -134 95 -4 34
6042C4J13k68n7kj4J21O2J02Jj15J18j25l7P2k88N34j26n8Q2r3k56O7j33O02k21
6067A15j88K20n15M51j79j03J31J27M0k59K15j25J97k76M72P9m28j45O1K7J79
6088I6j44J34p0j20k33J58K80j30J43R1j78k67R0O6j62L52q0l43L55j57j34j05
6110c58L66L9j89L04pk69Q9l23N40j33j37r4L2L03j73Q3M3k31R2j1K64j84k15
6133a69K4L53r6l1k22K05k43P0L06k23K56j48j20J53j58J44j61K68k81j6J87L84
6155D82p08N85K83k30n88P0J09j39J05q2j9L0K84k58m7K05j57M9J63m77J05K60
6177B5M7M9j24k04L8K51j00k39L23k94L51J77l77J43j65K22J36n98J61K00m63
6198d41L09p2L29j46j80n6k12N27p4k33L89k18j31M07k83k85J34N15k90L06l53
$$ plain form
6042 34 147 -121 -178 -180 -194 -73 -11 91 92 -23 95 -30 -67 5 -283 251 125 67 149 56 -200 -133 -266 336 115
6067 115 -73 147 -368 83 -96 -199 -68 59 99 -160 55 -70 127 -149 323 402 -26 -171 -110 -83 96
6088 96 -48 86 16 -104 -337 -179 101 -29 114 205 27 -240 -150 -84 -246 106 26 -317 38 -119 -253 -358
6110 -358 8 47 -142 162 155 -114 -25 -348 192 59 -78 -172 -140 163 -10 73 116 -115 -23 -34 230 46 -169
6133 -169 -145 208 112 81 -141 64 -179 -109 197 -26 230 82 -38 115 -43 101 -60 208 -73 -89 98 482
6155 482 -226 359 642 412 -176 -106 3 -136 -31 -113 -132 -102 182 -76 -123 82 -75 -26 137 -340 -235 25
6177 25 72 121 -3 -207 -169 82 -18 -257 66 -228 123 300 -77 66 -99 123 259 -339 -178 22 -441
6198 -441 -132 -204 125 -21 -201 -257 -469 58 -16 -249 140 -78 -209 198 -85 -370 -236 279 -11 295 -58
6219e8J24M28m24q5j22Q5k01k7K59j8K02K05o43J90J91k04L03k19M5j72J30K9
6241A8K2L2o4J08k34J00J12l10j08O9M07j99J44k64K6J60k85M67k3k55o1N54q28
6264d12O97l73k02J54K12j32K4r2J78p0o1O0p2N2K84m16J67M30n46k6J37J78q2
6287H9k7j64r9L87On33O41q7l46J66J67k87o1K16jk5L9j66l53K63j6J15K30J52
6311C06k43j72L57r6k54K03Q2m59M82l36q8M55m95K13K32q8M27m01l84K66j84
6332a77N16l09K28m72L6O7K37J95k18n5j98P2M51l96k32J92J79P4l9j67j89K1
6354a84P6K96l95K75p2K9l0P7m5J6J19%Jm6k22o0N22j88J34j97m7j94J28j71K20
6379D2Q7q0o0j87N06o06L52p8k35K46r4J41j64M50m37M6K66k05l02N92l30K38
$$ plain form
6219 -58 66 494 70 -15 -137 -52 -253 -280 -21 -39 163 368 -275 -85 106 -98 205 -14 31 -141 -11 18
6241 18 40 72 8 116 -118 -18 94 -216 -324 -255 152 -47 97 -167 -141 19 -266 201 178 -77 -138 416 -412
6264 -412 285 -88 -290 -136 76 -56 -32 -124 54 -16 -77 -17 -89 -37 247 -169 -2 428 -118 -144 -7 171 89
6287 89 62 -102 -201 186 192 -341 300 213 -133 33 200 -87 -148 68 67 42 81 -85 -438 -175 -191 -76 154 306
6311 306 63 -109 248 152 -102 101 183 -276 206 -130 -218 237 -258 -45 187 99 526 125 -259 7 -177
6332 -177 339 30 258 -214 -178 -111 126 321 103 48 -150 -78 373 -23 -255 -63 116 190 151 -16 -205 -184
6354 -184 -108 188 -207 68 -4 25 -5 72 27 43 162 162 163 117 -105 -165 357 169 303 106 59 -135 -7 -178 42
6379 42 129 49 -11 -198 308 -298 54 -24 -259 -13 -107 34 -130 320 -117 -71 195 -10 -312 280 -50 188
6401A88J30l42p8p0L27Q3k8k53k40J12k22K07K25J19k65K67j95L5j7j77K19R1
6423A16l06K85Nq1R4j53K6q0J93J6R9n24J06q0N32m65J12J75j33J35l12J99J56
6446A15m12N36m03j30K63j73L8L28j89m2K53l60L43k05K84l81J40J39p4J17j19
6467F8n15L42K38j82L01m43Q7RL16m08r5L32j24K19J24l8m56K26j6r2N96n11R0
6490F8j40k6J17j06L95o57O6L69j20k0J95j46k8K03l08l45J95J41L20j25j44J53
6512E7R6K68k03l59K81n0j07J6K79k86J07om41N42l91n9M89l36L02l05J39k0o3
6535e0K32l75L0L33k46K97j89j55R4J56k23k7L59k77k64K43J93j69j49L54m48
6556b81L48k35J59j43K38n9l39K28L7k58L33J9q9l6J3m0j2k01O15m93k19K99n
$$ plain form
6401 188 318 -24 -102 -172 155 238 210 -43 -283 -171 -393 -186 39 158 -107 160 -35 0 -17 -194 25 116
6423 116 -190 95 100 19 113 -40 -14 -94 99 115 214 -310 -204 -284 248 -217 -105 70 -63 72 -240 -41 115
6446 115 -297 239 -164 -294 -31 -204 -166 162 -27 -69 184 -176 167 -38 246 -135 5 144 70 187 68
6467 68 -447 -105 133 -49 252 -191 -104 -95 221 -187 -282 50 -74 145 269 231 -225 1 -15 -107 489 -22 68
6490 68 -72 -98 19 -87 308 -349 -283 86 -34 -54 141 -5 -33 170 -138 -483 -288 -147 173 48 -96 57
6512 57 153 421 218 -141 140 90 -17 -1 278 -8 99 93 -348 194 -197 -256 233 -103 199 -106 33 13 -50
6535 -50 182 -193 -163 170 -76 221 32 -123 -29 127 -96 -123 236 -41 -305 -62 131 -38 -187 167 -281
6556 -281 67 -168 -9 -152 86 27 -312 -84 -47 -305 28 47 -42 -78 -65 -105 -117 -318 297 -196 -415 -116 -121
6579a21J18L05l17J08J5j42j05R3M9j60K27k20J33L03j84J9p3R2o1j94M75l37
6601B3K1%J35k13L8J45j79J52J3k60L97m88Q5k27K65K48n5M3j47o4K78l09l4L49
6625B16j52k59N26k73P2k4J77o0k93p2l5Q2K76k60k48J43j32L18K99k29j48l08
6647c84J01L63R6J70k73j05L5L12p46O65j59j8J07k7j36J0K31j3l83K61m9q2l02
6670c26M27k93O2J08J14Q7R6p1k35K34pm0k2l84K2L66o31L74K29j32j72K19r6
6693g1K26J76k18o6L7k72K70r8K05k85K35l7k47M98l88k9L35k60L29l43mR4l26
6716b39P11l59l37K00M4k68L18K19m11k14Q94k48l26K14l05n8L03J90m41Q0M7
6737A4K8K40l30J5k9L4N7l6k24J38j23P0M9r0L40k64j22M82p9k39Q8r3j44k3j20
$$ plain form
6579 -121 -3 302 -15 93 108 -34 -139 -46 3 -157 70 -150 -17 286 102 121 48 140 79 -115 360 23
6601 23 44 44 179 -34 4 149 -30 122 135 -125 272 -216 -131 -358 -93 155 100 143 -4 -68 210 -99 -133 216
6625 216 64 -195 331 58 130 106 283 223 -70 -142 -177 -95 181 -79 -327 -184 -316 2 301 72 -76 -384
6647 -384 -283 80 176 346 73 -32 3 315 -431 234 75 57 164 137 1 11 242 229 -154 107 58 -24 -326
6670 -326 101 -192 -130 -22 92 179 275 204 -31 203 196 156 134 -250 -228 138 -493 -119 110 -22 -194 25 -71
6693 -71 155 331 113 47 84 -188 82 -16 189 -96 139 102 -145 353 -35 -64 271 11 340 -3 -7 87 -239
6716 -239 472 113 -224 -24 20 -248 70 289 -122 -336 558 310 -16 198 -107 -165 138 328 -113 -33 14
6737 14 42 282 -48 -33 -62 -28 29 -7 -231 -93 -216 -146 -97 -187 153 -111 -233 249 170 -69 19 -74 -218 -241 -361
6762c61L24j6m3nL3Pj97K68m7K52l85L63m5r5p3l2lk7J60J52m10J52K10l20M84
6787C46j7jj57K39q26O20j03j98M21m07J78J31j38m7J5Q2j18oj76K66Mkj99J77
6811H4j03l6J15j11J66l38K23l2K04k19OO6j38K37j04j06K84J82n06J88j4l35
6833b87Q3L90m7j08K81k83k1l63M70j32Pk60J06K24P7l41N3L62j63j80M6J17l72
6856c41L80L2J11J53l14l4N9K17j69O7l8j83N7J21k80O5L17O4l50m5J58l32L40
6879E5Q5L8j22M4j37L68r5p4P4m94J08M65j50r7m1o3n8j2N14l46o3j90M88l57
6903f0J00K30j56K81l55l46M8M96r2j32j31J14k1J40K23l48j37J94J12j73l4K27
6925A80R2n13m2K48L20l87k19K22K62j00j98K0J03J89j24q0k3K0j2j33k43K78
$$ plain form
6762 -361 -37 -53 -96 -101 -68 -61 -258 10 -37 215 -170 193 148 53 -20 -52 -55 -82 78 230 -180 -28 182 -138 346
6787 346 329 328 171 410 -416 204 101 -97 324 -83 95 226 88 41 56 138 20 14 -162 104 108 106 -93 84
6811 84 -19 -55 60 -51 115 -223 0 -32 172 -47 -41 25 -113 124 20 -86 198 380 -126 62 48 -287
6833 -287 -204 186 139 31 312 29 8 -355 115 -17 -10 -270 -164 60 137 -204 -151 211 48 -132 -86 31 -341
6856 -341 39 71 182 335 21 -13 46 263 94 161 123 -60 -3 118 -162 -97 220 284 -66 -111 47 -285 55
6879 55 140 178 56 100 -37 331 236 162 236 -258 -150 315 165 68 27 -36 -94 -106 408 62 -1 -191 297 -60
6903 -60 40 270 114 395 40 -306 -258 238 146 14 -117 -3 -24 116 339 -9 -146 48 160 -13 -47 180
6925 180 272 -241 -283 -35 285 -102 -321 -99 163 63 -135 -115 -12 177 53 -27 -50 -30 -42 -175 -418 -140
6947a40j11N05k39k10J86J17l12kJ17N5J86r3K37m43J91j0j09J84j73j13M65k76
6969A2j12K02j50j61J57Q8j82L5J63p9j68L38k65l19M86J94j57k58N7j49J36L16
6991A84l41J28J72p0J40L42o16N06k04l47R2P0J0P4q4j3r7j54J02K93P0k56l97
7014c96L65J99j44k07J35J67r3p5L74l83J32m17L19r5J72J0k62L47j54O3K6k74
7036a91P1J91q5q9J48M26m03J40p8j43j55lK29j37K98k59l50L94J15k91J84l30
7058c18M7K17o4L69l67P3j76K26j15q3K4J15l18J47L23j76O6O0k84M54o05N28
7080A43k2k81L78l00K34n6n1NL3j67J51K11l16Oprl75N02J25l36M58k38J36n14
7104b90P20l51K44l21l86O79o26L49k55J24j41L21n00O32k2k64R0l1k2J63Q8j91
$$ plain form
6947 -140 -251 254 15 -195 -9 108 -204 -206 -89 -34 152 59 296 -147 44 34 -75 109 -64 -177 288 12
6969 12 -100 102 -48 -209 -52 36 -146 -111 52 -27 -195 143 -122 -441 45 239 82 -176 -119 -268 -132 184
6991 184 -157 -29 143 73 213 555 -61 445 241 -106 -14 56 66 140 56 43 -54 -208 -106 187 257 1 -396
7014 -396 -31 168 24 -183 -48 119 26 -49 325 -58 74 -343 -24 -119 53 63 -199 148 -6 57 83 -191
7036 -191 -120 71 -14 -103 45 471 68 208 130 -13 -168 -171 58 -79 219 -40 -390 4 119 -172 12 -318
7058 -318 -271 -54 -118 251 -116 -43 -219 7 -108 -191 -167 -52 -370 -223 100 -76 -10 50 -234 220 -385 143
7080 143 121 -160 218 -82 152 96 45 50 83 -84 67 278 -38 -32 -39 -48 -423 79 204 -132 326 88 224 -290
7104 -290 430 79 323 2 -384 295 -331 18 -237 -113 -254 67 -433 199 177 -87 3 -28 -50 113 201 10
7126A0R3l90J63K16k64n5K61K35k82M7L78n13J22n19N09J96r4j30p8K76k47j8
7148h4j47J38K58k90Pj50M06j29P4k11L01k46J32n3l9j24J48j04J7J08JJ15n68
7171d40M62P1m1L8k10j84P08k89k04K87j30J62l77L62j63j07K88j89N01k67k84
7192fO2K36k43q1l2K58k44j7M1J9K8k50o6K75mJ76o8J38j06j41J03M49n89P8q0
7217f4o0P6j94j85O47j86J26J84l67n8l39N68m13K52j24j9r2K77J77L44p65N10
7239B95l74M85o01J39P8O55p85P2j19J0J94j60j93J64N3J35p6L8N3N2l4j39J63
7262A05J9j87J8L2P3j02K00O7J15p51N13kk28K50l65L89k92J55j88K00k35R8l
7285a19l20N39o9l0k75Q6M03p4r8J3j26L15j81j26k96L49Qj0j75N2P6l45O64n90
$$ plain form
7126 10 103 -287 -124 92 -172 -227 34 269 -13 34 412 -101 21 -498 11 207 113 -17 -95 181 -66 -84
7148 -84 -231 -93 165 -125 -118 -268 138 9 83 -128 173 -73 59 6 -33 -157 -9 -113 -96 12 13 128 -440
7171 -440 22 93 52 90 -120 -304 404 115 -89 198 68 230 -147 215 52 -55 233 44 545 278 -6
7192 -6 56 292 49 -32 -64 194 -50 -67 -26 -7 21 -229 -295 -20 -24 152 84 222 116 -25 78 527 -62 16 -64
7217 -64 -124 -48 -242 -427 220 34 160 344 -23 -81 -420 148 -265 -13 -137 -156 -248 29 206 550 -215 295
7239 295 -79 406 -195 -56 22 677 -108 -36 -155 -145 49 -111 -304 -140 -87 48 -28 10 63 115 81 -58 105
7262 105 124 -63 -45 -13 60 -42 158 225 340 -411 102 100 -128 122 -243 146 -146 9 -179 21 -214 -116 -119
7285 -119 -439 100 31 1 -274 -188 215 141 43 56 -70 245 64 -62 -358 -9 -1 -11 -186 -134 -58 -403 261 -329
7309c29O26l12L69l28j09M38n61J40L9K32j01j6J46k33k38n8L9M70l86r3N0K85
7331G0J41l36L21l16J78R9m05M77j17l39J29m4L3R3j04k5J69k30K31M53m57j0
7353A1j53j26l0L47k55M23k20k81M90k05O1J32k67K63J72j94L1m92L59j41K29
7374A54J64l69L23m66J03R4K47n40K35P6pk36K38J4l62J34L19l12L74J05k32R8
7396A54l13L05K04n01K55J03L11l87j13K3K62o63K7M67j18j37K3J78m1o60N06
7417a15k6M37m33j15K34K87l76K5k08J45m7M9P7j65K78J45q9n8j34j80J76J63
7439G0k10L25m3M5j28j32k7L48j8j60k75J83N62o98M5L87m61J59J59p7L24l13
7461F5J51k80M16m95N2J8j24m2O7L90k35J42j55l27N66n56K90r5K79r1l38K36
$$ plain form
7309 -329 297 -15 354 26 -83 355 -206 -66 -27 205 104 88 234 1 -237 -295 -256 214 -172 -265 -215 70
7331 70 211 -125 196 -120 58 157 -248 229 112 -227 -98 -142 -109 -16 -120 -145 24 -206 25 478 21 11
7353 11 -142 -268 -298 49 -206 217 -3 -284 206 1 62 194 -73 190 362 168 199 -293 66 -75 154
7374 154 318 -51 272 -194 -91 3 250 -290 -55 21 14 -222 16 30 -332 -198 121 -191 183 288 56 154
7396 154 -159 146 350 -151 104 207 518 131 18 41 303 -360 -333 134 16 -121 -98 80 39 -621 -115
7417 -115 -141 296 -137 -252 -18 269 -107 -82 -290 -145 -192 -143 -66 -231 47 192 103 45 -89 -269 -93 70
7439 70 -140 185 142 187 59 -73 -100 248 230 70 -205 -22 540 -158 -113 274 -187 -28 131 54 378 65
7461 65 216 -64 352 -143 -91 -73 -197 -239 -172 218 -17 125 -30 -357 209 -347 -57 -152 127 36 -302 -66
7483f6L4k06K46K39m75J39J72k60L54N6l67K80j39K05k45R2J56m3m33N06r1j45
7505Ij28L36m42K75j75k2L05l07J53J09M7j94jl89N83j17j6k29M13l89j77K62
7527i4J36j83R4j1J20q3N6P6J47l22RP8l6J24k33j56o3L30k46N30k62j44K28l10
7551b15O92n64K40o6p7k69L73J21m9k56P1J70k02O3L20k47J05j77k71m4L05j26
7573a03L20k26J15m08J25J56J10k6l7n2N9k19j39L15j92L20J21j55p4l94L40m0
7595h4rN9j5O1j95K97J53l28o7K46k08K24J29l66N5J62m55L85k39M99n90K21J19
7618E4j6j13l5J72j01j78K11J6j91R3L7J50q9j41K45j44R7K77m04M86l22K1j55
7641c0K46n06M06K3l47K29r7O1J26j20j41n1L84m08K04j38j53K37j76L22L0k96
$$ plain form
7483 -66 -32 -238 8 247 -228 -89 83 -177 177 233 -134 146 7 212 -33 59 215 172 -261 245 154 9
7505 9 -119 217 -225 50 -125 -147 158 -149 4 113 160 -34 -35 -424 159 42 26 -203 210 -179 -356 -94
7527 -94 42 -141 -47 -58 62 -21 35 111 258 -64 -55 23 -13 111 -122 -278 -341 -11 -257 273 11 -133 95 -215
7551 -215 477 -87 153 87 10 -259 114 235 186 -70 1 171 -31 32 352 105 210 33 -238 -282 23 -103
7573 -103 217 -9 106 -302 -177 -21 89 63 26 -26 33 -186 -325 -10 -202 118 239 84 10 -384 -44 -84
7595 -84 -93 -34 -49 12 -183 114 267 -61 -128 118 -90 134 263 -103 -48 114 -341 44 -195 304 -286 -65 54
7618 54 38 -75 -110 62 -39 -217 -6 10 -181 -88 -51 99 10 -131 114 -30 67 344 -60 426 104 125 -30
7641 -30 216 -290 116 139 -208 21 -76 -15 111 -9 -150 -201 183 -225 -21 -159 -312 -75 -251 71 101 -195
7663a95K82J93m52K50j87k0J39J49k53O2M4J03j52P4k18K99m3P0j93M9J56k09
7685e2K81j92j58l32O56k98j4L11j73J08M5m09K82j67L81N6q36N81j91P3o1J87
7707G8k63L12N4n5J55m38K89L50o25j86K82k66R9M25n49K48J12J52k54J28M7j68
7729g3m0L73n83L00n1K17m02J68M8r8J38k23J62J33l83K06K72m15M30m93K31J73
7751I0j98L67j46m00N30k86K88l38k07K06n4m8O7K55j40J05k43J75k44n8N48j06
7773A63l4l37J90N0j56L25j14L8j16k7kk11N89m58j84J63J18NN8k65M69m59j54
7796c49L73k0j5R8k87J90J74j98l8J40o1k43K19j19j62J80M15m13L69j62j75J65
7818H1j71k5l1P6k37M40o0q1j08p3L88P8m20m6J04K12l97J02K50M2k23K58j48
$$ plain form
7663 -195 87 280 -172 78 -109 -129 10 159 -94 -32 12 115 -37 37 -181 118 75 145 -48 1 157 -52
7685 -52 229 37 -121 -453 203 -95 -109 202 29 137 182 -227 55 -112 269 325 -511 70 -121 -48 -109 78
7707 78 -185 127 181 126 281 -157 132 482 -143 -329 -47 -313 -214 211 -338 -90 22 174 -80 48 95 -73
7729 -73 -113 260 -323 -23 -74 143 -259 -91 -43 -141 -3 -226 -64 69 -314 -108 164 -251 179 -314 -83 90
7751 90 -108 259 113 -287 243 -43 245 -93 -300 -94 -148 -196 -129 126 -14 91 -152 23 -221 -279 269 163
7773 163 129 -208 -18 32 -124 201 87 125 9 -18 -20 -231 358 -100 -284 -121 -3 2 60 -205 264 -195 -349
7796 -349 24 4 -11 87 -200 -10 164 -34 -72 68 7 -236 -17 -136 -298 -118 297 -116 253 91 -84 81
7818 81 -90 -115 -146 -70 -307 133 73 -8 -116 -189 199 277 -143 -189 -85 127 -270 -168 82 124 -99 159 11
7841A1o1p8K00j59j35J89l43O45l70J7K32n26M35p3n6J91j59L66l21k26N55k72
7863F2O5N7NN3j20q0j50N29o60K45k07j0L25l93K57J0J2nk42L72j44j80J70J05
7887G6q9j49K21J89j83j55J09j11K41P9n14P5N16l61K6j42j32K66q5R2K50l38
7909a19o6J57J82N4k26R3q9K83j68j3M4j74o9L98m95M60j64j30L06m53K46j95
7931a38K03m6K13j5n31K15k26L10R3l2J59r9l94M87m10K18J71l87K40K1l23J63
7953a08K43r0k17K54J29k49J47N3m39L11K05n58J53L08j60j49N28k40l8M0k20
7974i7J55k48K69l05N0J81n3K2J55j62J72k83o6K3j7Q7J58K5m10M70n2m41J8K32
7998a17K50l08k42J68L57j50m5j70j18N30J5l58K79m59J59M66o73M46l59M63J13
$$ plain form
7841 11 -50 -128 72 -87 -222 -33 -376 269 -101 -84 148 -378 57 -16 -72 119 -40 326 5 -221 334 62
7863 62 127 184 189 242 122 42 -108 421 -239 6 -201 -211 114 -279 -22 -12 0 -5 -247 125 -19 -199 -29 76
7887 76 -13 -162 59 248 65 -90 19 -92 149 228 -286 -211 305 -56 -30 -172 -304 -38 -123 -31 219 -119
7909 -119 -185 -28 154 208 -18 75 -14 269 101 88 132 -42 -111 287 -208 252 88 -42 264 -189 57 -138
7931 -138 65 19 232 217 -314 -99 -325 -15 78 46 205 106 -288 199 -211 7 178 -209 31 52 -271 -108
7953 -108 135 45 -172 82 211 -38 109 162 -277 34 239 -319 -166 142 -18 -167 361 121 83 123 -97
7974 -97 58 -190 79 -226 -176 5 -48 -26 129 -33 139 -144 -210 -187 -204 -117 41 66 -344 126 74 -367 -349 -117
7998 -117 133 -175 -417 -249 108 -42 -87 -257 -375 155 170 -188 91 -368 -209 257 -416 30 -329 134 247
8019B47j67K52m94L50O8m88K0J40J9K32Ql71P0K68k78k9K33j91K83m30L32Q6l9
8042A21m0m22L68L27l80q8J77J95k77J35k46j58J88j55J86L24l42%K53J72m43
8063a05J14J56O0j31j84K4L9J74k29K35j53QL36M2m35j05L55K87p07K35J01o6
8085E1m07j38N74j14p1J87k15L92k65j51j6J43j86J21K31L1O3n61M11n7O5k07
8107a19K79l17K24O6P2k49j3J55Q7j60j46K8J14k72L60n5m72M14J65k10j7M0r5
8130a21K82j73J33j43K24k63m7j36M92p5k44J36J83o7j68j06J42J46j53J76P8
8151B96l29J79M3Q8j75K02J02q5k05K7J99m00j06n4L75r1l5j17J8Q7m48K20j78
8174c87N03K68m77q2j41N49j39J8Q6l55K18k7R9K27j13k93p
$$ plain form
8019 247 80 332 -162 188 256 -232 -212 -72 -53 179 187 -184 -114 154 -124 -153 80 -111 172 -258 74 160 121
8042 121 81 -341 27 354 -26 -114 63 258 -19 116 -130 -288 -100 -255 -69 255 -87 -87 166 338 -105
8063 -105 9 165 225 94 -90 -66 -27 147 -82 153 0 8 344 386 -49 -154 201 488 -219 16 117 51
8085 51 -356 -494 80 -34 -105 82 -133 259 -6 -157 -173 -30 -216 -95 136 167 230 -331 80 23 88 -119
8107 -119 160 -157 67 133 205 -44 -57 98 185 25 -121 -93 21 -251 109 54 -418 -4 161 -49 -66 -26 -121
8130 -121 161 -12 121 -22 202 -61 -108 -244 248 173 -71 65 248 181 13 -93 49 195 42 218 296
8151 296 -33 146 189 277 102 304 406 321 116 143 342 -58 -164 -218 157 66 31 -86 -68 19 -429 -209 -387
8174 -387 116 384 -93 -175 -316 233 94 112 198 -157 61 34 133 360 247 -46 -53
8191e3
$$ Imaginary data points
##PAGE= N=2
##DATA TABLE= (X++(I..I)), XYDATA
0@%%%%%%%%%%%%%%%Jl3O4o4O4o5P6j07J29j32J64j94K26k61K93l53M03m44M99
34B66n69O49p32Q15r13J024j138J261j401J554j717J899k097K313k553K813l098
51a624L414l766M154m583N069n622O256o990P852q879J0131j1701J3726j6459
65i022K0368k6472L7390o2871K24017J68298l43362R67J14947M0145j15811q0830
77c2236K1811J31955o3221j95976J2215K06768J3990j28023o4250K4418L2810
88c9739k1152j09563K0237J80816L6574j53937l3050Q3350J6309m5028m2343j702
100a09228Q4972J9543j24730k5960J47227N1490p5525j9445L2958J6093j7251
111a9856q0138k6064J24350O2611j05114l3135R8013L4957n0485m5752n525O4503
$$ plain form
0 0 0 0 0 0 0 0 0 0 0 0 0 0 0 0 0 1 -32 32 -32 32 -33 43 -64 65 -67 97 -97 129 -132 161 -192 211 -233 266
34 266 -303 346 -386 429 -484 540 -598 663 -738 816 -901 998 -1099 1214 -1339 1474 -1624
51 -1624 1790 -1976 2178 -2405 2664 -2958 3298 -3692 4160 -4719 5412 -6289 7437 -9022
65 -9022 11346 -15126 22264 -40607 183410 351708 8346 9313 124260 164405 48594 -32236
77 -32236 -10425 121530 58309 -137667 -125452 81316 95306 -32717 -96967 -72549 -39739
88 -39739 -60891 -170454 -150217 30599 67173 -86764 -119814 -36464 -20155 -65183 -107526 -109228
100 -109228 -24256 -4713 -129443 -155403 -8176 43314 -32211 -51656 -18698 -2605 -19856
111 -19856 -99994 -126058 -1708 60903 -44211 -77346 20667 55624 5139 -40613 -46138 18365
123A8365L1013j14367o4526J31209Q4496q3972m9924N7699N7986p789r0672n9838
135i0320J01270Q6158j07520q2206J05849R5501l5014o3860j2837O5510N6735
146A19266r2898j05492R0359J14427o0379q1077L6924P4569K6010n7840p9593
157a5724M6392R1033p1067j16567M8269R7055p337n2149k2781L2379N4807m7345
169C6965j06736K7136R2707l9427q5119J5550N4150K2821j9349m8882J4484O9946
181C4246l8304j06478J7412Q2214n461m1137l158L2750M7476j5192p7167J5627
193e7172R1301k4144r4747O878O5453K0384j9031k8949K3649P7056j4748j07211
205f1281k512R0731K408o5903j6437L8610N1671k15p1973m029R8525R754j05617
$$ plain form
123 18365 49378 -64989 -129515 1694 86190 2218 -47706 9993 67979 60190 -30482 -90320
135 -90320 10950 97108 -10412 -92618 13231 108732 73718 9858 -2979 62531 119266
146 119266 26368 -79124 11235 125662 65283 -15794 21130 95699 121709 63869 -15724
157 -15724 30668 121701 50634 -65933 -17664 79391 72054 19905 -2876 29503 84310 36965
169 36965 -69771 -42635 50072 10645 -74474 -58924 -4774 18047 -1302 -50184 -35700 34246
181 34246 -4058 -110536 -93124 -10910 -16371 -57508 -60666 -27916 19560 4368 -72799 -57172
193 -57172 34129 9985 -84762 -77884 -12431 7953 -11078 -40027 -16378 60678 45930 -61281
205 -61281 -63793 26938 29346 -36557 -52994 -14384 37287 37072 -34901 -38930 59595 69349 -36268
218c6268l3070O0128L3557k0786m0668L673Q0466K8662r1198l7727Q2036L3372
230F2177o2039m1455J7018M7473K3930m8710k7073P9615M7272p4100m9929L8046
242A2225L1218j2448l2239j6208M8406M6110n1729m5172N9164M2215m8523m3893
254a0874L201K1347J3308l1562l0452N3227N0505n5016n0388L7409K8940k6696
266B949l4696j4301K8573L3424m0777m4333N7500N7339m4284n0069J2604K6222
278i849L557l4568l5464M5658O4588l9633o0718M0891N8221j5327m3951j9798
290d6393K5578M0876l0207o0099M0940Q1093j7740n7646L804L5625J5978k5781
302F028m9073J5020O6667j2353o6512J5021O5121Q072l3459k6430O580L5770p792
$$ plain form
218 -36268 -69338 -9210 24347 3561 -37107 -33434 47032 75694 -15504 -53231 28805 62177
230 62177 138 -41317 -24299 23174 47104 -1606 -28679 50936 98208 24108 -25821 12225
242 12225 43443 30995 -1244 -17452 30954 77064 25335 -19837 39327 81542 33019 -10874
254 -10874 -7673 13674 26982 -4580 -35032 18195 68700 13684 -36704 705 29645 2949
266 2949 -31747 -46048 -17475 15949 -24828 -69161 -11661 45678 1394 -48675 -36071 -9849
278 -9849 -6292 -40860 -76324 -30666 33922 -5711 -66429 -25538 32683 17356 -26595 -46393
290 -46393 -20815 20061 -10146 -70245 -29305 51788 34048 -23598 -19794 15831 31809 6028
302 6028 -43045 -28025 38642 26289 -40223 -25202 39919 47991 14532 -11898 -5318 30452 22660
315B2660o2372M508P0623N690m9864l645L1630J8763j0551l8750p748M5883P38
328B7565o0072j57N8422J3055k5468j2937N901K2797k143m9670r966N5911O731
341B9969n1885n153M0258J8215j0895k7494o392L7569K731o3936j5017N9823J9708
354B7501l6393j5497J8229K9219L259m7348k1105N2871J9821n9568k6139M2864
366a2286L2546o434k6070r893L9119K3357n5923l9722M7819L6513l0734k8793
378c0501J0717L3508K2697l1129l4302L7066L7633m5192m4436K4468L3957J929
390A6415j8561j5225K5011L6046k9972m6075K6027L5932k3486l1494K135K1323
402a924K1482j0346k8785K1117L8856k9269m5772J5735K8197n535j7317r132J7402
$$ plain form
315 22660 -39712 -35204 35419 41109 -8755 -12400 19230 37993 27442 -11308 -19056 26827 27565
328 27565 -32507 -32664 25758 38813 13345 408 6309 29106 26963 -22707 -32673 23238 29969
341 29969 -21916 -27069 13189 31404 20509 -6985 -13377 24192 26923 -37013 -52030 7793 27501
354 27501 -8892 -24389 -6160 23059 26318 -21030 -42135 10736 30557 -29011 -55150 -12286
366 -12286 20260 13826 -12244 -22137 16982 40339 -15584 -55306 -7487 29026 -1708 -30501
378 -30501 -19784 13724 36421 5292 -29010 8056 45689 497 -43939 -19471 14486 16415
390 16415 -2146 -17371 7640 43686 13714 -32361 -6334 29598 6112 -25382 -23247 -1924
402 -1924 19558 9212 -19573 1544 40400 11131 -34641 -18906 9291 3756 -13561 -22693 -5291
415e291L2013j6034l8287K2618M0649k4762l9607L822K1982J2026j0715k3141
427b4727K0217M4996j8715n0072J1922L8569o520k8624j4364J5230L4969o026
439A6855m2115J3103N4224p425m9277q830K3357J6657j0068l1283N171N0019M716
452C5104m9466m250M2057Q411k7347k3976O52K9888R194l7081p350M9448J4719
465D0003l9154j7779J6355J4926k578k7074j2728L4364J8129l6709j2288L7575
477A3042J5492k1864j8768l969J5479R469k7580j3762L8330K0026l2099j3540
489a9744K1489J3226o204k0261j3379K2836J7221l2784j6276L9571K3509k1967
501G237j8451L835J5593P443k7260k2311L3285K7651l1334k3473K6224K5295m258
$$ plain form
415 -5291 26722 10688 -27599 -4981 35668 10906 -28701 -24879 -2897 9129 -1586 -24727
427 -24727 -4510 40486 21771 -28301 -16379 22190 15670 -12954 -27318 -12088 22881 16855
439 16855 -25260 -12157 42067 34642 -14635 -23465 -108 16549 6481 -24802 -19631 30388 35104
452 35104 -14362 -18612 23445 31856 4509 -19467 -18815 11073 20267 -16814 -24164 25284 40003
465 40003 849 -16930 -575 14351 11773 -15301 -28029 6335 24464 -12245 -24533 13042
477 13042 28534 6670 -12098 -16067 -588 8881 -18699 -32461 5869 25895 -6204 -19744
489 -19744 1745 14971 8767 -11494 -24873 -2037 15184 -17600 -33876 5695 29204 7237
501 7237 -11214 -7379 8214 15657 -11603 -33914 -629 27022 -4312 -27785 -1561 23734 19476
514A9476k1780j6781J8398K2567k9194l2529L0608L5266j4675k4206P22J8675
526F547J6121j9024l3291J6218L5202j9697l4301J4670L1319O626j4095j9969
538a3674Q429K7660j3266l8612J1753L5614m699k2594r97J5999J8309l800k7991
551g869J553L0197r789l3516O120K6390N758q157j1160L560K2227m028l3098J946
565i866L0399o718k6612J60J6501J2709j544k0369j58K8123o628l8750J7K9073
579F337K833j5783r690O826K3226K220l2482m232L4254N01l4963r381J8678J6974
593E318J18k0091m671L1722R627l8017j3993K8963J2446j7145j7227J209K3631
606A890J5847k4764j5759L0764J5403k9138j9854J0938J6113N356j4209j3512
$$ plain form
514 19476 -2304 -19085 -687 21880 -7314 -39843 -9235 26031 11356 -12850 -12128 6547
526 6547 22668 3644 -29647 -13429 21773 2076 -32225 -17555 13764 20390 6295 -13674
538 -13674 -5245 22415 9149 -29463 -17710 17904 13205 -9389 -10386 5613 23922 20122 -7869
551 -7869 -6316 23881 14092 -19424 -13304 13086 18844 10687 -473 3087 25314 21286 -11812 -9866
565 -9866 20533 13815 -12797 -12637 3864 16573 15029 -5340 -5498 22625 15997 -22753 -22736 6337
579 6337 9170 -6613 -16303 -9477 13749 15969 -16513 -20745 13509 14010 -20953 -30334 -11656 5318
593 5318 5436 -14655 -19326 12396 22023 -15994 -29987 -1024 11422 -5723 -22950 -21741 1890
606 1890 17737 -7027 -22786 7978 23381 -5757 -25611 -14673 1440 6796 -7413 -20925
618b0925K2906K2229k3165j9978K1148J5268j2881j6051m135J2931J7657j1330
630C674j6782K2315K0234k0639j7939R919J1409k51j0116j1872J4336K0702j4915
643A0075j8089K0792J8401j5709j7390j490R093J0222j0841j7615J8204K4967
655C0620j8254k3712J2283J6548l702j5791j5116R417K2387j2061k6176J6359
667g198K8740j0162k3508m847J0617J2583r369k5229P397L1926n739k7978N155
680a7612K2625N245j2301j8797K76K3655K38k7918L270L0267L858j8923o612P904
694d825J3387M86k2194n920K4722M441k3422K10K0696P295o809j1572m895J4542
708F142M978k2306m986K4633M329j7384k435R553R719M76j5441q590J8359M957
$$ plain form
618 -20925 1981 24210 1045 -18933 2215 17483 4602 -11449 -15584 -2653 15004 3674
630 3674 -13108 9207 29441 8802 -9137 782 12191 11940 1824 -10048 4288 24990 10075
643 10075 -8014 12778 31179 15470 -1920 -3410 5683 15905 5064 -12551 5653 30620
655 30620 12366 -11346 937 17485 13783 -2008 -17124 -7707 14680 2619 -23557 -7198
667 -7198 21542 11380 -12128 -16975 -6358 6225 -3144 -28373 -20976 10950 5211 -22767 -17612
680 -17612 5013 10258 -2043 -20840 -20564 3091 3329 -24589 -21319 8948 12806 -6117 -12729 -4825
694 -4825 8562 9048 -13146 -19066 5656 10097 -13325 -13115 7581 14876 8067 -3505 -8400 6142
708 6142 11120 -11186 -16172 8461 12790 -4594 -7029 2524 12243 12719 -2722 -11312 7047 12004
722A2004k4194l865K3745Q257r717q124J16J3163O067k1933j0436K3984R497k1876
736c312q679J4785J3839J575j4350j1787J7968J2629k4974j6019K0554J5464r065
749H628j2524k365J4732J3704j7047k0883J6516J7241j8410j7755P662J5229O859
762A1587r492j6219J0645J8987j4368k2216J0139J6012n823j1021m080Q352J5886
775H389m408j8816O693J7548j0922j7727M756J0939M517l441j0122M887J8022
788A0315n979j8999P827J5131p602j2249r37P112J1834j308j5106O236J9485q428
802G332k0164M429J3401J248p438r253M648J9244j088k1052M835K0936l969j7665
816d556n111P710J2635R1j6609k53K4201J546k2781k863J5951N337p891j3436
$$ plain form
722 12004 -12190 -16055 7690 15947 6230 -1894 -1778 11385 17452 -4481 -14917 9067 18564 -3312
736 -3312 -11991 2794 16633 18208 3858 -7929 10039 22668 -2306 -18325 2229 17693 8628
749 8628 -3896 -6261 8471 22175 5128 -15755 761 18002 -408 -18163 -10501 4728 11587
762 11587 2095 -14124 -3479 15508 1140 -21076 -10937 5075 -748 -11769 -15849 -7497 8389
775 8389 3981 -14835 -8142 9406 -1516 -19243 -14487 -3548 969 -2472 -12594 -7707 10315
788 10315 4336 -14663 -6836 8295 693 -11556 -12493 -5381 6453 5145 -9961 -3725 15760 7332
802 7332 -12832 -8403 4998 6246 -1192 -10445 -5797 13447 12359 -8693 -3858 17078 13109 -4556
816 -4556 -9667 -1957 10678 10769 -5840 -6093 18108 19654 -3127 -5990 9961 15298 7407 -6029
830f029j894J8018P907j9234m888K0545M787j5349r243K773R943M120j4979q834
844a2357J7307R951j6708o929J1932N871n713j0077p387R565J0296j3026q261
857a5536J5576P952j2368o568L656M725L735r537r811J1254J1022j2662o613J3923
871a252P858o846p309l687P138R169j1089j1020J5604J2485j2404q389Q309R133
885G700J659r292j1537R354J4028j2051j2793J3077J4522n294r914l633P030J1474
899A4330q925j7146Q606J6903p435j3585M367J1117N633o496j4432K632J6625
912A2194n524j7586N216J4910q99p668m585L117J1597j148j6350p94J5260k907
926D833j2647K315Q541M532o85r900k217J2260K12j5745P39J2357j371p669j006
$$ plain form
830 -6029 -7923 10095 18002 -1232 -6120 14425 19212 3863 -5380 -2607 7336 11456 -3523 -12357
844 -12357 4950 14901 -1807 -8736 3196 9067 3354 -6723 -14110 -4545 5751 -7275 -15536
857 -15536 40 7992 -4376 -10944 -7288 -2563 1172 -8365 -18176 -6922 4100 -8562 -15175 -1252
871 -1252 6606 -240 -7549 -11236 -4098 5071 -6018 -17038 -1434 11051 -1353 -9742 -1433 7700
885 7700 9359 67 -11470 -2116 11912 -139 -12932 145 14667 9373 -541 -4174 2856 14330
899 14330 5405 -11741 -3135 13768 6333 -7252 -2885 8232 13865 7369 -7063 -4431 12194
912 12194 6670 -10916 -5700 9210 8311 643 -3942 -825 10772 9624 -6726 -7520 7740 4833
926 4833 -7814 -5499 3042 7574 6889 -3011 -5228 7032 7244 -8501 -7762 4595 3224 -4445 -5451
941e451K824Q295K176j2379k951J3360j942j4589J124J0666K531l129o485p68
955f718J2381K349j5838k691J4780O22j2529l106O133R369K981j1864n544J5290
969E615M317j6992m996J1814N784l320q748k598J2583R162j3590r352J3644O529
983I852j1210p583K439P876P453q317r828J1224J0521j1226r378P967N644k250
997C184n558n622O431J1953n981j0782Q487Q154q382o852J738M438M694l852q789
1012f739O012J1378p072r183P812N979m872n376l500L869R103l947j0385Q044
1026A123J0085q355q696M053M659J814m977q785M667J3193n950j1731P325J0204
1040H629m538q618l663L203R807k524j3486M218J4432l091j1620J371P505L431
$$ plain form
941 -5451 -2627 5668 7844 -4535 -7486 5874 3932 -10657 -9533 1133 3664 535 -5950 -6718
955 -6718 5663 8012 -7826 -10517 4263 4885 -7644 -10750 -4617 4752 7733 -4131 -9675 5615
969 5615 9932 -7060 -12056 -242 5542 2222 -6526 -9124 3459 12621 -969 -10321 3323 9852
983 9852 -1358 -8941 -6502 1374 8827 510 -9318 1906 12427 1201 -8177 -210 5434 3184
997 3184 -2374 -7996 -1565 10388 4407 -6375 2112 10266 1884 -4968 -3230 1208 5902 2050 -6739
1012 -6739 -727 10651 3579 -5604 2208 8187 3315 -2061 -5561 -1692 7411 3464 -6921 1123
1026 1123 11208 2853 -5843 -1790 2869 4683 -294 -9079 -4412 8781 2831 -8900 -1575 8629
1040 8629 4091 -4527 -8190 -4987 4820 2296 -11190 -6972 7460 4369 -7251 -5880 1625 5056
1054E056l513j0848r52J4473O60j3173J424J2488J034p050m838L29R001K745j2432
1069e596l274J3200K401r586j081O847L121n67p367n264R538M840j0759k349J0791
1084D895J648n915j937L67M793L659r231n710R781L158r812q11Q333K401k002
1099C617m871m128P219M876j0781m685J0912L164q171k277L326N091L375q274
1113a607p804R260O720j0784n280Q854N679k248n237m124P082Q461q342j0483
1127i853Q712P629o622n484J942N815N932m467j0343N192J0855o976r055M761
1141a962O439j81l418m705K778J0044k673j1442L017Q302m121n874J148L035M513
1156D900m08q274N82R768k803q868K935N094j792l204j972O23P901j53r453J521
$$ plain form
1054 5056 1543 -9305 -10257 4216 4876 -8297 -6873 5615 6649 -401 -5239 -4910 4091 6836 -5596
1069 -5596 -8870 4330 6731 -2855 -3936 2911 6032 5465 -1902 -7166 2372 7212 -3547 -5896 4895
1084 4895 6543 628 -1309 -942 3851 7510 -1721 -7431 2350 5508 -4304 -5115 3218 5619 3617
1099 3617 -1254 -5382 1837 6713 -4068 -8753 2159 5323 -2848 -5125 -1799 3292 6667 -1607
1113 -1607 -9411 -151 6569 -4215 -9495 -641 5038 2790 -2447 -6571 511 8972 630 -9853
1127 -9853 -1141 6488 -134 -5618 -3676 2139 8071 3604 -6739 -1547 9308 2332 -6723 -1962
1141 -1962 4477 4296 878 -3827 -1049 8995 6322 -5120 -2103 6199 2078 -3796 -2648 387 4900
1156 4900 4492 -3782 -3200 6568 3765 -5103 -2168 2926 1134 -2070 -4042 -3419 4482 4329 -5124 -3603
1172c603Q767m286p214K196L699J881q92o466K50J0541q78j0672K293Q270k281
1187A605n715k439J849Q018J421j0090l60J1159q7r877m33N066K886m21o730k566
1203f714J0575M717j0431k211Q605J906n325m190l69O206M781p820n669R421M584
1218H066p385k850L968K408j32m489n363O523P283p171m960P096K738m618k444
1233a330q42K646M337m660o821O357N378n904k664N204P98q45l019m478L740O313
1249D210n274n721O988M257n329k683J707K441K830l987p303N359P604n692n314
1264e907N395M316j593l115m383K827P615l803q718M569Q038l780m861R20L345
1279H65M391k332r090J890R326k484p573K379N956L18k315m542K40P581M20r698
$$ plain form
1172 -3603 5164 878 -6336 -4140 -441 1440 548 -5918 -5668 4873 3995 -6677 -4384 3886 1605
1187 1605 -4110 -6549 -4700 3318 4739 -5351 -5711 5448 5361 -4516 -4949 117 3003 2582 -4148 -6714
1203 -6714 3861 8578 -1853 -4064 4541 6447 1122 -3068 -3437 2769 7550 -270 -5939 3482 8066
1218 8066 681 -2169 1799 4207 4075 -414 -5777 746 8029 858 -4102 2994 5732 1114 -1330
1233 -1330 -2172 474 4811 151 -6670 -313 5065 -839 -3503 1701 2499 1654 -1365 -5843 -2103 4210
1249 4210 -1064 -6785 203 4460 -869 -3552 -1845 596 3426 -561 -7864 -2505 5099 -593 -5907
1264 -5907 -512 3804 2211 -904 -5287 -2460 5155 1352 -7366 -2797 5241 1461 -3400 -2480 865
1279 865 5256 2924 -6166 -4276 5050 2566 -5007 -2628 3328 3646 1331 -3211 -2971 4610 5030 -4668
1295d668Q9P847n28m848N08K200L005J300p496k214Q090N39o815J76M887K4j481
1312F15j810o06M907K250p476j780O651k17n579J260L005J396O10m269k439O700
1328C218J639p520m58N818l17l815p49K89M698K727p229l077P549J818p207j396
1344d012M069K375M7l991l745O523N394p690m428N649K792l844k733n13L928M877
1360D698m644o550N489N586n438l703K573K043J555k898m476L791O953l701o344
1375e066L794L640k414k088r25J570M917j523o277K991N992l147l816K823J070
1390A541l26m68l194Q01O608j865n777L395L809l289k268N49J519K500q26n883
1406c174J528P456l114n479K874L474j868j750k615J37O361m02p619J613O397
$$ plain form
1295 -4668 -4579 3268 2740 -2108 -1600 600 3605 4905 -2591 -4805 3285 3824 -2991 -2815 2072 2096 615
1312 615 -1195 -1801 3106 5356 -2120 -3900 2751 2534 -3045 -1785 1220 2616 3226 -1043 -3482 3218
1328 3218 4857 -2663 -3121 2697 2380 -1435 -2184 -1895 2803 5530 -1699 -4776 2773 4591 -2616 -4012
1344 -4012 57 2432 2479 -1512 -5257 1266 6660 -1030 -5458 191 2983 -861 -3594 -4107 -179 4698
1360 4698 54 -6496 -1007 4579 -859 -4562 -1989 54 1609 -1289 -5765 -1974 4979 1278 -5066
1375 -5066 -1272 2368 -46 -2134 -3059 -1489 3428 1905 -4372 -1381 4611 1464 -2352 471 1541
1390 1541 1215 747 -2447 -1646 4962 3097 -2680 715 4524 1235 -1033 -484 1035 3535 2709 -3174
1406 -3174 -1646 5810 2696 -2783 91 3565 1697 -53 -2668 -2531 3830 3428 -4191 -2578 3819
1421C819j797m190j67J586K887k68o229r46P377J038p008R36M089P67j709l297
1437c112j580O018K303p130j489O416J158l940m83J029K330J275m707l333N979
1452G34L036n154r92L280R60r69j051k148L133L416m625l866N325J918l475j91
1468f69J734Q71R44k557l360L669L174m641j961M568O90k467m97o25K204L053
1484D130m201m202M560L330m532j590K640J885r6j962m000L255N373m693n096
1499e199M601K929k365j959l22K017M223k780o364L165N488k935l887J901K198
1514G11P77j107l906J400N905j339n840J635L252p77j785l29O08L584N60n709
1530b360L59N007j055l749J255J834k39M15k446o04M903j00n135P51L391j183
$$ plain form
1421 3819 2022 -2168 -2335 -749 2138 1870 -4359 -5305 2072 3110 -3898 -2962 1127 1894 185 -3112
1437 -3112 -4692 1326 3629 -3501 -4990 1426 2584 -1356 -1839 -810 1520 2795 -1912 -5245 734
1452 734 3770 -1384 -2376 904 1864 895 -156 -2304 829 4245 -380 -4246 1079 2997 -478 -669
1468 -669 1065 1936 2880 323 -3037 632 3806 -835 -2796 1772 2462 -5 -502 -1127 1077 4130
1484 4130 -71 -4273 287 3617 -915 -2505 135 2020 1924 -38 -4038 -783 4590 -103 -5199
1499 -5199 -598 2331 -34 -1993 -2315 -298 3925 1145 -5219 -2054 3434 499 -3388 -1487 711
1514 711 1488 381 -3525 -2125 3780 2441 -3399 -1764 1488 711 -1074 -1403 -795 2789 3349 -2360
1530 -2360 -2001 3006 1951 -1798 -543 1291 1052 1467 -979 -1583 3320 3220 -1915 -1164 2227 1044
1546A044k255O84K58J781Q70m352m2M746m58m668J045K624j005r15j167m88M369
1563B071N76n031m32N211r08l545J4J054K062M21l695j678N800J772n489p86L286
1580G03O16r03j844j722L967L416m786l209N132J877l285j020O04Q83K255k889
1596b05l656L741M165l696k071K428K01m09p56j647J417L497k795l291L221K218
1612B362k238q47P41k57J279j023l011J895M022k980k192K834J360k023k08q79
1628a165O17K815j717l796K797L059k508j832K267Q18j9j137k625J248M710k159
1644A373m453K929K599j364j646k83Q13L190j295m623J221M215q62l512Q10J782
1660H94N00j14l100j45M795l63n249O71L406j84j605qo09K223J084l950j540M387
$$ plain form
1546 1044 -1211 -527 -269 1512 2382 -1970 -2012 2734 2276 -2392 -1347 1277 272 -643 -1810 -2298 2071
1563 2071 2647 -2384 -2816 2395 1487 -2058 -2044 -990 1072 1493 -2202 -3880 1920 3692 -1797 -2583 703
1580 703 1319 416 -1428 -3150 817 4233 -553 -3762 1370 3247 -38 -1058 -454 429 2684 -205
1596 -205 -3861 -120 4045 349 -1722 706 907 498 -258 -1905 -488 3009 214 -3077 144 2362
1612 2362 124 -723 18 -239 1040 17 -2994 -1099 2923 -57 -2249 585 1945 -78 -286 -1165
1628 -1165 -548 2267 550 -3246 -449 2610 102 -1730 537 1355 1336 199 -2426 -1178 3532 1373
1644 1373 -3080 -151 2448 1084 -562 -845 -32 3158 1863 -2760 -1539 2676 1814 -1698 -888 894
1660 894 1394 1280 -1820 -1965 2830 2467 -2782 -2111 1295 1111 -494 -502 -1111 1112 2196 -1754 -3294 1093
1678A093M38l659Q78J072K57L07j638j332L075J403l766q28K729o0j346L76l0
1695a031J268J314l070j638L749J263l442K93J875p5q00J65j091K408J771l928
1711i69j210L532O93k641M1Q38J197R52k406j558L234J924l362j893K540R53p17
1728A148j097j122J935L181l130l282K871K237k313j618Q22M65J532j183l114
1743b668J867L590k136k910J785O27o1j91j839L59L231o64m002J545K480j027
1759a4j205M17k43R52K72k610J064K953j145k316J337J313j103k58j2m79K343
1776A266n40k845O50L424j583j494J108M47j98J52j690K31L243n58l332Q07K744
1793A832p85j360j03J04K156J54l785l8L839m36k412J49J382K52j86j515j134
$$ plain form
1678 1093 1531 -2128 -1250 -178 79 386 -1252 -2584 491 1894 -1872 -2700 29 -31 -1377 -1001 -1031
1695 -1031 237 1551 -1519 -3157 592 1855 -1587 -1294 581 506 -294 -129 -1220 1188 2959 -969
1711 -969 -2179 1353 2046 -595 -554 284 1481 2433 27 -1531 1703 3627 265 -1628 912 1865 1148
1728 1148 51 -1071 864 4045 915 -2367 504 2741 428 -1190 -368 97 1629 446 -2668
1743 -2668 -801 2789 653 -2257 -472 155 94 -97 -1936 -1577 1654 990 -3012 -1467 1013 -14
1759 -14 -1219 -802 -1045 -93 179 -2431 -1367 1586 441 -1875 -538 775 -328 -586 -598 -1077 1266
1776 1266 726 -2119 -1469 1955 372 -1122 -14 433 235 387 -1303 -1072 2171 1613 -1719 -912 1832
1793 1832 1047 -313 -416 -312 1844 1998 -1787 -1825 2014 1578 -834 -685 697 949 763 -752 -1886
1810a886L232J171l489p56K671M10j519l29m86J575J763l451j281L051J107k093
1826c10o93J003M18J43r51j288J898J608k303j502K080M18l50n0j82l88J837j395
1844gj953K297J136j947p04J524O3n53M2q11J101J718k136j815K095J128j494
1861c16k33M66J47R33r99k095K129J747k070j746J783O68l31n60o55M56K369j495
1879A98k568J420K235r56j223j37Q70P57k38k202P03L091r87k408O58J360j74
1896C99n1q39k84K383K1l176J029J787l76j026K64J36N88L42j721m44K586l2k057
1915d71J82J170n99nj34o81J440M09k259p9K294m37j417P24l6m7M83j130l85J715
1935G37O28k504J49J665m93r30K51k77P26Q28j978o41K707P0k049K66P30K66L51
$$ plain form
1810 -1886 1346 2517 -972 -1728 943 1353 -166 -495 -981 594 2357 -1094 -2375 676 1783 -310
1826 -310 -1003 0 418 561 -390 -1678 220 1828 -475 -1977 103 521 171 121 -61 -449 1388 -7
1844 -7 -1960 337 1473 -474 -1178 346 409 -144 -102 -913 188 1906 -230 -2045 50 1178 -316
1861 -316 -549 -83 64 997 -2 -2097 32 1779 -291 -2037 -254 414 83 -477 -1132 -676 1693 198
1879 198 -2370 -950 1285 329 -894 -1031 -161 596 358 -1844 -1141 1950 963 -1445 -787 573 399
1896 399 348 -491 -775 1608 1629 -1547 -518 1269 893 -133 131 267 855 1197 -524 -968 1618 1586 -471
1915 -471 -289 881 282 277 143 -538 902 1311 -948 -1027 1267 830 -587 137 101 54 537 -593 -978 737
1935 737 1365 -1139 -990 675 182 -748 -497 -774 -48 780 -1198 -1839 868 938 -1111 -845 -115 151 502
1954E02q02j207J699J662k725p56J536J226j148j42n05P22J548j615k003K097
1970H9J667j476p52R34n06N15k03j366J077J883j714j307P66J057o39K49k68o94
1988f88J150l13j559R54J668r57r10P29m2l64L15q62J84J480p18j140Q45Q77q58
2007b09n49Q00J26J96m01j022L49K151j271j648J519N78p74L46o81QJ541k00k322
2026a463J051J638o79p35l0L40P03O92j942n91K262Lj789K31J207l82K50m54o13
2045c01J261M72j846n54J601M16r99j23j52N35M97q77r10J590K28j452LN19K27
2064A35J63k70p31P44L17r88r24J780O6j094L52N9l85P84k84q22R07Q95j693n19
2084a508J282N4m40l6R1K16P38j005q39J797P36j677p5P74l35P02k49p42P32J506
$$ plain form
1954 502 -300 -1507 192 1854 -871 -1627 -91 1135 -13 -155 -660 62 1610 -5 -2008 89
1970 89 1756 280 -472 462 -44 471 268 -1098 -21 1862 148 -1159 -393 664 25 274 6 -688
1988 -688 462 149 -1410 -456 1212 255 -655 74 32 -332 -17 -879 -695 785 67 -1073 -228 649 -209
2007 -209 -758 42 168 364 -37 -1059 -710 1441 170 -1478 41 619 -155 191 -490 -482 1059 859 -1463
2026 -1463 -412 1226 547 -188 -218 122 825 1517 -425 -1016 1246 1249 -540 -309 898 516 766 312 -301
2045 -301 960 1432 -414 -968 633 1049 50 -73 -225 310 807 -70 -980 610 838 -614 -611 -92 135
2064 135 298 28 -703 41 358 -630 -1554 226 292 -802 -450 -391 -776 8 -276 -1098 -191 704 -989 -1508
2084 -1508 -226 -172 -612 -648 -557 -341 397 -608 -1447 350 1086 -591 -666 108 -227 475 226 -516 216 1722
2104A722j365j237J283O57m65l53m14K70J117l41j442R98J340j339n39K76rM63
2122F22K0p76j58J498m88j449N74J095r00N01l13p09J126q5j518P01J012k8j313
2141e88O79j29l50M10m78k17Q33J33q65K61Q47r46m4M10n24K42P56r79r5J424
2161G80m79j314K42J057l39l5l30l29J080K17j620N7J373J31j041L39k47K53O45
2180D40j183j24J141N30j496K3Q39k2j3q1r26R36Q19j167m90J127K46n23Q9J2
2200A77m30J028n21o58Q16P82j024l94O11j61N91Q3q74N14j12J15j066R41M53
2219H71o73r4J69k82M70M4o78N42N95p19q49J162n28j22K38j96r5O00m33n61O22
2240H3P54j032j02L61m22M54j89n59K14P26n12j040P91Q78q18n7n2m98O19L32
$$ plain form
2104 1722 357 -880 403 1060 595 242 -172 98 1215 874 -568 430 1770 431 -108 168 159 622
2122 622 642 -134 -292 1206 718 -731 -157 938 38 539 226 -483 643 558 -960 -259 753 725 -588
2141 -588 91 -38 -388 22 -456 -673 160 293 -572 -311 536 -410 -454 -44 -568 -326 430 -549 -644 780
2161 780 301 -1013 -771 286 -53 -88 -418 -747 333 550 -1070 -1013 360 491 -550 -211 -458 -205 440
2180 440 -743 -867 274 804 -692 -669 170 148 135 54 -872 64 883 -284 -774 353 599 76 165 177
2200 177 -253 775 254 -404 412 1194 170 -224 387 226 817 900 26 540 428 543 -523 418 871
2219 871 198 104 273 -9 461 505 -173 369 964 245 -604 558 30 -92 146 -50 -145 455 22 -539 83
2240 83 837 -195 -297 64 -358 96 -93 -652 -438 288 -224 -1264 -473 405 -413 -470 -522 -1020 -401 -69
2260f9j184P33R75q24m45M12j95N00O2m97m62J457j66j478N86P45j71q7L06p72
2280e74L55Q00q74O9Q09j48m79L17Q7M1L28j54o99P72N92j375L42J098n74m90
2300B43L99m36J6Q35m26o73Q65M09j576P05J73n43J57K29m60M49kn34l41R78l58
2321A09l26J96l82J57K10l04m50R36r8p41p2Q28j80r2l0l16j42R92o02r54Q17
2342d44O56m12l94L01k57L83K34j409R14J128j100q2L79l24K85M08o94J01Q17
2361D90j06r01R6P77l25q5Q8k8m4O02n81J3M57l88j75L16K22n06K98J0j01K7N54
$$ plain form
2260 -69 -1253 -520 455 -369 -814 -402 -597 -97 -35 -532 -994 463 297 -1181 -595 150 -21 -108 198 -574
2280 -574 -219 581 -293 -224 585 437 -42 275 362 403 731 577 -122 650 1242 -133 209 1307 733 243
2300 243 642 206 222 1057 631 -42 823 1232 -344 361 534 -9 148 377 -83 366 364 -170 -511 467 109
2321 109 -217 -21 -403 -246 -36 -340 -790 146 48 -693 -765 63 -117 -209 -239 -555 -697 295 -307 -1261 -444
2342 -444 212 -200 -594 -293 -550 -167 67 -1342 -428 700 -400 -482 -103 -427 -142 266 -428 -327 490
2361 490 384 -517 -421 356 31 -54 34 6 -38 564 -17 -4 453 65 -110 206 428 -78 220 230 129 156 710
$$ [...]
8191a63
##END NTUPLES=NMR FID
##END=
