##TITLE=1H ikalashn
 3752
16.10.2024
##JCAMPDX= 6.0         $$ Bruker NMR JCAMP-DX V2.0
##DATA TYPE= NMR FID
##DATA CLASS= NTUPLES
##ORIGIN= UXNMR, Bruker Analytische Messtechnik GmbH
##OWNER= root
$$ TOPSPIN		Version 1.3
$$ 2024-10-16 16:11:41.156 +0400  Irina@DPX200
$$ Compression mode = diff/dup
##.OBSERVE FREQUENCY= 200.131392401
##.OBSERVE NUCLEUS= ^1H
##.DELAY= (6, 6)
##.ACQUISITION MODE= SIMULTANEOUS
##.ACQUISITION SCHEME= undefined
##.AVERAGES= 32
##.DIGITISER RES= 18
##SPECTROMETER/DATA SYSTEM= spect
##.PULSE SEQUENCE= zg
##.SOLVENT NAME= CDCl3
##.SHIFT REFERENCE= INTERNAL, CDCl3, 1, 17.95386
##AUDIT TRAIL= $$ (NUMBER, WHEN, WHO, WHERE, WHAT)
$$ ##TITLE= Audit trail, TOPSPIN		Version 1.3
$$ ##JCAMPDX= 5.01
$$ ##ORIGIN= Bruker BioSpin GmbH
$$ ##OWNER= Irina
$$ $$ F:/spectra/data/iren/nmr/1H/4/audita.txt
$$ ##AUDIT TRAIL=  $$ (NUMBER, WHEN, WHO, WHERE, VERSION, WHAT)
(   1,<2024-10-16 16:11:26.812 +0400>,<Irina>,<DPX200>,<TOPSPIN 1.3>,
      <created by zg
	started at 2024-10-16 16:09:16.703 +0400,
	POWCHK disabled, PULCHK disabled
       terminated by command 'halt'
       configuration hash MD5:
       BE 6D 3F 07 2A EA 11 49 91 17 2B D3 AF B3 58 0D
       data hash MD5: 16K
       7F A0 2A 32 73 EA 29 04 90 2D 52 71 2B 41 70 3D>)
$$ ##END=
$$ 
$$ $$ hash MD5
$$ $$ EE 8B 23 FD B2 CD E3 6F BF 1A DE 57 D5 4C 85 25
##$RELAX= 
##$RELAX= 
##$RELAX= 
##$RELAX= 
##$RELAX= 
##$RELAX= 
##$RELAX= 
##$RELAX= 
##$RELAX= 
$$ Bruker specific parameters
$$ --------------------------
##$DU= <F:/spectra>
##$EXPNO= 4
##$NAME= <1H>
##$PROCNO= 1
##$TYPE= <nmr>
##$USER= <iren>
##$AMP= (0..31)
100 100 100 100 100 100 100 100 100 100 100 100 100 100 100 100 100 100 
100 100 100 100 100 100 100 100 100 100 100 100 100 100 
##$ANAVPT= -1
##$AQSEQ= 0
##$AQ_mod= 1
##$AUNM= <au_zg>
##$AUTOPOS= <>
##$BF1= 200.13
##$BF2= 200.13
##$BF3= 200.13
##$BF4= 200.13
##$BF5= 200.13
##$BF6= 200.13
##$BF7= 200.13
##$BF8= 200.13
##$BYTORDA= 1
##$CFDGTYP= 0
##$CFRGTYP= 5
##$CHEMSTR= <none>
##$CNST= (0..63)
1 1 145 1 1 1 1 1 1 1 1 1 1 1 1 1 1 1 1 1 1 1 1 1 1 1 1 1 1 1 1 1 1 1 
1 1 1 1 1 1 1 1 1 1 1 1 1 1 1 1 1 1 1 1 1 1 1 1 1 1 1 1 1 1 
##$CPDPRG= <>
##$CPDPRG1= <>
##$CPDPRG2= <>
##$CPDPRG3= <>
##$CPDPRG4= <mlev>
##$CPDPRG5= <mlev>
##$CPDPRG6= <mlev>
##$CPDPRG7= <mlev>
##$CPDPRG8= <mlev>
##$CPDPRGB= <>
##$CPDPRGT= <>
##$D= (0..63)
0 2 0 0 0 0 0 0 0 0.06 0 0.03 0 0 0 0 0.0002 0 0 0 0 0 0 0 0 0 0 0 0 0 
0 0 0 0 0 0 0 0 0 0 0 0 0 0 0 0 0 0 0 0 0 0 0 0 0 0 0 0 0 0 0 0 0 0 
##$DATE= 1729080684
##$DBL= (0..7)
120 120 120 120 120 120 120 120 
##$DBP= (0..7)
150 150 150 150 150 150 150 150 
##$DBP07= 0
##$DBPNAM0= <>
##$DBPNAM1= <>
##$DBPNAM2= <>
##$DBPNAM3= <>
##$DBPNAM4= <>
##$DBPNAM5= <>
##$DBPNAM6= <>
##$DBPNAM7= <>
##$DBPOAL= (0..7)
0.5 0.5 0.5 0.5 0.5 0.5 0.5 0.5 
##$DBPOFFS= (0..7)
0 0 0 0 0 0 0 0 
##$DE= 6
##$DECBNUC= <off>
##$DECIM= 32
##$DECNUC= <off>
##$DECSTAT= 4
##$DIGMOD= 1
##$DIGTYP= 9
##$DL= (0..7)
0 120 120 120 120 120 120 120 
##$DP= (0..7)
$$ [...]
##$SW= 21.9925939549014
##$SWIBOX= (0..15)
0 0 2 0 0 0 0 0 0 0 0 0 0 0 0 0 
##$SW_h= 4401.40845070422
##$TD= 16384
##$TD0= 1
##$TE= 300
##$TE2= 300
##$TE3= 300
##$TEG= 300
##$TL= (0..7)
0 120 120 120 120 120 120 120 
##$TP= (0..7)
150 150 150 150 150 150 150 150 
##$TP07= 0
##$TPNAME0= <>
##$TPNAME1= <>
##$TPNAME2= <>
##$TPNAME3= <>
##$TPNAME4= <>
##$TPNAME5= <>
##$TPNAME6= <>
##$TPNAME7= <>
##$TPOAL= (0..7)
0.5 0.5 0.5 0.5 0.5 0.5 0.5 0.5 
##$TPOFFS= (0..7)
0 0 0 0 0 0 0 0 
##$TUNHIN= 0
##$TUNHOUT= 0
##$TUNXOUT= 0
##$USERA1= <user>
##$USERA2= <user>
##$USERA3= <user>
##$USERA4= <user>
##$USERA5= <user>
##$V9= 5
##$VALIST= <valist>
##$VCLIST= <CCCCCCCCCCCCCCC>
##$VD= 0
##$VDLIST= <DDDDDDDDDDDDDDD>
##$VPLIST= <PPPPPPPPPPPPPPP>
##$VTLIST= <TTTTTTTTTTTTTTT>
##$WBST= 1024
##$WBSW= 25
##$XGAIN= (0..3)
0 0 0 0 
##$XL= 0
##$YL= 0
##$YMAX_a= 300365
##$YMIN_a= -182892
##$ZGOPTNS= <>
##$ZL1= 120
##$ZL2= 120
##$ZL3= 120
##$ZL4= 120
##$ABSF1= 10
##$ABSF2= 0
##$ABSG= 5
##$ABSL= 3
##$ALPHA= 0
##$AQORDER= 0
##$ASSFAC= 0
##$ASSFACI= 0
##$ASSFACX= 0
##$ASSWID= 0
##$AUNMP= <proc_1d>
##$AXLEFT= 0
##$AXRIGHT= 0
##$AXTYPE= 0
##$AXUNIT= <>
##$AZFE= 0.1
##$AZFW= 0.1
##$BCFW= 1
##$BC_mod= 2
##$BYTORDP= 1
##$COROFFS= 0
##$CY= 7568.61572265625
##$DATMOD= 1
##$DC= 2
##$DFILT= <>
##$DTYPP= 0
##$F1P= 17.9538593292236
##$F2P= -4.03888763876832
##$FCOR= 0.5
##$FTSIZE= 32768
##$FT_mod= 4
##$GAMMA= 1
##$GB= 1
##$INTBC= 1
##$INTSCL= 1
##$ISEN= 128
##$LB= 0.05
##$LEV0= 0
##$LPBIN= 0
##$MAXI= 945.577
##$MC2= 0
##$MEAN= 0
##$ME_mod= 0
##$MI= -402.1523
##$NCOEF= 0
##$NC_proc= 0
##$NLEV= 6
##$NOISF1= 8.587773
##$NOISF2= 6.764455
##$NSP= 1
##$NTH_PI= 0
##$NZP= 0
##$OFFSET= 17.95386
##$PC= 1
##$PHC0= 106.1592
##$PHC1= 19.79985
##$PH_mod= 0
##$PKNL= yes
##$PPARMOD= 0
##$PPDIAG= 0
##$PPIPTYP= 0
##$PPMPNUM= 100
##$PPRESOL= 1
##$PSCAL= 0
##$PSIGN= 0
##$REVERSE= no
##$SF= 200.13
##$SI= 32768
##$SIGF1= 18.5376
##$SIGF2= -6.396296
##$SINO= 400
##$SIOLD= 32768
##$SREGLST= <1H.CDCl3>
##$SSB= 3
##$STSI= 0
##$STSR= 0
##$SW_p= 4401.40845070423
##$SYMM= 0
##$S_DEV= 0
##$TDeff= 0
##$TDoff= 0
##$TI= <>
##$TILT= no
##$TM1= 0
##$TM2= 0
##$TOPLEV= 0
##$USERP1= <user>
##$USERP2= <user>
##$USERP3= <user>
##$USERP4= <user>
##$USERP5= <user>
##$WDW= 1
##$XDIM= 8192
##$YMAX_p= 0
##$YMIN_p= 0
$$ End of Bruker specific parameters
$$ ---------------------------------
##NTUPLES= NMR FID
##VAR_NAME=  TIME,          FID/REAL,        FID/IMAG
##SYMBOL=    X,             R,               I
##VAR_TYPE=  INDEPENDENT,   DEPENDENT,       DEPENDENT
##VAR_FORM=  AFFN,          ASDF,            ASDF
##VAR_DIM=   8192,          8192,            8192
##UNITS=     SECONDS,       ARBITRARY UNITS, ARBITRARY UNITS
##FACTOR=    0.0002272,     1,               1
##FIRST=     0,             0,               0
##LAST=      1.8609952,     -25,             -131
##MIN=       0,             -182892,         -182892
##MAX=       1.8609952,     300365,          300365
$$ Real data points
##PAGE= N=1
##DATA TABLE= (X++(R..R)), XYDATA
0 0 0 0 0 0 0 0 0 0 0 0 0 0 0 0 0 0 0 0 1 -26 32 -32 32 -32 32 -33 64 -64 65 -90 97 -97 129 -129 161 -172 193
37 193 -225 252 -275 307 -344 381 -421 462 -512 565 -624 688 -756 838 -920 1013 -1122 1236
55 1236 -1367 1520 -1690 1890 -2122 2397 -2737 3163 -3706 4450 -5507 7159 -10120 17186 -78730
70 -78730 -2555 31227 -135648 -100082 15279 71426 -12485 -132358 -130559 2967 -29218 -182892
82 -182892 -161579 -6878 12762 -53454 -94230 -86654 -38097 -39136 -145888 -146780 -3807 38364
94 38364 -42778 -45615 10011 36437 37148 -4357 -28738 50148 82803 -21926 -60934 25966 58018
107 58018 21384 7354 16649 55809 78304 -499 -54911 30366 75017 -13108 -50396 11301
119 11301 57432 58803 22584 -4233 61915 107718 2687 -73384 14250 81368 29541 -16126
131 -16126 4956 63956 97914 28529 -37948 44993 122166 32236 -54353 -7356 55623 55113
143 55113 13913 -16368 40587 112484 42606 -60643 -14129 62398 23137 -43073 -50320 -11735
155 -11735 33637 6429 -66740 -32905 54665 13619 -82303 -77820 -29831 -20741 -44396 -79674
167 -79674 -60912 11701 2205 -78856 -64712 9841 -278 -54284 -68225 -51062 -17013 -12332
179 -12332 -56731 -43918 38867 38718 -34251 -36157 10992 17152 -5462 -30977 -25138 29155 37053
192 37053 -27776 -21702 59126 63038 1274 -16272 5670 25426 16984 -29531 -30371 46016 60993
205 60993 -14985 -28301 34065 51896 16214 -19402 -22665 21341 36793 -27875 -47607 35176
217 35176 72014 16077 -16798 6007 35783 38034 -8491 -38627 20567 63235 3531 -34471
229 -34471 19251 62368 45103 10438 -9036 17674 46556 498 -46771 2779 53730 20175
241 20175 -16815 -5067 19865 31984 5181 -37030 -15974 24559 -12947 -60664 -28348 13016
253 13016 5794 -15758 -28868 -17152 8728 -16585 -64270 -37497 9251 -17703 -53709 -34837
265 -34837 -4679 6199 -6494 -31996 -17468 20911 -8194 -60152 -33066 16533 8313 -16542
277 -16542 -17912 3818 33497 18729 -29271 -12578 41788 20869 -34078 -25709 15332 31830
289 31830 19408 -8634 382 48488 37799 -27023 -25103 28322 30590 -5145 -20218 -4436 31701
302 31701 36970 -8091 -15472 37376 40994 -15062 -31122 -838 20330 17135 -7853 -16033 25884
315 25884 43238 -5436 -23771 18246 31230 -281 -20546 -17433 6613 24207 -2234 -18900
327 -18900 20984 38731 -4951 -26162 -3152 10170 2289 -15448 -26051 -119 22489 -9434
339 -9434 -28472 10185 27716 -5519 -28094 -21969 -6619 3663 -16368 -34255 1663 30513
351 30513 -6926 -33253 -3447 18885 4934 -17917 -29790 -7588 19707 -6468 -34870 3380
363 3380 40263 13673 -17652 -12401 7374 19683 -66 -30448 -7150 34465 12651 -25585
375 -25585 -4660 29918 27406 2681 -19186 -10256 21212 9687 -30947 -14641 29958 21844 -9865
388 -9865 -12778 4201 20356 12289 -21459 -22320 14220 10453 -25822 -18606 15090 20078 5614 -10485
402 -10485 -11916 10842 12092 -22448 -22733 13825 14227 -14323 -14214 4469 17249 14737 -8176 -15416
416 -15416 12600 12944 -23329 -22583 12956 18820 1354 -8062 -3298 16904 20775 -11350 -20491 14742
430 14742 19439 -15473 -22606 2602 19715 17889 -2872 -13109 14845 26435 -11709 -28376 5640
443 5640 21778 2174 -14956 -11840 11958 27733 1302 -21817 5956 26350 -5339 -28141
455 -28141 -11556 10120 14733 -1935 -19809 358 26000 2628 -25731 -6105 15422 2102
467 2102 -16804 -20960 -5121 17071 6657 -18986 -4057 21412 2844 -22072 -12700 3444 6999
480 6999 -2026 -17273 -8154 18403 9760 -15642 -2597 19162 6583 -12834 -14382 -4378 10770
493 10770 6885 -13863 -5045 22597 10805 -16129 -7873 11311 9969 -3660 -17877 -11742 13652
506 13652 10248 -16865 -8208 21542 14622 -11225 -16431 -4150 10337 6712 -18283 -16544 15711
519 15711 16885 -12564 -12590 11384 18446 4615 -13975 -15663 9382 17794 -9807 -15462 15419 23829
533 23829 1532 -9419 -1040 14684 18235 -4868 -18795 6869 20953 -2517 -11800 8789 19784
546 19784 11720 -3345 -12230 2868 16687 -3501 -18119 2773 15703 -416 -10004 -2671 7715
559 7715 12884 -1854 -18604 -4899 10763 -7185 -19005 -1029 11116 3495 -6922 -11627 -1048
572 -1048 12136 -2699 -21119 -4930 10854 -5553 -17470 -6331 6807 11004 -725 -16474
584 -16474 -6020 13212 -2561 -22811 -8118 10248 3569 -9630 -13798 -2190 15555 5905 -19023
597 -19023 -10300 12460 2171 -18172 -13062 3534 12335 5155 -13279 -9094 16012 12008 -12799
610 -12799 -10101 9912 10710 -1766 -9481 -2905 16938 19872 -2820 -5920 15838 16020 -2838 -4951
624 -4951 6406 14151 13173 -591 -4686 15057 20878 1106 -3598 11820 12136 710 -5676 -3223
638 -3223 8371 14030 -1296 -8417 8375 11325 -6962 -9946 451 3838 -736 -10537 -14599 840
652 840 9478 -7709 -14373 2433 6632 -8006 -15742 -11346 -301 4984 -9065 -18968 -581 11587
666 11587 -5699 -14672 -1864 7014 1935 -10215 -16753 -2703 12857 -1054 -15324 -248 13317
679 13317 1912 -9185 -8235 1586 11080 184 -16920 -6053 12903 3966 -9764 -2445 8156
692 8156 8031 -696 -11874 -5882 11020 6118 -10881 -4603 10310 5685 -3155 -2531 2692 10399 6750
707 6750 -8526 -6125 10606 7610 -5031 323 10691 9297 3847 -2079 -193 11438 10151 -5909
721 -5909 -3552 11374 7498 -3149 77 6655 11316 7092 -5911 -6104 9262 8349 -8654 -5684
735 -5684 7194 6864 -1471 -6773 -4426 8163 8510 -9614 -12821 3933 5119 -8293 -10368 -982
749 -982 6369 4745 -8757 -13457 2926 9019 -7752 -13756 -770 4587 -2033 -9391 -8896 3269
763 3269 10772 -3920 -14105 -1186 6744 -4174 -10349 -3967 2360 4411 -3799 -12003 -1520 9805
777 9805 -1164 -10691 -2508 2987 -1970 -5968 -6774 -2 8739 1132 -9671 -1067 7994 -589 -6564
792 -6564 -777 3404 3868 -169 -5736 1134 12452 4882 -5299 3011 9939 3414 -2150 -452 5730
807 5730 12125 5807 -5371 2420 15184 7376 -2961 2291 9085 7957 1631 -5673 226 14022
821 14022 8719 -6551 -1922 10175 5775 -3673 -5850 -392 8027 3929 -10304 -9003 7184 6186
835 6186 -7210 -6861 382 2255 -1811 -10728 -10490 3030 5112 -9505 -11160 844 2162 -4761 -7318
850 -7318 -5610 651 2167 -8779 -12312 487 4945 -4923 -6279 283 1747 -300 -5251 -7060 1697
865 1697 6572 -4584 -8573 2636 5097 -2050 -2362 996 4016 5145 -2919 -7771 3129 8831 -1642
880 -1642 -4894 3909 6587 2337 -1638 -2608 5086 10639 -1008 -8136 3004 9675 1449 -3048 1695
895 1695 6872 8188 255 -7375 2075 12056 2390 -7041 373 7263 4586 -820 -4034 1861 11066
910 11066 3168 -9424 -3178 7261 2863 -4756 -2957 1353 5312 1612 -7964 -4390 7544 3761
924 3761 -7471 -4982 1149 930 -2265 -5023 -2877 4897 3281 -7577 -6347 3654 1682 -4729 -3587
939 -3587 -777 1113 533 -5483 -4491 5239 4395 -5880 -4919 2394 923 -2829 -3479 -1505 4246 4106
955 4106 -6177 -5860 5294 4629 -4134 -3956 1459 2454 391 -4551 -4855 5803 7457 -4649 -6310
970 -6310 2885 4255 -1396 -4233 -2527 3942 5835 -3951 -7577 4266 8503 -949 -4603 47 3910
985 3910 3197 -2309 -5756 2988 9584 203 -5927 1599 6304 2630 -931 -2027 2271 6524 637
1000 637 -6294 551 8078 2495 -2936 9 2140 2389 32 -4003 -357 6809 1536 -5715 -757
1015 -757 4294 870 -1610 -1503 -17 2476 -660 -7021 -2114 5050 784 -4967 -1702 1625 140
1030 140 -2030 -4612 -1706 4304 6 -8109 -3354 4096 1208 -3579 -2577 188 3063 -21 -7069
1045 -7069 -3952 5859 3101 -5734 -3561 2438 2880 -46 -3604 -1952 5372 4397 -5966 -5052 4301
1060 4301 4862 -1208 -2251 58 3695 4060 -3319 -4546 5051 6365 -2457 -3928 1081 3204 1708
1075 1708 -779 -2169 3062 5397 -2292 -5360 2119 4566 -404 -1757 -774 1299 2954 -752 -4207
1090 -4207 2087 5157 -2263 -4887 -75 1502 -297 -1120 -2392 612 3400 -2239 -5796 1127 4026
1105 4026 -1464 -3364 -821 239 1270 -1723 -4156 1602 5757 -1283 -5879 105 3172 216 -1760
1120 -1760 -1714 1317 5179 -50 -5676 455 6728 1683 -3318 -950 1858 3160 776 -3933 196
1135 196 7153 2334 -4806 -1184 3756 2702 -88 -1873 -1158 4110 2513 -4838 -2369 5361 2840
1150 2840 -2624 -2000 -3 1365 995 -3037 -2825 3131 2574 -4335 -3302 1728 1318 -1015 -2032 -2487
1166 -2487 442 1047 -4320 -3712 2756 2416 -3344 -2768 -34 47 116 -2122 -2818 2276 2555 -4189 -3669 2551
1184 2551 2266 -1084 -1511 -432 1288 1522 -2667 -3119 3687 4852 -2231 -2916 2009 2882 1774 -860
1200 -860 -1711 2806 5079 -2038 -4207 2691 5019 935 -1370 -733 2104 4172 -192 -4236 1846 5808
1216 5808 -119 -3674 44 2520 2164 -30 -2721 -116 4251 130 -5325 -460 3438 721 -1575
1231 -1575 -1765 -878 1985 560 -3874 -1023 3306 -32 -3962 -1433 561 139 -79 -1735 -1056 1874
1247 1874 317 -4291 -876 2957 -241 -2571 -1157 -57 1155 149 -2786 -889 3765 488 -4542
1262 -4542 -1361 2423 1231 -772 -1709 -879 2854 1244 -3881 -1741 4108 2140 -2403 -2151 -9 1615
1278 1615 1277 -2568 -2214 3845 2933 -3696 -2784 2080 2250 285 -1689 -1848 2022 3004 -2572 -2766 2715
1295 2715 3193 -1033 -2154 -582 1301 2305 -831 -2666 1519 3871 -1169 -2763 895 2470 583
1310 583 -349 -1355 608 2459 -371 -2285 2319 3774 -261 -1374 408 1010 1394 408 -2054 821
1326 821 3684 -832 -3191 1736 2731 -96 -976 -773 30 2037 -641 -3208 810 3351 -937 -3238
1342 -3238 -266 828 772 -963 -3096 -554 2738 -1307 -4854 -822 2589 -55 -2324 -2300 -830 1598
1358 1598 12 -4432 -1377 3319 216 -3945 -1455 943 1449 281 -2419 -1956 2312 1724 -3499 -1612
1374 -1612 2799 1771 -249 -997 -463 1875 2424 -1553 -1120 2889 2234 -1843 -856 1535 1890 1876 -220
1391 -220 -1020 1737 2496 -1615 -1066 2712 1749 -806 -24 51 1188 1870 -522 -1333 2413 2222 -2197 -1574
1409 -1574 1813 1193 107 -1055 -1181 602 2086 -2201 -2448 1791 2085 -1811 -2086 -651 449 1423
1425 1423 -1297 -3128 623 2241 -2386 -3259 112 1668 164 -1391 -2317 33 2429 -965 -3332
1440 -3332 463 2810 -536 -2472 -623 484 1987 525 -2557 19 2944 131 -2530 -131 2047
1455 2047 1361 75 -1281 -815 2778 1331 -1966 -212 2725 550 -1094 -268 170 1239 1226 -1302
1471 -1302 -782 2190 110 -2108 -100 1535 79 -595 -1116 -883 902 887 -2373 -718 2071 326
1487 326 -2383 -911 665 360 40 -1700 -1884 1733 1054 -2689 -852 2206 808 -1056 -1114 -1080 1228
1504 1228 1718 -1475 -1270 2490 2274 -1466 -1686 985 1487 1648 -720 -1545 1528 2840 -901 -1667 1502
1521 1502 2053 12 -809 -921 1150 2314 -52 -2445 987 1999 -1066 -1357 -11 812 705 -58 -1937
1538 -1937 -279 1544 -487 -1925 507 1261 -632 -865 -817 -296 1251 -177 -2099 -197 1365 -1181
1554 -1181 -1812 333 939 260 -310 -1666 -425 1613 -684 -2238 765 1882 -386 -1426 -376 240
1570 240 1233 32 -1913 87 2241 -402 -2484 207 1569 787 -721 -1314 -354 2104 944 -2011
1586 -2011 -308 2143 534 -1000 -651 -277 1774 1061 -1502 -919 1873 1367 -1415 -375 1022 1034 394
1603 394 -1125 -963 1609 997 -1418 -1124 1191 492 -940 -773 -194 486 1078 -669 -1253 888 974 -1281
1621 -1281 -871 744 210 -604 -386 -921 452 1508 -560 -934 1224 988 -1079 -99 559 364 722 -175
1639 -175 -1179 762 1431 -1179 -697 1541 786 -873 -805 -757 785 1511 -789 -1906 894 1682 -1220
1656 -1220 -1181 165 757 786 -114 -1882 -95 1780 -640 -2079 374 1241 -521 -1295 -1317 -232 1128
1673 1128 -21 -2348 -491 1295 -349 -1736 -534 46 388 139 -1316 -1071 1257 247 -1349 -330
1689 -330 1058 149 -371 -596 -234 1192 920 -996 -295 1174 482 -502 649 1129 445 707 -387 -62
1707 -62 1490 1158 -1069 526 1349 329 -328 74 575 1176 891 -644 -479 1485 669 -805 410 1092
1725 1092 627 -106 -875 -672 936 1051 -1293 -1294 911 207 -1477 -563 -554 183 857 -1666 -1669 268 680 -1071
1745 -1071 -1490 -104 330 -131 -1158 -1425 119 1219 -675 -1920 167 478 -791 -425 -548 -234 687
1762 687 -253 -1347 409 990 -518 -502 233 -74 422 128 -226 -181 1545 501 -884 712 863 -164
1780 -164 -511 466 209 666 135 -732 356 1057 -78 -663 1025 926 -90 -140 -609 573 1558 508 -1220
1799 -1220 -134 1591 -239 -955 74 457 418 429 -1207 -494 1261 29 -1505 -469 833 145 -305
1816 -305 -829 -270 888 672 -1492 -1035 888 283 -890 -219 67 548 370 -799 -1394 965 1026 -658
1834 -658 -587 264 112 -197 -537 -616 458 903 -424 -1039 650 305 -460 -201 387 112 271 -38 -715 198
1854 198 837 -539 -404 563 -8 -561 -334 -232 83 124 -959 -1294 499 571 -967 -450 482 323 -191
1873 -191 -611 -456 395 847 -450 -1152 345 788 -559 -226 -76 145 1171 -183 -1569 110 1404
1890 1404 210 -612 351 894 431 -130 -600 -13 1280 905 -874 -136 983 226 -184 -233 237 1119 594
1909 594 -964 -578 737 658 -478 203 162 123 115 -497 -360 864 633 -809 -317 184 -191 -690 106 -390
1929 -390 87 427 -960 -457 472 279 -1150 -193 328 -614 -310 -639 -387 329 712 -1113 -765 586 -36
1948 -36 -670 -299 118 275 196 -481 -484 719 523 -608 -907 458 334 288 -239 -39 963 1088 -564 -926
1968 -926 689 911 245 -347 -23 189 605 -443 -718 87 863 -253 -966 64 579 197 -37 -478 -102
1987 -102 924 -73 -1121 -56 450 -335 -403 -245 -331 128 36 -1332 -261 716 -192 -901 163 -186 -645
2006 -645 -400 34 -361 541 211 -635 -193 870 -90 -198 42 81 250 395 -344 279 1233 256 -294 240
2026 240 965 71 260 -21 499 746 715 -680 94 1012 344 -418 202 262 784 385 -29 -322 792 882
2046 882 -1034 -622 346 362 -350 -340 -134 135 282 -1058 -947 46 281 -382 -565 -21 -171 254 -292 -797
2066 -797 -44 328 -609 -943 99 33 -236 -383 -281 -753 333 -125 -1012 431 631 -380 -532 -212 -202
2085 -202 81 -62 -307 150 812 -47 -621 711 532 -259 -108 26 122 550 666 -295 868 1175 95
2104 95 -365 382 682 491 393 125 223 1245 65 -637 380 761 149 37 -84 541 410 111 -651 -578
2124 -578 1142 190 -689 -131 232 -202 0 -262 -145 475 74 -1114 -771 404 131 -489 -316 -343 72
2143 72 23 -875 -774 -55 -38 -628 -308 -242 -159 -69 27 -459 -63 141 -827 -416 646 -110 -631 115 -33 -446
2165 -446 -145 -279 -520 279 73 -913 -322 439 -163 -191 -103 -299 -53 280 -585 -674 349 799 -507 -249
2185 -249 -29 43 307 -4 -415 621 868 -366 -500 582 643 211 350 137 450 991 92 -596 367 1038
2205 1038 144 328 324 249 723 337 -470 371 979 -7 -403 309 641 56 276 -248 -294 828 22 -603 -17
2226 -17 443 -140 -170 -7 -269 -414 -100 -368 -248 378 -519 -958 -273 127 -666 -466 -328 -438 -803 -392 -695
2247 -695 -783 193 -325 -1194 -291 -451 -583 -148 -502 -383 48 -66 -811 -643 260 -363 -471 -618 -256 -251 215
2268 215 -232 -677 550 395 -481 34 376 711 428 329 118 917 816 269 253 958 916 304 742 270 493
2289 493 981 671 -116 852 788 506 438 734 302 658 524 216 57 730 158 -220 481 530 -366 -123 -17
2310 -17 -117 5 210 -577 -354 215 -871 -823 -416 94 -443 -433 -548 -544 -267 -409 -998 -193 86 -841 -753 -249
2332 -249 -619 -179 -599 -999 -376 434 -424 -787 -97 -7 -366 -257 -322 -419 94 61 -788 -309 466 -102 -209
2353 -209 50 -123 -123 330 -332 -104 337 162 -480 23 842 45 8 343 135 401 441 152 -35 571 374
2374 374 -22 378 271 340 344 442 131 237 300 59 -15 768 172 60 81 379 255 114 -134 -442 142 404
2396 404 -367 9 392 -274 308 53 -480 -72 569 -717 -598 12 -35 -201 -62 -291 -41 201 -185 -722
2416 -722 230 113 -842 -255 57 140 339 -132 -312 9 60 -219 -1009 -179 64 -150 -171 -420 -310 311 -131
2437 -131 -623 -274 366 -73 -541 -235 -137 -271 25 -312 -444 -58 -30 -575 -152 436 15 316 244 -224 296
2458 296 454 154 -94 488 126 214 390 334 145 629 508 -95 293 -17 -150 298 824 7 -36 416 323
2479 323 99 232 90 -39 526 -139 -411 -137 652 303 135 227 -168 170 45 -373 -440 319 -229 -374 -310
2500 -310 -292 -172 112 -382 -711 78 387 -513 -770 -395 -379 -214 -385 -475 -639 -117 -16 -575 -106 -117 -455
2521 -455 265 -160 -615 193 83 -22 -331 194 -206 -208 580 36 -124 429 308 -132 316 139 -296 -80 416
2542 416 -251 70 641 199 568 724 56 152 246 109 -197 787 121 -307 223 184 -42 540 62 -396 201
2563 201 206 -456 -438 110 -296 -149 -153 -433 -529 382 -220 -259 92 -60 -300 -199 -146 -390 171 203 -582 -367 426
2586 426 -68 -660 -150 -176 -359 367 -3 -489 452 436 -151 50 446 70 107 492 88 278 263 -15 57 47
2608 47 123 -168 181 226 286 30 342 -28 -102 318 -316 263 390 182 -347 201 113 -60 60 100 -196 -206 -122
2631 -122 -287 -153 171 -68 -131 -23 55 -26 450 -113 -176 267 32 -386 -337 -294 -206 169 -250 -357 -136 386
2653 386 -558 -522 433 188 42 -153 -203 143 403 110 -123 -102 225 -162 -594 89 -6 193 470 -370 -241
2674 -241 238 88 -187 241 90 -67 385 143 20 516 206 0 400 828 -192 -224 484 -25 30 21 -23
2695 -23 57 2 75 -557 94 463 -265 -57 -107 -132 52 165 -312 -325 244 -473 -299 -120 -74 -12 159 -112 -103 359
2719 359 317 -397 9 271 346 -98 51 -410 110 668 -109 -31 705 394 -352 -92 63 85 97 -148 -295 5
2741 5 439 -64 -25 353 28 -492 157 -117 33 251 -42 -692 45 143 -475 -84 140 -256 -182 -81 -300 -307
2763 -307 104 82 -220 185 -34 -58 47 264 -1 -37 -225 -183 274 454 -108 347 185 -389 -201 75 25 119
2785 119 438 367 -22 760 368 -89 45 336 447 271 -216 -273 103 480 375 -150 555 259 89 84 56 -375
2807 -375 154 90 -438 256 192 -218 -142 -77 -353 27 39 -332 -534 -2 -77 -397 -1 -284 -125 66 -269 -252
2829 -252 -168 -56 -154 -440 -177 -47 -331 14 -220 -409 1 244 -286 -24 -129 -212 -137 52 -273 -234 45 -278
2851 -278 -184 -76 -261 151 140 152 -69 239 373 -254 -177 -10 -40 236 99 -208 41 452 24 201 381 5
2873 5 135 364 98 403 411 133 -8 181 198 70 101 223 -427 14 -35 -15 -247 114 479 -83 -172 -194 -105 -199
2897 -199 -112 -163 -183 209 -103 23 38 -373 -293 -147 -39 -153 422 -107 -56 -185 -215 -393 211 -317 -234 -86 218
2920 218 -173 -157 422 -184 -241 12 -245 -121 -30 -114 113 107 -170 -249 39 43 -198 -54 313 28 -94 223 -62
2943 -62 149 -30 -11 -361 -282 321 -92 -46 121 -185 277 -67 -267 93 -57 -156 344 666 184 18 190 -236
2965 -236 -21 82 198 -35 -166 384 172 397 202 -50 33 203 252 382 120 -119 -43 349 -143 -299 173
2986 173 669 -5 -79 658 169 12 332 -189 7 222 -130 36 -7 26 -167 264 100 -252 60 152 -175
3007 -175 -24 -193 -426 97 -114 -279 184 -155 5 -320 141 -149 123 184 129 -720 86 59 69 -499 169
3028 169 -174 -155 95 -180 -147 153 384 -244 -51 -140 149 350 326 -176 -5 179 -42 -220 63 487 -17
3049 -17 450 150 336 350 65 26 168 107 86 135 543 270 134 268 175 -11 262 -15 -186 258 -89 210
3071 210 359 162 -112 26 -312 -40 147 -58 -323 -329 -8 235 -292 -123 300 366 -230 -72 44 -39 146
3092 146 -588 -135 139 -481 -227 77 -344 -193 133 -572 -695 97 -36 -33 46 -27 -31 229 33 -349 150 47
3114 47 173 -209 -161 -216 -96 310 52 114 163 -172 33 74 264 -29 -26 305 -148 93 164 39 50 143 189 -196
3138 -196 186 -114 -21 31 -156 -7 22 8 342 85 232 88 -125 41 -198 -393 81 -179 -313 205 244 77
3160 77 35 -1 -338 19 379 -349 39 194 -233 -88 99 -290 -311 301 -177 -213 147 -171 -75 153 120 124 32
3183 32 -57 18 267 -155 13 12 68 -44 -117 -182 69 38 207 -92 -127 -47 -18 139 107 -61 -431 -83 67 -146
3207 -146 4 -215 116 105 328 41 131 62 107 264 122 381 -323 95 -152 169 58 148 -244 -92 84 -145
3229 -145 -18 82 -250 -275 -350 -149 -335 62 84 17 110 161 28 70 61 -50 -148 -178 -140 101 115 328 -281 -144
3253 -144 264 136 162 -45 -79 -171 303 0 -151 -14 -12 84 -125 54 -108 -87 157 -137 218 -91 -96 74 269
3276 269 -330 -107 98 -277 -72 216 39 65 130 -74 63 99 188 -21 114 -20 -29 73 160 -253 -65 410
3298 410 62 -296 -22 -186 153 189 109 58 343 382 60 107 -78 230 40 -240 71 -185 1 170 -289 194
3320 194 62 -71 29 -129 -111 141 524 -260 59 177 -539 46 -327 -127 36 239 -251 -744 -180 -192 -418
3341 -418 48 109 -233 -283 307 -394 151 -53 -258 -260 -373 -183 105 452 -221 -202 325 431 60 351 215 -5
3363 -5 355 22 74 264 229 19 7 -7 217 100 149 280 -87 131 225 411 49 123 168 -52 349 -16 96
3386 96 211 -39 -42 383 33 -173 1 265 -203 -35 62 -330 48 -87 183 151 3 -182 38 205 -237 -95
3408 -95 464 -135 -403 -66 -5 -353 -182 -238 -329 67 343 -150 -118 231 -97 -152 147 99 187 -377 -314 -1 -279
3431 -279 250 78 182 99 290 -232 201 -173 -241 -46 26 -22 323 -38 155 165 14 -140 352 70 -195 -97
3453 -97 119 136 -75 63 128 386 207 37 28 94 239 -254 123 377 63 395 -97 39 -126 340 -210 11
3475 11 132 -77 27 287 -67 104 -48 67 -371 126 237 -319 -193 3 -274 22 -159 -32 -157 -252 94
3496 94 -70 70 -61 -287 148 148 -136 -366 196 -30 53 91 -112 -3 -263 -10 -579 -21 -241 -213 -155 24
3518 24 -440 104 -35 -151 -186 -72 -198 -56 36 -152 164 98 -230 -42 196 77 -97 -142 71 -326 33 276
3540 276 35 -34 406 164 62 158 -205 117 336 -18 -130 76 212 54 216 -101 150 91 283 249 -16
3561 -16 65 266 -66 -34 109 325 457 125 -103 -168 73 -189 -103 -65 -105 -160 -83 123 -28 58 -147 -7 113
3584 113 -125 -351 132 -103 121 -108 -123 -143 -44 136 -250 -195 -108 11 -226 -399 -221 -329 -44 39 -236 187
3606 187 -66 16 2 -4 13 -214 -1 -173 -365 163 -158 -199 355 184 -25 264 -24 -208 -70 14 112 -7 592
3629 592 -80 634 -21 33 27 713 -59 -174 28 285 311 -75 -271 -156 -16 187 -168 -176 452 -217 113 554
3651 554 466 -308 -45 179 -8 108 -134 -24 52 98 -11 13 -61 242 -33 -86 -119 -459 244 -183 -113 112 110
3674 110 54 60 17 -91 89 298 -244 -230 208 22 -137 -369 166 80 -53 -292 -258 133 109 -229 41 4 -187
3697 -187 176 -87 -355 -104 161 -260 -93 182 222 -98 150 123 -29 268 10 -190 -161 148 158 39 -35 190
3719 190 -142 87 -306 168 -157 104 -79 -250 250 55 -46 -123 174 -28 21 -137 297 90 -100 37 294
3740 294 65 -19 254 56 -53 73 -126 -138 265 -145 49 -185 -211 26 54 46 -267 122 217 222 194 135 140 33
3764 33 142 89 -272 205 -273 90 341 237 -381 29 -83 -189 -96 46 -97 -196 -7 70 -85 -131 -26 -216
3786 -216 -155 -77 158 -169 138 -54 -358 313 71 80 -55 -27 -300 131 -212 -153 62 89 -333 -56 261 -374
3808 -374 32 -224 6 253 89 57 4 -107 -10 -219 161 -103 2 177 -6 34 -74 1 -60 -184 210 335
3830 335 -360 -90 -323 -239 65 97 -502 46 90 217 37 -140 96 -100 141 -166 50 -299 -56 14 -67 285
3852 285 -263 195 8 -358 96 322 -260 -149 -296 17 57 295 37 -137 -183 -49 104 189 -27 -297 178
3873 178 -68 -62 107 -121 134 -160 180 89 -120 -130 112 -348 297 214 24 57 294 41 -57 -43 -143 48 77
3896 77 196 59 122 90 -311 -272 67 -678 -207 -221 -85 -347 4 77 3 -34 -369 374 60 -130 -404 -59 455
3919 455 -312 122 -15 51 19 -82 -34 105 -161 101 -86 11 -197 86 446 -276 256 197 -140 -50 -88 -26 -75
3942 -75 61 139 -134 -89 -255 217 -147 220 -137 315 -108 39 40 -324 -111 216 85 295 -185 -62 0 -161
3964 -161 66 59 131 257 153 -136 251 3 221 -49 -136 307 -243 -66 28 -300 23 -193 -269 -223 9 134
3986 134 -52 -93 -229 22 -149 -148 -268 32 -188 -218 -92 60 -72 -212 249 -172 -65 -134 -41 106 -23 -124
4008 -124 17 182 72 -208 327 -353 -60 -234 -285 55 308 -42 25 -69 -97 88 246 -49 -300 149 -140
4029 -140 481 -6 187 11 176 26 60 -190 -206 204 70 -67 273 -5 -315 176 42 -87 25 225 355
4050 355 170 -96 -94 6 -67 263 94 -119 227 204 -20 -49 -100 -102 -24 -24 111 58 -76 85 -37 73 -148 157
4074 157 -144 14 21 157 -55 22 -138 -86 -96 -181 -53 -297 131 285 41 -151 -239 168 149 92 -106 283 -5
4097 -5 -102 -305 -48 -236 -138 -124 51 8 -72 -364 -117 100 -135 54 229 262 57 -141 -172 131 -496 339 147
4120 147 174 -61 349 198 200 -40 63 370 100 70 108 49 -73 217 84 -4 148 -185 -91 199 390 270 1
4143 1 162 85 66 196 -91 -195 137 -163 -114 10 213 -19 217 -432 -34 213 126 -77 -42 -49 71 -20 418
4166 418 -357 -590 6 -40 -8 103 29 -118 385 63 106 -44 236 -168 -126 -242 -193 -240 330 80 -283 -145
4188 -145 175 -90 56 -115 325 -332 198 -254 -3 267 83 136 -6 184 -58 149 -37 -189 412 176
4208 176 32 229 85 243 206 1 30 310 35 65 -20 202 -86 -88 -31 -93 59 7 145 240 -105 -122 -167 269
4232 269 -260 -155 121 58 -59 -209 9 -254 54 156 -204 -178 101 250 -150 -59 -69 10 -53 153 -51 -278
4254 -278 13 282 -189 -144 111 33 -94 348 -488 -170 145 -325 -331 -144 244 -100 417 -229 -229 -222 91 53 348
4277 348 383 41 -267 -60 22 -293 -119 -234 -141 -581 96 -255 342 -264 47 207 96 217 26 -100 -76
4298 -76 -73 -136 -116 -458 341 -179 -129 102 -430 -96 -327 83 4 -256 -481 -280 -343 388 -439 147 341 -144 297
4321 297 20 -6 -27 22 424 310 -138 122 0 370 39 268 -167 64 82 3 78 106 -17 188 140 -52 -243
4344 -243 75 235 211 -51 184 194 -148 -68 -103 -9 -28 -194 173 -134 -190 -95 -75 179 135 76 146 -173 37 -178
4368 -178 -129 161 53 125 124 -344 -430 179 196 -185 75 61 -85 26 14 -264 228 -42 9 -30 -22 28 459 99
4392 99 -154 -167 -151 10 -43 111 -74 -103 128 -115 -137 -38 -37 77 -39 13 52 -173 -77 8 -68 -256 197 -34 88
4417 88 59 0 126 103 180 -151 23 80 -81 -34 -182 -323 331 -141 -87 -100 191 -261 -152 -67 -150 -101 49 237
4441 237 308 111 -288 67 54 240 38 277 1 -81 -79 66 -3 142 178 -155 -22 -333 -261 -85 -245 -365 -101
4464 -101 77 4 -189 449 -5 56 66 207 -50 -88 2 -208 115 24 -425 122 -224 -421 -134 -82 28 105 -51
4487 -51 158 -232 213 341 -65 -33 -209 -208 -112 -231 -59 -118 166 28 -403 -1 -30 -72 -75 88 51 57 -135 3
4511 3 -86 322 320 286 168 30 -53 254 145 143 277 -260 -205 120 25 -52 474 87 54 385 -206 166 175 202 180 214
4537 214 -8 -63 18 348 90 -109 -46 12 106 99 -187 -37 13 123 308 -296 55 -261 70 -287 -328 -12 -59
4560 -59 -9 -233 -68 95 101 -396 -67 -115 -302 -89 -91 -94 -98 247 -90 -208 -166 34 -217 -7 118 155 86 132 214
4585 214 89 -355 160 23 111 -330 93 25 -119 -62 55 -315 74 -54 155 112 268 146 343 -114 141
4606 141 212 -8 38 140 -6 -445 54 50 -187 155 -9 36 -8 4 313 -112 26 363 44 39 138 291 16
4629 16 -55 314 307 -137 131 -197 198 118 -29 -148 264 68 -193 290 391 -53 88 64 -26 -195 -145 54 -18
4652 -18 -49 -207 -136 -242 18 -4 -201 -42 119 59 -187 162 -131 -364 -318 5 110 -208 128 97 -190 -254 -334
4675 -334 -154 -99 227 385 -550 -122 -188 -299 -60 158 -131 8 -199 -132 -29 112 -126 184 21 -249 85
4696 85 57 -4 99 171 -19 -137 6 164 96 -86 -159 163 176 -24 -91 192 31 -37 497 191 8 119 80
4719 80 561 -126 424 -197 168 297 -116 55 56 -87 54 -169 147 117 -107 152 -350 -349 -25 301 -53 -222
4741 -222 76 -151 -102 -556 119 39 207 90 -152 278 -87 121 -114 186 -138 -182 -199 94 -167 103 -33
4762 -33 -273 147 153 446 -78 -71 -427 -355 441 137 -73 199 -111 151 160 123 -217 224 472 -106 14 -140 220
4785 220 22 -173 213 168 45 -218 139 349 196 190 -182 146 -141 39 282 -173 -214 1 265 10 -27 198
4807 198 354 108 17 155 10 81 -383 75 -254 146 -102 -69 -12 55 -246 235 -38 -79 69 95 -75 108
4829 108 52 110 36 -146 61 40 96 43 -151 71 180 181 -52 -47 -46 254 169 42 152 -225 16 -213 332 106
4853 106 -138 49 113 141 -96 16 -153 -61 -33 203 18 -114 117 165 -187 -337 -231 -25 -41 204 177 -24
4875 -24 -82 36 -86 234 496 16 -114 -161 -274 22 182 -124 164 -127 145 208 -229 348 114 45 -20 0
4897 0 117 264 -82 68 110 -121 203 52 138 -314 -16 -309 -164 -451 -150 315 -193 -313 -362 41 232 -372
4919 -372 -43 199 293 -443 -51 233 -148 -519 -21 91 326 -88 -48 160 -193 -89 -347 -14 72 6 -162
4940 -162 -64 252 11 -262 219 -26 -47 118 -162 -104 -207 40 53 -106 -148 -18 -64 327 157 -353 234 -146
4962 -146 154 11 -349 76 19 -154 -22 131 -33 -186 211 71 107 176 31 -344 247 335 64 0 -81 30
4984 30 -46 -220 223 186 -59 -159 123 8 124 11 333 144 -115 301 -104 -19 -323 280 -94 -253 36
5005 36 127 239 -211 -355 70 -142 -246 -308 -57 217 40 169 121 -26 -138 -166 -301 -258 -72 -127 -159 -46 170
5028 170 107 -184 -187 173 -28 21 5 -91 153 63 -51 -3 -94 -30 277 140 -57 -15 185 178 388 10 6 -208 -189
5053 -189 53 127 -59 278 8 169 248 -22 -21 181 -283 -31 99 -239 -330 -274 -268 86 -10 -102 -74 -121 -152 -88 240
5078 240 93 367 199 -252 -60 -109 89 5 -95 494 31 -160 -221 5 -290 -44 24 99 258 186 -155 16
5100 16 66 215 -3 260 -93 306 190 270 204 81 125 73 36 52 91 117 149 163 51 -17 -36 -156 -93 -21 -60 -180
5126 -180 -113 -22 -193 -306 -335 142 83 67 90 30 26 194 223 -401 -168 322 -16 217 30 -62 -279 -202 -194 43 152
5151 152 418 38 -196 204 -157 112 -268 150 -37 -209 10 -30 110 -308 -172 18 -9 -48 153 27 -211
5172 -211 -31 -212 251 48 -76 -241 43 -340 -263 47 220 358 147 -43 75 185 134 -200 115 -131 181
5193 181 -71 -220 60 -74 -76 -226 50 -214 -37 -113 357 59 309 258 94 -32 213 -51 116 -140 85
5214 85 196 -129 -68 185 -121 -128 -6 150 149 -179 94 161 -12 -63 -49 -250 265 -359 -207 -68 14 -241 -294 127
5238 127 50 251 -436 81 70 -163 78 -92 121 -274 15 -266 -291 -275 -28 1 -36 -237 -81 -109 28 -357
5260 -357 -164 -81 -130 -13 -46 15 -469 -174 -60 -82 -30 -97 -133 166 -144 -159 -159 299 188 69 -323 -102 -159 392
5284 392 201 -513 -269 -506 160 46 11 265 -40 282 94 81 741 202 -196 -162 -281 71 -60 -78 -8 91
5306 91 174 -198 -121 13 95 471 -184 271 -43 -362 -242 -476 34 -121 228 -99 -125 151 -308 -182 -185 -105 -192
5329 -192 84 -10 -24 -366 -151 100 -304 49 31 90 -356 -45 -369 193 -46 -68 -176 123 -256 153 -195 -4
5351 -4 94 -175 236 144 -100 -333 110 105 315 -41 95 -223 -35 65 -157 132 19 -77 162 -34 -55 -272 279
5374 279 -490 -41 -33 -83 245 85 414 -49 -58 318 -268 -210 -214 116 -135 -343 -204 74 212 -20 -72 315 -180
5397 -180 53 301 -61 112 -87 11 -410 52 7 -304 164 -215 369 239 500 3 96 -59 -109 34 -95
5418 -95 -34 -144 42 -324 -204 -96 -247 -132 62 116 416 -213 64 -22 165 -154 85 137 236 -87 -180 -69
5440 -69 -253 129 33 -45 61 -383 54 -29 -133 316 7 152 -80 44 126 98 -534 -193 -197 47 19 -129 43
5463 43 3 30 372 162 -15 -81 77 275 215 -108 -77 130 -155 -127 -332 39 166 -205 99 282 -46 102
5485 102 -128 -206 39 214 137 226 -18 -250 127 182 -137 -120 -81 90 -110 39 -17 0 -107 195 -130 -211 129
5508 129 -31 -346 13 179 -21 182 164 -30 179 440 -99 85 -74 180 -11 -206 59 -238 28 101 -40
5529 -40 -209 -132 147 -33 232 115 -61 -322 -48 -321 453 49 653 92 55 -94 54 -72 -2 151 166 216
5551 216 132 320 7 54 -322 -80 -65 29 -32 195 49 -61 78 153 -175 -137 245 72 64 -267 -74 -162 4
5574 4 5 -49 -166 -187 -141 -255 -260 -107 27 75 -130 62 252 33 -395 -204 -89 183 -328 -287 -74 5 -79 16 -151
5599 -151 99 -71 305 -53 -47 -109 -256 -11 417 52 -189 57 193 158 -90 199 84 121 27 -78 -70 217 292
5622 292 41 -104 -103 66 -107 -129 -162 -19 264 104 -187 -363 -16 94 27 -25 -195 201 128 338 12 67 142
5645 142 -223 44 -160 115 186 37 24 -111 167 -1 -151 124 -382 -167 -223 244 -171 -112 103 193 -69 132
5667 132 30 122 202 225 -155 -192 -12 -78 -55 26 -66 155 176 -155 -136 -61 -48 -54 -300 -184 37 -179 -368 183 -87
5692 -87 -441 304 319 142 111 -202 215 -45 -190 26 305 275 96 -266 -133 28 118 349 122 -3 -156 114
5714 114 -5 100 -15 -8 183 95 55 -97 -134 -109 4 82 -22 -103 -25 -24 44 -228 -116 8 -26 -562 -304 -137
5738 -137 67 -136 -120 -470 -305 14 -44 -161 -64 -95 -113 -224 -15 396 254 -98 74 -73 47 278 73 225
5760 225 29 75 -285 -64 -217 -91 23 213 -46 138 67 -343 205 122 -262 -504 -224 -120 96 59 52 91
5782 91 -378 -136 268 -191 -12 294 -331 277 40 421 -181 -185 101 16 -297 -49 41 60 -338 141 -272 -84
5804 -84 -149 -267 -75 -86 76 5 -132 297 -20 -130 -84 -122 73 -158 -36 -38 131 86 166 235 72 119 -59 -257
5828 -257 -227 -147 26 -184 130 -37 -381 102 193 -218 -91 48 -109 -138 -38 -448 175 -116 -157 47 125 237
5850 237 -126 -51 11 145 229 21 100 171 386 298 -104 -22 -173 -149 -310 -163 -107 -71 106 -24 130 108 -124 218
5874 218 -161 218 -31 -154 12 -39 -246 31 194 335 178 206 393 10 124 -73 -197 290 303 -16 83
5895 83 -126 1 -12 -373 -140 359 -59 -442 28 10 -239 -269 101 107 205 -154 -298 74 -340 154 -79 70
5917 70 152 -51 10 20 -105 66 -59 -51 79 61 309 171 -56 -11 -119 34 -36 194 233 -175 136 -254 -301 315
5941 315 -114 -176 29 154 -106 168 35 268 510 -82 -107 -422 -58 100 -64 188 -63 12 -168 53 251
5962 251 -240 -400 -118 -78 -224 -189 57 277 -413 249 107 -137 250 -21 55 198 -393 195 87 55 160
5983 160 152 219 218 -300 -390 -135 -180 57 1 -286 192 -269 129 -203 243 -9 -222 -224 -210 167 100 122 -339 46
6007 46 -31 17 -60 69 -264 -26 208 -357 -36 -239 -1 101 -318 -142 -216 -100 -379 -190 -99 147 -81 181
6029 181 42 106 134 146 86 -59 -70 63 30 135 -384 63 -170 168 8 236 170 -174 -199 -68 118 -2 101
6052 101 -67 -94 -17 167 106 -100 59 -195 102 111 134 8 -138 -118 -153 35 -166 229 40 474 220 -219 25
6075 25 265 123 124 29 70 -165 -149 78 116 -291 -245 321 105 422 55 38 -60 152 -220 -98 10 48 -26 128
6099 128 122 -79 -35 -59 218 17 -210 88 -21 199 256 -58 -4 -68 -67 283 -217 -60 199 -183 140 -28 59
6122 59 -17 -162 182 147 211 66 169 224 -159 165 155 -100 -90 -156 -273 -130 -260 139 282 -517 -75 374 -122
6145 -122 103 -318 159 -92 -91 -93 -210 -152 -112 442 194 -313 -104 11 546 -445 118 -84 115 -27 -159 14
6167 14 -87 -119 50 78 121 -88 205 230 40 3 -290 370 -567 -37 -147 -101 350 67 286 115 -7 113
6189 113 48 131 -151 35 -174 -168 68 37 -117 -115 170 -148 298 -111 209 -22 -84 -395 63 -13 -111 9 -222
6212 -222 -348 -108 95 229 -58 -354 69 -183 -57 206 420 -170 -30 27 158 196 -188 -102 -37 -87 -364 -82
6234 -82 -253 58 97 49 -62 23 9 -143 -140 239 -126 -85 85 149 -291 -70 12 137 -72 -9 266 -51 -34 -191
6258 -191 39 4 273 -19 -94 91 -154 -152 -110 -105 63 -338 129 -50 225 -184 67 252 11 -5 346 11 191
6281 191 -88 -164 -52 -86 -29 -87 101 45 -219 -95 141 -46 35 -7 49 -12 -155 -124 10 -303 120 24 -52 -49 -145
6306 -145 113 409 415 -114 46 2 67 -214 107 249 310 334 102 331 -117 -106 -219 -318 17 -190 -219 -233 138
6329 138 130 51 138 0 -235 -75 -42 520 73 -148 -58 -53 -75 -181 133 -278 54 100 -264 250 139 -3 -63 75
6353 75 6 185 125 -113 68 -218 307 -31 40 25 29 -184 -73 136 -164 108 166 -149 -283 116 289 129 140
6376 140 234 -239 424 -29 66 79 43 -60 252 102 -328 -183 247 -32 -91 38 266 350 -26 378 -56 1
6398 1 -3 -75 -53 -74 217 159 20 104 222 94 55 -89 136 -98 148 64 1 129 274 -52 -177 41 -109 -169
6422 -169 19 -41 126 151 94 225 -191 292 290 -183 -16 -67 314 9 433 -105 201 -182 -215 -150 -68 264 -27
6445 -27 79 194 -248 -211 -40 -55 -151 -42 -80 253 229 26 -348 -81 -82 249 -24 331 -44 -64 90 -199 -57
6468 -57 -347 28 -1 44 113 -18 -406 -25 265 -176 -45 176 48 64 -323 42 24 -42 88 -235 249 323 -397
6491 -397 -156 53 60 -184 -210 167 217 -494 -163 255 -369 -278 27 -115 0 -167 308 74 145 -4 -88 -212
6513 -212 -257 147 138 -144 0 -132 -170 -46 65 483 71 14 -277 42 101 -227 -72 86 240 351 5 -212
6535 -212 -261 -214 -69 76 -186 -199 35 128 -186 164 -235 -356 127 -217 137 -410 -126 213 -206 63 289
6556 289 -148 53 280 112 -307 -205 -60 67 -286 -165 143 -342 -144 -145 -243 -110 -27 35 99 26 168 14
6578 14 -232 112 -144 -205 -14 -70 -73 -128 57 259 -264 -71 46 104 -30 -109 -207 -324 29 35 -292 35 -54 266
6602 266 22 -259 22 208 -34 -195 37 -69 55 -37 -116 -179 -189 57 -318 33 221 -159 40 44 311 278
6624 278 -317 -182 83 -121 -254 9 408 106 -351 321 305 280 268 -219 -21 295 -123 88 291 -100 60
6645 60 -7 163 313 -123 93 -6 -14 273 -284 63 129 -119 -186 271 -29 -70 -112 244 36 -162 -199 -97 -285
6668 -285 22 -149 217 -139 218 -48 82 105 115 -123 75 -176 -215 -133 -60 186 -19 -140 -10 -48 258 -274
6690 -274 172 26 188 -31 19 49 -58 25 -69 148 -88 -111 40 -151 146 303 -84 -67 53 0 124 290
6712 290 -286 48 -227 33 -104 -267 -44 -108 100 -198 59 -272 -341 -102 -354 -49 27 -298 -29 -105 133
6733 133 -219 342 197 15 122 -130 254 -96 -59 186 -50 -181 125 -45 -203 -23 113 -186 47 -33 -144
6754 -144 466 93 63 -262 135 -57 84 67 84 147 53 218 -30 -137 -260 63 -24 -30 -305 2 77 -316 -4
6777 -4 5 68 -140 -167 -29 258 -52 -19 85 208 190 65 100 -144 74 126 128 -157 -78 -431 -58 376 4 136
6801 136 -96 -18 -113 -253 344 97 21 -135 247 -171 -79 -122 -203 145 -233 -75 173 -154 191 -241 -8 -238
6823 -238 2 20 274 -84 -91 -177 4 426 -112 -19 -58 22 193 -314 -198 1 228 130 -22 88 -264 -75 -146
6846 -146 -282 128 112 243 293 -281 -263 -251 94 18 -6 -56 169 -100 18 -106 -105 111 125 -31 -184 111 -74
6869 -74 31 -112 -325 324 -41 -111 182 -209 16 144 20 88 272 92 85 -192 2 -41 16 -19 -151 157 -262
6892 -262 -42 -108 -228 -121 71 -198 -155 201 232 -152 -30 -106 -79 50 -234 149 -16 -359 14 -62 156 -115
6914 -115 -20 -43 -289 -147 96 -12 14 -226 112 -73 -14 14 -270 -3 -72 234 -208 52 -130 154 60 69 -16
6937 -16 -193 25 11 147 -146 -71 172 15 122 21 -122 -147 251 -116 222 -103 569 -2 39 85 -20 -66
6959 -66 127 31 119 -131 154 334 63 160 -209 -180 -160 44 -154 -494 -263 -205 222 159 -179 480 -55 -75 -326
6982 -326 -226 -13 122 -23 -181 266 -92 -224 37 112 -21 -214 -248 151 -448 -50 215 -159 310 -31 -8
7003 -8 -82 163 111 22 151 128 175 -239 -254 223 -297 -313 279 -189 290 57 29 114 624 -363 177 -139 171 -58
7027 -58 -26 62 -39 -124 -623 -8 -21 -55 72 324 -72 -106 32 88 -285 177 -25 -191 16 185 -100 88 76
7050 76 -96 175 204 22 100 -118 231 -168 -47 -34 -62 -388 335 135 131 126 -67 -115 -275 245 -93 45 59 63
7074 63 -219 133 -11 610 86 215 -5 180 216 -13 68 108 91 -75 83 23 -235 -38 43 -99 51 388
7096 388 -248 -230 -69 -224 165 125 -208 33 167 -179 56 -78 -126 -75 -224 -125 -120 -93 -153 -90 -13 205 -31 -90
7120 -90 -12 -542 56 325 -167 -23 114 -212 204 155 25 -23 425 -93 59 59 -24 230 108 43 -261 84 -216
7143 -216 186 129 163 87 -257 -65 165 131 -104 -124 -262 90 93 5 163 105 -103 -236 -82 96 -63 91 -182
7166 -182 -196 215 163 -327 -119 -186 133 -136 -291 -133 -54 -37 -157 79 167 -156 -519 -59 -2 -120 -155 61 -97
7189 -97 173 223 293 168 -83 -47 205 -81 -233 -316 124 -133 -170 44 -97 127 -272 -94 116 55 -3 350 375
7212 375 55 -220 -9 78 86 132 -9 67 73 101 -275 160 -96 -156 -4 -88 -35 17 155 -300 -60 -191 -128 -161 -134
7237 -134 -266 38 -395 -152 160 -51 -49 -75 230 36 36 79 -295 247 -355 -189 -236 -115 238 -114 -28 17 -59
7260 -59 25 40 351 193 -33 -139 243 -317 59 31 -73 85 172 -17 -213 194 -195 -1 107 -173 191 -93
7282 -93 -85 50 -343 -60 -99 -56 -343 53 -74 97 -102 218 110 -132 -53 -71 -140 -200 60 -97 -10 144 106 122
7306 122 -173 -157 -68 230 53 -32 35 77 189 151 30 120 -16 -85 -201 0 216 -40 65 125 143 -248 264
7329 264 -85 -132 56 -67 -108 371 42 117 -18 -196 -217 -11 72 28 -41 -273 -101 -174 101 103 219 -171 5
7352 5 -87 -34 217 376 -37 349 -48 -21 -235 -282 217 82 -253 4 -56 124 66 -224 146 22 274 -222 19
7375 19 -237 163 324 -199 283 357 -82 60 42 -63 -22 -179 57 -145 13 25 -24 -211 -43 -95 -212 128
7397 128 -122 56 122 180 309 -46 -270 66 -304 -93 159 98 -76 99 -60 40 259 194 221 -135 -281 -177
7419 -177 244 334 -169 145 -152 262 -101 19 -110 -187 -38 65 -127 -193 -57 46 -32 -128 164 502 67 -319
7441 -319 -170 -357 214 -61 -142 -269 -20 453 362 -241 203 235 249 288 -130 -23 152 380 345 -335 -81 314
7463 314 111 62 -69 -77 304 168 58 -133 42 53 114 118 -117 -51 -102 -182 -223 -171 362 -182 -176 40 -169 85 153
7488 153 2 8 91 39 -93 -40 -111 -113 -10 -74 69 116 -97 -2 -318 6 -350 -200 22 -47 -146 -309 -111 -209 298
7513 298 24 163 -16 -200 177 192 271 33 -56 -51 -126 100 -173 56 362 25 -98 10 -32 26 -228 109 336
7536 336 209 -127 61 324 -169 160 1 -485 -61 22 125 256 -6 96 -32 -96 -9 186 -54 -58 -243 -64
7558 -64 -210 47 -240 61 155 -43 32 136 -4 -204 59 77 153 -123 116 16 110 -40 418 94 314 15
7580 15 86 -140 87 -161 -8 -3 325 471 -7 125 27 -220 -197 -15 134 -267 61 414 -259 -79 -36 214
7602 214 145 -171 -117 -229 84 187 329 -120 37 21 -127 244 106 -33 -8 -52 51 -83 -78 150 -47 111
7624 111 51 -170 115 96 -127 315 -54 -99 -41 115 108 93 280 214 -174 121 -203 -266 -188 -2 75 129 38 -253
7648 -253 -96 3 -20 36 -73 -13 111 252 48 475 -494 -279 -279 -575 18 90 -51 158 -81 18 -211 -119 252
7671 252 152 -232 -181 110 148 -18 -279 -266 83 59 -111 -322 -210 -56 -20 -103 -228 22 51 81 -38 -125 95
7694 95 208 -139 -186 -104 53 -103 -294 -134 -38 -220 556 -433 -4 55 255 -94 118 108 -96 22 -18 -143
7716 -143 104 55 -321 158 92 132 -2 163 -55 48 -190 -160 -156 34 294 -151 -18 -100 63 142 -61 79 38
7739 38 -61 -127 114 -65 -193 22 59 260 177 587 -17 -78 168 20 226 108 -90 180 -130 -2 482 -150
7761 -150 -146 -125 -151 -540 -300 256 -327 15 -28 74 -48 31 -73 337 50 -137 -68 60 -245 -263 264 251 -3
7784 -3 -222 190 44 59 267 -55 19 -45 -131 -351 7 376 -130 -247 -86 146 -107 -189 80 -23 -187 -59
7806 -59 210 -92 -281 -83 11 -26 -34 -163 324 -254 -276 -229 123 10 4 124 146 -128 175 -5 -79 212 176 -5
7830 -5 -125 -18 33 109 -176 -72 33 123 56 226 55 -56 -108 -54 192 325 255 -141 -386 87 -31 242 80
7853 80 329 -203 -120 -44 -156 -146 18 -245 -238 -356 -219 -85 -79 -231 3 29 5 77 85 -71 123 -19 -90 75 -35
7878 -35 176 -256 -9 -209 -83 -456 77 75 69 13 131 215 -350 18 33 261 -62 151 147 -38 263 -112 5
7901 5 -132 -176 -105 61 253 127 -46 -49 -9 -374 -114 170 -247 97 90 -8 5 -60 -93 -56 118 -76 169 156 -342
7926 -342 -124 -134 115 91 58 -14 -6 265 275 327 93 189 -144 50 248 194 -74 52 -12 -179 42 75 39 263
7950 263 1 443 -100 -107 -280 159 172 107 -21 -2 -62 -77 -62 -29 -146 -161 -299 -296 63 57 426 -203 -219 41 63
7975 63 -80 163 -147 -39 -94 100 11 2 254 49 39 117 -389 51 -27 53 43 -145 0 -211 -237 43 -40 -94
7999 -94 146 134 -67 -65 164 -403 19 199 -159 257 -75 -248 -80 214 55 -382 -95 129 186 78 -16 46
8021 46 230 -110 -179 -81 -180 362 -104 121 -132 147 152 8 45 167 -66 144 -242 172 133 3 584 -161 265
8044 265 65 225 -5 13 -51 -2 71 -240 -139 202 10 135 -46 54 -72 59 501 -249 134 -277 -143
8065 -143 -159 57 -23 40 132 -66 -38 -90 25 -30 8 218 -394 -234 120 -128 100 -425 195 -98 172 -275 120
8088 120 -255 145 154 291 103 -192 -220 59 38 -42 137 317 261 -37 -4 -152 46 17 143 -231 116 178 -274
8111 -274 -206 -173 110 44 -385 -77 -64 -84 125 30 -92 -127 360 158 -117 -51 -242 -20 32 203 280 334 -231 77
8135 77 -56 -202 276 -179 -396 -172 9 129 39 67 125 256 -78 223 2 -458 76 -21 -76 113 124 -250
8157 -250 -111 -243 1 16 -3 -299 -65 -40 -302 235 -44 -90 35 120 188 299 -91 -305 514 179 -30 -18
8179 -18 -84 -146 157 103 506 -9 146 336 -79 -130 -234 -25
8191b5
$$ Imaginary data points
##PAGE= N=2
##DATA TABLE= (X++(I..I)), XYDATA
0 0 0 0 0 0 0 0 0 0 0 0 0 0 0 0 0 0 -3 32 -32 32 -32 32 -53 64 -64 70 -96 97 -128 130 -161 189 -200 226 -258
35 -258 290 -329 376 -419 467 -516 574 -639 705 -782 862 -953 1051 -1157 1274 -1404 1548
52 1548 -1706 1884 -2080 2304 -2560 2856 -3195 3598 -4084 4682 -5440 6430 -7800 9804
66 9804 -13058 19215 -35035 161585 300365 13183 15907 105512 129355 25565 -37482 -6578
78 -6578 118234 66132 -109319 -116342 33219 26711 -70008 -91533 -47917 -12788 -24726 -122195
90 -122195 -131910 -5411 28528 -74363 -79197 -2245 11840 -24613 -69802 -99357 -45199 -14402
102 -14402 -99124 -122386 -7447 36864 -24044 -48964 -31971 -13173 -5585 -61386 -95351 -3901
114 -3901 52699 -34697 -74076 5001 47185 18587 -19531 -36203 10560 43796 -48183 -114226
126 -114226 -12262 64796 -1571 -51422 -9475 43278 50921 -13731 -68374 7417 81861 -4803
138 -4803 -84123 -5477 78614 61312 15918 3208 50837 102691 37658 -54074 6808 101468
150 101468 58774 -10670 9611 62728 92273 62165 -10 26581 104479 59357 -41945 -22240
162 -22240 49098 50414 16058 -5975 11281 62518 43495 -42753 -37004 36685 16774 -54211
174 -54211 -57832 -23554 -77 -2312 -40737 -38448 24821 14833 -69882 -72922 -13000 -10454 -43121
187 -43121 -54483 -38497 4825 11274 -45925 -45017 30427 27992 -47837 -58846 -16614 2512 -7102
200 -7102 -35041 -28552 37038 46779 -32203 -47228 22419 35060 -16759 -44285 -28995 11297 24141
213 24141 -28101 -44240 33283 62357 -11159 -49291 -12069 16982 6677 -29666 -45457 10795
225 10795 51836 -5659 -44351 16583 58059 21336 -18706 -21260 8072 35391 2489 -32894
237 -32894 21125 75648 33571 -10049 13929 43024 41915 15812 -13937 8294 51907 22846
249 22846 -21354 17372 63559 41173 7463 202 10700 26687 6154 -33354 -8252 39647
261 39647 10633 -32406 -8361 23185 16142 -7247 -29412 -21483 8464 -15391 -62315 -31436
273 -31436 23167 5846 -31452 -26994 -5212 8549 -10138 -50105 -35793 17084 -1297 -55674
285 -55674 -37145 16023 22347 -2169 -23781 -15530 21454 10786 -47189 -39794 22983 24533 -19318
298 -19318 -25177 2390 28952 25083 -16499 -25199 23001 26950 -30481 -38760 7803 27935 13451
311 13451 -7478 -10879 22315 35460 -12034 -31649 14408 29315 -8218 -23137 -3921 20698
323 20698 30795 7137 -11162 21447 37565 -7717 -28509 6354 23514 9085 -4125 -5518
335 -5518 16745 35123 6124 -16788 17858 33900 -6221 -27404 -7844 10804 14609 -1509
347 -1509 -15955 12071 35014 -4873 -34510 -1438 21017 -3210 -25787 -25179 -2504 19382 -3058
360 -3058 -30725 2475 34908 -819 -36993 -21469 4186 8307 -9763 -30310 -7615 31161
372 31161 9678 -30877 -7737 28933 14945 -15926 -26036 -10213 18485 10435 -24245 -8449
384 -8449 36339 23403 -16913 -14325 9044 17109 4550 -20775 -18853 18492 18656 -18025 -10655
397 -10655 25310 22675 -2723 -15563 -11391 7368 9389 -18834 -19742 17534 18559 -14221 -12930
410 -12930 10453 15692 4401 -15272 -19569 5081 10078 -21829 -19937 18847 21811 -5296 -13036
423 -13036 -2933 10886 10192 -16215 -23896 10623 18235 -16998 -21156 11324 23919 10293 -9362
436 -9362 -15755 7857 18736 -15016 -29011 9341 27137 194 -15519 -2857 17511 24091 -1911
449 -1911 -23266 3739 24844 -5728 -26259 106 23360 18230 -146 -12467 4406 26429
461 26429 3461 -25834 -4038 21001 4157 -15247 -9958 7656 22068 9370 -16383 -5679
473 -5679 19700 1531 -25051 -10898 10583 8315 -4042 -12798 -4407 17710 8664 -18496 -8004
486 -8004 14917 569 -20545 -13729 2199 11857 6762 -11736 -5186 19530 7402 -20656 -10363
499 -10363 12588 7226 -8884 -14688 -4621 16716 13690 -13587 -7769 20396 10560 -19124 -18051
512 -18051 869 10747 3895 -15418 -13475 15899 16517 -16121 -16522 10418 12038 -8346 -21071 -15364
526 -15364 7899 14685 -11295 -17962 12299 18771 -8646 -18014 -3365 9578 8299 -11035 -19791
539 -19791 6239 21575 -1552 -13122 10107 19363 4563 -9281 -10385 4922 17523 1056
551 1056 -13533 8365 22593 3812 -7084 4461 13600 11622 -1433 -13662 249 17582 1647
564 1647 -11810 7312 19410 5066 -6516 -5827 3724 12185 -295 -17033 -1321 16591 -75
577 -75 -13280 1461 13751 9394 -3259 -14634 -4349 13331 -44 -19590 -3423 16725 4971
590 4971 -10605 -9331 2578 13398 2133 -20550 -12545 11897 1785 -19860 -10946 8181 9987
603 9987 -2377 -17253 -12916 9142 4895 -21192 -18142 5650 3819 -12351 -14513 -5123 9134
616 9134 7985 -14110 -18325 4622 6517 -13660 -13249 3210 8884 3966 -6188 -7841 10152 16408
630 16408 -4030 -9167 9360 11249 -1800 -3523 4732 13956 16703 2851 -4260 12439 17250 -1055
644 -1055 -4538 10455 13177 5234 -1186 -1069 11714 18801 1022 -7514 9101 13021 -4497 -10385
658 -10385 -537 8643 8850 -3571 -12065 4106 15229 -3796 -15200 -172 8373 -1452 -11744
671 -11744 -12631 797 13532 -794 -16130 -1646 11938 -1878 -14598 -8295 2640 6921 -3401
684 -3401 -16619 -5561 13302 3588 -12972 -5159 7101 2035 -8214 -13416 -5781 9014 3988
697 3988 -13809 -7782 8691 2870 -9242 -6911 147 2810 -1495 -12854 -10046 6968 5559 -8902
711 -8902 -4579 6760 3061 -4843 -6865 -3014 6272 5323 -8892 -6386 9762 7166 -4906 -858
725 -858 8233 8504 2944 -5597 -4307 10721 11055 -4662 -2366 13002 10957 19 -2288 2958 11239
740 11239 10393 -6087 -8084 9514 12060 -3324 -4281 7516 11097 5290 -5448 -8123 6533 12490
754 12490 -4838 -11335 4275 9596 -297 -6063 -2724 6391 10077 -3823 -13903 87 9307 -2815
768 -2815 -8840 -405 5763 3774 -3441 -9330 -167 9678 -1990 -12816 -3146 4324 -2572 -6639 -4442
783 -4442 979 5382 -2150 -12531 -5018 5041 -3496 -11266 -4357 1013 -1915 -5497 -8629 -2725 6298
798 6298 -1138 -12887 -4584 3761 -3444 -8909 -4021 1761 4600 -343 -9923 -2465 10465 2743 -8727
813 -8727 -1534 7366 4224 -1992 -4043 2439 13759 8590 -6142 -1165 12448 7649 -2678 -862
827 -862 6327 11425 7372 -4303 -1597 13851 12625 -2410 -2218 7669 7323 1323 -4048 -1953 9288
842 9288 10569 -4179 -7006 6417 7671 -2516 -4611 -674 3433 2909 -6030 -9298 3358 7645
856 7645 -4293 -7094 607 1528 -3426 -6302 -6235 494 4114 -5901 -10595 764 4114 -4620 -5935
871 -5935 -1295 100 -879 -6771 -9506 390 6099 -4333 -8632 1368 3679 -3270 -5923 -4169 1975
886 1975 4835 -4296 -11226 705 8397 -1335 -6344 302 5064 2926 -3480 -8033 767 10457 1207
901 1207 -8732 171 8514 3433 -2208 -2154 3326 9593 2634 -8619 -1707 10872 5186 -3423 201
916 201 5488 6553 2095 -4449 -1053 9572 5379 -6309 -2843 5715 4431 -212 -1196 711 5884
931 5884 4120 -5994 -5167 5521 3939 -4202 -2794 1862 2205 353 -3412 -2921 5404 4611 -6489
946 -6489 -5680 3581 1708 -3268 -2233 233 3326 2290 -5734 -5751 4959 4295 -5655 -4917 1860 2530
962 2530 -1250 -4226 -2792 4935 6031 -5884 -8165 2816 4476 -3724 -5378 -1104 3237 3575 -4627
977 -4627 -8236 3407 7326 -3191 -7638 -416 3356 42 -3565 -5598 2449 7628 -1799 -8402 212
992 212 5888 448 -3954 -2172 1658 4672 -235 -6072 950 8283 1935 -4781 -781 3155 1985
1007 1985 156 -1827 898 6859 2548 -5281 323 6767 2362 -1221 220 1949 3141 846 -3833
1022 -3833 139 7795 2633 -4258 249 4456 1024 -980 -1664 -16 4618 875 -6403 -1786 6547
1037 6547 2165 -4233 -1820 1264 2103 -1199 -5674 -2974 5833 2885 -6986 -4145 3284 2362 -2229
1052 -2229 -4099 -2023 3532 2270 -6904 -5904 4174 4581 -3349 -4126 -20 2305 1472 -4442 -4987 3577
1068 3577 5161 -3972 -5435 1772 3610 657 -1451 -1514 2171 4378 -2643 -5384 2492 5579 -428
1083 -428 -2158 610 1855 2418 -260 -2897 2528 5628 -1779 -4654 1314 3337 631 -464 -245 1345
1099 1345 3129 -1373 -4791 1872 5200 -1870 -3851 282 1490 285 -1435 -3060 1100 4795 -2152
1114 -2152 -6878 -254 4040 -493 -3040 -1585 720 3042 -935 -6193 88 5944 -205 -5570 -1880
1129 -1880 2231 1741 -652 -2944 -372 5738 1692 -5780 -1598 4766 2493 -1552 -1749 293 3792
1144 3792 2489 -3487 -1481 6307 3795 -2726 -1831 2253 2592 1683 -1266 -1120 3910 3454 -2932 -2400
1160 -2400 4035 2733 -538 -835 -630 982 1767 -2048 -2446 3721 3027 -3717 -2540 1343 694 -402
1176 -402 -1590 -2139 1285 1889 -4104 -4032 3036 1854 -3142 -2836 -687 -84 255 -2976 -3929 2629 3118
1193 3118 -4134 -4300 1073 2078 -861 -2329 -2307 1389 3165 -3095 -5079 2102 4874 -636 -2768 -674
1209 -674 1393 2411 -702 -3595 1627 5600 -278 -4350 744 3887 1836 -158 -1372 717 4393
1224 4393 646 -4017 802 5253 1230 -1737 -463 1308 2597 1542 -2205 -326 4154 693 -3346
1239 -3346 -207 3237 1319 -30 -564 -477 2177 969 -3465 -596 3881 216 -2869 -762 700 459
1255 459 24 -1917 -1096 2915 126 -4763 -1658 3154 684 -1689 -1113 -84 1522 889 -3332 -1211
1271 -1211 3941 1686 -3714 -2363 1246 1733 643 -2050 -1733 2674 2519 -4149 -3304 2716 2354 -1186
1287 -1186 -2325 -990 1559 2394 -2283 -3459 2540 3095 -2576 -3455 -254 1371 1362 -891 -2612 606
1303 606 3204 -2066 -3767 1403 2305 -392 -1589 -1161 159 2085 -106 -2845 1726 3461 -1700 -2832
1319 -2832 309 1568 966 -88 -1199 542 2986 -431 -2549 2268 3325 -123 -833 145 1197 2132
1335 2132 102 -1793 1502 4271 -208 -2752 881 2777 1136 -366 -1319 225 3183 -98 -3308
1350 -3308 472 4115 470 -3030 -1238 374 1794 177 -2937 -1051 3173 314 -4188 -1303 1676
1365 1676 893 -958 -2994 -2465 1616 1032 -4167 -2607 2791 799 -2609 -2270 -848 862 915 -2606
1381 -2606 -2588 1919 1519 -3147 -1757 1318 909 94 -890 -1496 773 2173 -2018 -1599 2617 1646 -1297
1398 -1297 -693 867 880 1618 -420 -1238 1876 2425 -2176 -1133 2850 2111 -166 -486 -107 1531 2307
1415 2307 -1129 -1702 2784 2667 -1817 -1811 1111 1542 1561 -825 -1835 1095 2682 -1922 -3128 1360 2563
1432 2563 -245 -1648 -1819 313 2347 -316 -3559 633 2490 -1029 -3284 -424 1232 1155 -94 -3029
1448 -3029 -973 2311 -287 -3139 -475 2286 500 -1509 -1607 -768 1997 733 -2308 -351 2427 346
1464 346 -1847 -137 1260 937 1264 -1039 -828 1697 1189 -1718 340 2408 505 -697 -344 120 1343
1481 1343 1413 -1357 -950 2421 637 -2455 -440 1654 681 -107 -1209 -1146 1628 1102 -2587 -1103 2525
1498 2525 696 -1740 -1450 -499 1104 976 -2017 -1965 1702 1389 -2811 -1720 1124 1182 220 -1686 -1824
1515 -1824 879 2106 -1194 -2129 1610 2145 -807 -1347 -127 1055 2094 -261 -1873 1032 2464 -597
1531 -597 -1457 1292 1520 679 83 -1244 252 2319 224 -1561 949 1728 -462 -761 -4 737 1370
1548 1370 358 -1534 214 1794 -678 -1247 991 1378 20 -246 -1224 -246 1377 -222 -1890 269
1564 269 1657 -997 -1579 49 291 785 -266 -1780 -581 1714 -344 -2434 117 1669 106 -1341
1580 -1341 -1547 5 1451 320 -2563 -636 1891 212 -1834 -599 745 1243 339 -1743 -1383 1723
1596 1723 1137 -2038 -890 1573 868 -239 -865 -348 1196 1517 -1315 -1363 1725 1093 -1107 -631 440
1613 440 563 915 -429 -1380 747 1755 -1180 -660 1227 468 -756 -493 -281 153 1296 -555 -1307
1630 -1307 1118 743 -1522 -353 509 232 130 -549 -807 851 1593 -1001 -1137 1707 1115 -631 -438
1647 -438 -85 548 1230 -483 -1668 1128 1850 -637 -1373 1021 1404 430 -350 -1521 347 2109 23
1664 23 -2063 560 1717 -36 -978 -566 131 1271 223 -1882 -446 1736 -44 -1404 -247 633
1680 633 76 -688 -1699 -1043 1045 597 -1833 -1025 659 -255 -1318 -618 -377 488 170 -1619 -1309 943
1698 943 35 -1286 -243 425 -246 -513 -466 -770 741 482 -1141 -615 1690 188 -829 335 576 1024
1716 1024 652 -554 -343 1294 875 -727 241 2057 822 33 178 258 1596 1653 -679 -705 1859 1400
1734 1400 -770 -325 773 1001 1186 -323 -831 1172 1560 -1087 -1115 699 900 -3 -403 -945 321 1449
1752 1449 -664 -1617 119 994 -558 -829 -9 165 523 -113 -1593 -463 1219 -549 -1233 -5 -214
1769 -214 -746 -701 -743 -386 942 -269 -1392 -275 826 -733 -764 217 16 -60 -385 -590 -417 1307 21
1788 21 -1095 299 603 -263 -542 -132 660 958 184 -889 26 1726 213 -861 536 807 550 -179
1806 -179 -937 125 1446 520 -1135 -42 1284 264 -467 -76 468 818 628 -1209 -916 1310 653
1823 653 -866 -154 524 174 1 -854 -797 957 771 -865 -977 692 441 -529 -231 -155 409 1035 -508
1842 -508 -1201 444 965 -492 -245 544 157 103 289 -533 682 912 -482 -824 738 406 -552 88 -5
1861 -5 251 131 -412 -1132 505 941 -535 -797 593 158 -833 -154 -536 7 761 -638 -1541 217 603
1880 603 -824 -894 -240 482 203 -586 -1003 30 1058 -540 -1472 -386 556 104 -633 -710 -181 1222 404
1899 404 -1237 -53 1117 188 -690 -70 214 484 176 -617 -63 1336 876 -456 320 786 431 -114
1917 -114 116 -31 754 559 -756 -305 842 258 -24 116 302 235 -66 -345 -192 1123 410 -829 -54
1936 -54 351 -138 -583 -171 -251 269 613 -814 -527 1137 265 -1051 -497 155 206 45 -475 -554 815 471
1956 471 -951 -702 849 322 -475 -785 -209 282 746 -721 -1361 311 1192 -507 -426 300 565 352 -90
1975 -90 -691 398 1441 -44 -1188 446 362 413 -135 -254 74 715 153 -1012 96 1111 222 -633
1993 -633 141 -395 351 380 -866 -146 828 158 -759 -181 313 -509 -373 -218 -259 -37 -198 -986 -344 448
2013 448 -585 -1037 187 169 -812 -376 -447 -3 360 79 -965 25 854 -115 -364 -189 632 4 212 -463
2033 -463 59 1154 318 -698 117 639 432 -77 160 554 698 751 -717 -496 990 729 -25 -42 308
2052 308 373 677 -219 -692 708 1087 -249 -31 495 227 -99 65 -608 399 816 -692 -1102 161 276
2071 276 -92 -271 -362 -694 -68 -318 -788 -230 321 -1032 -833 256 -238 -237 -70 -504 -262 -158 -510 -1113
2091 -1113 118 337 -702 -287 21 -15 -381 -424 -525 53 573 -525 -948 185 9 99 5 -125 239 941
2111 941 -237 -652 298 727 158 -149 558 440 782 298 -241 371 1103 399 -103 546 854 265 400 133
2131 133 244 1054 592 -511 138 847 138 -427 140 270 408 477 -179 -805 484 451 -747 -226 409 -52
2151 -52 -83 70 -535 329 -125 -361 -448 1003 52 -700 -87 75 -198 -214 -232 -371 36 362 -793 -723 526
2172 526 -313 -308 -15 -300 -259 -143 -700 -547 319 266 -958 -612 145 -198 -240 -452 -583 362 474 -915 -1047
2193 -1047 396 376 -120 -701 -539 -218 140 -217 -727 206 984 -366 -636 -300 -25 -15 280 -89 210 948
2213 948 386 -228 402 1171 439 475 231 488 496 422 190 238 1220 167 50 684 646 427 690 169 473 537
2235 537 384 -99 277 1237 -101 -19 331 400 345 59 -27 92 618 -264 -497 65 -13 -634 -244 -243 -216 253
2257 253 -357 -1266 -446 269 38 -1090 -825 -267 -384 -397 -641 -857 -144 -213 -1259 -829 -54 -431 -389 -565
2277 -565 -900 -67 273 -835 -1121 83 148 -768 -323 -651 -363 169 -135 -347 289 838 113 -394 735
2296 735 525 56 459 176 407 715 601 83 677 920 643 407 645 764 467 511 428 408 880 259 -33
2317 -33 901 746 72 319 634 138 453 220 -119 455 942 -81 -265 260 158 206 74 -562 -227 -3
2337 -3 -243 -1037 -158 39 -468 -302 -608 -265 -35 -257 -695 -262 321 -112 -865 -215 -277 -228 -203 -498 -410 -159
2359 -159 -94 -758 -641 51 103 -348 20 -533 -48 327 -312 -119 632 -230 -480 -1 -215 67 141 231 -57
2380 -57 55 593 6 64 206 -44 -145 417 -67 154 644 176 -61 718 556 -268 284 589 146 94 149
2401 149 -117 202 407 -85 57 821 302 -207 296 574 64 642 176 -230 355 422 -366 -405 561 302 203
2422 203 287 -194 -142 610 -138 -127 117 462 -386 -19 -311 -292 155 603 -663 -132 344 -179 -605 -393 -389 -217
2444 -217 139 -195 -672 54 81 -578 -166 -3 -403 -353 71 -258 -205 225 -296 -696 -84 161 -462 188 -121
2465 -121 -165 -243 180 -248 -54 161 -230 -213 413 -283 -244 509 270 -164 466 400 456 516 430 -162 150 491 226
2488 226 413 360 117 475 580 -109 92 746 544 -283 414 622 353 274 -43 -554 23 490 -160 -27 222
2509 222 143 -393 78 -323 -134 241 -535 -409 115 147 -374 -327 -82 -298 -163 -190 -438 -262 130 -453 -910
2530 -910 -49 46 -465 -24 -435 -317 -83 29 -388 299 -210 -542 -284 137 -289 -224 258 -57 -3 95 133 -244
2552 -244 266 478 -91 -177 351 -141 -57 425 229 275 472 -30 -34 188 69 257 141 135 -21 408 383 -342 112
2575 112 581 121 -139 -87 -169 -87 97 -234 -576 147 -442 -714 -83 -81 -349 141 -82 -227 136 -18 -634 -344
2597 -344 -112 -161 -236 -117 -171 158 324 -132 -461 -111 47 -85 -189 204 -211 193 20 -38 135 225 -132 -205
2619 -205 547 21 165 182 341 165 350 78 39 411 409 -140 9 41 93 -151 192 -163 -96 528 -313 -76
2641 -76 363 161 -189 60 354 143 -11 -32 -73 294 267 21 -793 51 357 -77 205 -441 -208 424 -1
2662 -1 -474 -244 82 -173 -117 -66 -143 -262 177 25 -114 449 240 41 254 121 -140 22 509 146 114 261
2684 261 -119 -113 271 -410 -43 245 184 -156 -25 216 -113 -94 0 -627 523 165 42 211 115 79 -204 -74
2706 -74 -15 83 83 -89 -551 175 144 -46 127 26 -116 217 331 -326 212 383 -138 -319 141 117 123 171 -473
2729 -473 -532 257 116 -444 301 63 -318 187 18 150 171 803 -87 -406 419 -20 236 83 -187 -141 350
2750 350 357 -203 224 427 31 74 -28 73 104 128 188 -131 64 -282 -116 109 -5 -363 -43 423 -524 -164
2772 -164 -285 -511 -282 422 -204 -200 -86 -455 -176 -234 -340 -243 192 174 -457 327 322 -111 -158 144 183 253 478
2795 478 -137 145 398 305 -169 275 167 171 546 349 322 321 335 -216 17 412 339 -73 22 227 228 433 328 -118
2819 -118 664 711 27 56 276 85 354 651 -280 -186 158 -52 -119 247 -235 -475 -90 -3 208 -210 203 -129
2841 -129 -66 -22 -398 -589 -6 -373 -318 193 -323 -195 -19 -42 -70 -271 -114 -427 -224 126 -627 28 -441 -96
2863 -96 -41 61 -112 -147 -30 25 115 5 -87 114 274 -206 -90 -141 107 -266 270 352 -20 127 198 39 -279
2886 -279 220 379 -355 70 300 -153 188 221 -1 108 531 -108 81 80 -73 165 66 174 104 -118 86 -380
2908 -380 -165 -145 -257 53 -142 -465 138 478 -277 -104 -43 145 66 112 425 35 -111 -416 -520 -9 94
2929 94 -43 249 47 -324 -77 -116 -333 -352 103 124 -535 -110 -382 -85 268 174 -47 -206 -84 -220 -243 80
2951 80 -136 131 221 -296 -111 -117 296 -48 23 -243 -487 223 -286 -256 -152 -394 -148 -23 -23 128 -268 318 212
2974 212 -95 160 -5 -24 -135 395 404 111 313 -113 25 89 -198 133 437 39 -30 250 358 140 439 245
2996 245 108 311 109 -341 4 41 255 237 82 122 322 254 316 245 318 -137 -208 251 124 -224 164 59 -718
3019 -718 238 71 -399 -236 434 -328 -12 27 -292 -108 -441 125 -280 280 -213 -231 -451 65 -292 85 -25
3040 -25 -495 223 154 -231 -434 -90 83 -288 -107 -191 -241 92 -60 -173 -455 168 -169 141 225 51 -8 188
3062 188 174 19 101 260 -7 427 298 -100 215 -59 -83 466 376 255 329 311 271 366 279 -68 -88 410 -1
3085 -1 355 245 66 -69 7 269 -21 82 387 289 71 121 -62 -202 -20 -410 -282 -166 -101 -368 -93 -311
3107 -311 3 -13 -269 -340 -115 168 -101 -119 144 -110 -214 -128 -51 -197 11 224 -419 -80 -107 -237 -133 795
3129 795 44 285 -70 -57 -30 437 -31 204 193 24 163 318 -16 -333 230 65 124 84 98 -48 10 128
3151 128 389 -110 49 563 81 -234 236 -67 -238 -9 -83 -37 164 -110 -126 379 -88 242 164 97 -281 14
3173 14 129 -5 29 -262 -330 1 -194 16 61 -95 -145 -182 37 -528 65 47 -269 192 -106 230 -223 132
3195 132 94 -184 73 -253 -7 -161 -177 -158 -61 185 28 -93 345 -210 -140 147 361 -212 179 250 -383 -72
3217 -72 134 -311 75 -19 193 -28 -114 366 -489 46 -72 18 -197 49 -476 -77 -7 -142 -138 165 -246 -231 253
3240 253 -121 -186 118 152 25 -93 79 -482 153 -134 -99 192 285 -115 218 220 -201 -116 308 42 -168 348
3262 348 159 115 38 18 -56 -47 2 -34 54 -23 -151 102 58 2 -422 107 -229 -140 -144 -271 178 -38 -43 -58 -183 50
3288 50 306 -310 -107 -258 -413 -85 -396 -468 2 -24 -198 -12 -172 -254 301 2 -69 -219 238 116 407 428
3310 428 -68 -230 80 69 45 28 452 -48 217 4 105 201 30 -58 30 397 -8 -149 313 -159 -447 63
3332 63 49 27 10 162 -146 245 353 -121 227 2 70 -139 186 -147 -110 -291 -9 51 -222 49 47 4 -235
3355 -235 -172 206 -224 -275 166 31 -149 82 -197 -161 -318 -329 -168 -52 -172 191 52 -58 -134 -152 -107 131
3377 131 64 -230 -82 41 -21 -177 80 -166 353 447 437 468 185 171 256 450 80 -65 315 94 304 191
3399 191 88 199 154 -24 -133 76 3 -500 -11 167 -189 95 201 -378 -164 -53 -170 -273 -37 72 -212
3420 -212 340 -104 -207 74 487 -100 -31 87 -371 -161 -72 -349 -488 224 -133 -363 16 -101 -257 491 -124
3441 -124 -268 -173 -192 -271 -258 173 -317 285 146 -405 -272 84 134 -451 78 84 -155 -52 44 101 388 105 -84
3464 -84 67 -151 -105 -254 226 -67 -3 -144 -154 -253 217 150 24 163 -85 -73 11 376 10 163 78 -92 61
3487 61 -4 207 63 132 -14 -223 199 210 -56 142 249 -127 53 91 318 -199 403 194 3 23 34 -161
3509 -161 456 -60 508 178 120 -279 -240 -36 44 64 -11 -158 -236 238 -135 -338 54 323 -227 -104 -15 -127
3531 -127 -136 67 163 98 -133 96 -181 -39 10 -33 91 40 -119 131 -14 -176 -229 107 -251 -1 180 -46 34
3554 34 143 351 88 294 66 -125 -13 257 -237 270 -18 -83 441 -55 -5 292 112 442 196 140 191 90
3576 90 -196 -286 -79 191 71 317 193 220 277 111 470 -96 237 79 -205 -64 357 -118 136 -76 -149 -17
3598 -17 217 -13 -23 10 233 -166 131 252 206 -92 -116 -443 -68 -117 96 -194 21 -76 -61 -12 129 -577 106
3621 106 -406 -334 -9 39 17 -553 64 46 -109 220 -117 67 188 -184 -281 -92 341 -20 330 127 39 134
3643 134 303 648 404 129 -61 227 325 -152 81 -292 -84 184 527 -45 -67 53 334 143 -205 -22 97
3664 97 75 -77 -65 -89 155 0 91 -125 -392 5 57 -117 -190 -22 57 -61 80 135 -194 168 353 221 8
3687 8 -86 -24 -210 193 -97 -175 261 -39 -78 45 -135 40 183 174 143 207 -131 -49 -216 -188 145 86 9 113 404
3712 404 -35 312 -32 22 299 347 -428 147 -178 -13 64 -226 57 2 -241 -202 -68 -343 193 -96 110 -154
3734 -154 -4 -33 -355 66 56 200 87 284 149 -472 14 42 -125 -368 59 -334 -2 80 117 -21 55 -231
3756 -231 -193 159 -277 -147 30 -11 -39 221 178 -125 -137 150 -419 -15 -17 218 -256 84 80 282 200 -28 -396
3779 -396 56 74 -37 24 225 140 -51 -111 34 -8 149 96 -50 326 -54 -189 278 166 -154 15 -13 8 80
3802 80 60 246 -135 158 19 -365 131 -147 6 -144 -123 -256 353 -120 90 90 16 166 41 -18 218 150 -71
3825 -71 13 -159 50 240 -76 16 58 24 99 64 6 135 -102 185 -428 101 -334 -231 148 28 -42 207 4
3848 4 157 -286 288 -21 -8 -32 13 -28 220 -307 -114 79 -217 -161 50 166 37 -73 -221 -126 -129 19 57 151
3872 151 -300 170 -394 70 0 80 -160 168 -401 340 225 75 -85 97 146 -253 158 84 -101 -6 -41 -126
3894 -126 6 55 13 -13 482 -44 106 332 -54 -29 656 82 -20 115 301 -198 45 380 95 110 122 -16
3916 -16 29 196 56 -358 -6 -253 76 409 -374 -480 -191 -212 -212 -34 -113 -97 -129 -51 -188 93 27 -260 -254 246
3940 246 -362 -355 -44 169 -77 -180 6 -31 -187 -345 -244 138 -2 -341 164 42 -85 115 284 25 -125
3961 -125 413 356 193 151 107 276 53 123 174 173 -80 -59 -510 20 386 -16 -182 -33 181 223 109 167 468
3984 468 180 6 -29 185 218 -23 -185 -101 344 -132 17 -141 208 -347 -559 155 226 -181 180 -191 21
4005 21 -137 -258 -397 -65 171 -83 -152 -129 197 -72 111 -170 -186 303 -16 -195 -1 2 -20 172 -96 -270
4027 -270 307 246 -125 -58 -40 178 41 -282 -97 239 -174 -138 133 -57 50 183 -242 -150 -203 -5 -3 -293 113
4050 113 238 -365 -76 -52 -106 106 -5 -165 70 -256 45 -360 -202 37 136 83 -3 69 -65 187 35 212
4072 212 239 -66 -96 127 163 -57 -28 95 172 -104 6 186 -445 229 -244 -33 -61 -338 -61 -385 -92 -231
4094 -231 -5 50 -107 322 57 -185 -132 67 -134 58 -162 -128 -359 -483 -226 -55 -316 -149 -177 -35 -35 -59
4116 -59 215 -210 -8 -6 -90 -88 -95 -47 -172 -249 -71 -191 138 -19 39 -316 -147 -331 56 -173 18 -245 -365 462
4140 462 367 -90 295 141 -209 -151 376 50 285 -8 67 61 177 -225 21 355 164 236 118 -306 8 776
4162 776 -159 115 264 122 180 259 232 -248 199 214 224 47 -2 -101 -128 379 7 -32 132 85 -51 -174 132
4185 132 -133 -176 46 62 299 -58 152 -138 19 24 -223 249 -212 175 48 -148 148 -109 7 -79 53 -167
4207 -167 -132 -155 396 -27 -345 -112 10 123 157 31 143 361 111 -193 237 19 3 -128 76 41 173 59
4229 59 -178 -107 214 219 25 59 -272 -158 -218 -437 -291 115 366 42 -100 565 -95 -11 -276 -57 -135 138 -286
4252 -286 -106 193 -195 -214 -9 -275 -44 115 -73 72 22 158 -237 -126 -20 116 304 52 -242 -13 92
4273 92 345 -16 86 246 129 122 -237 412 264 -438 1 -365 -382 -74 17 -207 -87 -510 -13 217 -64 -194
4295 -194 186 -173 485 66 358 -108 171 -114 -38 153 -89 120 17 54 -283 -141 -335 -104 140 -369 -78
4316 -78 -135 -233 -34 187 467 -170 -21 -108 165 242 9 104 -134 41 -6 -380 -63 -109 -76 -102 -233 -91 -275
4339 -275 -331 -37 291 -133 109 224 -191 205 59 -290 427 231 -389 27 -2 121 -2 -110 22 52 -112
4360 -112 168 443 -19 28 -299 29 76 125 63 -253 12 79 -51 153 10 44 45 -10 -109 -227 257 199 -137 -90
4384 -90 411 -119 -37 -200 -82 194 -168 -150 -96 133 -208 -58 -20 -68 -91 -246 98 137 25 279 310 148 300
4407 300 -3 255 186 20 216 -291 254 -106 8 170 -119 -139 52 81 -12 196 -66 -57 188 97 -5 83 307
4430 307 177 -110 -191 -285 -135 -304 -35 -137 -64 -191 -4 283 198 -101 313 180 -162 23 286 -49 -74 -180
4452 -180 -219 90 71 134 -196 370 249 -63 184 -249 274 -267 -27 150 -133 149 48 66 -18 -178 38 165
4474 165 216 -112 -82 -100 34 -14 -131 53 27 192 95 237 216 -98 -96 -94 131 -134 5 -149 -349 -108 44 1
4498 1 -122 44 28 -100 -375 -225 36 25 -244 -140 45 -123 -308 -80 -132 -24 -474 -154 -319 -198 -100 -14
4520 -14 -323 22 377 -31 -194 -307 148 121 -40 56 194 147 -27 139 30 -299 183 97 203 267 202 11
4542 11 5 -58 206 154 192 -40 -71 262 312 -262 -37 43 181 144 -48 35 -201 139 -241 205 98 -287 181 -244
4566 -244 83 -229 135 -326 -17 284 -81 -220 88 90 106 5 -104 -145 -45 162 -361 -34 -257 -479 62
4587 62 190 -328 -29 101 103 17 -61 -66 -129 228 88 -67 -30 175 -182 -396 -70 -19 62 -196 43 42 -125 -63 -377
4612 -377 228 291 -241 -81 -473 -137 381 -87 -312 -166 -56 44 32 204 53 -149 -65 49 -25 7 192 268
4634 268 -129 119 304 96 195 -57 392 -133 -99 -160 0 -43 82 338 310 69 263 468 268 -256 17 148
4656 148 64 -324 65 218 66 177 123 -205 -303 72 -72 179 110 -31 -319 176 165 96 -175 -42 193 286
4678 286 -346 -216 193 -245 70 -494 -95 -50 -27 166 72 -39 -471 54 -169 -206 112 -112 -96 -125 65 -93
4700 -93 1 199 173 -81 29 4 -56 -76 -307 15 8 67 275 -2 -275 -118 -59 108 189 43 255 125 -48 -18
4724 -18 179 184 68 -315 203 316 60 98 201 237 -7 -74 432 -170 72 250 151 -36 184 256 -226 -188 65
4747 65 9 105 131 131 -15 205 235 -311 176 108 -163 -183 100 -223 379 17 -285 -267 53 131 39 204 92 -151
4771 -151 -105 42 -172 -16 -462 -9 410 0 98 161 -358 -154 -167 -130 330 11 -87 -53 154 73 335 262 -1
4794 -1 93 97 43 332 61 0 31 -119 249 -126 -77 12 -1 173 -97 -77 361 243 -236 -274 -197 61 110 -205 90
4819 90 121 -27 128 197 52 -217 88 40 27 106 68 182 -68 -8 41 -185 147 -50 -259 317 -6 -81 108
4842 108 227 -283 38 273 -22 -35 11 411 25 35 -319 -238 -12 39 99 26 -139 62 15 185 195 98 -335
4865 -335 21 232 -232 100 -291 90 -72 -72 -49 -79 227 -222 107 -231 207 161 -65 205 255 -128 -190 -400
4887 -400 -110 92 7 38 -219 50 168 114 -205 -49 281 24 -126 -251 92 77 43 -153 -175 157 -124 -78
4909 -78 -9 21 54 57 -263 243 15 254 220 228 -6 364 149 121 15 -107 -92 216 -243 -49 -129 -48 14 -138 -118
4934 -118 -138 207 490 -29 -182 198 -103 -38 18 -130 -94 -219 -259 -59 -230 -88 -117 -209 266 3 145 16
4956 16 180 -165 -236 -110 67 22 80 -68 60 41 -86 0 219 -63 -161 -99 -170 -247 -103 87 -155 289 -44
4979 -44 79 -44 -114 -156 218 378 -280 109 -81 130 107 11 -148 60 -79 -265 337 17 -178 -188 130 97
5001 97 247 -182 0 176 72 183 -130 141 441 35 92 97 39 100 40 -362 44 -111 -7 185 -280 150
5023 150 -37 -37 -35 135 20 258 62 49 39 98 107 44 192 27 426 -59 33 162 26 432 76 46 16 46 245
5048 245 228 -89 79 4 203 18 -167 179 -24 37 -161 -133 54 -33 -368 -589 -25 -40 -48 195 -297 -93 -17
5071 -17 20 -192 146 89 -165 -207 -140 65 9 -229 -168 -156 42 232 103 -91 -210 -128 43 -216 35 216 -72
5094 -72 239 210 23 -221 -50 -51 -35 -22 -75 -133 -266 -83 -150 232 -109 82 -193 167 -52 -36 169 88 288 350
5118 350 61 228 -280 67 -268 26 -6 0 -187 -188 187 -77 -46 -255 -217 97 -265 -11 128 182 -79 -105 104
5141 104 -159 100 156 296 -101 55 45 -203 -240 187 -114 12 197 -81 93 391 -38 -161 48 -238 40
5162 40 -56 161 36 272 -149 -78 21 83 -187 -222 -1 23 -53 -110 -212 87 -78 10 81 69 -103 311 203 -348
5186 -348 -105 -234 140 -116 156 -184 388 103 27 -293 -141 -72 -241 -108 180 -287 -131 43 -190 194 107
5207 107 -17 -322 83 148 167 175 51 132 19 119 -205 -431 124 -387 -188 179 325 295 -295 -72 228 165
5229 165 337 510 47 -272 -243 37 188 294 -78 266 271 32 -120 191 203 178 -91 250 395 153 -213 64
5251 64 -80 10 35 312 156 216 24 132 114 36 65 -96 -76 -123 -189 -128 77 201 346 87 -107 -269 42 -49
5275 -49 -101 -115 -57 -61 233 -71 -188 -18 64 244 -28 79 -6 19 -121 -256 45 -160 -25 -102 -57 230 378 50
5299 50 111 115 428 148 94 179 -232 326 -60 -90 58 230 174 -135 -100 223 32 449 4 230 105 -25 148
5322 148 -409 77 -261 -18 -163 -446 -283 -38 26 -73 -31 353 164 45 -225 -94 -167 -132 77 -2 33 218
5344 218 198 -14 335 44 105 151 -134 127 -13 -125 -169 -586 35 30 -80 -122 -17 465 -109 157 155 -276 -284 -149
5368 -149 -57 69 -43 -166 371 -97 62 130 167 60 -156 -115 88 -70 -158 -141 -98 257 -268 9 -101 464
5390 464 -181 257 -215 398 101 -267 116 400 99 160 -55 192 -47 -131 -231 -448 123 -66 329 -199 158
5411 158 155 -112 99 330 -62 16 104 186 66 44 -346 13 -25 -109 79 -85 -52 74 -189 -281 -220 -311 173 28
5435 28 302 -38 -226 -51 -2 -88 -387 -133 -2 138 -92 210 -277 -220 73 78 13 -455 -401 232 229 6 -217
5458 -217 14 -3 -102 108 0 -32 -113 -206 -25 -117 239 50 299 -80 281 71 -127 26 -56 239 -77 -228
5480 -228 -32 162 -55 -300 372 105 -51 41 -455 -261 -387 291 -97 57 109 -379 -155 92 -94 415 171
5501 171 56 193 207 46 99 88 -39 161 480 227 -79 6 310 113 -147 117 -98 -96 59 -15 -156 69
5523 69 97 -160 166 -154 161 -335 -127 -215 -71 -167 85 13 139 -20 -261 -208 274 231 -144 -78 -361 77 -237
5546 -237 156 -110 31 72 126 -147 395 111 256 -40 -15 41 -149 21 13 -331 -126 -33 67 140 83 -3 -45 91
5570 91 19 -32 -191 164 -170 439 19 -89 289 -245 -95 73 -179 -234 129 159 -79 63 203 -191 -89 -135
5592 -135 -24 -1 92 -249 -179 272 -411 4 307 20 267 21 280 -139 -6 -30 481 -36 27 -86 109 11
5614 11 -210 161 -124 123 428 23 318 -262 52 -265 -134 304 -24 28 185 -178 55 -75 195 23 76
5635 76 -48 -74 62 -209 38 -249 82 -130 85 116 -535 147 32 54 264 -127 37 203 -58 224 -60
5656 -60 14 -14 -95 1 -140 40 -40 10 490 -212 -259 -29 -166 -65 -269 -250 -55 -169 41 261 -4 41 193
5679 193 34 198 -315 103 -208 -46 -82 -67 -27 -171 13 -214 124 -92 -154 -108 -1 -89 -158 24 119 -28 -5
5702 -5 372 195 -70 65 -207 146 138 150 -84 -25 367 -163 -222 -235 164 122 132 85 79 208 -99 -107 52 22 -371
5727 -371 -74 -138 58 -198 -99 -22 -376 123 -244 -363 -198 -278 229 -211 -156 277 -190 -190 -182 -148 -273 -54 -192
5750 -192 40 38 -114 -170 39 -35 -61 20 -187 79 -330 76 243 -62 -281 235 60 333 176 81 -43 -226
5772 -226 -567 191 -73 -284 -237 -130 160 -18 -29 -100 57 -35 63 -66 -87 -151 43 -202 -131 106 348 8 -39
5795 -39 111 230 -40 82 104 -196 277 174 49 250 210 -46 18 -424 17 -106 15 196 46 191 56
5816 56 -10 38 4 -168 204 37 216 -80 50 56 -539 119 354 -38 222 -408 -35 -161 -222 -289 -128 43 -128
5839 -128 145 123 -100 -61 -339 51 248 -172 444 -85 -44 -139 238 439 142 80 146 -77 -176 -526 28 157
5861 157 -110 -221 222 139 -177 -72 -122 76 -50 358 -213 153 51 156 -42 -249 115 -82 176 132 344
5882 344 -241 137 -254 -147 173 82 289 65 81 473 313 -141 118 -274 112 127 90 31 98 -225 -240 371
5904 371 80 -203 104 117 -348 127 234 106 89 174 -72 54 -295 28 -515 -80 60 -197 -128 -217 33 -168
5926 -168 -109 28 183 -8 57 -319 -132 155 112 169 323 -42 4 27 -21 15 28 -175 49 -215 -210 -68 15 8 -151
5951 -151 229 -50 -100 -114 -26 13 -211 100 -21 3 -358 -469 276 -117 38 -178 -23 208 -105 263 -175 181
5973 181 18 -228 -62 37 96 -121 -142 295 336 -99 114 34 25 417 -251 17 33 450 -17 231 320 10 -71
5996 -71 -86 -223 -30 105 -274 -222 -248 -28 115 91 70 51 -279 -140 -228 -205 -319 -148 357 270 -130 28 -150
6019 -150 268 17 343 210 -149 23 -105 144 144 107 98 316 71 -295 46 167 139 75 113 -367 293 -261 -60
6042 -60 -296 -61 19 -179 131 15 301 -89 -482 100 -101 -67 8 115 179 -130 -156 97 -83 -45 -89 371 -140
6065 -140 -244 278 80 -10 104 174 12 65 -37 -430 -40 359 124 -269 94 111 65 102 534 -157 296 -17
6087 -17 -168 -182 100 247 -27 -223 14 58 -227 18 80 -15 118 10 -254 -63 -154 115 -44 149 76 94 -290
6110 -290 29 66 1 39 -135 -166 72 -205 -253 113 -87 210 261 170 -19 -3 75 191 169 -16 239 247 344 -169
6134 -169 -217 50 92 132 130 -197 -38 76 55 -109 -200 -113 115 -58 112 -118 120 68 116 205 -142 15 -432 -259
6158 -259 -130 160 -351 -25 -106 171 -153 -2 22 232 191 200 -28 -147 197 -125 101 -241 120 -188 -454 -185
6180 -185 -78 -49 153 310 -261 74 59 -106 -58 -104 0 92 312 299 2 -173 -350 72 -257 73 -92 399
6202 399 13 -305 -193 -14 84 180 -115 70 -222 162 168 -82 -218 37 215 -64 299 169 114 78 -145 214
6224 214 107 36 184 279 93 -36 -83 -133 85 171 174 59 237 170 6 -272 -219 -139 -197 -86 -58 -112 55 -77
6248 -77 107 -196 -131 -160 -136 -311 -134 -57 -67 -149 349 166 -168 165 -91 137 74 132 -9 -23 99 29 -180 -384
6272 -384 -2 -140 -66 -103 93 78 -180 -25 -419 146 72 -33 -220 237 -334 -107 -237 82 121 -49 -198 -166
6294 -166 -134 -70 -148 241 -259 100 -393 -106 -193 279 234 -204 259 74 223 218 216 -174 -240 89 -189 136 72 -149
6318 -149 151 195 39 43 160 21 -39 -271 260 136 -329 102 -141 118 83 -251 104 115 323 -105 -28 107
6340 107 164 -79 151 -393 -271 -264 -49 40 10 -119 -96 332 81 221 212 -136 -129 -84 -239 90 -69 -63 -334 -35
6364 -35 -153 380 111 -107 -48 67 -62 175 50 22 94 -81 -36 -38 -75 272 -118 127 248 256 -283 43 320
6387 320 -125 70 -288 338 185 153 96 121 -113 -31 -81 237 -218 -284 -146 91 -165 100 224 71 128 143 191
6410 191 88 299 118 -371 -254 -178 116 33 134 -36 209 137 76 -86 -23 -35 -157 231 81 86 -78 57 321
6433 321 302 145 -1 -131 -144 -32 488 270 -21 165 -152 -45 -203 -81 160 133 -293 -117 33 -475 -216
6454 -216 159 186 -195 30 123 144 -294 -420 -177 171 -78 -120 280 -43 -140 89 -312 17 176 -4 230 -260
6476 -260 -39 158 -42 -152 158 104 53 171 34 17 -328 -17 324 142 -26 -253 19 186 -412 48 95
6497 95 5 -64 -43 144 -55 -240 232 226 106 94 89 -42 84 50 -66 -41 133 -314 -90 -77 -39 16 25 112 49 234
6523 234 -44 -25 -92 -164 -133 -144 39 260 -15 -61 -245 84 72 -52 36 -152 -100 -116 116 177 -262 55 -14 -77
6547 -77 -3 172 205 24 205 240 -353 -27 -265 -196 1 -39 229 -98 -34 -34 -53 97 -4 -303 322 284 367 -125
6571 -125 -185 -186 -109 32 108 -214 0 -14 -93 -155 -242 -172 -38 70 -381 234 31 250 142 232 -115 -83 -33 -115 31
6596 31 -59 224 -69 -401 390 336 -171 -47 -68 -451 57 -66 81 170 -670 -120 -73 -58 -389 100 -173 107
6618 107 199 59 -99 -293 6 250 -34 -25 -358 348 107 50 -308 585 -128 184 -114 -135 -161 173 -51 -171
6640 -171 61 112 23 210 -152 -192 -115 391 -42 -205 346 104 52 -225 227 -44 11 -136 151 310 -98 -74
6662 -74 -48 166 64 66 -139 15 191 -96 -95 37 37 296 -167 -20 -82 -295 115 160 103 121 -74 41 -93 -76
6686 -76 -12 -64 -67 4 130 -59 374 -159 123 137 118 -47 72 120 -245 -414 86 28 93 -30 -33 208 -4 -9 153
6711 153 16 -30 -285 259 105 95 -158 -37 -125 1 92 -184 -148 -87 -129 -227 -96 -367 111 175 -160 29 144
6734 144 -49 -276 -125 351 68 -7 4 -133 -394 155 192 -50 -74 -234 109 210 -187 -219 28 112 -109 -20
6756 -20 36 -139 -12 -304 145 336 262 -334 -94 -115 95 58 -4 84 -55 -240 236 -225 -479 16 260 -97
6778 -97 18 -32 73 -293 330 132 30 199 263 146 -130 194 163 45 32 131 259 103 -164 95 192 -80
6800 -80 51 40 202 121 -84 62 75 33 -235 5 -89 99 143 -43 -293 -163 -88 200 210 70 154 -38 -123 -234
6824 -234 174 229 -98 101 34 168 53 96 53 -103 -155 -153 74 -115 -2 -48 30 182 124 -236 32 187 6
6847 6 21 -143 32 239 -12 216 280 267 108 79 118 351 -215 -220 -124 19 -49 8 82 248 -124 -24 209 325
6871 325 117 -238 -148 -98 -159 1 154 -166 96 247 -270 -51 -124 35 -90 -142 -15 -91 -80 278 -26 -283
6893 -283 78 63 276 290 171 -55 -82 180 208 -223 -124 51 -82 74 -69 339 -87 -206 175 -221 -57 -172
6915 -172 165 54 -34 -32 -92 -124 0 -48 -300 -142 -103 -139 209 -201 -126 -107 -217 -7 14 -95 -89 -141 -125 209 -150
6940 -150 20 -32 -125 146 102 -324 -52 319 238 -357 -152 186 -298 -203 -96 244 -81 -2 118 -122 289 60
6962 60 -77 -87 229 42 58 -158 -267 -226 -19 -76 -219 -243 -231 -242 35 129 -23 299 -94 126 -144 136 -328
6985 -328 150 -31 103 -204 75 360 342 184 -35 -202 -69 47 -104 -11 -349 -229 89 434 -141 110 -123
7006 -123 151 37 188 250 294 144 25 103 30 261 -139 -279 28 227 137 73 12 90 281 -341 -30 74 -117
7029 -117 187 -292 -128 -35 -33 -61 -131 149 -79 84 293 77 -192 -128 185 229 8 188 -100 -29 -36 -194 280
7052 280 362 193 -274 409 162 -289 -132 -185 17 -115 54 -295 -55 -91 92 190 -219 -268 334 189 8 -291
7074 -291 -146 -145 238 35 -116 -88 76 -4 -186 -33 -123 75 -73 -158 -261 30 -181 -329 -132 139 -133 -5
7096 -5 47 -133 205 -275 104 69 162 439 149 32 -51 -175 32 274 95 -146 -46 205 -285 72 -234 91
7118 91 -218 391 -287 -35 147 -242 113 180 119 227 48 -52 195 -91 42 135 77 -169 -32 -257 -45 -147
7140 -147 -76 190 -165 343 230 64 -10 4 -88 46 19 223 322 7 120 64 107 123 209 264 -163 -49 122 -275
7164 -275 -30 30 -174 -173 -28 13 -157 -72 44 106 219 -380 153 219 151 9 76 24 37 20 -59 83 223 -148
7188 -148 103 -146 -119 55 0 -217 125 77 -8 -33 -18 -241 106 597 317 -200 44 -324 448 191 -62 30
7210 30 -21 -103 -126 33 14 84 -451 72 -125 49 126 193 277 55 30 174 233 204 -118 -95 -122 99 -115 -116 156
7235 156 -113 -11 -78 136 229 -48 61 -113 57 -131 -275 -9 -123 163 125 98 -321 158 230 -93 -118 -164
7257 -164 293 -282 -62 171 51 150 -11 215 13 -68 66 32 13 -88 200 -89 156 -91 159 46 -53 -69
7279 -69 194 80 -143 -54 -16 208 130 -89 -53 -329 151 310 -194 -323 -58 97 177 94 54 -114 158 -170 144
7302 144 102 -75 80 -166 252 47 120 155 174 -195 55 195 3 -407 -210 -132 31 142 83 107 -241 299
7324 299 -18 -158 -140 80 -195 -108 485 348 -54 -158 34 -356 -28 -100 130 -26 -252 101 -30 241 -366
7345 -366 -213 -139 117 50 -323 142 185 -205 172 -164 191 -184 491 1 11 78 -207 322 19 -79 -196 -42
7367 -42 209 50 163 -10 203 59 330 -52 156 284 149 -22 -286 -368 413 156 26 6 126 -97 295
7388 295 -252 -197 -141 -56 26 27 -270 132 118 21 -16 6 -96 211 -287 -81 -159 90 154 -24 33 -38 -71 -60 -279
7413 -279 -120 31 -24 132 31 46 167 10 481 65 169 353 -137 -180 -240 67 340 75 56 -286 70 -346
7435 -346 292 -36 -292 173 -202 94 271 251 43 85 217 -208 196 -272 89 116 -329 256 176 224 -212 202
7457 202 217 -74 190 -61 11 -278 -115 -83 -104 9 17 -12 72 101 133 217 98 -110 -43 65 -166 -142 -60 227 127
7482 127 98 -13 -1 53 -155 -62 -174 -176 154 -167 58 75 175 -311 48 112 -143 215 -196 -84 -75 171 -221
7505 -221 135 93 -10 -60 -97 -194 -33 -276 -13 502 -53 331 43 160 22 2 16 -488 -102 -11 45 -20 -2
7528 -2 118 -136 87 -33 -116 -19 230 -29 -205 -65 -66 175 87 40 70 44 -211 -59 6 -110 -88 60 -45 -46 -62
7553 -62 301 -32 -88 41 -201 93 -62 22 309 243 -5 -372 -112 354 67 -6 63 14 98 -54 -170 107 -335
7576 -335 -100 13 -167 152 167 -70 -118 251 425 -94 289 90 -282 181 -226 -108 -134 -2 177 267 -77
7597 -77 247 -101 41 105 82 291 -57 456 149 75 -124 -50 -61 95 29 -411 -407 -142 -133 311 -25 68 10 14 -231
7622 -231 -358 -5 -52 62 157 185 153 167 239 164 212 66 -106 -64 149 -125 110 -30 47 -467 263 141 -10
7645 -10 149 -350 26 -192 130 65 -35 399 -139 60 -43 -374 60 256 -109 105 61 238 114 217 15
7666 15 301 172 14 123 -82 -176 153 105 250 119 108 -133 -98 162 34 323 110 212 148 180 1 120
7688 120 1 271 -37 -64 -55 -335 205 -110 -29 -4 72 11 251 163 102 -134 -131 257 -17 203 12 30 440 -152
7712 -152 233 15 144 -126 286 57 10 306 127 59 165 371 -344 202 -119 -217 -62 97 -254 -97 11
7733 11 -18 -233 96 86 184 145 133 -190 -2 90 126 3 -138 167 -19 86 101 -138 -185 0 -80 -12 -81 -100 -13
7758 -13 -275 22 -14 -6 -75 38 29 165 43 17 329 -62 -65 -154 -184 99 -51 -107 -23 -82 -3 7 -278 -5 -249 60
7784 60 80 -118 274 120 108 159 -316 72 -318 -138 236 184 -48 80 -107 24 74 9 -180 -109 29 -46 199
7807 199 74 -67 -96 -204 138 124 -124 60 166 -123 319 202 146 155 219 -39 145 -73 186 45 -107 38
7829 38 -23 124 30 -53 216 188 -110 234 221 258 -83 121 267 29 -103 123 21 -246 -207 52 -224 122 54
7852 54 -23 -30 -179 -186 80 -234 -43 125 304 -98 21 24 17 118 -18 129 122 155 -126 29 326 -42 -131 -56 -55 -277
7878 -277 135 -94 -204 102 137 -62 65 -13 -261 57 101 -235 121 -338 -84 -55 -2 94 -256 285 -274 43
7900 43 137 -140 -204 299 -44 -35 -76 231 200 -113 -100 92 -139 -46 138 -232 -89 216 83 -30 -278 -62 98
7923 98 99 -23 46 173 208 50 143 491 96 26 16 -187 -18 181 -37 101 -15 -131 16 4 -11 -384 -15
7946 -15 -151 -370 -61 -742 80 -8 133 -147 -455 -105 -132 114 -351 -234 93 455 -189 -266 46 44 120 -116
7968 -116 -358 -134 -351 45 -134 207 290 -50 167 -319 -77 -301 13 -131 242 -37 -18 29 0 11 -94 200
7990 200 51 155 5 -80 -286 -16 146 -135 14 52 145 158 214 80 -205 66 365 -191 -18 -365 -112 -52
8012 -52 319 33 -127 -258 -29 30 -272 223 -631 -77 -1 301 51 256 -38 -284 296 120 -39 224 34
8033 34 280 110 278 -184 86 148 32 166 -57 155 -147 262 -283 -9 208 262 160 163 -290 7 238 57
8055 57 -90 -107 -12 -35 -78 20 -217 54 -268 109 160 91 -162 144 1 -56 79 -478 -135 -134 -124 279 81 -278
8079 -278 -238 175 134 219 -123 290 222 115 -187 -303 138 -99 130 -218 208 -96 -326 417 122 151 287 46
8101 46 -257 53 219 -95 -81 -305 -58 200 417 49 91 -82 221 11 -26 25 9 -142 -147 278 42 -96 299
8124 299 66 -32 235 -387 96 -21 -238 -162 43 171 86 96 147 -93 -632 199 116 -239 18 -183 -22 293
8146 293 -80 -85 -302 65 253 -188 -55 -323 -7 130 194 -15 65 -120 193 55 -204 18 67 481 1 -129
8168 -129 -148 51 -82 186 -8 254 -76 -160 453 -147 -223 18 -142 -73 -143 39 27 156 137 -141 164 -278
8190 -278 -131
8191a31
##END NTUPLES=NMR FID
##END=
