##TITLE=1H ikalashn
desoxy DHA
18.11.2024
##JCAMPDX= 6.0         $$ Bruker NMR JCAMP-DX V2.0
##DATA TYPE= NMR FID
##DATA CLASS= NTUPLES
##ORIGIN= UXNMR, Bruker Analytische Messtechnik GmbH
##OWNER= root
$$ TOPSPIN		Version 1.3
$$ 2024-11-18 13:56:55.140 +0400  Irina@DPX200
$$ Compression mode = diff/dup
##.OBSERVE FREQUENCY= 200.131300845
##.OBSERVE NUCLEUS= ^1H
##.DELAY= (6, 6)
##.ACQUISITION MODE= SIMULTANEOUS
##.ACQUISITION SCHEME= undefined
##.AVERAGES= 128
##.DIGITISER RES= 18
##SPECTROMETER/DATA SYSTEM= spect
##.PULSE SEQUENCE= zg
##.SOLVENT NAME= CDCl3
##.SHIFT REFERENCE= INTERNAL, CDCl3, 1, 17.49637
##AUDIT TRAIL= $$ (NUMBER, WHEN, WHO, WHERE, WHAT)
$$ ##TITLE= Audit trail, TOPSPIN		Version 1.3
$$ ##JCAMPDX= 5.01
$$ ##ORIGIN= Bruker BioSpin GmbH
$$ ##OWNER= Irina
$$ $$ F:/spectra/data/iren/nmr/1H/4/audita.txt
$$ ##AUDIT TRAIL=  $$ (NUMBER, WHEN, WHO, WHERE, VERSION, WHAT)
(   1,<2024-11-18 13:56:29.046 +0400>,<Irina>,<DPX200>,<TOPSPIN 1.3>,
      <created by zg
	started at 2024-11-18 13:48:05.562 +0400,
	POWCHK disabled, PULCHK disabled
       configuration hash MD5:
       BE 6D 3F 07 2A EA 11 49 91 17 2B D3 AF B3 58 0D
       data hash MD5: 16K
       3C D9 0A D2 83 CB 30 25 3C AA B9 86 CD 8E DD D2>)
$$ ##END=
$$ 
$$ $$ hash MD5
$$ $$ B6 2C 01 04 0D BC 15 0E 99 EE 58 BB F6 7A A9 65
##$RELAX= 
##$RELAX= 
##$RELAX= 
##$RELAX= 
##$RELAX= 
##$RELAX= 
##$RELAX= 
##$RELAX= 
##$RELAX= 
$$ Bruker specific parameters
$$ --------------------------
##$DU= <F:/spectra>
##$EXPNO= 4
##$NAME= <1H>
##$PROCNO= 1
##$TYPE= <nmr>
##$USER= <iren>
##$AMP= (0..31)
100 100 100 100 100 100 100 100 100 100 100 100 100 100 100 100 100 100 
100 100 100 100 100 100 100 100 100 100 100 100 100 100 
##$ANAVPT= -1
##$AQSEQ= 0
##$AQ_mod= 1
##$AUNM= <au_zg>
##$AUTOPOS= <>
##$BF1= 200.13
##$BF2= 200.13
##$BF3= 200.13
##$BF4= 200.13
##$BF5= 200.13
##$BF6= 200.13
##$BF7= 200.13
##$BF8= 200.13
##$BYTORDA= 1
##$CFDGTYP= 0
##$CFRGTYP= 5
##$CHEMSTR= <none>
##$CNST= (0..63)
1 1 145 1 1 1 1 1 1 1 1 1 1 1 1 1 1 1 1 1 1 1 1 1 1 1 1 1 1 1 1 1 1 1 
1 1 1 1 1 1 1 1 1 1 1 1 1 1 1 1 1 1 1 1 1 1 1 1 1 1 1 1 1 1 
##$CPDPRG= <>
##$CPDPRG1= <>
##$CPDPRG2= <>
##$CPDPRG3= <>
##$CPDPRG4= <mlev>
##$CPDPRG5= <mlev>
##$CPDPRG6= <mlev>
##$CPDPRG7= <mlev>
##$CPDPRG8= <mlev>
##$CPDPRGB= <>
##$CPDPRGT= <>
##$D= (0..63)
0 2 0 0 0 0 0 0 0 0.06 0 0.03 0 0 0 0 0.0002 0 0 0 0 0 0 0 0 0 0 0 0 0 
0 0 0 0 0 0 0 0 0 0 0 0 0 0 0 0 0 0 0 0 0 0 0 0 0 0 0 0 0 0 0 0 0 0 
##$DATE= 1731923786
##$DBL= (0..7)
120 120 120 120 120 120 120 120 
##$DBP= (0..7)
150 150 150 150 150 150 150 150 
##$DBP07= 0
##$DBPNAM0= <>
##$DBPNAM1= <>
##$DBPNAM2= <>
##$DBPNAM3= <>
##$DBPNAM4= <>
##$DBPNAM5= <>
##$DBPNAM6= <>
##$DBPNAM7= <>
##$DBPOAL= (0..7)
0.5 0.5 0.5 0.5 0.5 0.5 0.5 0.5 
##$DBPOFFS= (0..7)
0 0 0 0 0 0 0 0 
##$DE= 6
##$DECBNUC= <off>
##$DECIM= 32
##$DECNUC= <off>
##$DECSTAT= 4
##$DIGMOD= 1
##$DIGTYP= 9
##$DL= (0..7)
0 120 120 120 120 120 120 120 
##$DP= (0..7)
150 150 150 150 150 150 150 150 
##$DP07= 0
##$DPNAME0= <>
$$ [...]
##$SW= 21.9926040160658
##$SWIBOX= (0..15)
0 0 2 0 0 0 0 0 0 0 0 0 0 0 0 0 
##$SW_h= 4401.40845070422
##$TD= 16384
##$TD0= 1
##$TE= 300
##$TE2= 300
##$TE3= 300
##$TEG= 300
##$TL= (0..7)
0 120 120 120 120 120 120 120 
##$TP= (0..7)
150 150 150 150 150 150 150 150 
##$TP07= 0
##$TPNAME0= <>
##$TPNAME1= <>
##$TPNAME2= <>
##$TPNAME3= <>
##$TPNAME4= <>
##$TPNAME5= <>
##$TPNAME6= <>
##$TPNAME7= <>
##$TPOAL= (0..7)
0.5 0.5 0.5 0.5 0.5 0.5 0.5 0.5 
##$TPOFFS= (0..7)
0 0 0 0 0 0 0 0 
##$TUNHIN= 0
##$TUNHOUT= 0
##$TUNXOUT= 0
##$USERA1= <user>
##$USERA2= <user>
##$USERA3= <user>
##$USERA4= <user>
##$USERA5= <user>
##$V9= 5
##$VALIST= <valist>
##$VCLIST= <CCCCCCCCCCCCCCC>
##$VD= 0
##$VDLIST= <DDDDDDDDDDDDDDD>
##$VPLIST= <PPPPPPPPPPPPPPP>
##$VTLIST= <TTTTTTTTTTTTTTT>
##$WBST= 1024
##$WBSW= 25
##$XGAIN= (0..3)
0 0 0 0 
##$XL= 0
##$YL= 0
##$YMAX_a= 2979623
##$YMIN_a= -2244415
##$ZGOPTNS= <>
##$ZL1= 120
##$ZL2= 120
##$ZL3= 120
##$ZL4= 120
##$ABSF1= 10
##$ABSF2= 0
##$ABSG= 5
##$ABSL= 3
##$ALPHA= 0
##$AQORDER= 0
##$ASSFAC= 0
##$ASSFACI= 0
##$ASSFACX= 0
##$ASSWID= 0
##$AUNMP= <proc_1d>
##$AXLEFT= 0
##$AXRIGHT= 0
##$AXTYPE= 0
##$AXUNIT= <>
##$AZFE= 0.1
##$AZFW= 0.1
##$BCFW= 1
##$BC_mod= 2
##$BYTORDP= 1
##$COROFFS= 0
##$CY= 7568.61572265625
##$DATMOD= 1
##$DC= 2
##$DFILT= <>
##$DTYPP= 0
##$F1P= 17.9538593292236
##$F2P= -4.03888763876832
##$FCOR= 0.5
##$FTSIZE= 32768
##$FT_mod= 4
##$GAMMA= 1
##$GB= 1
##$INTBC= 1
##$INTSCL= 1
##$ISEN= 128
##$LB= 0.02
##$LEV0= 0
##$LPBIN= 0
##$MAXI= 945.577
##$MC2= 0
##$MEAN= 0
##$ME_mod= 0
##$MI= -402.1523
##$NCOEF= 0
##$NC_proc= 0
##$NLEV= 6
##$NOISF1= 8.587773
##$NOISF2= 6.764455
##$NSP= 1
##$NTH_PI= 0
##$NZP= 0
##$OFFSET= 17.49637
##$PC= 1
##$PHC0= 121.1868
##$PHC1= 5.902561
##$PH_mod= 0
##$PKNL= yes
##$PPARMOD= 0
##$PPDIAG= 0
##$PPIPTYP= 0
##$PPMPNUM= 100
##$PPRESOL= 1
##$PSCAL= 0
##$PSIGN= 0
##$REVERSE= no
##$SF= 200.13
##$SI= 32768
##$SIGF1= 18.5376
##$SIGF2= -6.396296
##$SINO= 400
##$SIOLD= 32768
##$SREGLST= <1H.CDCl3>
##$SSB= 3
##$STSI= 0
##$STSR= 0
##$SW_p= 4401.40845070422
##$SYMM= 0
##$S_DEV= 0
##$TDeff= 0
##$TDoff= 0
##$TI= <>
##$TILT= no
##$TM1= 0
##$TM2= 0
##$TOPLEV= 0
##$USERP1= <user>
##$USERP2= <user>
##$USERP3= <user>
##$USERP4= <user>
##$USERP5= <user>
##$WDW= 1
##$XDIM= 8192
##$YMAX_p= 0
##$YMIN_p= 0
$$ End of Bruker specific parameters
$$ ---------------------------------
##NTUPLES= NMR FID
##VAR_NAME=  TIME,          FID/REAL,        FID/IMAG
##SYMBOL=    X,             R,               I
##VAR_TYPE=  INDEPENDENT,   DEPENDENT,       DEPENDENT
##VAR_FORM=  AFFN,          ASDF,            ASDF
##VAR_DIM=   8192,          8192,            8192
##UNITS=     SECONDS,       ARBITRARY UNITS, ARBITRARY UNITS
##FACTOR=    0.0002272,     1,               1
##FIRST=     0,             0,               0
##LAST=      1.8609952,     -484,            64
##MIN=       0,             -2244415,        -2244415
##MAX=       1.8609952,     2979623,         2979623
$$ Real data points
##PAGE= N=1
##DATA TABLE= (X++(R..R)), XYDATA
0@%%%%%%%%%%%%%%J28k56K56k56K56l57M85n12O37p65Q89j018J153j405J623j832
30i74K097k402K697l057L467l893M390m935N533o190O903p676Q525r456J0468
45E497j1573J2782j4107J5556j7142J8887k0809K2929k5276K7890l0832L4153
57A7955l7929M2287m7361N3352o0572O9485q0782R5641j16203J46789j97516L01373
69A86519q95227K219088J091995l726316j120474K586704J689159k121272j485033
78a574857J431446J513547j104521j241787N73512R85757l60211m52257L01735
87G2364K27050l80839K3831L34539k61306m77892N50885P44766n80683j096329
97h43614L81974J159308j53843j110319K3494R12037j13967r80505L9558R61804
$$ y = [0, 0, 0, 0, 0, 0, 0, 0, 0, 0, 0, 0, 0, 0, 0, 128, -128, 128, -128, 128, -229, 256, -256, 381, -384, 505, -513, 640, -765, 858, -974, 1123, -1279, 1418, -1639, 1828, -2065, 2325, -2610, 2923, -3267, 3636, -4040, 4485, -4971, 5497, -6076, 6706, -7401, 8155, -8987, 9900, -10909, 12020, -13256, 14634, -16198, 17955, -19974, 22313, -25048, 28304, -32268, 37217, -43565, 52076, -64127, 82662, -114854, 186519, -708708, 1510380, 2602375, -1123941, -2244415, 342289, 2031448, -89824, -1574857, -143411, 1370136, 265615, -976172, -402660, 583097, 222886, -229371, 72364, 299414, -81425, -57594, 276945, 15639, -462253, 88632, 833398, 252715, -843614, -461640, 697668, 543825, -566494, -543000, 369037, 255070, -725435, -685877, 275927]
107B75927J29088p44533n1089O62745M8634m88638J94916O37322j63125p04917
117b03670J1940N37283p0930n19267L1165L75474j29311l59698J46546K65431
127H4963k27952j99979L68241K16991m67535k65418N57750L87837m84408k98617
137c28127O32703L87946p39080n84441O89385P28890n99785q75196L88873Q43214
147E44382k63732q21592J63989Q23121J2858p22616j63292N21999J89025l56366
157g2224j53221K16722M9502j83989J241J54996k7828q4782J36651J45663j42008
168D0723j67655J43162J95547q4328j35922J02251R9652j75578j59261J55616
178A4207J99710j27036k51636j8333J23542j9635j11713K3995J24210K7632o4294
$$ y = [275927, 405015, -339518, -390607, 272138, 320772, -167866, 27050, 664372, 501247, -203670, -191730, 345553, 274623, -244644, -213479, 161995, 32684, -327014, -180468, 84963, -142989, -342968, 25273, 242264, -225271, -490689, 67061, 454898, -29510, -328127, 304576, 692522, -46558, -630999, 58386, 787276, 187491, -687705, -298832, 544382, 280650, -540942, -376953, 446168, 459026, -263590, -426882, 95117, 284142, -72224, -225445, -8723, 40779, -143210, -141969, 13027, -14801, -99583, 37068, 182731, 40723, -126932, 16230, 211777, 127449, -8473, 93778, 193430, 17852, -141409, 14207, 213917, 86881, -164755, -183088, -59546, -79181, -190894, -166899, -42689, -15057, -79351]
189g9351j8057P3190J10555P2787k0146q3010j6529P0387O848r5448j7985J13847
201A17088O302j78745q3181J54271Q6465j78885j34258J70031J58324j79222k32121
212b93931J30385K98931M854k37865n1796J89135J03361j00662p9058O5936P2449
223A01739l3754p2554k1107N1411O9417O63q7394o1509O7044Q8610o4858j35807
235i8099N193J12057r563j37474l1918J21233N4416q7254l4748J01621P6234n8225
247A3473o0092O4208Q4905j5807p2339o639P6378N6272m4175r2706j9234Q2988
259F7232L4653j21357j22675N5134J13724o9915j61424M5456K05158J3501j93623
270a34136l6820K16739J07563j63263r9417J71171J36794j34077j43268J20807
$$ y = [-79351, -97408, -24218, 86337, 159124, 138978, 55968, 39439, 109826, 116674, 21226, 3241, 117088, 123390, -55355, -138536, 15735, 102200, -76685, -210943, -40912, 117412, -61810, -293931, -163546, 135385, 140239, -97626, -149422, 39713, 143074, 42412, -36646, 29290, 101739, 67985, -4569, -25676, 25735, 95152, 95815, 8421, -53088, 13956, 102566, 37708, -98099, -92906, 19151, 9588, -127886, -159804, -38571, 15845, -71409, -106157, -4536, 71698, 13473, -46619, 17589, 102494, 86687, 14348, 7709, 84087, 140359, 96184, 3478, -15756, 67232, 101885, -19472, -142147, -87013, 26711, -43204, -204628, -159172, 45986, 59487, -134136, -170956, 45783, 153346, -9917, -109334, 61837, 198631, 64554, -78714, 42093]
280D2093J66014q0712j76869J7367J27140l1345j42603j5474J03192K0081j01698
291g2814o3136M4899P0781J6658l5984k6189K4822O0959J0708n1791P02Q9273
303F8888L6747r1851o2856R4597R3600p9003j05223P4211J10440q8944j60477
314a09871L8397J60731k2838j79050l1161J42536M4329j28262o1762J06228Q7551
325D6828n9235p9347K6734Q0805M5757k44k6690j5270L6493N9108j7414q6055
337A1470j0743Q6763R558j26915o5906R9249N3767j26121r4217J09776J07587
348E4268j12193j39149R7050J86368j9919j53710O308J57827M8110j06023m2141
359b3204Q6243O1051n5793o8638P398L7526M421l1010l7500j7040K1438J4037
$$ y = [42093, 208107, 127395, -49474, -32107, 95033, 63688, -78915, -94389, 8803, 28884, -72814, -135950, -91051, -20270, -3612, -39596, -65785, -40963, 19996, 30704, -21087, -20385, 68888, 105635, 13784, -49072, 45525, 139125, 60122, -45101, 29110, 139550, 50606, -109871, -71474, 89257, 66419, -112631, -143792, -1256, 43073, -85189, -146951, -40723, 46828, -12407, -91754, -65020, 15785, 61542, 61298, 34608, 19338, 55831, 114939, 97525, 11470, 727, 87490, 97048, -29867, -95773, 3476, 57243, -68878, -163095, -53319, 54268, -57925, -197074, -100024, 86344, 66425, -87285, -80977, 76850, 124960, 18937, -23204, 63039, 124090, 68297, -341, 7057, 44583, 49004, 17994, -19506, -36546, -15108, -1071]
371a071l8755m3331L3756O8057k2175q6183M295R3938K6249p1059j3653P8870
383B8938K7540o6774j9578Q7199M3710o8010m6263N9391M1590n6866m3230M3749
395C1396K9800o1526n5671K3449K2314m0266k4116L8288J1519n9330j2635Q0522
407a6256N1981n0562l9478P4324O9436m1684n7576M7586P9951k1290q3407j2558
419D67M3221n73m6781j4603J9618k1425n1560O40M6659J3360l9317j5910L6266
432b9938L2536j8453j6276L0877M1996L325l4058j5493J9382L6193R971j8896
444D1166l2967l225K4691P049l0719k4042K4509K7925l3713o7259K192O4625J9147
457A9379o2324l7349M7300L9359m4378l6678O1952P5446k7585p3557J8430Q7851
$$ y = [-1071, -39826, -83157, -49401, 18656, -3519, -89702, -85407, 8531, 34780, -36279, -49932, 28938, 56478, -10296, -29874, 57325, 101035, 33025, -13238, 46153, 87743, 30877, -12353, 31396, 61196, -330, -56001, -32552, -10238, -50504, -74620, -36332, -24813, -84143, -96778, -16256, 35725, -14837, -54315, 20009, 89445, 47761, -9815, 37771, 117722, 96432, 13025, 467, 43688, 43115, -3666, -18269, 1349, -20076, -71636, -70996, -24337, -10977, -50294, -66204, -29938, 2598, -15855, -32131, -1254, 40742, 44067, 10009, -5484, 13898, 50091, 60062, 41166, 8199, 4974, 29665, 36714, 5995, -18047, 6462, 34387, 674, -66585, -64393, 232, 19379, -42945, -80294, -32994, 6365, -38013, -74691, -12739, 62707, 35122, -38435, -20005, 67846]
469F7846J3868n8700r004N9547O326p2502l9605M8142L6881m0444o1423j1248
481f0316K2499N022j1285j1775L464K6073K6191j3482l5665J7457Q2988K9666
493H0837o3770l8732O0693M5447o0010n2614O6437O4591p5813j07141L8081J01703
505E9709l0580j01194J8422R7749k4577j13923M251J22832L1497j02247m8174
516h6235P5672N1648m9741l2713N4999M0400l0607k7426J6752J0467j0496K2750
528C5470K9373k9867n2702J4657L7703k5456m7733L0763M3697n7100q6471L2204
540g5462R4542j1470q0030J5924Q6288j1069q4414K4221J23048K0973j02302l5554
552c5305Q2499M1392o5949l9162N4029K4986o1875m6853K7772J9730k4684n932
$$ y = [67846, 81714, 23014, 14010, 73557, 79883, 7381, -32224, 15918, 52799, 12355, -49068, -60316, -37817, -32795, -44080, -55855, -52391, -26318, -127, -13609, -49274, -31817, 51171, 80837, 17067, -21665, 39028, 84475, 24465, -28149, 38288, 102879, 27066, -80075, -41994, 59709, 29129, -72065, -53643, 44106, 19529, -94394, -90143, 32689, 64186, -38061, -86235, -10563, 41085, -8656, -41369, 13630, 54030, 23423, -4003, 12749, 23216, 12720, 35470, 64843, 34976, -17726, -3069, 34634, 9178, -38555, -7792, 35905, -21195, -107666, -75462, 19080, 7610, -72420, -56496, 29792, 18723, -65691, -41470, 81578, 102551, 249, -35305, 47194, 88586, 22637, -16525, 37504, 62490, 615, -46238, -18466, 1264, -23420, -29352]
564b9352K5283j7181m5640R799N2678O723l0599J8206M7667k0040n7986K4783
576a5659Q2242L239p0836j8640N0850J065n3739Q929P2537K811q7647k8833O1653
589G972L3772n4003l5944L4981K1650l8026k3688K9402K0844j1894M172K1405
601A0643j4661l5920K2667N9793J982m4982N508N1138r424n7063P711P0489L140
614G1021q6342l4907N6192J9721o3631l2908O1070L2736p0755n3575O2487Q0497
626D1606k4680o1776J8157O8329L412n2453q135M6169L3032k6853l3570N72K2957
639B6767P578j5421k4995r083R633j352l1675j8432L2763M2002j4700n0667L517
652d4065N5718J2706m1459j5436M6217K6309m2089l5450M1596N6946j6947n0562
$$ y = [-29352, -4069, -21250, -66890, -57091, -4413, 2310, -28289, -10083, 37584, 17544, -40442, -15659, 66583, 69822, -1014, -19654, 31196, 32261, -21478, -12549, 59988, 62799, -24848, -53681, 7972, 41744, -12259, -48203, -13222, 8428, -29598, -53286, -23884, -3040, -14934, -10762, 10643, -4018, -39938, -17271, 42522, 44504, -478, 5030, 56168, 46744, -10319, -2608, 67881, 71021, -15321, -50228, 5964, 25685, -37946, -70854, -9784, 22952, -47803, -101378, -38891, 41606, 16926, -44850, -26693, 41636, 45048, -7405, -15540, 30629, 63661, 36808, 3238, 3810, 26767, 34345, 18924, -6071, -15154, -5521, -6873, -38548, -56980, -24217, 17785, 3085, -47582, -44065, 11653, 24359, -17100, -32536, 13681, 39990, -2099, -37549, 4047, 60993, 44046, -6516]
664f516M1M7035K848m3293j7293L3546J8488l4429m1048O241L4648L307l3188
677b9613j6410K4052K6497j0132l2711Q63M2984K3245k4120l1004K1154M8702
689D3507N898k6270n67K3948o291l7029j0973K8513N80m6087k8558L2203L1278
702A0152k7685m0701J8664N1096j914m9162j5003M7699L7342j6772k8858J6068
714I26L8460L557k7131m632K1543R291k8360k8830J0422J9945j1209k8824J196
727b3646K7932k83l5229j2609L6248K5935k4875l6756J0034L5476Q668k3374o046
740a8525K3845K0625m640j1796L256J9044P627j6118k2130r92J9290k411k8157
753a1082j1743K2586J8112l2624l7555J8362M1362q198m9013k657N0629J4698
$$ y = [-6516, -6475, 40560, 43408, 115, -17178, 16368, 34856, 427, -40621, -34380, 268, 3575, -29613, -46023, -21971, 4526, -5606, -38317, -37454, 5530, 28775, 4655, -26349, -5195, 43507, 49405, 23135, 22568, 46516, 40225, 3196, -7777, 20736, 21316, -24771, -53329, -21126, 10152, -17533, -58234, -39570, 11526, 9612, -39550, -54553, -6854, 30488, 13716, -15142, 926, 39386, 42943, 15812, 11180, 32723, 42014, 13654, -15176, -4754, 15191, 3982, -24842, -23646, 4286, 4003, -31226, -43835, -7587, 18348, -6527, -43283, -33249, 2227, 10895, -12479, -18525, 5320, 25945, 21305, 9509, 12765, 31809, 39436, 23318, 1188, 196, 19486, 17075, -11082, -22825, -239, 17873, -14751, -52306, -33944, 7418, -780, -49793, -52450, -1821, 12877]
765A2877l1709o113N0763K8940l5575k4691L1022K8965k5225l6141J3982K2815
777B9910j6540l0237K366J6736m347j3872k061l299r320M665J8862l239j9283
790b9659Q783L2693K819k9453M359M4028R869l6619j6576L0808J4301k9837j5443
803i927K6133J3266l2815j9135K4176J8910k6244k3968J5878J3531j5003j9734
815c4932J1564J2620m559J695J0390L40p888J8683K7474j1871k6059J3351L4475
828D5283j3460m2003O523M4089p149n2480o944M2286O38n2604j3210M5478Q625
841E072m5533j0954N0477K5595m1052j8083M4218L3492k9458k8762K7605K8341
853D0958j7959k6690J4009J6109j5959j4426J0267J57j5573l102J8041p171k5449
$$ y = [12877, -18832, -24945, 25818, 54758, 19183, -5508, 25514, 54479, 29254, -6887, 7095, 29910, 13370, -16867, -14501, 2235, -2112, -15984, -18045, -21344, -30664, -25999, -7137, -10376, -29659, -20876, 11817, 14636, -14817, -10458, 33570, 43439, 6820, -9756, 21052, 35353, 5516, -9927, 16206, 29472, -3343, -22478, 1698, 20608, -5636, -29604, -13726, -195, -15198, -34932, -23368, -10748, -15307, -13612, -3222, -2882, -10770, 7913, 35387, 23516, -2543, 10808, 45283, 31823, -10180, -3657, 40432, 33283, -19197, -26141, 16145, 16783, -35821, -49031, -3553, 5072, -40461, -51415, -938, 24657, -16395, -34478, 9740, 43232, 13774, -14988, 12617, 40958, 22999, -3691, 10318, 26427, 10468, -3958, 6309, 6466, -9107, -12209, 5832, -1339, -26788]
866b6788K068K7658l058l0490L186L6300R24l9790J242M7264J6143m1891r863
879a7095M0921J7213m0302j9931M0062K8941l1601l6948J9280K9767j7480l2575
891a9748J506J7515m152k3182n246R803J2435Q789o60j3725l659K4026K0620j2342
905A1980j7225J9527K6486j9564l1730J4780L6008j1465m3140l277L2336k386
917A2330m1861o886M2209J4807m2641k6285L0957L2786j5173k4192J3063L0853
929A9967m791k4394k845K4763J2208j0534j4276m879J0243J0344J052j0132j900
942D826R942j014k3330j2598J4118J8896j1914k2827K626J7245k657j8621N169
955b0139K5421N522k1744j1263K1504K3911l321j2411O722J4450m765k0174q941
$$ y = [-26788, -24720, 2938, -120, -30610, -27424, 8876, 9800, -29990, -28748, 18516, 34659, -7232, -17095, 23826, 41039, 737, -19194, 20868, 49809, 18208, -18740, 540, 30307, 12827, -19748, -18242, -727, -4879, -28061, -33307, -23504, -11069, -2280, -2940, -16665, -20324, 3702, 24322, 11980, -5245, 14282, 40768, 21204, -10526, 4254, 40262, 28797, -14343, -17620, 14716, 12330, -29531, -36417, 5792, 20599, -22042, -48327, -17370, 15416, 243, -23949, -10886, 19967, 15176, -9218, -12063, 12700, 24908, 14374, 98, -4781, 5462, 15806, 16858, 6726, 4826, 14768, 13754, -9576, -22174, -8056, 10840, -1074, -23901, -21275, -4030, -6687, -25308, -20139, 5282, 10804, -10940, -22203, -699, 23212, 19891, 7480, 14202, 28652, 23887, 3713, -5228]
968e228J5841J5925j2812k6660j0594J1671R415j0727q537R121J1770r301j6282
981b6398P293K4770P672r913k650Q854K733j2039r75K0702J1495j3967k3818L7
995f204J1297M439p343o832N061P80j0176r820K642J5188J0836r965k0527m939
1009b5563J8205J2592p218m720J3588Q546j3360j7796J4711K8593J233k2251r598
1022c038J0720Q341j3115n108J0758O426j5551k1795j433J5327L915o058n513
1035a6124L702M947m908k574R705J9186M760r414j3061N286J4370Q256j0978p676
1049E477Q682M87j4687j3110P387J5451q58k4324p907Q630Q185n314k391Q951
1063e341R738p216j0152M128J8003O685q627p176R903O278j1190r807J1702J5400
$$ y = [-5228, 10613, 26538, 13726, -12934, -23528, -11857, -2442, -13169, -21706, -12585, -815, -10116, -26398, -19105, 5665, 13337, 3424, 774, 9628, 12361, 322, -653, 20049, 31544, 17577, -6241, -6204, 5093, 9532, 2189, -4643, 418, 1198, -8978, -18798, -16156, -968, 9868, -97, -20624, -25563, -7358, 5234, -1984, -6704, 6884, 15430, 2070, -15726, -1015, 27578, 28811, 6560, -3038, 7682, 16023, 2908, -2200, 8558, 14984, -567, -22362, -23795, -8468, -4553, -10611, -16124, -12422, -7475, -12383, -14957, -5252, 13934, 18694, 9280, -3781, 1505, 15875, 24131, 13153, 5477, 14159, 14646, -41, -13151, -5764, 9687, 8829, -15495, -23402, -14772, -6587, -11901, -14292, -5341, 4397, -2819, -12971, -8843, 9160, 15845, 7218, 42, 9945, 16223, 5033, -4774, 6928, 22328]
1077B2328o189j8525r991J0872J0466n676j2054P48P742l914j0461m108J1155
1090g607J0712k613j1642k315J0522P221m733M37J0060J0346r670j1666K333J4864
1104A6249N495j4481q333P563L533j5028j1847Q832J3948p955k0429l738J7042
1117i149O945j0635m44J2651P955p099m251Q298J0520N342o906k768k632r55L183
1132A0055k476m234j798m31m040q006k896P296M511p257p825P224R871p786l245
1147a1037J1503J1923n951j4689O298J7010k82j5221k003J4114L359j4131o366
1160e473J1063P694q253r300n83M885m416m710M977k565l100j206O021j391m665
1175a1022O035O495q56m431N371R345k604n350N615J2343n112j5354K40J3844
$$ y = [22328, 16139, -2386, -12377, -1505, 8961, 3285, -8769, -8021, -279, -4193, -14654, -18762, -7607, 3105, 492, -11150, -13465, -2943, 4278, -455, -18, 10042, 20388, 10718, -948, 1385, 16249, 21744, 7263, -1070, 6493, 10026, -5002, -16849, -8017, 5931, -2024, -22453, -26191, -9149, -2204, -12839, -13283, -632, 7323, 224, -4027, 4271, 14791, 20133, 13227, 10459, 7827, 6872, 10055, 7579, 3345, 1547, 1116, -2924, -10930, -13826, -6530, -2019, -9276, -17101, -9877, -6, -7792, -11037, 466, 12389, 6438, -8251, -1953, 15057, 14775, -446, -2449, 11665, 15024, 893, -5473, 5590, 13284, 5031, -4269, -4852, 33, -4383, -9093, -4116, -6681, -9781, -10987, -4966, -6357, -11022, -4987, 1508, 652, -3779, 1592, 10937, 8333, 2983, 8598, 20941, 15829, 475, 715, 14559]
1189A4559P58k0210r761J2440O009j5215j1440Q903J1209n023q645O089J3082
1202B755o28p956L635Q242O536l757K46k12k50k500J953q19m428r30k582n14o965
1219h174J929M259R40j1192L82Q986K187q324j876J2474O145p237r882Q700J0637
1234I954k105j1323N362J0704k272r258j455R239K673q174n27j074k251n477Q98
1249e086L767n204n354J171L795j202r34M762K909q35j378P456L409l566j473
1264B237Q610P250j0551p325N868Q700n853j6502K631R090p609j1941l167J4759
1278c803N287j1646k262R597O043p361j058Q913O228o648n343O395P607m480n222
1293B247M044L700m042n882J966k145j890J362J368m166r288M606Q715m00p790
$$ y = [14559, 15317, -4893, -14654, -2214, 3795, -11420, -22860, -13957, -2748, -7771, -16416, -10327, 2755, 2127, -5829, -2194, 6048, 12584, 8827, 9073, 8861, 8611, 6111, 8064, 7245, 2817, 1887, -695, -1209, -8174, -6245, -1986, -1046, -12238, -11856, -2870, -683, -9007, -10883, 1591, 7736, 499, -9383, -683, 9954, 7849, -3474, 1888, 12592, 10320, 1062, -393, 8846, 11519, 3345, 2818, 1744, -507, -5984, -5086, -1319, -6523, -11877, -10706, -6911, -8113, -9047, -4285, -1376, -2211, -3589, 3867, 7276, 3710, 2237, 10847, 18097, 7546, 221, 6089, 14789, 8936, -7566, -4935, 4155, -3454, -15395, -18562, -3803, 1484, -10162, -12424, -2827, 3216, -4145, -5203, 3710, 9938, 3290, -2053, 4342, 11949, 7469, 2247, 6291, 9991, 5949, 67, 2033, -112, -2002, -640, 728, -3438, -12726, -8120, 595, 195, -7595]
1308g595r32J0202K335j2062k819J3156Q385r919p952Q198R949m319n170M237
1322E694P941n622j0794K032M689l449o116J507K004k703n308K795K139Q41r96
1337e346J218K127l219k99P852M604l814j269O506K333n003m469Q137K871j1293
1352I36p276M103O483m325j0806L895Q278m729p436M344N348Q77n181q77O978
1367F12M47k532K94M818M853l344k653L081k169J556J30N43o591l436N916J338
1383B863n168o442O023O750q558r838O639J3200m783j2732L166J1880K740r070
1397c330j632J1121M373p406k644P659J793n595m327L354J10l752l531L017J530
1412G40l949k495N64l14k495J693L396j29k216K968L914J563l102K231Q799k070
$$ y = [-7595, -8527, 1675, 4010, -8052, -10871, 2285, 10670, 751, -7201, 997, 10946, 6627, 1457, 5694, 13635, 8013, -2781, -749, 3940, 491, -5625, -4118, -2114, -4817, -10125, -7330, -5191, -4350, -5346, -4128, -2001, -5220, -5519, 2333, 6937, 3123, 1854, 8360, 10693, 5690, 1221, 9358, 12229, 936, -6340, -2237, 4246, -79, -10885, -6990, 1288, -3441, -10877, -6533, -1185, -308, -5489, -6366, 612, 1059, -1473, -1179, 3639, 8492, 5148, 2495, 5576, 3407, 4963, 5093, 5636, -955, -4391, 1525, 2863, -2305, -8747, -2724, 4026, -4532, -14370, -7731, 5469, 686, -12046, -8880, 3000, 5740, -3330, -4962, 6159, 10532, 3126, 482, 8141, 9934, 4339, 12, 3366, 3476, -276, -3807, -790, 740, -3209, -5704, -5140, -5454, -7949, -6256, -2860, -2989, -5205, -2237, 1677, 3240, 138, 2369, 11168, 9098]
1428I098r276k09P363J774o921l450L590J318n213n230O179L583n416n535L031
1443e314M373k553k385j02M966L871o340p16M169K761L021j498j496J500J320
1458E577k695k269K093J249J528n461m993K195N703m035n357m73O941l824n028
1473h849R43O523M668l138m108N013L109j271k259M391L209j373m480j122L781
1488E037j130r7k989k869N00j34l338j218K796K613o79n347j02J434N169J443
1504A089j489J645L361p77j834m61L383K804l529m634O14K318j71p32j959J291
1520I19m11m984k442M093K580k762j299o68K375N28j463J528L601K540k438m141
1536b444K536N169L361l192l306K819l74l313k424L847j004k047k419k009R73
$$ y = [9098, -178, -387, 6976, 8750, 1829, -1621, 1969, 3287, -1926, -7156, -977, 2606, -2810, -8345, -5314, -941, -3494, -5879, -5981, -1015, 2856, -3484, -4200, -31, 2730, 5751, 4253, 2757, 4257, 5577, 2882, 613, 2706, 3955, 5483, 22, -4971, -2776, 2927, -1108, -6465, -6938, 3, -3821, -8849, -7906, -1383, 3285, 147, -3961, 1052, 4161, 2890, 631, 5022, 8231, 6858, 2378, 1256, 5037, 3907, 3810, 821, -2048, -1548, -1682, -5020, -6238, -3442, -829, -1508, -6855, -6957, -5523, -354, 1089, -400, 1245, 4606, 3829, 1995, 1534, 4917, 7721, 4192, -442, 172, 2490, 2319, 1587, -372, 919, 508, -4476, -6918, -2825, -245, -3007, -4306, -4974, -2599, -2071, -3534, -2006, 1595, 4135, 1697, -2444, 92, 5261, 8622, 5430, 2124, 4943, 4569, 1256, -1168, 2679, 1675, -372, -2791, -4800, -3827]
1551c827P0P05k432J714k74r84J542K5L258L586M10k876n92M147J711j805k444
1568A934L108J812l041o913M29M884p10n056k800J648L042j281l677L557M946
1583A882k256l466n64M742M480l110j341J897K859j039k356K08J809J645m397
1598I93k417J599J862k92m265j664M356j282m002k571K900N790j259n699J246
1613d705N237J315j066j308J861M811p71l774n06M458J21j268m714J970l62k234
1629i35j792k83R24m54l841R06N55L345k339N50l63M809N88j463j15L333K349
1646E774j693l141j8L608p68m656j455O157O42l927o129K489M101q13n955J292
1662d492L185J384l640j555N636K742k639l213K669M672r23l308o99K535K647
$$ y = [-3827, -3757, -3052, -5484, -3770, -4044, -5028, -3486, -3461, -203, 3383, 3793, 917, 325, 4472, 6183, 4378, 1934, 5042, 6854, 3813, -3100, -2671, 2213, 1503, -3553, -6353, -4705, -1663, -2944, -6621, -3064, 1882, -374, -3840, -4404, 338, 4818, 1708, 367, 2264, 5123, 4084, 1728, 1936, 3745, 5390, 993, -1424, 175, 2037, 1745, -2520, -4184, 172, -1110, -5112, -7683, -4783, 1007, -252, -5951, -4705, 532, 1847, 781, -527, 1334, 6145, 5374, 1600, 1094, 5552, 5673, 4405, -309, 1661, 1299, -935, -2727, -3010, -2086, -2540, -6381, -5475, -4920, -1575, -3914, -3364, -3727, 1082, 1670, 207, 92, 3425, 5774, 4081, 940, 922, 4530, 3762, -894, -2349, 3808, 4450, 523, -5606, -3117, 984, 171, -5784, -4492, -1307, 77, -3563, -5118, 518, 3260, 621, -2592, 77, 4749, 3826, 518, -181, 2354, 5001]
1677E001j472l569K144J777M21n316p84J586K200l579m290L95M292p0k415j20
1693c799K476L226k394j379J531K422J899j786p4J483J363j711k922J493O48K9
1709B505m222m90P92J257l777j754J434J607K046k431p67L598J435j423k787M651
1725A674J274q31j458K587R35K01j561k349R99J77j740Q2k24o44O4j547j04J631
1743h34n14o54j532K192N94J321r89o14N39L977j665j326O3K831Q98j076l418
1760b07J657K464k938p63k589L317j844j616j36J169k28j292j40J828n82J338
1776e62l50J283r60J421O63J039o94j93K217j829j004J068Q78k07l431j684L098
1793G53P89k860k339K836J702l334k725K780L831j743l397L102J751Q77j775J009
$$ y = [5001, 3529, -40, 2104, 3881, 4302, -1014, -1798, -212, 1988, -1591, -5881, -5486, -1194, -1264, -3679, -3799, -1323, 1903, -491, -1870, -339, 2083, 3982, 2196, 2122, 3605, 4968, 3257, 335, 1828, 2476, 2505, -1717, -2207, -1415, -158, -3935, -5689, -4255, -2648, -602, -3033, -3800, -202, 1233, -190, -2977, 1674, 2948, 2117, 659, 3246, 4181, 4382, 2821, 472, 1471, 1648, -92, -10, -234, -878, -814, -2361, -2465, -834, -1348, -2002, -3534, -1342, -748, 573, -416, -1030, -491, 3486, 1821, 495, 558, 3389, 4287, 3211, -207, 1450, 3914, 976, 213, -2376, 941, -903, -2519, -2655, -1486, -1714, -3006, -3146, -1318, -1900, -562, -912, 371, -589, 832, 1495, 2534, 1840, 1647, 3864, 2035, 1031, 2099, 2977, 2770, -661, -2345, 753, 1542, -1318, -3657, -821, 881, -2453, -5178, -2398, 1433, -310, -3707, -605, 1146, 2023, 248, 1257]
1809A257k3K655j617O6L3m83k075K48o03N7R98j858O66j493m92K530O00l273j059
1828c866L496j26k042J84K738M332l180l584K615L402k084j577J74L394M34n126
1844h16j437K614K06L38l331j60N50n6j57J633j774qJ158j823J218J773J395q04
1862E19n9N22J314O38k263J029J698M27k940K33m82J590k385l519P95K250P89
1879A56l916r27M008J135k274J7K337J654l110k59K107K336j557r67K46K326j182
1896B130q40j408J274q72p3k276M53O41J51n77r35o39L55K923k269J48J42L603
1914A931j646m84p46L313P33k313o48K083l50Jj838K430O97k808l076J78J162
1931a381J075k411L48J242n96M90m08n28Q72J292j51M51j179K734l4o12J625n44
$$ y = [1257, 1234, 3889, 2272, 2338, 2371, 1888, -187, 61, -542, -485, 513, -1345, -679, -2172, -2664, -134, 466, -2807, -3866, -370, -496, -2538, -2354, 384, 4716, 1536, -2048, 567, 3969, 1885, 308, 482, 3876, 4310, -816, -2253, 361, 567, 905, -2426, -2586, -2036, -2092, -2249, -616, -2390, -2398, -1240, -3063, -1845, -72, 1323, 519, 460, 982, 2296, 2934, 671, 1700, 3398, 3825, 885, 1118, 636, 2226, -159, -3678, -2883, -633, 156, -3760, -4687, -679, 456, -1818, -1801, 536, 2190, -920, -1179, 928, 3264, 1707, 740, 986, 3312, 2130, 1290, -118, 1156, 284, 211, -2065, -1612, -971, -820, -1397, -2332, -2971, -2616, 307, -1962, -1814, -1672, 1931, 285, -199, -945, 2368, 3101, 788, 140, 2223, 1873, 1874, 36, 2466, 3163, 355, -2721, -2543, -1381, -306, -2717, -2369, -1127, -1723, -1233, -1641, -2169, -1297, -5, -156, 295, -884, 1850, 1816, 1204, 2829, 2285]
1949B285j429J611l133Q68K042J162m594j240K874l165O89o21R74J600j731l643
1965e451L845Q68K331k994J581k67L30o21R18K332M30j285o89q78P68P49j527
1982D40k63k488J258K31j000j335j64J690L696l433q99J018M28K122m00L36M91
1999A728l01L13k49J434Q79k851J107k58J052l460O52j026O39K07j882m1p97J866
2017i88o36m71o88J782O34N70o68r65K719Q21j169J264j624J004J150n0k217r16
2035d48R93j672O07J677j219j999Q48n65K92M61k264L699q09m83o16n15J415J813
2053A215J304p73P61M59j711j77j12j251K950j279k192o39J123m93j045N70r77
2070b267l69J035n41M8R16P82r0L88k19R35j54J549j99J217R9j243k727K678N82
$$ y = [2285, 856, 2467, -666, 202, 2244, 3406, -1188, -2428, 446, -2719, -2030, -2651, -1677, -77, -1808, -5451, -1606, -738, 1593, -1401, 180, -87, 243, -378, 540, 2872, 3302, 2017, 1328, 450, 1218, 1967, 440, 177, -2311, -1053, -822, -1822, -3157, -3321, -1631, 2065, -1368, -2267, -1249, -821, 1301, 901, 1237, 1728, 1427, 1740, 1491, 2925, 3804, 953, 2060, 1802, 2854, -606, 46, -980, -341, -134, -2016, -2057, -2854, -988, -1624, -2095, -2783, -1001, -367, 203, -465, -1430, 1289, 2110, 941, 2205, 581, 1585, 2735, 2685, 468, -448, 545, -1127, -520, 1157, -62, -2061, -1213, -1778, -1486, -1025, -3289, 410, -399, -882, -1498, -2013, -598, 1215, 2519, 1746, 2507, 2966, 1255, 1078, 966, -285, 2665, 1386, -806, -1445, -322, -815, -1860, -1290, -2267, -2636, -1601, -2142, -2094, -1178, -396, -486, -98, -317, 618, 464, 2013, 1814, 3031, 3130, 1887, -840, 1838, 2420]
2089B420k091j701K11P49m81j730L49J543l53j993J737p4J201m65k46J20J480
2106F76O96l48j791J061J490k15j76j95k018K637J555l480J358j038j407L40k058
2123b913J649J202j696o72J803j779J232k09L06J307l32O42P74k76P4m7Q07n14
2141A358K012j398k249J92m41Q78j559J26k03R81j462p85J417O82k92M60j150
2158a433R13Q34N67j168K308k88m74K84p37N2m92Q14P06r83n50q06m40M41k55
2177g07j189K72J290L55q26m31L66O08O72J28m02Q33K173j589l31J119j217M3
2195A167J327j297j422J284n33p13j767R48j516Q72J310j8k025P83L99P38j165
2212a628J006j311L101q75j529J016J139J871p08j818Q24r27J257o32k284K558
$$ y = [2420, 329, -1372, -1161, -412, -893, -2623, -2274, -731, -1084, -3077, -1340, -1414, -213, -678, -924, -804, 676, 1372, 1024, -767, 294, 1784, 1569, 1393, 1198, -820, 1817, 3372, -108, 1250, 212, -1195, -855, -2913, -1264, -62, -1758, -2430, -627, -2406, -1174, -1383, -1077, 230, -102, 540, 1314, 1038, 1112, 1065, 1872, 1358, 3370, 1972, -277, -85, -526, 352, -1207, -1081, -1284, -303, -1765, -2550, -1133, -451, -743, -283, -1433, -520, 314, 881, -287, 2021, 1733, 1259, 1543, 806, 858, 366, 1180, 1886, 903, 353, -453, -893, -452, -707, -1896, -1624, -334, 21, -805, -1236, -870, -262, 410, 538, 136, 969, 3142, 1553, 1222, 2341, 1124, 1167, 2494, 1197, -225, 1059, 526, -187, -1954, -1006, -2522, -1650, -340, -358, -2383, -1600, -1201, -463, -1628, -622, -1933, 1168, 293, -1236, -220, 919, 2790, 2082, 264, 1088, 161, 1418, 786, -1498, 1060]
2228A060k09r68k334L5J593n37p81J73J816m35J370r86L36K482k037N10Q9J947
2246C124j377m03m30n90J194Q99j522j577J396l33r84j744J397P16j130l43Q64
2263h43J830L61k411M02J319p01j3R45R21M3q5q62p0P61j34Q54k818J996j4l204
2283a723k28J342j390J869j243O28j266J415j058K11J54Q87j41J785j198P60m56
2300C48O88j254n12L200j946K245q23o52j18j943j043m5K283k25k949N6L185O82
2318A177k077j792J493J392r64n44K060Q22L57J86j491J372q80M83l94J49j046
2335C03R24p58q29j96L91P72k721j314L265J62l051M91K770M62N4j177J65J229
2353I42J483k583J907r21J875k109J816o09r3r92j912J496o56m38l69K99r5j031
$$ y = [1060, 851, -117, -2451, -2416, -823, -1360, -2141, -1968, -152, -587, 783, -203, 133, 2615, 578, 1088, 1177, 3124, 1747, 1344, 914, 324, 1518, 2417, 895, -682, 714, 381, -603, -2347, -950, -234, -1364, -1707, -843, 987, 1348, -1063, -661, 658, -43, -56, 889, 1810, 1853, 1768, 906, 836, 1597, 1463, 2317, -501, 1495, 1481, -1723, -1951, -609, -1999, -130, -1373, -745, -2011, -596, -1654, -1443, -1289, -402, -543, 1242, 44, 804, 348, 1036, -218, -730, 2470, 524, 2769, 1946, 1294, 1176, -767, -1810, -1855, 428, 203, -2746, -2690, 495, 1177, -900, -2692, -1199, 193, -771, -1315, 745, 1567, 1924, 2110, 619, 1991, 1111, 1594, 1200, 1349, 303, 1227, 469, -360, -556, -165, 607, -2114, -3428, -163, -1, -3052, -2561, 209, 671, 725, -452, -287, 942, 2425, -158, 1749, 828, 2703, 594, 2410, 1801, 1708, 716, -1196, 300, -356, -794, -1163, -864, -959, -1990]
2371a990j476K091P18m7n29J321J205j376P52O70J340j606k04R09k07r32j210
2388e71K847j307k669n9L71K189l022l6J84J830k38j492R05K78N45j049J208J461
2406A375j301o28J757L60N69j315P90J694l118p25J574o20K42j635K176j288j878
2423a971l28J323J475j675j067J253J723r68j495N52L593l99l285J241L708j380
2439B300j616q87J250O39j091r9M08k75k55j887l32N88l51R00j220M45k63J109
2457f37J196j513N75J101L68l48k94J856j019m08o15M02J522p41j674j284J678
2474A65J138k574n29J906m49j389j299L512N17j63l397K251J109Q12l18j335Q88
2491H45r27N63j186J633P35k90k17k70o11l19J314q83j519j54L58q46j84k80J668
$$ y = [-1990, -3466, -1375, -657, -704, -1233, 88, 1293, -83, 669, 1339, 2679, 1073, 869, 1778, 1571, 639, -571, 2276, 969, -1700, -1759, -1388, 801, -2221, -2257, -2073, -243, -481, -1973, -1068, -790, -245, -1294, -86, 1375, 74, -554, 1203, 1563, 2132, 817, 1607, 3301, 183, -542, 1032, 412, 654, -981, 1195, -93, -1971, -2299, -976, 499, -1176, -2243, -990, 733, -235, -1730, -1178, 2415, 2016, -1269, -28, 3680, 2300, 684, -203, 1047, 1686, 595, 496, 904, 629, 374, -1513, -1845, -1257, -1608, -708, -1928, -1483, -1746, -637, 559, -954, -379, 722, 1090, 742, 448, 2304, 1285, 877, 262, 664, 2186, 1445, -229, -1513, 165, 1303, -1271, -1800, 106, -343, -1732, -3031, 481, 998, 835, -2562, -311, 798, 1610, 1292, -43, 845, -82, 481, -705, 928, 1663, 1373, 1156, 886, 275, -44, 1270, 387, -1132, -1286, -928, -1774, -1958, -2238, -570]
2510e70J235k469L11J521P48q87j22J428Q74O75k505R07K20K22q35r01J268k372
2528a252M2j583L321M78k098l74j25P51J42n46J38K862O50m211J209J351q78j1
2546a34Q21J75K86j226Q57n63k99J051j092J28j872J514J184n96j468Q45n80J035
2564F6l817J780J565J97q43O22K18J024K80k071K490J427j322o95o48p0O11j287
2582d73J319o7j088j220O67q1Q34o06P11k014R95O53K59O92r5j570J887R96k81
2601A518q66K20k57J501k144k13J877j474k90J72J003k377j281l18K455M53j412
2618a433J098q6o3M41L8N44q86J818r27j65O16J165o01J454l660m9J103P6k11
2637B72j028J057j091m79m67Q48J648o02p58k226K482P88l158L574Q23q6k062
$$ y = [-570, 665, -1804, -1493, 28, 776, -111, -233, 1195, 2069, 2744, 239, 1146, 1366, 1588, 753, -148, 1120, -1252, -1210, -2793, 528, 1006, -1092, -1466, -1591, -840, -698, -1244, -1106, 1756, 2406, -1805, -596, 755, -123, -134, 687, 862, 1148, -78, 779, 216, -83, 968, -124, 4, -1868, -354, 830, 234, -1234, -389, -969, 66, -3751, -1971, -406, -209, -1052, -430, -212, 812, 1092, -979, 1511, 2938, 1616, 921, 273, 203, 814, -473, 846, 779, -309, -1529, -862, -943, -109, -715, -4, -2018, -1023, -370, -111, 581, 486, -1084, 803, 1799, 1518, 652, 872, 615, 2116, -28, -241, 1636, 162, -128, 44, 1047, -1330, -2611, -2929, -474, -21, -1433, -335, -421, -484, -43, -5, 539, -347, 1471, 544, 379, 995, 2160, 1559, 3013, -647, -696, 407, 483, 272, -756, 301, -790, -1269, -1736, -888, 760, 158, -600, -2826, -344, 444, -2714, 860, 1683, 1597, -465]
2654d65J63J49K179r24J300Nk355p80J862r25l96J197l098J399j152J156k49J226
2672B92j44j806J709n1n23j16m31J424q01K19J118K173j100j947O48N12j285Q76
2690G67l728L034O79j310j547P27K362k265R05k862K071J797k226J066J327p72
2706B5J385j635o74K211k98P49K15k437K472o89j491r14n58J912j50j928N10j1
2724a306J075r08j319J228J97P06j591R85K899o65m30j533K313j827M92j323L247
2741B240j083j39J74j768J417o43r35r06J741q85L44p81l88m28J406k37m34P43
2759e62J307M33j781J827O79n67p16n82J667j523k87P20K52o74M58k375K110r17
2777e31P20n65n40J32P6J488j217K15m43J041o89K005j244L91k80O14P60m4j85
$$ y = [-465, -302, -153, 2026, 1102, 2402, 2407, 52, -728, 1134, 209, -187, 1010, -2088, -689, -1841, -685, -934, 292, 148, -1658, 51, 0, -523, -639, -1070, 354, -447, -228, 890, 3063, 1963, 16, 664, 1176, -109, 767, -2961, 73, 752, -558, -2105, -1378, 984, -1281, -376, -3238, -1167, 630, -1596, -530, 797, 25, 1410, -225, -899, 1312, 1014, 1763, 1978, -459, 2013, 1324, -167, -1081, -1639, 273, 123, -1805, -1295, -1306, -231, -1139, -2458, -1230, -1033, -327, -1918, -933, 1966, 1301, 871, -662, 1651, -176, 316, -1007, 2240, 1157, 1018, 1192, -576, 841, 198, -737, -1643, 98, -787, -443, -1224, -1612, -2040, -634, -871, -1305, -562, 745, 1178, -603, 1224, 1903, 1336, 620, 38, 1705, 182, -105, 615, 867, 193, 651, -1724, 386, -531, 189, -376, -916, -784, -708, 780, -437, -222, -665, 376, -313, 1692, 448, 839, 559, 1173, 1933, 1889, 1704]
2796A704j736k6J158j551J534r52j151P14r94J332j796J209q60j393J267J997
2812D56j425J631j174P29p34J958n73L32J83j486J906P1P27j743M86k181J154
2829C17O84k24l36k01j386j805J792l15l74K536r99J26J065J805j603n04r91J682
2847A269o20j12k59J74J398j302p56J83N3j256j588M209K31m970pL467Jo11k703
2866c199J358J563K54l90J302j24M59N8j211O25K95q31j75J308K81m75j455J144
2884G87k347o67K121j146O61j166K25K93L70j608J490J590p36o05J614j346J86
2901b84N75R42N68r13J004j850p05J026m46p34P2J76o08r59N99J505j832J655
2919b09j926K596O45k571L3K211P02J251k307r66J38K409m19q17P70n24j009l41
$$ y = [1704, -32, -58, 1100, -451, 1083, 131, -1020, -306, -1300, 32, -1764, -555, -1415, -2808, -1541, 456, -969, 662, -512, 217, -517, 1441, 868, 1200, 1383, -103, 1803, 1874, 2601, 858, 1344, -837, 317, 1001, 777, 441, 240, -1146, -2951, -1159, -1474, -1848, 688, -311, -185, 880, 2685, 1082, 578, -413, 1269, 649, 537, 278, 452, 1850, 548, -208, -25, 28, -1228, -2816, 1393, 1624, -3346, -3353, 114, 115, -496, -3199, -1841, -278, -24, -414, 888, 764, 1223, 1281, 70, 695, 990, 159, -16, 1292, 1573, 1098, -357, 787, -1560, -2227, -106, -1252, -591, -1757, -1532, -1239, -869, -2477, -987, 603, -133, -738, 876, -470, -284, 291, 1233, 1801, 888, 1892, 42, -663, 363, -83, -817, -745, -569, -1177, -2136, -1537, -32, -1864, -209, -2135, 461, 1106, -1465, -1432, 779, 1481, 2732, 425, -541, -403, 2006, 1587, 770, 1540, 1016, 7, -334]
2937c34J011r49N26j343L84K97l93J193k124J136J583j680j395j57K327J290m23
2954I49l99l89Q38L33j58k22J083k16j458k20O74o78j038j93J452m60j59k574
2972b835K27L387k138K003k02l51o89L93Q06R0J143j498J023J13n05R64j08o77
2990A146j085k388L193r41q6N3k11N52j191j101Q00K087j04l24j401J173j154
3007i82L85M76J405n65K4J663j889P65j700J144J524j275k112O92n46p40K301
3024E70o41M6j322j581K636P4J47j403P88P07j234m37J491M99J135o23Rp00M44
3043F05L5j99p83N43m17l36k56K54k38k3n93j43Q08j27m82j681L738P0k010J239
3063DJ105K86j026j592J406K220q31j380j820R09L06M82j624k70J896O8j748J80
$$ y = [-334, 677, -272, 254, -1089, -705, -408, -801, 392, -1732, -596, 987, -693, -2088, -2245, 82, 1372, 949, 550, 161, 999, 1332, 1174, 952, 2035, 1819, 361, 141, 815, 137, -901, -1094, 358, -102, -261, -2835, -2608, 779, -1359, 644, 442, 91, -598, -205, 601, 691, 1834, 336, 1359, 1472, 967, 1931, 1823, 1146, 61, -2327, 866, -75, -161, -108, -319, 233, -958, -2059, -1259, 828, 724, 400, -1001, 172, -982, -597, -121, 1284, 719, 743, 2406, 517, 1282, -418, 726, 2250, 975, -1137, -445, -991, -1731, 570, -71, -25, -1347, -2928, -292, -218, -71, -1474, -686, 21, -1213, -1650, -159, 340, 1475, 852, 861, 161, 605, 640, 441, -342, 201, -216, -552, -808, -554, -792, -815, -1408, -1551, -743, -870, -1352, -3033, 705, 775, -1235, 4, 1109, 1395, 369, -1223, 183, 2403, 1572, 192, -1628, -719, -413, 69, -1555, -1825, 71, 139, -1609, -1429]
3081a429P0J784k452M44N79Q30j11k15J261n09m26J255k35M55R5l33j06l71j67
3100D19j21j111n99p14J841J246k933J33P43J816j163o62J21J980J4j829o81L105
3118A605P58o26j949Q26J551m44j073Q4Q59j055n68k04j68o4n79k07J152J66j462
3137a398O70p56K924k613l48J999J087k103J058J142j235Q76j05n95j115o35J231
3154H4J059r38j958L097j384o87q14O42J535k186o20J097P07k20l58O93K038j525
3172B62m00n8K592p86p26q5J420k227K34O40j94l027R23K056k965J037m0M92Q77
3191B5k922J123J487M32r44N3r09K963n02j802J233O59j059J257K80R43l58k377
3209d18N05Q63j88n1q09l67j096Q0J400r25N27J032j378j121J23N82J336k98J092
$$ y = [-1429, -1359, 425, -2027, -1583, -1004, -174, -285, -500, 761, 252, -174, 1081, 846, 1301, 1396, 1063, 957, 586, 419, 298, -813, -1412, -2126, -285, 961, -1972, -1839, -1096, 720, -443, -1105, -984, 996, 1010, -819, -1500, 1605, 2363, 1737, -212, 614, 2165, 1721, 648, 732, 1591, 536, -32, -236, -404, -468, -1047, -1254, -102, 64, -1398, -728, -1484, 1440, -1173, -1521, 478, 1565, -538, 520, 1662, 427, 1303, 1198, 603, -512, -1147, 84, 1143, 205, -1753, 1344, -40, -727, -1541, -899, 636, -1550, -2170, -1073, -366, -586, -944, -251, 1787, 262, -138, -196, 2396, 1610, 884, 799, 2219, -8, 226, 866, 672, -2355, -1432, 624, -2341, -1304, -1344, -852, 25, -2897, -1774, -287, 145, -799, -746, -1655, 1308, 806, -996, 237, 896, -163, 1094, 1374, 2317, 1959, -418, 87, 950, 762, 711, -98, -465, -1561, -1481, -81, -1006, -479, 553, -825, -1946, -1823, -1241, 95, -203, 889]
3228H89j086J238j189J443p44Q15j07q98j305O00J026n24j254N22K4O23j166q99
3246a992K144n19q90M82p14J962p16J263j377J720n64p00J707j127J33l02J481
3263A991j764K374j149j113J55q83L6N28k030K39n97K662k273M94J739R04j443
3280a30L77L09j686J668m6k91p15J704m10r09J082n32O71k77k593J434J226k144
3298a262N26j876J308j62N78M1K91N94m35O23J096M83j392m0j19J493r23R9j299
3317c76P24P15M55j404K20j639J618j376L59p42J532j225M2Q89o96J473l97l12
3335a40M55O49L82l29j623K095R81k092L83j722J956j740L40l46J349j393m21
3352a216J118r74J368j242q65J569Q26j221m52N81J729Q13j104P7m77R44p2j284
$$ y = [889, -197, 1041, -148, 1295, 551, 1366, 1259, 361, -944, -344, 682, 158, -1096, -574, -550, 73, -1093, -1992, 152, -367, -1257, -775, -1489, 473, -243, 1020, -357, 1363, 799, 99, 1806, 679, 812, 510, 1991, 227, 2601, 1452, 339, 494, -389, -353, 175, -1855, -1616, -2213, 449, -1824, -1330, 409, 1313, -130, 247, 556, -1130, 538, 492, 201, -514, 1190, 780, -129, 953, 421, 1092, 815, -1778, -344, 882, -1262, -736, -2612, -1304, -1466, -888, -847, -556, 38, -397, 226, 1322, 1805, 413, 373, 254, 1747, 824, 923, -376, 348, 1063, 1518, 114, 334, -1305, 313, -1063, -704, -1446, 86, -1139, -1097, -208, -904, 569, 172, -140, 315, 964, 1346, 1017, -606, 1489, 2470, 378, 761, -961, 995, -745, -405, -751, 598, -795, -1216, -98, -1072, 296, -946, -1811, -242, 584, -637, -1089, -508, 1221, 2034, 930, 1007, 530, 1474, 1402, 118]
3370A18O3P06m30R97k60j156J484j284n50j170q1k15K815k039k70O76J744j606
3388d58j609J980l16Q73j9N55R16k587J882J12l78R43k191j96J572j78q42j166
3406a107J005j007p99R29L75J70O97k169J520j26J449p95j31P01j292R63M85j043
3424a75J791q83K38l40p92j243J557j595J656j848K293k064Q14m44N21k8j41p2
3442g55k94J927j265K052p32j373o74J211J382j312J152j01r12j258N65K11l9
3459b15J209j018j384O27N79r7N4j23k70j315J313j52K689k721Q40n43K043j205
3477C11J23N34J60j005J093k94m20J663j599j086K321j050j363j348J194QJ677
3494I19k100p50J228P45N27k301J557Q20K13j95j220R24L99m75J226j355J33p25
$$ y = [118, 181, 887, 457, 1454, 1194, 38, 1522, 238, -312, -1482, -1563, -1778, 1037, -1002, -1272, -596, 1148, -458, -2067, -87, -403, 470, 451, 1006, 1922, -665, 1217, 1329, 951, 1894, -297, -493, 1079, 901, 59, -1107, -102, -1109, -1908, -979, -604, -434, 263, -1906, -386, -512, 937, 142, 11, 712, -580, 383, 868, -175, 1616, 733, 971, 631, -161, -1404, 153, -1442, 214, -1634, 659, -1405, -591, -1035, -514, -542, -683, -755, -1049, 878, -387, 1665, 933, -440, -1114, 97, 1479, 167, 1319, 1218, 306, -952, -387, -176, -215, 994, -24, -1408, -781, -202, -299, -245, -368, -638, -1953, -640, -792, 1897, -824, 16, -527, 1516, 311, 434, 968, 1128, 123, 1216, 922, 502, 2165, 566, -520, 1801, 751, -612, -1960, -766, -758, 919, -1181, -1931, -703, 42, 569, -1732, -175, 645, 858, 663, -557, 367, 766, 291, 1517, 162, 295, -430]
3512d30J088k625K230l82j37j535M96O62P96j628k23K228k809J520J035r38p78
3529a430J797o41J554j375J404o47j399J540k27J088j228P4j591K05J298r59k35
3546g72R13K95K99j208j287J303L88m28L97O65p37K35o85K658l13p78k45K03N30
3565A433j365j79j289J084p67P51O55p07P23j686O34M84j60J231j136o65K16j46
3583h89J391r06J359j79R05j420J198q39M86J074k259J483l154J301l57K6M18
3600c62J394j186o11L07Q9m02j476J703R41l57m7O52J075k152N59J452j796N46
3618C29M3j50p42P19K48o97J48J44j789O53k57J262j98N04L69k284M09M92Q0P25
3638Hj77J12K406j629j222J674K95p60q81R3l49M12q61Q16Q01j464J82n75k59
$$ y = [-430, 658, -1967, 263, -119, -256, -1791, -1295, -633, 163, -1465, -1688, 540, -2269, -749, 286, -652, -1430, 367, -274, 1280, -95, 1309, 662, -737, 803, 576, 1664, 436, 510, -1081, -876, 422, -537, -772, 141, 436, 735, -473, -1760, -457, -69, -497, -100, 565, -172, 63, -622, 2036, 1723, 945, 700, 903, 1433, 68, -111, -1400, -316, -1083, -332, 323, -384, 339, -1347, -713, -229, -389, 842, -294, -959, -743, -889, 502, -404, 955, 776, 1681, 261, 1459, 620, 1106, 2180, -79, 1404, -1750, -449, -806, -780, -362, 1032, -154, -765, -458, -369, -771, -2247, -544, 397, 40, -7, 645, 1720, -432, 127, 1579, -217, 329, 372, 222, -520, 199, 447, -250, -102, 42, -1747, -1094, -1351, -89, -287, 217, 586, -1698, -1289, -797, -717, 8, -169, -57, 2349, 720, -502, 1172, 1467, 707, -174, -81, -430, -18, -879, -63, 738, -726, -544, -1119, -1378]
3657a378J486k114L36K164o30L68j412J585k71j4J57J12J58P44K64j755K955k768
3675a3j036R53n7j257J200Q35j677O89l95M35M41n78K25l74K447j473n43P13L07
3694H42j260J203K55J44n63O6K05j110L25R36l32j527K398j438J43o80r05J739
3712D41l23j041n48k08Q06M64J154j323J856j544j27J533q76O39j176N08j93q88
3730h46J550r76P7m05n61L24j66J761j103O54j411O24M54l35m80J609j771k42
3748a243J972q06K56J498j272J514j240m77N77m28o18M44O22M34j736m51J77N0
3766g27P25n25rr01O88M83p10N7J290N53j441J325j067J189l16J07n31K295l250
3785g65M4Q36N55k111J611k34j997k99J962p0o69m88J140j78J36p68K150K40p51
$$ y = [-1378, 108, -2006, -1670, 494, -136, 232, -1180, 405, 134, 120, 277, 389, 547, 1291, 1555, -200, 2755, -13, -1049, -96, -153, -1410, -210, 625, -1052, -363, -758, -323, 118, -460, -235, -609, 1838, 365, -178, 535, 842, -418, 785, 1040, 1184, 621, 687, 892, -218, 107, 1043, 711, -816, 1582, 144, 287, -393, -1298, 441, 118, -923, -1471, -1679, -873, -409, 745, -578, 1278, -266, -393, 1140, 264, 903, -273, 235, 42, -846, 704, -272, -195, -600, -1161, -837, -1003, 758, -345, 309, -1102, -478, -24, -359, -839, 770, -1001, -1243, 729, -77, 179, 1677, 405, 1919, 679, 202, 779, 351, -267, 177, 799, 1233, -503, -954, -777, -727, -2, -527, -536, -1437, -749, -266, -976, -919, 371, 924, -517, 808, -259, 930, 614, 721, 190, 2485, -765, -721, 115, 670, -1441, 170, -64, -2061, -2360, -398, -468, -1137, -1625, -485, -663, -527, -1295, 855, 1095, 344]
3804C44r2r59J934m84j040P48J100k727K308j680M97p36J051J55j460O04J550
3821A113m17m99j515J845j246m75Q00J84J237j032P85M43L15p90j498O3Q02r50
3839h35O87J073k419K020j145r71J110P7m73P63k161K126o4j028J638M3j369N39
3857c89P82K28q36J795n70j108l05j17J908L4n22K5j492O41j5K54ln15k23J48
3877b80k57j024R85l25J259o6j180p1K436o58j125M74J653j784K45M43M48j320
3895a47j19O30j269m70J970l337J745J609P41k402k72P85m17O88N58r55M27L58
3913A23l60J050p58r20J811K6J59j808J528N3j020n76O45j83n22L89L06L93j093
3932g57K38M41l96k675L306J415j846R72j091Q05l24j95J242l2l50l25q82o06
$$ y = [344, 252, -707, 1227, 743, -297, 451, 1551, -1176, 1132, -548, -51, -787, 264, 419, -1041, -437, 1113, 696, 197, -1318, 527, -719, -1194, -394, -210, 1027, -5, 780, 1223, 1538, 748, -750, -687, 115, -835, -148, 925, -1494, 526, -619, -1590, -480, -403, -876, -113, -2274, -148, -212, -1240, 398, 441, -928, -389, 393, 621, -215, 1580, 1010, -98, -403, -520, 1388, 1422, 900, 925, -567, 74, 59, 313, 310, -205, -428, -280, -537, -1561, -576, -901, 358, 292, -888, -959, 1477, 819, -306, 168, 1821, 37, 282, 725, 1173, -147, -266, 364, -905, -1375, 595, -2742, -997, 612, 1353, -1049, -1321, -536, -953, -265, 293, -662, -235, 123, -237, 813, 55, -865, 946, 972, 1131, -677, 851, 904, -116, -692, -47, -230, -752, -363, -57, 336, -757, -519, -78, -474, -3149, 157, 1572, -274, 698, -393, 412, 88, -107, 1135, 1103, 753, 428, -454, -1060]
3950a060Q9Q03P04J20j115J426n30k305K000k41n35k52J06J621q94M26j123J158
3968C98p26P26r8k23R3K30Oj250M96r9k54Q64n08K82K49N53j066L00Q88l78J66
3989F49j105J240k399L67K820j98k703J728m6k78l33K336j960q40J61J021l020
4006b560L299j238J233o12j235P30m06m09N69J06k175K217N58o93p93N20O77K02
4024a0N65J77j474L71M80P58o45Q90k84j057J58P19j041p63J467r27N54l8j078
4043a178Q14O71J84r72J468n39k87J32J072o06j533K63K41n70J134j022j170J716
4061a82l71O29m36p33J343q3p23j03k4rk37N88j57J176k00P76j175N39J505j416
4081G07j49r17J957j214P31l21p17N36m71p80l43M19j403Q26r31K964j524n50
$$ y = [-1060, -971, -168, 536, 656, -459, 967, 437, -1868, 132, -109, -644, -896, -790, 831, -63, 363, -760, 398, -328, 398, 300, 77, 170, 400, 406, -844, -348, -447, -701, 163, -345, -63, 186, 739, -327, -27, 861, 483, 649, -456, 784, -1615, -1248, 1572, 1374, -1329, 399, 353, 75, -258, 2078, 118, -722, -561, 460, -2560, 739, -499, 734, 122, -1113, -383, -789, -1198, -629, -523, -2698, -481, 77, -616, -1409, -889, -212, -10, 555, 732, -742, -371, 109, 867, 222, 1112, 828, -229, -71, 648, -393, -1156, 311, -616, -62, -100, -1178, -364, 307, 491, -481, 987, 448, 161, 293, 1365, 759, -774, -511, -270, -840, 294, -728, -1898, -182, -553, 76, -360, -1093, 250, 167, -556, -659, -683, -692, -929, -341, -498, 678, 478, 1254, 79, 618, 2123, 707, 558, -359, 1598, 384, 1115, 794, 77, 613, 142, -638, -981, -562, -1965, -1139, -2070, 894, -630, -1180]
4099a180J252J411k144p73K155N49j712J379j354K103k664O19k75Q08K28k36k27
4116f1j132P32J16M75n62M81l42Q33j132J155j144J035j54K04L31j637R65l19
4134a56M1J591r22o26L71r50R67L31j169L02J122j255j188K156n56q52j105L074
4152A176j982r18K401o53m76j132J961R1l60j24K73m23P64J56j359O62q04Q10
4170F3N85o60j177J619O67j608J531N2k090P57j354K654n06j202M18k31O7Q17
4188D02j351O09J056j39j693R11R00P96j490J97J83n19M52M78k041J506L13k291
4206a721J852O11j696J908j621M69N25m53J184j247J271l221K916k77k11j61k43
4223a15L00L17j925K146k252J743o95n25P43k61M82J7k47M07r87N55R88k70r08
$$ y = [-1180, 72, 1483, -661, -1434, 721, 1270, -442, 937, -417, 1686, -978, -359, -634, 174, 402, 166, -61, -1193, -461, -345, 130, -432, 49, -293, 540, -592, 563, -581, 454, 300, 504, 835, -802, 163, -156, -115, 1476, 554, -72, 299, -651, 316, 647, -522, -220, 902, -353, -1541, 615, 59, -793, -1898, 1176, -806, -1724, 677, 24, -452, -1584, 377, 468, 108, -16, 257, -166, 598, 754, -605, 57, -747, 63, 648, -12, -1189, 430, 1097, -511, 1020, 1072, -1018, -261, -1615, 1039, 533, -669, -251, -482, -415, 402, -949, -340, 716, 577, -1116, -205, 695, 1491, 1, 198, 381, -138, 314, 792, -1249, 257, 570, -1721, 131, 742, -954, 954, -667, -198, 327, -126, 1058, -189, 1082, -2139, 777, 500, 289, 128, -115, 185, 502, -1423, 723, -1529, 214, -481, -1006, -263, -524, -42, -25, -272, 135, -852, -297, 691, 421, -487]
4242d87J429j068j13k08P61j190J485o11k50R49k127J669j204J706j054k27R27
4259C87k329Q69J505j702J676j026J372j897J483o18j81M72k53J552j650J021
4275F81j315K500k581O1J256j977J162Q62j378J004j134J509l00j018K31K19M78
4292B60j588P52L6J317M11j88r62J94n60j34J145j99j099J609j336M33p35Q35
4310A91k43J154r01J48j099m21J933k051J056M94N6k08j74P5J178m78n1o13j059
4329a013L34J809n14k72k71N06k298J421n1j145J533j572J603K39l20l68J245
4346H66l04o27R14j306O57nJ18j273l12M29M28R18n14o71J265l47m53M25P90j307
4366c09N06J750j388m50j93M12j748J486P96m04nl00k37o0j83N12o70K383j129
$$ y = [-487, 942, -126, -239, -447, 314, -876, 609, -2, -252, 697, -1430, 239, -965, 741, -313, -540, 387, -1942, -1073, 432, -1270, 406, -620, 752, -1145, 338, -280, -461, 11, -242, 1310, -340, 681, -634, 1866, -715, -654, 602, -1375, -213, 649, -729, 275, -859, 650, 350, -668, -437, -218, 260, -1328, -576, -540, 777, 1188, 1000, 38, 232, -328, -462, 683, 484, -615, 994, -342, 91, -644, 191, -52, 1102, 201, 349, -750, -1171, 762, -1289, -233, 261, 317, 109, -65, 10, 1188, 710, 659, 46, -1013, -679, 1130, 616, 344, 73, 579, -1719, -298, -349, -1494, 39, -1533, 70, 309, -11, -379, 866, 562, -65, 849, -457, 200, 195, 313, -960, -1272, -843, -415, 503, -11, -682, 583, 236, -217, 208, 998, -309, 197, 1947, 559, 109, -84, 328, -1420, 66, 862, 458, 453, 153, -84, -144, -327, 185, -485, 1898, 769]
4385G69q55N93j291M62P95J51k24J271j468p99Q78O25k110O83j76J180N4k16j32
4404A90p9l21n04M21J053R9m13n62o14L55k97R95M77K75M01p11J94j668Q39j041
4424i11J525P86j343J475j062p13k31Q40j302j08L05P62j200L068l215L05N44
4441d75j03Q94J119q93k264J168O76o1j548Q36K051q03j608J049L60J44N36k341
4459a263J782P38j565n60K460j111Qp03k499J191K581n49k543M157j373o18q41
4476g08n89J922n59P01P56j301p17Q5P58l03Q61n03r55J178j472J465q18P80j141
4495e60k97J510P5k03K10N56j203M13o34L09o7Q82O44l000J697o53L26j37J506
4514A374m8p08J544k372q5o48J946n75P97l192J309J105L80j171n57M86O62K45
$$ y = [769, -86, 507, -784, -322, 473, 624, 400, 1671, 203, -596, 282, 907, -1203, -520, -696, 484, 538, 322, 190, 111, -210, -714, -293, 760, 859, 446, -116, -730, -375, -672, 323, 800, 1075, 1476, 765, 959, -709, 130, -911, 614, 1400, 57, 1532, 470, -243, -474, 366, -936, -1044, -739, 23, -1177, 1891, -1324, -1019, -475, -578, 316, 1435, 542, -1722, -554, 122, 61, -1487, -651, 1400, 597, -1011, 38, 398, 542, 1078, -1263, 519, 1257, -308, -868, 1592, 481, 489, -214, -2713, -1522, 1059, 510, -2033, 2124, 751, 133, -708, -1297, 625, 66, 767, 1523, 222, -495, -410, 348, 45, 906, 403, -552, 626, -846, 619, -199, 581, -560, -857, 653, 728, 525, 735, 1291, 88, 501, -133, 176, 109, 991, 1635, -1365, 332, -321, 5, -132, 1374, 1326, 618, 2162, -210, -295, -943, 1003, 428, 1225, -1967, -658, 447, 827, -344, -901, -415, 247, 492]
4532D92l70m41j02p34M64J432n08l32j69M23j070P99q93L59j05j4L43K58L92l38
4552a14p18M29M94J26j080K78Q92P86j455M5J346k053J957j016M19m86m83N33
4570a00L13k8n83q77J238K55j12R37l50n48n59n95r06J206J503q59L94n53P87
4589E63j23j305J71J433n43R32n45m11j393l59J391P5M01r82K090j137Q81k113
4607i74R1J287L8J98J54j023K144j240j030J234p38l37p8j372P77J890k81n34
4625B06J047k702K113K59r85r21J415j709J62j67K121l13p59L71j070Q64p4P32
4643E90L72j34k65j354J446J047K65p51k052J71o17J384m48l24K207k293n95N30
4661h21P97n27J452j143J410L92j196J82m03K93j271J754q03R74j83j442K07j447
$$ y = [492, 122, -319, -421, -1155, -691, 741, 233, -99, -268, 155, -915, -116, -1009, -650, -755, -769, -426, -168, 224, -114, -832, -403, 91, 217, -863, -585, 307, 1093, -362, -317, 1029, -1024, 933, -83, 336, -150, -633, -100, 213, 185, -398, -1275, -37, 218, 106, 1043, 693, 145, -414, -1009, -1915, -709, 794, -65, 329, -224, 563, 440, -865, -694, 739, 196, 1128, 583, 172, -1221, -1580, -189, -114, 287, -695, 1395, 258, 1139, -974, -883, 404, 442, 640, 794, -229, 1915, 675, -355, 879, 141, -196, -274, -1646, -869, 1021, 740, 206, 1253, -1449, 664, 923, -62, -983, 432, -1277, -1115, -1282, 839, 526, -233, 138, -932, -68, -142, 590, 962, 828, 563, -791, 655, 1702, 1967, 1216, -836, -665, -1282, 102, -346, -670, 1537, -756, -1351, -821, -24, -551, 901, -242, 1168, 1560, 364, 546, 143, 436, -835, 919, 116, 1090, 907, -535, -328, -1775]
4679a775J694P52l90l22j85m39J81J581j403J798j360m38J557j264l65K34J218
4696A074j739K086k127N70o29O33J148r96L48J198k334J844r87M73r10q3j54P18
4714A33J316p18m11j4k40K94j412L99j01P44N84o69m49J977j560J575j650J715
4732A513q66k129J849K29j86p42M82l79P00J224j997P4P21k00k620J155J469o88
4750c91J194o63J366j924J502j002P29k108J980r0J252j369r60O09k47O29p75
4767b68L69q5l51J163Q16k165j91M72J2Q26j671K117N13j070j433M63J553O68
4785A738k703O27J03Q55k22P9l03J62q20R58K50q78k96j614K024o09J59J48l24
4804f66J058m67n21O45p09K036j640J478j273J164J82j479J453J112k793J413
$$ y = [-1775, -81, 671, 281, -41, -226, -665, -484, 1097, -306, 1492, 132, -306, 1251, -13, -378, -144, 1074, -665, 1421, -706, -136, -765, -132, 1016, 20, 368, 1566, -768, 1076, 89, 562, -348, -431, -585, 133, 1449, 731, 320, 306, 66, 360, -1052, -653, -754, -10, 574, -95, -544, 1433, -127, 1448, -202, 1513, 647, -1482, 367, 596, 410, -332, 150, -229, 471, 1695, -302, -228, 493, 293, -2327, -1172, 297, -391, 803, 140, 1506, -418, 1084, 82, 811, -1297, 683, 593, 1845, 476, -484, 125, -122, 507, -268, 101, 16, -335, 828, 1644, -521, -712, -240, -228, 598, -1073, 1044, 1557, 487, -946, -483, 1070, 1738, -965, -338, -235, 620, 398, 477, 174, 336, -484, 474, 724, -154, -450, -2064, -40, -649, -490, -342, -666, 392, -75, -596, 49, -660, 1376, -264, 1214, -59, 1105, 1287, -192, 1261, 2373, -420, 993]
4820I93j409o8m56J727k150K78P48J96K21O3K323k164j082Q90O68l70j146Q57
4838A19n40j399J068L54j143J890l8m61J66L47l28N35n30o0M65j419J021j873
4856a826K300L30l81k16J92J658k696l85Q59J168j782L64P53m25r27J274J89n38
4874h9J022Lj843N04J010j11o97J132p12j96l51P81j854Q84k06q4K057k349L30
4893g69P52M62l23o79N80P99J100j000J321k808J122j478m01J319p79j208J780
4910b10k11J144j109m79p7K034j68r51q75Q80M69J27p1j396J609j049J486l002
4928a849P14J357q69J115r3Q15j841R85O54j933L35L00n02K608k042p03J856j268
4946c61M94n64L59J114j73p06L2K99j364P76o40MJ68M58R6J087P5j659%M18q11
$$ y = [993, -416, -484, -940, 787, -1363, -1085, -337, -141, 80, 143, 2466, 302, -780, 110, 778, 408, -738, 119, -421, -1820, -752, -398, -1541, 349, 311, -150, 16, 363, 35, 570, 40, -20, 445, -974, 47, -1826, 474, 804, 423, 207, 399, 2057, -639, -1024, -165, 1003, -779, -415, 338, -87, -1014, 260, 449, -89, 933, 936, -907, -403, 607, 496, -201, 931, 219, 23, -328, 453, -1401, -517, -723, -807, 1250, -1099, -769, -17, 445, 122, -557, 23, 822, 1922, 922, 2243, -565, 557, -921, -1322, -3, -782, -1990, -210, -421, 723, -386, -865, -942, 1092, 924, -27, -902, -22, 447, 574, 503, -893, 716, -333, 1153, -1849, -1135, 222, -647, 468, 375, 1190, -651, 334, 988, -945, -610, -310, -812, 1796, -246, -949, 907, -361, 133, -431, -72, 1042, 869, 163, 195, 494, -870, -94, -734, -730, -562, -104, -8, 1079, 1154, -505, -505, -87, -898]
4967h98L56N10j619N13K24R64k79j81J365n57p33R52n46l10n55P45o73Q92O08
4986G78k286J251j80N3k50l14J570o94m24Q06m84j61k12M49J905j422J649l412
5004a378Q35J045j02r21J41J538l42q38j47J65J069j583j955Q09L183j130m87
5021i8N94N25q78J09Q52k331J341J570j305M72j464m09J427o19j258o7J613J64
5039B38j362P51J223j740K28l7J188l063K292k99m56J217Q94j394n33P25p2m42
5057f42R60N28j287J286j203Q0J83N32j83q73M77Q81j360P02M83o93m17K05K263
5076A922j451L14r96j60Q54k39q13J857p70j452J801q7l43j033m3J685j790L90
5094c54J108o44o99K11k22J008P41r33n11K90J051j943J435o01k75k00k99K0J019
$$ y = [-898, -542, -32, -1651, -1138, -914, 50, -229, -410, 955, 398, -335, 617, 71, -239, -794, -49, -722, 170, 778, -1508, -257, -437, -384, -634, -948, 622, -72, -496, 310, -174, -335, -547, -98, 1807, 385, 2034, -1378, -543, 502, 400, -521, -380, 1158, 816, -22, -169, -4, 1065, -518, -2473, -1664, 1519, 389, -98, 496, 1021, 143, 252, 1104, -1227, 114, 1684, 379, 851, -613, -1022, 405, -214, -1472, -1539, 74, 238, -1124, -373, 850, -890, -662, -699, 489, -2574, -282, -581, -1037, 180, 1074, -320, -853, -128, -200, -642, 318, 846, -441, 845, -358, -278, -95, 437, 254, -619, -142, 739, -621, 81, 564, -129, -546, -341, 1922, 471, 785, -211, -371, 483, 244, -569, 1288, 518, -934, 867, 780, 437, -596, -639, 1046, -744, -354, 754, 110, -589, -378, -600, 408, 1149, 216, -295, -5, 1046, -897, 538, -63, -338, -538, -837, -817, 202]
5113B02K32l21K293k624N01J389j357O2m68O79l61n5O47m96n01J88k16p06L37
5132e75N24j163q98K081k12r6M29R79j115l0N37q19J198m62q60K40P18j119K33
5151d10j266J316J07j9J006p01P93j595L63J082n56n14J438j331J278r70q2L60
5169B99Q8j996K303q57M38N1Q3J56j470J432j530K14P06L25l0j1J421j393n4J7
5189A92l65J109j488O34J060k465K228j120n51J928k949J206P99K54j803J897
5205E66r11j008N60K613j375J175j759j293K033j283k40Q54q88J963n41m66P67
5222G67R6m36N69M23j278r19J149n1j397P43j278J510q43R5o84J607k46m75K024
5241A376p32L50m6j249J468m1r41K72r3m13m39J462N24j049j830J104O4n5L23
$$ y = [202, 434, 113, 2406, -218, 283, 1672, 315, 377, -91, 588, 227, 172, 819, 323, -178, 10, -206, -912, -575, -51, -1214, -2112, -31, -243, -339, 90, 1069, -46, -76, 461, -358, 840, 378, -482, -242, 476, -643, -410, -1676, -360, -253, -272, 734, 33, 826, -769, -406, 676, 120, -394, 1044, -287, 991, 21, -61, 299, 387, -1609, 694, -163, 275, 326, 409, 565, -905, 527, -1003, -789, -83, 242, 212, 201, 1622, 229, 175, 192, -173, 936, -552, 82, 1142, -1323, 905, -215, -766, 1162, -1787, -581, 218, 472, -1331, 566, -345, -1353, -793, 1820, 445, 1620, -139, -1432, 601, -682, -922, -68, -956, 1007, 466, 0, 767, 863, 427, 996, 1419, 141, -778, 371, 320, -1077, -334, -1612, -102, -945, -850, -1534, 73, -173, -648, 1376, 644, 994, 948, -301, 1167, 1126, 185, 457, 364, -49, -488, 974, 1498, 449, -1381, -277, -213, -268, 55]
5260E5l48o22K360k131L27m50M87k74j83P93j054J049O67l81q96L58J096p81N24
5279E96m14l09l38L15r36J919J44k829J684p30P19n37m5O2N60m00K40p81J91K843
5299A954j405o16n6J576n19j983L38O39o07J517k81k16n35q29N70l22J870r56
5317A39m48N71K49J263k974J833%j229N11n88J609r79J271n77j39j67K18o56M04
5336C11J156k193k06R23O89J73j489J38o16m58J738m53J591j955N88P05j923J106
5354a75P32m78j03N69p11K75M82q91l22J539n97J151j462r77J035r9l23n60N40
5373c75j120N96K135j046j42k53P33J081k119N05K59O10M47o77r93M68R12k331
5391a310J401o67J341j603n36q11J606m87R37O05p94j072J027P19o67M16J185
$$ y = [55, -293, -915, 1445, -686, -359, -809, -322, -596, -779, 14, -1040, 9, 676, 295, -601, -243, 853, 72, 596, 182, -127, -465, -150, -1086, 833, 977, -1852, -168, -898, -179, -716, -761, -699, -139, -539, -299, -1080, -889, 1954, 549, -67, -123, 1453, 934, -1049, -711, -72, -679, 838, 557, 341, -194, -1023, -453, -775, 1095, 139, -309, 262, 511, 1774, -1200, 633, 633, -596, -85, -673, 936, -43, 1228, 651, 512, 345, 563, -93, 311, 1467, -726, -932, -9, 680, 853, -636, -498, -1114, -1572, 166, -287, 1304, -651, -63, 642, -1281, -175, 557, 79, -24, 545, -166, 109, 591, -300, -622, 917, 320, 1471, 9, -968, 67, -32, -355, -915, -375, -1495, -899, 1236, 190, 48, -205, 528, 1609, -510, -5, 254, 864, 1311, 634, -359, 109, 1021, -1310, 91, -576, 765, -838, -1374, -2185, -579, -1066, -129, 476, -318, -1390, -363, 356, -311, 105, 1290]
5408A290l57n06j076l74J795q91R68j494J107j98N75p59L25k06j000J701j205
5425c05j1n20J87o24J17P06k51P91j778K414j065K3O68k21k59P30l64Q11j318
5444b69O39j355K37J954l149J183N13j117L96K84n1o89J180j85l53n50P13J706
5462A087m07O76j630o00K061p26q21K4L73p44N80n9J787j622N72k34j606J516
5480B27p80J708m60K7Q06j491L23o61N97J26N43j431j16N75J304J75j019P17r91
5499A79l14O78j163M47q76R05J59N13P58n33o55k179K267j27l68N15n55j95J035
5518D91O57k92j213J753j962J382k04O70o01o38m1l69l84P76O88q50q02k43M21
5537g61O26J440j656k50L39N13q29J318k719J647Q00l27m75J224j175l94J863
$$ y = [1290, 933, 427, -649, -1023, 772, -119, 849, -645, 462, 264, 839, 80, 405, 199, -801, 900, -305, -316, -836, -649, -1273, -1156, -450, -701, 90, -1688, 726, -339, -316, 352, 131, -128, 602, 238, 1049, -269, 370, -985, -748, 1206, -1943, -760, -247, -1364, -968, -684, -735, -1424, -244, -429, -782, -1332, -619, 1087, 680, 1356, -274, -874, 1187, 461, -360, -336, 37, -707, -127, -186, 1601, -21, 551, 317, -1289, 227, -553, 1155, 695, 722, 1528, 37, 360, -301, 296, 422, 965, -466, -582, -7, 1297, 1472, 453, 1170, 179, -135, 543, -620, -173, -1049, -144, 15, 528, 1286, 753, 98, -2081, 186, 59, -309, 206, -349, -544, 491, 1148, 856, -357, 1396, -566, 816, 612, 1282, 681, 43, 2, -367, -751, 25, 713, -137, -939, -1182, -761, -135, 1305, -351, -601, -262, 251, -578, 740, -1979, -332, 468, 141, -334, 890, -285, -679, 1184]
5554A184k191J066O13M12l090K382o21J133j755J567j021r64J863j381M2J206
5570D45J61p96J094j174J418p23K54n17J3j063J191j72k96J081p85l37P82j734
5588a158J848k912J981P73n28j69M40j299m78J440j247K258k238J228o82q8K102
5605A271k827K451n46J32J81l29R94j110P9n26QM97p55J109o69o60J436l85j49
5624B02l11o80P07O57o23l61M08o3j559K531k390L64O41j34m93J684q87j60O36
5643A69j349K050P89j702m36k61K56J321k119J080l6lJ264k13j231q21J010N49
5661C17J586k898J191J71r28J105j534J920m57j40j104O73J075j491O98l41Q91
5678G34p33k58n86L31O36j91m77o84P93P09r70Q64J096j201j100K881j642m04
$$ y = [1184, -1007, 59, 672, 1084, -2006, 376, -245, 888, -867, 700, -321, -1285, 578, -803, -761, 445, 606, -190, 904, -270, 1148, 425, 679, 162, 175, -888, 303, 131, -165, 916, 131, -206, 576, -1158, 690, -2222, -241, 532, 4, -165, 275, -1024, -1502, -62, -1309, 949, -1289, -61, -743, -831, 1271, -1556, 895, 349, 481, 662, 333, 1327, 217, 296, -230, -222, 275, -480, 629, -40, -700, 736, 351, 202, -109, -789, -82, 575, -48, -409, -1, -64, -1623, 908, -1482, -1118, -477, -611, -1104, 580, -307, -467, 169, -1180, 870, 1659, -43, -479, -740, -484, 837, -1282, -202, -238, -241, 1023, 810, -421, -1242, -232, 317, 1903, -995, 196, 367, -561, 544, -990, 930, 473, 333, -771, -98, 977, -514, 184, -157, 734, 1, -257, -843, -512, 124, -67, -544, -1228, -435, 274, -696, 168, 1264, 63, -1037, 1844, 202, -202]
5696b02K88o91K91J589j781l10R51j468K476j107M88J218r32o69oJ466j806K92
5714H7L53n16J085r39o24j51M59N4n45M6j72J159q92R06K56J12m99K9k38j052
5734a082O73J030J14P47j391n39p8l49K434l142J816r93O45J730j281p08P92l89
5752B9n33J87J683j398k04m63O20P12J017j802k35P41m63P80L20j222N92j454
5770a093o77J200J739j038j221N56L54P91o58k95O46r27n4J997j459j57M47R01
5788A052k417O70J689j323p26J077N10j062O35k50P65Q22k822J939j146K018k70
5805A161n77M46k218K176j055j184J289n88J333r29k15J041k79L59j149n63J837
5822H85j81p24j52R09N95j468N66j597J163p69J497k5p64k148J769J894Q0j173
$$ y = [-202, 86, -605, -314, 1275, -506, -816, 135, -1333, 1143, 36, 524, 1742, 810, 141, 135, 1601, -205, 87, 440, -76, 1009, 70, -554, -705, -246, -192, -737, -691, -863, 296, -596, 310, 566, 678, 179, 208, -30, -1082, -409, 621, 735, 1482, 91, -448, -526, -875, 1559, -1583, 233, -760, -115, 1615, 334, -374, 418, 29, -504, -317, 1366, -32, -236, -699, -79, 633, 1650, -152, -387, 354, -109, 671, 991, -231, 361, -1093, -1770, -570, 1169, 131, -1090, -534, -180, 611, -47, -342, 304, -623, -677, 1320, -139, -296, 151, 1052, -1365, -695, 994, -329, -1055, 22, 532, -530, 105, -145, 620, 1442, -1380, 559, -587, 1431, 1161, 584, 1030, -1188, 988, -67, -1251, 38, -550, 783, -146, -361, 680, 401, 760, -389, -952, 885, 704, -20, -172, 737, 1332, -136, 430, -1167, -4, -773, 724, 699, -65, -2213, -444, 1450, 1530, 357]
5840C57o96J579j848P86m77J681k470L76J055k46j105K155j245K80K318k692K99
5857A07K24j126J686n84J044j931M9l8j319J408P15l93m69M96J454q67J340k65
5875A531k280J617r20n36K40J754q97o03l61R76P81j563k30J206o29n03L12j218
5893a323J019N72j57R6L38m43L72n83r37R81J049j431J86J65N20n98O69L7O5M31
5913A028j186L48p42J28P46q31K34N01j139J338j10k455K458p92M51Q9p13J701
5931A054j626o60J477n18J87k16L43q36J223L01j1N28q19k81R26j085R0J26O94
5950H97j080J005j782P5N03m6k81M2j42O18R32k378J573r36Q69L21M95J79j3k37
5970F14J181k165p11N50Q75m22j407J434R09r91r09j82J380q21J532m99K13q94
$$ y = [357, -339, 1240, -608, 178, -299, 1382, -1088, -712, 343, 97, -1008, 1147, -98, 182, 2500, -192, 107, 331, -795, 891, 307, 1351, -580, -531, -569, -1888, -480, 235, -158, -627, -131, 1323, 456, 1796, 1531, -749, 868, -52, -588, -348, 1406, 509, -94, -455, 521, 1302, -261, -491, 715, 86, -417, -105, -1323, -304, 268, 111, 207, 545, 102, 474, -109, -1046, -65, 984, -447, -261, -96, 424, -174, 495, 532, 597, 1028, -158, 190, -552, -424, 322, -509, -275, 226, -913, 425, 315, -2140, 318, -474, -23, 66, -647, 1054, -572, -1232, 245, -273, -86, -302, 41, -795, 428, 729, 718, 1246, 427, 146, 1072, -13, 77, 203, 897, -183, 822, -960, -885, -382, -428, -709, -667, -809, -191, 741, -1637, -64, -1000, -131, 190, 685, 864, 851, 614, 1795, -370, -1081, -531, 344, -78, -1485, -51, 858, -133, -1042, -1224, 156, -665, 867, 368, 581, -313]
5988c13K16P9l56Q54J61l65j110J858j47k395J234o70J85K070j423k5P18q12j099
6007a340K66J382l85J036j231j92M57J134j920J063j067M97Q82j886J462j167
6023a009Q50r68K201J93k349J35N75o10R55n23J91l5l60M96j021K28J918p87o9
6042A1J060J038j237o99j66m09J289k113J578p79K57N58j573q16J936k80r41M26
6060h60k79L95J034j862K222k10o11J54k62N50J4J333j753R89Q82l485J939l7
6078A53L06N9J7j358Q70j713J957Q87q30L38j684P13n10O98P05j084K280k287
6096d83r00K209j240O74Q86j858J993p14j0r89N34J93k403J793M92J027k194k11
6114a201RK34n34K422p71J00j31j466J421R71j297M17L34k53L76J54M42l58j312
$$ y = [-313, -97, -18, -374, 480, 641, 276, -834, 1024, 877, -1518, -284, -954, -769, 1301, -122, -147, 571, -241, -1340, -1074, 308, -77, 959, -272, -464, -7, 1127, -793, 270, -797, -300, 582, -1304, 158, -1009, -159, -1127, 1074, 1267, -1082, -947, -372, -982, -27, -550, -359, -394, -754, -258, -1279, -1051, 867, 80, 11, 1071, 2109, 872, 173, 7, -402, 887, -1226, 352, -427, -170, 388, -1185, -2001, -65, -345, -1286, -860, -1139, -744, 290, -1572, 650, 440, -171, -17, -279, 271, 285, 1618, -135, 854, 1736, -1749, 190, 153, 459, 518, 535, -823, 47, -1666, 291, 1178, 348, 686, -998, -285, -795, -97, 608, -476, 1804, -483, -1383, 826, -414, 260, 1146, -712, 1281, 567, 557, -432, 102, 295, -2108, -315, 177, 1204, -990, -1201, -1192, -958, -1492, 930, 159, 259, 128, -1338, 83, 1054, -243, 174, 508, 255, 631, 785, 1227, 869, -443]
6133d43k89J179K54O94j620j221Q32J064j253Q48j082K298j407R8M36q47J827
6150A368p50on75O70o93J003j007J297r90o90Q58m57L6J269r83j352q93K669k205
6169a431R47P43O61j602O03J081J167k087j287R99J092P7n26R54j036J443k020
6186b22M14M98p70l28P41J00M15j521L66J762k65k186J476n67L8k92N88N78j650
6205h25J405J42j7j024R28J11o79P07j60k175J337p8m73k08J403p65Q61j458K40
6224g28J502m53o99L05J32k242K346k26M41j611K022k058K031q58j74L04R82j007
6242IP67Rn79Ln94o21O24J210j895J640k558K501j249O77J594j944rK173k455
6261f97K220l05p45k54m42J020o18n2q50O97k54P14o69l57J188r34J21k5j53K78
$$ y = [-443, -732, 447, 701, 1395, -225, -1446, -614, 450, -803, 45, -1037, 1261, -146, -48, 388, -459, 1368, 618, 612, 37, 707, 14, 1017, 10, 1307, 317, -373, 485, 28, 64, 1333, 350, -1002, -1895, 774, -1431, -484, 259, 920, -682, -79, 1002, 2169, 82, -1205, -206, 886, 963, 437, 1391, 355, 1798, -222, 192, 690, -80, -408, 333, 433, 848, -673, -307, 1455, 1190, -996, 480, -87, -49, -341, 247, 825, -825, 580, 722, 705, -319, 609, 720, 41, 748, 588, -1587, -250, -328, -801, -1009, 394, -371, 490, -968, -728, 774, 321, -378, -73, 59, -2183, 163, -63, 378, -1233, 789, -1269, 762, -96, -270, 34, 1016, 9, 776, 785, 206, 209, -385, -1006, -382, 828, -1067, 573, -1985, 516, -733, -56, 1538, -406, -415, 1758, -697, 1523, 1218, 473, 219, -223, 797, 179, 127, -723, -26, -280, 434, -235, -592, 596, -338, -217, -242, -395, -117]
6281a17j340K158j502P22l22L59r95Q40J86p22K167j763ol91P09J134p52L95k51
6300E09L41n64j267K10K048j622K94J343j148k4N86j541K84q38R02M79j621J788
6318A59R21M2J68j454J614j948L08l15Q24r74J072j25j363K245j352M70L66j061
6336d03J189j287j75N97L80R70P37k301Q92l99J303o00R2m24q40p66J656J80j651
6355h50M71O62q7j03m23N73j218L93Q67r00m27J606K60j382J699m69q50P69j05
6374D86l55J117k589K244q25o45J206o23k56J62K23m56m72m13J033k14J293j235
6392c19N94p60J153L52j356p90R55P32o87j45k29j288J906J531o94r70o88J09
6410e94j500J815m63J251o05k80j413K173N83k431L415k453J261J72j748p47N44
$$ y = [-117, -1457, 701, -801, -79, -401, -42, -1037, -197, -11, -733, 1434, -329, -335, -726, -17, 1117, 365, 760, 509, 850, 286, -981, -771, 1277, -345, -51, 1292, 144, 120, 706, -835, -551, -1389, -487, -8, -1629, 159, 1080, 1122, 1290, -164, 1450, -498, -190, -505, 319, -655, 417, 292, -1071, 1174, -178, 292, 658, -403, 786, -501, -676, -79, 301, 1271, 2008, -293, 599, 200, 1503, 903, 995, 571, -269, -1035, 621, 801, -850, -379, 283, 196, 93, -330, 243, -975, -582, 285, -615, -1042, 564, 824, -558, 1141, 672, -178, 591, 486, 131, 1248, -1341, 903, 78, -567, 639, 16, -240, -78, 145, -311, -783, -1196, -163, -377, 916, -319, 275, -485, 668, 1020, -336, -1126, -171, 561, -126, -271, -500, -1788, 118, 1649, 955, -15, -703, -594, -2094, -279, -742, 509, -96, -376, -1789, 384, 967, -1464, 1951, -502, 759, 931, -817, -1564, -1020]
6427a020J191K2l7q81J25J895k495J881j472J162o97l40k97K86J67J377m3j761
6445i37P92J81Q5j548J174k06J046j647L023j986n27J609p1j180k77P25L90m25
6463B21o22m00K031k276R51j014L38K56J560n80o21N90j331J366n46j91N94R31
6481A257j492J118q73r1p38J125q12J54J175m59M67j161K44k84k37J492p49j069
6499i33J32K346j108p12J317j831l64R01J653j004m70n17J526j243M71j359J957
6516G62j700J520j56m63k23m59J241o39J78o56N63P0M03l3L55o99o57Q64l26K268
6536B213j401r01J332j405k30k5r32J421J57l32r55J199k79Q53j147q1J191j154
6554d76R49j249P92m79N22k32J019j068j634K389j786K011M41p32K01j541K115
$$ y = [-1020, 171, 193, 156, -725, -600, 1295, -1200, 681, -791, 371, -326, -666, -963, -677, -510, 867, 824, -937, -145, 36, 121, -1427, -253, -459, 587, -1060, 1963, -23, -550, 1059, 988, -192, -469, 256, 646, 221, -401, -801, 1230, -1046, -95, -1109, -771, -515, 1045, 465, -156, 434, -897, 469, -77, -268, 326, 1257, -235, 883, 10, -81, -819, 306, -506, -352, 823, 364, 831, -330, -86, -370, -607, 885, 136, -933, -801, 1545, 437, -275, 1042, -789, -1153, -252, 1401, 397, -73, -590, 936, -307, 164, -1195, 762, -938, 582, 426, -37, -260, -719, 522, -117, 61, -595, -32, 38, 441, 408, 763, 64, -593, 271, -55, 2213, 812, -89, 1243, -162, -392, -417, -1349, 72, 229, -103, -1058, 141, -138, 715, -432, -513, 678, -476, 473, -776, 16, -463, 59, -173, 846, -222, -1856, 533, -1253, 758, 1199, 467, 668, -873, 1242]
6571A242j111j767K187N1r57p01K385j273m54Q80j650m48J477O71j331J934j908
6588g73J230j439J086r43Q65J204j440N54q70J011q57P87j076L17J553j819j32
6605g42K689j507p67l47J261j378J386j504J941m69o72P45k431J268J043J088
6621A604l62k637m43J480K76k86N54j137J637j485r81J443P21o14K07J208j232
6638d7O63r58J830j143N05J1j645J949j148Q25j987J945j486o76J718k60j144
6655a048K071R32l259J153O4M78q9l01k20N01L20j70k66P33q78n26L00J365j762
6674f02J319L63r43L4n62J12J003j276r11R48M47O69j3m83L4Q15k515J225Q3l
6694b56K06p4J053q72J42M71J3j049J498j077J029q41k81J09N9K9K0J14l67j309
$$ y = [1242, 131, -1636, 551, 602, -355, -1056, 1329, 56, -398, 482, -1168, -1616, -139, 532, -799, 1135, -773, 457, -982, 104, -839, 26, 1230, -210, 344, -526, 485, -372, 415, -661, -344, 1209, -610, -742, 1947, 440, -327, -674, 587, -791, 595, -909, 1032, 563, -109, 636, -1795, -527, 516, 1604, 1242, -1395, -1838, -358, -82, -368, 186, -951, 686, -799, -1780, -337, 384, -230, -23, 1185, -47, 616, -342, 1488, 345, 850, 861, -784, 1165, 17, 842, -1145, 800, -686, -1362, 356, 96, -1048, 1023, 1955, -1304, -151, -87, 391, 302, 1, -219, 282, 602, 432, 166, 899, 21, -505, -205, 1160, -602, 717, 1080, 137, 171, -391, -279, 724, -552, -1463, -515, -68, 601, 588, 105, 139, 954, -1561, -336, -253, -256, -50, -124, 929, 57, 199, 670, 683, -366, 1132, 55, 1084, 243, -38, 71, 130, 159, 179, 293, -74, -1383]
6714a383K074r53q66J023J80J024j244k26k5k56J407j347R65k98Q74k008J462
6731D03J259q79j858J687N82k294J027p61R37n58L60O15K33n43r39K62p74R05
6749c36J253j605J92L73j93k43J331o9j24l92r69L50OQ2R01n57L44m47j69J433
6769A161j685L47j763J757Q31j52m88O15o14p71R90l16K189j207l70k63n07K444
6787B198k691p3m01J800k127O85J10J80O00j376K447k061K329k343J287L66p90
6804A40O2j74J275j136l81M47k44m87R18J35P79j382q20J65R78O6k703M47J221
6823f94R10nM31j38j018n33R97j486K396j001J13P14J054k242j47L56o54J048
6841A01L87N26n36J469j821o37L30l93J046j564J103P47q17J80K96R6m94k51K22
$$ y = [-1383, 691, -262, -1128, -105, 75, 1099, -145, -371, -396, -652, 755, -592, 373, 75, 949, -1059, 403, 1662, 783, -1075, 612, 1194, -1100, -73, -834, 103, -455, -95, 520, 753, 210, -729, -467, -1241, -336, 917, -688, -496, -123, -316, -559, 772, 703, 579, 187, -782, -432, -426, -344, 557, 0, 344, -103, -272, 1161, -524, -177, -1940, -183, 648, 496, 8, 623, 9, -762, 228, -88, 2101, 894, 524, 261, -246, 2198, -493, -566, -967, 833, -1294, -609, -499, -319, 281, -1095, 1352, -709, 1620, -723, 564, 930, 140, 202, 28, 1303, 167, -214, 233, -11, -498, 420, 555, 1334, -48, -868, -703, 275, 341, -2362, -1915, -694, 216, 211, 642, 504, -514, -1047, -50, -1536, 860, -141, -28, 686, 1740, -502, -649, -293, -947, 101, 488, 1014, 478, 1947, 126, -511, -181, -574, 472, -1092, 11, 758, -59, 121, 417, 513, 19, -232, -10]
6860a0K94J79O8j155K548k433j9K82r35J695n54j3K30L8j324K94J434k033K127
6879G13o54q43J550j238r89J663k04P52j044r28K8K036j175P90o23O04j211O22
6897a51J248L34Q4m55n23j138Q36n66L39m06J340j075K98q09J586p92j3k141K459
6916D55o60P22m03l38P16n28qj895K010j152J114J212r68l0n45j531K925j383
6934b87J315p46q83R85j026J175l53Q9l45j50n67P79N4j01m44r94K013j23j480
6953a089j310J614K236k222k38N28K310k142M7q27K346m44l31k98J812j602J51
6970E41m05q23Q56m16l7J104j269J218j637J406r96R77r61K63k5p7R42j03j910
6989a352K438m3j567K75J50Q18r84J79M0J34n14k04K67P60j5O00m90j303R14j183
$$ y = [-10, 284, 463, 531, -624, 1924, -509, -528, -246, -1181, 514, -40, -53, 177, 215, -1109, -815, 619, -1414, 713, 59, -784, 766, -472, -1461, 202, -2, 750, -294, -1222, -1194, 842, -333, 457, -166, 438, -773, -151, 1097, 1431, 1515, 1060, 537, -601, 235, -331, 8, -398, 942, -133, 165, -644, 942, 150, 137, -2004, 455, -205, 517, 114, -224, 492, -36, -44, -1939, 71, -1081, 33, 1245, 277, 247, -298, -1829, 1096, -287, 1028, 282, -601, 384, -642, 533, 180, 269, -76, -226, -793, -14, 40, -61, -505, -1499, 514, 391, -1089, -2399, -785, 1451, -771, -1009, -481, 1829, -313, -266, -1093, 1253, 809, 478, 180, 1992, 390, 541, 136, -687, 169, -247, -284, 820, -449, 769, -868, 538, -458, 519, -442, -179, -204, -281, 661, 558, -1352, 1086, 1043, -524, -249, -99, 719, -265, -86, -46, 88, -426, -630, -363, 397, 382, 982, 492, -811, 103, -1080]
7009a080K272j763n17L076j706p23j452M98J524m13l63L66N53j203PK096j070
7026A02L75O61j774j14p11K445j434J33N89j38Q47m8n37O96L7q63l48m9R41r83
7046a73J70p21J81J356R02k264R12n15J133j799Q89M17j322J149j13m42Q5q71
7064a026O8O68p59j4J483p86N69L95j360r61J827J65j86L7J45N45N4j132m34M10
7084b92L2o76K406j518p92P45m34k31J97K11n45J902j053N08L93r43L97j21K46
7103D32n96J106K45j269J005k54k581M058k271L98J16j340N28N5O49j918J674
7120C7J679j978J155n53j243O46M38j121K108k198L75K71J24J471m62j248O74
7137A75M1j833K417L95p32R16k180j031o13K172j595J685J144l094K641R29K96
$$ y = [-1080, 1192, -571, -1088, 1988, 282, -441, -1893, -1395, 129, -284, -647, -281, 272, -931, -924, 1172, 102, 477, 1138, -636, -750, -1461, 984, -450, -317, 272, 134, 981, 933, 396, 1092, 1129, 266, -82, -131, 810, -173, -3, -724, -543, 813, 1715, -549, 363, -152, 981, -818, 71, 488, -834, 315, 202, -240, -155, -1026, -958, -290, -1049, -1063, 420, -366, 203, 598, -762, -1723, 104, 269, 83, 120, 265, 810, 864, -268, -702, -292, -260, -936, 1470, -48, -840, -95, -529, -760, -563, -352, -897, 1005, -48, 460, 853, -90, 307, 186, 432, -164, 942, 1187, -82, 923, 669, -1912, 2146, -125, 273, 389, -951, -423, -368, 281, -1637, 37, 1716, -262, 893, 340, -903, -257, 181, -940, 1168, -1030, -655, -384, -260, 1211, 749, -499, 175, 216, -1617, 800, 1195, 463, 1379, -801, -1832, -2445, -273, -1868, -183, 961, -2133, 508, 1437, 1733]
7154A733l811K775k18r6J071j997J096j716J456N94m95l42p56J001J209k238J254
7171E20m21J176j352k66P98j306m92N71O60K58P86L35K51l35q34p00J03J080j283
7190d51M60M98l22o63k82J305j516O14K42J165r52j184O56K52l20l22j545L107
7208G42j945P28J602j499O98j635J861r79Q41j179J17M89l72J596m04j43j472
7225i54K214j229n84p6k26J103R07j419K99j058J945k550J614j23N54j63j367
7242a113K62J184R4o6P14r46K27n99p91K620j074n22J345p24l12m08n07R77j499
7261a138P3J038j725K592J37r60r22J441M22J83o75o15R06L11m55l76P85j003
7279A9n4q13n7J147j355N00R9R29l58L94l9n05J305l191K922j68m32M93j92M88
$$ y = [1733, -2078, 697, 479, 383, 1454, -543, 553, -1163, 293, 887, 392, 50, -706, 295, 1504, -734, 520, 99, 1275, -77, -343, 455, -851, -1343, -772, -112, 146, 932, 1267, 1518, 1183, 349, -351, -248, 832, -451, 9, 507, 185, -478, -760, 545, -971, -357, -115, 1050, 98, -1086, -430, -178, -498, -820, -2365, 742, -1203, -475, 1127, -372, 326, -1309, 552, -427, 414, -765, -648, -159, -531, 1065, 661, 518, -954, 1260, 31, -553, -629, -855, 248, 1155, -264, 35, -1023, 922, -1628, -14, -137, 417, 254, -1113, -851, 333, 427, 361, 1075, 129, 356, -243, -1034, 1586, 512, -10, 1335, 611, 299, -109, -616, 361, -1138, -1065, -27, -1752, 840, 977, 17, -905, 536, 958, 1141, 466, -149, 757, 1068, 613, 237, 1022, 19, -35, -848, -905, 242, -1113, -613, -514, 415, 57, 451, 412, -93, 1212, -1979, 943, 775, 343, 836, 644, 1132]
7299A132p43p70j177J429j12R36r31Q7l85M38n64J014r60J176j16L35p46j295
7317a252J279j410N07J600j65k01j802J557p84J362j563P08P73P53o29j597J091
7334B27K96n31J010p82q55N67P13j855J10Q72P8j337J032l60J729K63j447K407
7352B137j887k85l52J323j727J151j369J927n21K37R0M7m19k90L94l00J049j667
7370d62Q67m70mO77k47j425Q18m90l4Q97o78J53P57j580O86K214j982J045k226
7389a484K324q82p82J231MP18j215l78J62J90k87J274j129n22J73O98j008p21
7407a634J296J30P19j12p71R17k719J759N7j9j317J258O85O50M60j367l15k17
7425e40pK414j229m94j740K228j919J836k94Q27q14m63J194o02K32r18Q89j52
$$ y = [1132, 389, -381, -1558, -129, -241, 695, -236, -149, -534, -96, -660, 354, -606, 570, 454, 789, 43, -1252, 27, -1383, -876, 724, 559, 358, -1444, 113, -671, 691, -872, -164, 609, 1362, 733, -864, 227, 523, -8, 1002, 220, -635, -68, 645, -1210, -1100, -228, -150, -1487, -455, -815, 914, 1177, -270, 2137, 250, -35, -387, 936, -791, 360, -1009, 918, 397, 634, 724, 771, 352, 62, 456, 156, 1205, -462, 405, -65, -69, 608, 361, -1064, -246, -736, -770, 127, -551, -398, 359, -1221, -535, 1679, -303, 742, -1484, 840, -42, -824, 407, 411, 1129, -86, -464, -302, -112, -399, 875, -254, -776, -603, 95, -913, -1634, -338, -208, 511, 399, -372, 545, -2174, -415, -358, -377, -1694, -436, 249, 899, 1359, -8, -323, -540, -547, 1867, 638, 144, -1596, 632, -1287, 549, 255, 1082, 268, -195, 999, 397, 629, -289, 600, 448]
7443D48r55L62R79j759j48M40O43j416J536L49n07J130o20j30j671J663j395J263
7461B12j81n93R26j24n9k82J478j399J39K88j437P60J147Q22k721Q58J91M02r97
7480e70J615k335J081R28o81R32q29j61NK116j780o75m92k66N71rJ368l34l49
7499A35j025p10J238N04r59N66J147j757J340k101L51J277Q04j178J130j04O61
7516A319n46l56O30R9j845J277N8j004J145m5j05j516K086n10j000j092J287K248
7534B130l454L17J351q78K355k456K084j651R09j483k69k57K225j76j405O19p70
7551h09o0J695o37N70j198J166j200q9N88K0n50P72L22q34l09M16j45J853r23
7570F48j034O69o44q7P71j225j48K093l003K266j776J548M69r89o97J600j847
$$ y = [448, -507, -145, 834, -925, -1073, -633, 10, -1406, 130, 479, -28, 1102, 482, 352, -1319, 344, -1051, 212, 31, -562, 364, 240, 181, -101, 1377, -22, 117, 405, -1032, -272, 875, 1697, -1024, -166, 25, 427, -570, 1045, -1290, -209, 719, 38, 970, 141, -20, -15, 2101, 321, -354, -846, -1112, -541, -550, 818, 484, 135, -890, -1600, -362, 142, -817, -251, 896, -861, 479, -1622, -1271, 6, 810, -368, 762, 658, 1319, 773, 417, 1047, 1146, -699, 578, 636, -368, 777, 732, 627, -889, 1197, 687, -313, -1405, -118, 2130, -1324, -1007, 344, -534, 1821, -635, 1449, -202, 707, -776, -1045, -1302, 923, 747, -658, -39, -809, -869, 826, 189, 759, -439, 727, -473, -562, 26, 46, -504, 268, 590, -244, -553, -137, -282, 1571, 648, -386, 283, -361, -448, 323, -902, -1050, 1043, -1960, 306, -1470, 78, 547, -442, -1139, 461, -1386]
7587a386K305k97p79P90J70j082P30k487J920K727j889K87o68K09o82J94j147
7604a085J852o16L8o57K24J50L71R64j290o25K96k45K31j02N28k44k81J228k41
7623D96J24O74m54j549M87J35O89j275J437m6j200N10P16j642J738p30k99L31
7641A42P68L60j990n5J325j31k054Q01J278J388j30j880J076m77j80j039J051
7658B53n17q09K522j499j69N39j6j69o31n05J971q44P8R31j329N63j271J161J02
7677C61K92k13j368J283k157R98M36K65r39K052J132o56r81r02P41n75N80j101
7695g52K242p45m42j397Q60o0m45l62K444k433J17N2J958j926Q6J508L53m40R47
7714A565k178l86J200o4p17K37j70K35j341K80J82K995k196j86K396k403K458
$$ y = [-1386, 919, 622, -157, 633, 803, -279, 451, -2036, -116, 2611, 722, 1009, 341, 550, -132, 62, -1085, 767, 151, 189, -468, -244, -94, 277, 1241, -49, -674, -378, -623, -392, -494, 34, -210, -491, 737, 496, 620, 1294, 840, -709, -222, -87, 602, -673, 764, 718, -482, 28, 744, -898, 840, 110, -189, 142, 910, 1270, -720, -775, 550, 419, -1635, -834, 444, 1832, 1702, -178, 898, 421, 241, -798, 253, -264, -1073, 1449, -50, -219, 320, 304, 135, -496, -1001, 970, 126, 204, 1135, -194, 369, -902, 259, 361, 653, 440, -928, 355, -1802, -804, -368, -103, -1042, 1010, 2142, 1486, 505, -397, 344, -231, 349, -752, 1490, 745, 303, -1094, -234, -294, -739, -1101, 1343, -1090, -973, -921, 1037, -889, -803, 705, 1058, 618, 1565, -613, -999, 201, 137, -580, -343, -513, -278, -1619, -1339, -1157, 1838, -358, -544, 1852, -551, 1907]
7731A907k058j185J827l99k456J490J183k033J461P46K38k08j479J523p7j65j110
7748g95J666j835M51Q88o07M60j109J625j046P60p76L5J41l06J358j758J987j356
7766b17R92l13Nj322O43J824n65j163K32M77j089n5L27k61K89M57p24p64J841
7785F14J343r45j517M30m47l3K99R6J139j080K4k29P56k87n71M7k06J219j828
7804a176K078n72R77j670q68J416K43n39Q17O60k687N38N40J016j54n88P75q26
7822b0N04j019L58J194k89j324k06J863k62j253r93J063J045r34k2M11K24m4r02
7841f06K89R21k69J49j532Q32O69J409k219K95P57j637J04M30O8J520o92k252
7859a764K434j240Q48j282J021N90l50R7j469P58j47J166j585J765K43N09n19
$$ y = [1907, -151, -1336, 491, 92, -2364, -874, 309, -1724, -263, 483, 721, 513, -966, 557, 480, 315, -795, 871, -964, -513, 375, -232, 228, -881, 744, -302, 458, -318, -283, -142, -448, 910, -848, 1139, -217, 775, 462, 467, -855, -212, 1612, 1047, -116, 116, 593, -496, -551, -224, -485, -196, 261, -463, -1227, 614, 1957, 1012, -505, -75, -522, -555, -256, -160, 979, -101, -77, -306, 450, 163, -408, -361, -567, 652, -1176, 902, 330, 1307, -363, -1231, 185, 428, -111, 706, 1366, -1321, -783, -243, 773, 619, 31, 806, -20, 484, -535, -177, 1017, 728, -596, -802, 1061, 799, -454, -1447, -384, 661, -273, -295, 116, 340, 296, -606, -317, 604, 335, 484, -1048, -216, 453, 1862, -357, -62, 695, -942, -838, -408, -340, 1180, 488, -1764, 670, -570, 278, -1004, 17, 607, 257, 354, -1115, -357, -504, 662, -923, 842, 1085, 1594, 1075]
7876A075n56m97o15Q0J596j862J247m59o65J810j422P41n24N91k321J772K27r01
7894f83l43N63Q36p88j537K133n40n89R97k48j85m33O77J437p68J200k305J414
7912H38j054J168j762N29J19O38j296j48N85J381N2r84o74M42J732j977O26J739
7930A954j693q2N48l74J317k033n06M88K038j278k492K600l9j096J861l30o93
7947A90n23o06J170L30j31j063K37j217R25J621j498j74J707m71l54J002j56m72
7965E17p34l55J006J3j740J622j115K661k612O30P7o67J018k69j023J426l94%
7983F1p79J019o77l3k74K366l26r65K51L96K26r92K92M9j543J375k09L0o2K5Q26
8004A056k530J780j329J395o27K90l06R59r7K89j227J876j343L11p82r50L14J598
$$ y = [1075, 519, 22, -593, -513, 1083, -779, 468, 9, -656, 1154, -268, 473, -51, 540, -1781, -9, 218, -683, -1026, -463, 373, -415, -1952, 181, -359, -948, 49, -199, -384, -817, -140, 1297, 529, 1729, -576, 838, -216, 952, -810, -281, -162, 476, -820, -968, -383, 998, 1050, 66, -608, -166, 1566, -411, 215, 1954, 261, 179, 727, 353, 1670, -363, -869, -381, 1657, 379, -2113, 487, 448, -648, 1213, 883, 190, -333, -939, 231, 561, 430, -633, -396, -1613, -688, 933, -565, -739, 968, 497, 143, 1145, 989, 517, -217, -572, 434, 447, -1293, 329, -786, 1875, -737, -107, -30, -697, 321, 52, -971, 455, 61, 61, -718, 301, -376, -409, -683, 1683, 1357, 392, 643, 1039, 1265, 273, 565, 614, -929, 446, 237, 267, 205, 230, 1056, -1474, 306, -1023, 372, -255, 35, -271, 688, 591, 880, -347, 1529, 186, 497, -285, -1235, -921, 677]
8022F77m00n05m61m41J300q17j596J926N56l16J101l69k387K518l65j035j99L84
8040d29R95J90n36O55Q03j483k25M75r07m31J667j148M12q80N9n82J965r34j136
8059a470j15J131R05q50R99r29q20J270j017R04Q14l11j09j518J150j29q37J21
8077h11k94R90k57L03p8K11l83n72J507n82j291J874j080Q87L31O15r89J43N98
8096A122j192O57J36l51L51o26j333K018j019j4k28n30J184R98j56j153K96k97
8114a37P28k93n73m33j114J856j098J170j00N35l90j215L94J137n83k78K45p21
8132h70J216k530J938O49j57N52k361J533P61n90N11r45p14J762J27o61N57j571
8150g93r21J750Q01r74M73n29n59M81O59L59P42j277j325M83j791L545j547P77
$$ y = [677, 277, -228, -689, -1130, 170, -647, -2243, -317, 239, -77, 1024, 655, -1732, 786, 421, -614, -813, -429, 566, 756, 220, 875, 1678, 195, -30, 445, -462, -893, 774, -374, 38, -842, -783, -1365, 600, -334, -1470, -1585, -454, 451, -399, 600, -329, -1149, 121, -896, 8, 822, 511, 402, -1116, 34, -95, -932, -811, -1105, -115, -372, -69, -147, 64, -319, -891, 616, 34, -1257, 617, -463, 424, 755, 1370, 381, 524, 1122, -70, 587, 723, 372, 723, 97, -1236, 782, -237, -251, -479, -1009, 175, 1173, 1017, -136, 160, -137, 591, 298, -275, -708, -1822, 34, -1064, 106, 6, 541, 151, -1064, -670, 467, -116, -394, -149, -870, 346, -2184, -246, 403, 246, 798, -1563, -30, 731, 141, 652, -293, -1007, 755, 882, 221, 778, -793, -1714, 36, 837, -137, 336, -193, -752, -271, 388, 747, 1489, 212, -1113, -630, -2421, 1124, -423, 354]
8168C54J495j663k27P59N92j281J313j992J258q55n44P73K75j423K76O07O18n86
8186b51j498L333k621L85J68
$$ y = [354, 1849, 186, -41, 718, 1310, 29, 1342, -650, 608, -247, -791, -18, 257, -1166, -890, -283, 335, -251, -1749, 1584, -1037, -652, -484]
8191d84
$$ Imaginary data points
##PAGE= N=2
##DATA TABLE= (X++(I..I)), XYDATA
0@%%%%%%%%%%%%%J28k56K56k56K57l85N12n55O83q56R85j153J401j627J862k142
29a146K427k749L135l570M054m572N147n781O480p253Q094r013J0020j1117J2314
44F470j3626J5058j6623J8332k0204K2262k4521K7020k9778L2852l6298M0165
56B1109m4558M9598n5447O2326p0544Q0588r3183J09502j31622J63447k13381
67a22165L03517n16386J877311J437346m333142q38434K845453J569909k537950
76c14541j544982J611151J556975j358289j332288P85176J212215m50246o33584
85d68413L09231L97400l29917l0448L72837p1099l76095M56950N87241n89559
95B58128r63269M85506J112231k91863j211762K6817R48022r0960r59993Q8382
$$ y = [0, 0, 0, 0, 0, 0, 0, 0, 0, 0, 0, 0, 0, 0, 128, -128, 128, -128, 129, -256, 256, -299, 384, -472, 513, -640, 761, -866, 996, -1146, 1281, -1468, 1667, -1903, 2151, -2421, 2726, -3055, 3425, -3828, 4266, -4747, 5273, -5844, 6470, -7156, 7902, -8721, 9611, -10593, 11669, -12852, 14168, -15610, 17242, -19056, 21109, -23449, 26149, -29298, 33028, -37516, 43072, -50111, 59391, -72231, 91216, -122165, 181352, -335034, 1542277, 2979623, -1353519, -2191953, 653500, 2223409, -314541, -1859523, -248372, 1308603, -49686, -1381974, -596798, 615417, 165171, -468413, -159182, 238218, -91699, -122147, 250690, 179591, -196504, 260446, 847687, 258128, -705141, -219635, 892596, 600733, -611029, -584212, 363810, 272850, -687143, -598761]
105e98761R83401O2226q54784q4433P15422Q2648n45262R5975N60657j95658o80672
116d59241R7404O45534j0458n02703P0016M58521o8697l61296J34224L02661j98536
127A07429k49497K66169J71635m49137k60490N05774L15732n31106l63379N31152
137D4282L19667o97541m69364P50202O94599o20507p74397N37896R10306k82007
147D13136p99661K35982Q32387q8111q09299j27007N96014J53325m76760k16851
157b86845K42630O7972k16469l0641J68254n404j08045R7149J25232j24327j30547
168b01041J79289K17140q3593j46614J04535J22573j29334j20154J71252J68652
178B82705j70535k58920K4589J72592r177j25593J4314J03602j1520j05299k6124
$$ y = [-598761, 384640, 446866, -407918, -492351, 223071, 305719, -239543, -143568, 417089, 221431, -459241, -361837, 283697, 273239, -229464, -159448, 299073, 230376, -130920, 3304, 305965, 107429, -142068, 124101, 295736, -153401, -413891, 91883, 407615, -123491, -486870, 44282, 363949, -333592, -802956, -52754, 641845, 21338, -753059, -215163, 695143, 413136, -386525, -150543, 681844, 593733, -215566, -342573, 253441, 406766, -69994, -286845, -44215, 23757, -192712, -223353, -55099, -60503, -168548, -71399, 53833, -70494, -201041, -21752, 195388, 111795, -34819, 69716, 192289, 62955, -57199, 114053, 282705, 112170, -146750, -122161, 50431, 41254, -84339, -70025, 33577, 22057, -83242, -109366]
189a09366P2497O7232n396p1983q2069Q901R4650L4337n5978J1620J23890K9538
201A17873j30661l1045J78003Q6537j69843j20480J59542J26689j95772k17138
211a96295J41548K53786q7247k95867n1062K02082P6364j43759q9875R0516R1041
222h768k7560m8203L7736R6248P2504m274o7251k2834Q4137P3404p5882j30930
234b1673J5270J05878k9062j49394k9262J09930K9081j14903n5385Q6741N3208
245D29p8707n9409O9225Q9863k0310n8305K9371R3084N2632m6792o8069J7208
257B0220R0269K1279j09877r2099P9864J08635p3720j48266M6061J68878l0179
268H1065k16123l7829J98702O7536j91153j05790J74201J27241j38647j24919
$$ y = [-109366, -36869, 30363, 24967, -47016, -129085, -120184, -25534, 8803, -47175, -35555, 88335, 117873, -12788, -43833, 134170, 220707, 50864, -69616, 89926, 216615, 20843, -196295, -54747, 199039, 111792, -184075, -235137, -33055, 43309, -100450, -190325, -99809, -8768, -36328, -84531, -46795, 49453, 121957, 117683, 50432, 27598, 111735, 185139, 109257, -21673, -6403, 99475, 70413, -78981, -108243, 1687, 30768, -84135, -139520, -52779, 429, -78278, -137687, -68462, 21401, 1091, -57214, -27843, 65241, 117873, 71081, 3012, 20220, 110489, 131768, 21891, -70208, 9656, 118291, 44571, -103695, -57634, 111244, 81065, -135058, -172887, 25815, 93351, -97802, -203592, -29391, 97850, -40797, -165716]
278a65716J45844J72072q7017j60286O1400J60906j6014j25905R870J19809R966
289A24929j12920n4286N8671N6254k9679p0970m2417J4732L4248j6184n9597l921
301a01140P4573K5965q0038l1853J12966R9170o8385q5033Q9718J17011p4672
312G8282j34156O5271J62433l9180j83419k0036J45786K2992j54079o7894J03182
323b0818O6013r3830r1969M4078R0954J8815l2234k5362J145M1157N3906j4705
335C7150o3191J3306R6412J5360j08699l6486J12826N6106j17578q0512J05088
346B9782Q7663j22781j30336R8393J55125o8685j82419Q429J52321K1481j29502
357h0529m1423J03448O1853n8528n4809M5511O8513J4250k3809j5486J2381L1630
$$ y = [-165716, -19872, 152200, 65183, -95103, -33703, 127203, 111189, -14716, -4846, 114963, 124929, 12009, -42277, 16394, 72648, 42969, -28001, -70418, -55686, -21438, -37622, -97219, -101140, -26567, -602, -80640, -112493, 473, 99643, 31258, -53775, 35943, 152954, 78282, -55874, 9397, 171830, 132650, -50769, -70805, 74981, 97973, -56106, -124000, -20818, 45195, -48635, -140604, -96526, -5572, 13243, -18991, -44353, -43208, -2051, 51855, 37150, -26041, -12735, 83677, 99037, -9662, -46148, 66678, 122784, 5206, -75306, 29782, 117445, -5336, -135672, -37279, 117846, 49161, -133258, -124829, 27492, 48973, -80529, -121952, -18504, 43349, -15179, -69988, -24477, 44036, 58286, 34477, 18991, 31372, 63002]
369F3002J6073l3257l6837K4209M3342m5203r4598M60P7131K266q9951k8919P1488
382c0794K2647o5205j5776Q7708M3672o5088l0738P7386N5549m5282l5088N4238
394E3229M1186n9516m7297L6056L4529m3359l4483L0424N988n7690k0075O3886
406B878K6942p1253m9487O2760N6601n2120n9377N2872P8084k7414p5720J3944
418d1290P3745J7842l7851k386L5588k799l4227J0889M6574j763n2875k6246K4787
431I988J2421l8771l5119J5783K2707j8621m1527p927L2921L7507P618j7875j0901
444c1796K4007M2353J6455j7142p435K9192K6695l4298n3625J0028N7833l494
456E8773p6380m1244L9899K8414n0887m0661N0492N5494m3546p4913L1452Q9581
$$ y = [63002, 79075, 45818, 8981, 33190, 76532, 31329, -63269, -62809, 14322, 16588, -73363, -102282, -30794, -8147, -73352, -89128, -1420, 42252, -22836, -53574, 23812, 79361, 34079, -1009, 53229, 94415, 34899, -12398, 23658, 58187, 14828, -19655, 10769, 16757, -40933, -61008, 2878, 29820, -41433, -90920, -28160, 28441, -23679, -83056, -30184, 47900, 20486, -55234, -41290, 32455, 50297, 12446, 10060, 45648, 42849, 8622, 19511, 66085, 64322, 11447, -14799, 9988, 22409, -16362, -51481, -35698, -12991, -31612, -73139, -81066, -48145, -10638, -3020, -20895, -31796, -7789, 34564, 51019, 33877, 26442, 55634, 82329, 48031, -5594, 4434, 62267, 58773, -17607, -58851, -18952, 9462, -41425, -82086, -31594, 23900, -19646, -94559, -63107, 26474]
468B6474J0441o7134k297O6215J3142n8960j5053O6870M3913m3320n5985J1312
480d382M1822K910j9561j5876j174R781L45k8138m1894J2381N8202L107p6849
493e9326l9547O4787N1638n0238l7648P0913P0431o3590p7977O9175J13395k5324
505H6689r6782K0588R0304k7472j14461O852J09720O34j26190n6928Q2247M4420
517A9621o7974l9905N2231M0590l7951k7523L1711L1832J500J8004K6342j9074
529B9404l5155K4718N1739j8633m4796K1453L5473n5741p3533L9640Q7178k9062
541C2685r6358L414P8779j7718q5026K0878J07236r9j11674k6983J01471M8517
553E5122o5947l2143O7944L4848n4631l0138M7299L9602k1985j8547J8847j5184
$$ y = [26474, 36915, -30219, -32516, 33699, 46841, -12119, -27172, 39698, 83611, 40291, -15694, -4382, 37440, 40350, 20789, 4913, 3739, 13520, 13865, -14273, -56167, -43786, 14416, 17523, -59326, -98873, -34086, 17552, -32686, -70334, 579, 71010, 7420, -70557, -1382, 112013, 86689, -10093, 10495, 100799, 73327, -41134, -34282, 75438, 76072, -50118, -107046, -24799, 19621, -48353, -88258, -36027, 4563, -33388, -60911, -29200, 2632, 4132, 22136, 48478, 29404, -5751, 18967, 70706, 52073, 7277, 28730, 64203, 8462, -65071, -25431, 61747, 32685, -63673, -60259, 18520, 802, -84224, -63346, 43890, 43791, -67883, -94866, 6605, 55122, -10825, -42968, 24976, 59824, 5193, -24945, 22354, 61956, 39971, 21424, 40271, 25087]
565B5087m2381L813M5007o658n2184k358K7992k8176n3240K3445P5351r248p4581
578f8131m130O9085K2939l7099J9970O9533j01p8306j2198P5781L2092o1577m1743
591a3885L6237J7868m5118l3531K7118J7150k7423j5829Q317j1529k5692K3987
603d2330N5743m980m4763J0693N5428p27m6435J5954P1867k20q0830k1444O9368
616C7324K7643o3155l1010N6395K2625o8537n0868O3256O3216m7740p7062J5902
628e2011O2009o196n9038k560N9925K5140l1053k7985K1739L5222J0661j4030
640B1823j3411L726J8021J917k0926q914K9745K5538l1431n8051j592M4706J60
653A1311n5111j9866L9420K0303l9426k6148N2602N3531k3429m8177J7021N7280
$$ y = [25087, -17294, -13481, 31526, 24868, -27316, -29674, -1682, -29858, -83098, -59653, 15698, 6450, -68131, -72261, -3176, 19763, -17336, 2634, 72167, 72066, -6240, -18438, 57343, 89435, 27858, -13885, 22352, 40220, -4898, -38429, -11311, 5839, -21584, -37413, -29096, -40625, -66317, -42330, 13413, 8433, -36330, -25637, 29791, 29064, -17371, -1417, 70450, 70230, -10600, -32044, 37324, 64967, 1812, -29198, 27197, 49822, -18715, -69583, -6327, 56889, 9149, -67913, -52011, 9998, 3802, -55236, -57796, 2129, 27269, -3784, -31769, -10030, 25192, 35853, 21823, 8412, 12138, 30159, 32076, 11150, 2236, 31981, 57519, 26088, -31963, -33555, 11151, 11311, -43800, -63666, -24246, -3943, -43369, -69517, -16915, 36616, 13187, -34990, -17969, 39311]
665C9311O889l7913r102M2765J7380l6611l4856J8016L2922r326l9055j7723J9336
678g967J5063k3100l3720L859L7783J1262l1139k4686L1686M5821L4k9969j58
691e231K4650J253k4582J00L4664P623l9503j3248L9768K4625l0699m3277J7218
704f639L9070j7957n7262j0694M5838K4324k9971l4279J6405L7700j294k8790
716b3549k285K8695J4827k2000j2866K5405L0057o540k3701P410K7631o002l4982
729B100j0519K8282J0349l9450l8614J0494L5664l771k9623r166K6587J9823j0442
742h286j2983J0013K2708O446j3607r698J3093K4099J249k1179o930K6193R283
755D0401l5582l2619J9846L7075k1268n1139j544M9524R724m1933r774M1659K0150
$$ y = [39311, 46200, 8287, -815, 41950, 59330, 22719, -12137, 5879, 38801, 29475, -9580, -27303, -7967, 7096, -16004, -49724, -45865, -8082, 3180, -27959, -52645, -20959, 24862, 24896, -5073, -5231, 19419, 20672, -3910, -3810, 30854, 38477, -1026, -14274, 25494, 50119, 19420, -23857, -6639, 32431, 14474, -42788, -53482, -7644, 16680, -13291, -47570, -31165, 6535, 5241, -23549, -25834, 2861, 17688, -4312, -17178, 8227, 38284, 31744, 8043, 15453, 43084, 37082, 2100, -8419, 19863, 30212, -9238, -47852, -37358, -1694, -5465, -35088, -44254, -17667, 2156, -8286, -21269, -11256, 11452, 17898, 4291, -5407, 7686, 31785, 33034, 11855, 4925, 31118, 40401, 4819, -27800, -7954, 29121, 7853, -43286, -44830, 4694, 14418, -27515, -37289, 4370, 24520]
768B4520m2169k5933L7211L0571k6173k5862K3337L3130r523k2674J2655K4824
780C3914k061j8897l461Q26n542J54O530q305k4876L029K0856o146l2852Q49L7763
795A781L951l8979j2027M0936K3634k3561j1254L4130K1298k6227j5167K9318
807B7833J7172k6022k5250J5175J4866k0309k2975Q202J1719j0934p941M777j512
820a5199q319J1836J6419j4031k2073J5480L6083q093l4418J5119M5615l191m5554
833a0326P80M6641K428m7758j0979M4608R728n0265j3000M7010J1818m9201k6808
846d5324M1449K6585m0745l2737K9757L3509k0467k3282K1344K6194r305r972
858b994J5601J0687j0143R14J6545m528k3718J61K2022p665l5582Q21K8952r889
$$ y = [24520, -17649, -43582, -6371, 24200, -1973, -27835, -4498, 28632, 19109, -3565, 9090, 33914, 31853, 12956, 9495, 10321, 4779, 4933, 11463, 3158, -21718, -18689, 2167, -3979, -36831, -35982, 1781, 5732, -33247, -45274, -4338, 19296, -4265, -15519, 18611, 39909, 13682, -1485, 27833, 45005, 18983, -6267, 8908, 23774, 3465, -19510, -11308, 411, -10523, -18464, -13687, -15199, -23518, -11682, 4737, -9294, -31367, -15887, 20196, 12103, -22315, -7196, 38419, 35228, -10326, -9546, 37095, 39523, -8235, -19214, 25394, 35122, -15143, -28143, 18867, 30685, -18516, -45324, -3875, 22710, -18035, -50772, -21015, 12494, -7973, -31255, -9911, 16283, 6978, -2994, 12607, 23294, 13151, 14065, 30610, 26082, 2364, 2525, 24547, 16882, -18700, -17879, 11073, 1184]
872A184l8738j481M1246Q381m4457j2055M5511J8813l7501j1856M5555L0607l4467
885A0742l0791K8126L6429j8978l2356N755K3318o924k1822j958J0756R003n592
898E708j1483j4748k205J6530J2137j8532j7329J7274K1151j5333k5105J9837
910a2098L8687p339l7072O011L9997L480l5410m93M1740R115m6783k5356L2265
923F744K7014k6988l3947R930K1843j3077k9101L224K5140J1564j6235j1851P925
936a7815J9536J2693j460l567K673J0169O19j7439n397J8538J3471j6364k5561
949i904P93J6105o950j8156L14J8185j331k5619r566K4410K2850j0007j4295N038
963h133J6157l353j4897J007K3502J5389j4693k0023q3J7910J1231j0858j1715
$$ y = [1184, -37554, -39035, 2211, 10592, -33865, -45920, -409, 18404, -19097, -30953, 14602, 45209, 10742, -20049, 8077, 44506, 25528, -6828, -1073, 22245, 15321, -6501, -8459, 2297, 11300, 5708, -5775, -20523, -22728, -6198, 5939, -12593, -29922, -12648, 8503, -6830, -31935, -12098, 26589, 19250, -17822, -11811, 28186, 31666, -3744, -4237, 37503, 46618, -165, -25521, 6744, 33758, 6770, -27177, -17247, 4596, -8481, -37582, -34358, -9218, 2346, -13889, -25740, -17815, 1721, 14414, 12954, 9387, 12060, 22229, 22848, 5409, 12, 18550, 32021, 15657, -9904, -9111, 6994, 44, -18112, -17798, 387, -944, -26563, -36129, -11719, 11131, 1124, -13171, -8133, 8024, 4671, -10226, -9219, 14283, 29672, 14979, -5044, -5127, 12783, 24014, 13156, 1441]
976A441N695M790j1284j7140N124J8605j663j9799q880P325K691r017M360J9056
990A304R065j5345j4528J2010K3746N632n057l922M602K506q165n980M639R410
1004A9917m03k0469k1233j906J7223N721j3359o601Q509N866j3346p344J8302
1017i123K7922k125k3315l343J7976J4431r187n565J2458M058j6953j7487N520
1030d733J6089L480j3664j1376K166m34m598l254Q738J0875j304j6478j0744J2440
1044a2797J7886O051j1320m680J0137N744r143n310J4430J5502n176k2758o138
1057g572J2110J1062r381q538M445J236j2790j2339N983J3869k3j3224n856J1377
1071i641P073m446n786J5930J5766k641j6977k068J7143J2101p314j3136O42P112
$$ y = [1441, 7136, 11926, 642, -16498, -11374, 7231, 5568, -14231, -23111, -15786, -13095, -22112, -17752, 1304, 10369, -4976, -19504, -7494, 16252, 21884, 16827, 12905, 17507, 20013, 11848, 5868, 10507, 19917, 19514, -955, -22188, -24094, -6871, -1150, -14509, -21110, -12601, -6735, -20081, -27425, -9123, 18799, 16674, -6641, -9984, 7992, 22423, 13236, 7671, 20129, 24187, 7234, -10253, -4733, 11356, 14836, 1172, -10204, -8038, -8472, -13070, -16324, -7586, 3289, 1985, -14493, -25237, -12797, 5089, 11140, -180, -4860, 5277, 11021, 1878, -3432, 10998, 26500, 21324, -1434, -7572, 4538, 15600, 6219, -2319, 2126, 3362, -9428, -21767, -15784, -1915, -1938, -15162, -21018, -9641, -2568, -7014, -12800, 3130, 18896, 16255, -722, -2790, 14353, 26454, 19140, 6004, 6646, 13758]
1085A3758o795j2091l426P888N746r604j5256j808J2389M728m871l128R176O263
1099B969n300p411Q716J5730M527j3953n507J2456M644j1634q422J0496R686r069
1113G928k0946R14J5668L352j3071n427P891M061j0781m024O713J1066k996n966
1127e618j053J127N162N373J155j083n48L656j70l203q64R001L165j0984r700
1142d584O874K323p327o896M232Q673j2915j4805N836J8146j894j2043K002J6282
1156C904M766j0871n02J5185R150r851p864N054M472n354l471Q03k453n403l848
1171f283K774l428n659K428O330l293n557N412Q077j367n622P407J0376n063j1462
$$ y = [13758, 6963, -5128, -8554, -666, 5080, -4524, -19780, -21588, -9199, -4471, -9342, -12470, -3294, 2969, -2331, -9742, -1026, 14704, 19231, 5278, -229, 12227, 16871, 5237, -3185, 7311, 16997, 7928, -13018, -12104, 3564, 6916, -6155, -11582, -3691, 370, -10411, -14435, -7722, 3344, 348, -5618, -6671, -5544, -382, 4991, 6146, 5063, 4515, 8171, 8001, 4798, 3934, 12935, 16100, 5116, -4584, 2290, 4613, -2714, -9610, -5378, 3295, -9620, -24425, -18589, -443, -2337, -14380, -12378, 3904, 8670, -2201, -2703, 12482, 21632, 11781, 3917, 8971, 13443, 8089, 4618, 5421, 2968, -2435, -6283, -3509, -6937, -12596, -10168, -3838, -7131, -12688, -7276, 801, -566, -6188, 1219, 11595, 6532, -4930]
$$ [...]
8191F4
##END NTUPLES=NMR FID
##END=
