##TITLE=1H ikalashn
EC-3336(3)
19.11.2024
##JCAMPDX= 6.0         $$ Bruker NMR JCAMP-DX V2.0
##DATA TYPE= NMR SPECTRUM
##DATA CLASS= NTUPLES
##ORIGIN= UXNMR, Bruker Analytische Messtechnik GmbH
##OWNER= root
$$ TOPSPIN		Version 1.3
$$ 2024-11-19 10:32:32.984 +0400  Irina@DPX200
$$ Compression mode = diff/dup
##.OBSERVE FREQUENCY= 200.131300845
##.OBSERVE NUCLEUS= ^1H
##.ACQUISITION MODE= SIMULTANEOUS
##.ACQUISITION SCHEME= undefined
##.AVERAGES= 8
##.DIGITISER RES= 18
##SPECTROMETER/DATA SYSTEM= spect
##.PULSE SEQUENCE= zg
##.SOLVENT NAME= CDCl3
##.SHIFT REFERENCE= INTERNAL, CDCl3, 1, 17.49637
##AUDIT TRAIL= $$ (NUMBER, WHEN, WHO, WHERE, WHAT)
$$ ##TITLE= Audit trail, TOPSPIN		Version 1.3
$$ ##JCAMPDX= 5.01
$$ ##ORIGIN= Bruker BioSpin GmbH
$$ ##OWNER= Irina
$$ $$ F:/spectra/data/iren/nmr/1H/4/pdata/1/auditp.txt
$$ ##AUDIT TRAIL=  $$ (NUMBER, WHEN, WHO, WHERE, VERSION, WHAT)
(   1,<2024-11-19 10:32:12.281 +0400>,<Irina>,<DPX200>,<TOPSPIN 1.3>,
      <created by zg
	started at 2024-11-19 10:31:34.750 +0400,
	POWCHK disabled, PULCHK disabled
       terminated by command 'halt'
       configuration hash MD5:
       BE 6D 3F 07 2A EA 11 49 91 17 2B D3 AF B3 58 0D
       data hash MD5: 16K
       76 4A 5B E2 0C 66 35 79 DB 7F 69 00 EE A5 C5 81>)
(   2,<2024-11-19 10:32:13.703 +0400>,<Irina>,<DPX200>,<TOPSPIN 1.3>,
      <Start of raw data processing
       efp BC_mod = 2 LB = 0.02 FT_mod = 6 PKNL = 1 PHC0 = 327.8841 PHC1 = -6.278573 SI = 32K 
       data hash MD5: 32K
       2F 75 08 A4 00 1C B9 C3 45 05 DA 48 B2 DF F9 E1>)
(   3,<2024-11-19 10:32:15.953 +0400>,<Irina>,<DPX200>,<TOPSPIN 1.3>,
      <apk 
       data hash MD5: 32K
       8C 97 26 F2 FF 7C AB B1 5B DE 3C 75 84 25 E5 FF>)
(   4,<2024-11-19 10:32:20.390 +0400>,<Irina>,<DPX200>,<TOPSPIN 1.3>,
      <abs n ABSG = 5 
       data hash MD5: 32K
       2A 69 5F 4E E6 1A BC B4 67 CA E6 48 F0 60 AF E8>)
$$ ##END=
$$ 
$$ $$ hash MD5
$$ $$ 7F 0B 5F A3 3B D6 66 78 ED 0F 0A 65 55 F6 DC 09
##$RELAX= 
##$RELAX= 
##$RELAX= 
##$RELAX= 
##$RELAX= 
##$RELAX= 
##$RELAX= 
##$RELAX= 
##$RELAX= 
$$ Bruker specific parameters
$$ --------------------------
##$DU= <F:/spectra>
##$EXPNO= 4
##$NAME= <1H>
##$PROCNO= 1
##$TYPE= <nmr>
##$USER= <iren>
##$AMP= (0..31)
100 100 100 100 100 100 100 100 100 100 100 100 100 100 100 100 100 100 
100 100 100 100 100 100 100 100 100 100 100 100 100 100 
##$ANAVPT= -1
##$AQSEQ= 0
##$AQ_mod= 1
##$AUNM= <au_zg>
##$AUTOPOS= <>
##$BF1= 200.13
##$BF2= 200.13
##$BF3= 200.13
##$BF4= 200.13
##$BF5= 200.13
##$BF6= 200.13
##$BF7= 200.13
##$BF8= 200.13
##$BYTORDA= 1
##$CFDGTYP= 0
##$CFRGTYP= 5
##$CHEMSTR= <none>
##$CNST= (0..63)
1 1 145 1 1 1 1 1 1 1 1 1 1 1 1 1 1 1 1 1 1 1 1 1 1 1 1 1 1 1 1 1 1 1 
1 1 1 1 1 1 1 1 1 1 1 1 1 1 1 1 1 1 1 1 1 1 1 1 1 1 1 1 1 1 
##$CPDPRG= <>
##$CPDPRG1= <>
##$CPDPRG2= <>
##$CPDPRG3= <>
##$CPDPRG4= <mlev>
##$CPDPRG5= <mlev>
##$CPDPRG6= <mlev>
##$CPDPRG7= <mlev>
##$CPDPRG8= <mlev>
##$CPDPRGB= <>
##$CPDPRGT= <>
##$D= (0..63)
$$ [...]
##$SW_h= 4401.40845070422
##$TD= 16384
##$TD0= 1
##$TE= 300
##$TE2= 300
##$TE3= 300
##$TEG= 300
##$TL= (0..7)
0 120 120 120 120 120 120 120 
##$TP= (0..7)
150 150 150 150 150 150 150 150 
##$TP07= 0
##$TPNAME0= <>
##$TPNAME1= <>
##$TPNAME2= <>
##$TPNAME3= <>
##$TPNAME4= <>
##$TPNAME5= <>
##$TPNAME6= <>
##$TPNAME7= <>
##$TPOAL= (0..7)
0.5 0.5 0.5 0.5 0.5 0.5 0.5 0.5 
##$TPOFFS= (0..7)
0 0 0 0 0 0 0 0 
##$TUNHIN= 0
##$TUNHOUT= 0
##$TUNXOUT= 0
##$USERA1= <user>
##$USERA2= <user>
##$USERA3= <user>
##$USERA4= <user>
##$USERA5= <user>
##$V9= 5
##$VALIST= <valist>
##$VCLIST= <CCCCCCCCCCCCCCC>
##$VD= 0
##$VDLIST= <DDDDDDDDDDDDDDD>
##$VPLIST= <PPPPPPPPPPPPPPP>
##$VTLIST= <TTTTTTTTTTTTTTT>
##$WBST= 1024
##$WBSW= 25
##$XGAIN= (0..3)
0 0 0 0 
##$XL= 0
##$YL= 0
##$YMAX_a= 550192
##$YMIN_a= -858790
##$ZGOPTNS= <>
##$ZL1= 120
##$ZL2= 120
##$ZL3= 120
##$ZL4= 120
##$ABSF1= 17.49637
##$ABSF2= -4.496376
##$ABSG= 5
##$ABSL= 3
##$ALPHA= 0
##$AQORDER= 0
##$ASSFAC= 0
##$ASSFACI= 0
##$ASSFACX= 0
##$ASSWID= 0
##$AUNMP= <proc_1d>
##$AXLEFT= 0
##$AXRIGHT= 0
##$AXTYPE= 0
##$AXUNIT= <>
##$AZFE= 0.1
##$AZFW= 0.1
##$BCFW= 0
##$BC_mod= 2
##$BYTORDP= 0
##$COROFFS= 0
##$CY= 7568.61572265625
##$DATMOD= 1
##$DC= 0
##$DFILT= <>
##$DTYPP= 0
##$F1P= 17.9538593292236
##$F2P= -4.03888763876832
##$FCOR= 0.5
##$FTSIZE= 32768
##$FT_mod= 6
##$GAMMA= 0
##$GB= 0
##$INTBC= 0
##$INTSCL= 1.367314e-010
##$ISEN= 128
##$LB= 0.02
##$LEV0= 0
##$LPBIN= 0
##$MAXI= 945.577
##$MC2= 0
##$MEAN= 0
##$ME_mod= 0
##$MI= -402.1523
##$NCOEF= 0
##$NC_proc= -6
##$NLEV= 6
##$NOISF1= 8.587773
##$NOISF2= 6.764455
##$NSP= 0
##$NTH_PI= 0
##$NZP= 0
##$OFFSET= 17.49637
##$PC= 1
##$PHC0= 319.7567
##$PHC1= 6.510891
##$PH_mod= 1
##$PKNL= yes
##$PPARMOD= 0
##$PPDIAG= 0
##$PPIPTYP= 0
##$PPMPNUM= 100
##$PPRESOL= 1
##$PSCAL= 0
##$PSIGN= 0
##$REVERSE= no
##$SF= 200.13
##$SI= 32768
##$SIGF1= 16.12182
##$SIGF2= -4.496377
##$SINO= 3.521527
##$SIOLD= 32768
##$SREGLST= <1H.CDCl3>
##$SSB= 0
##$STSI= 32768
##$STSR= 0
##$SW_p= 4401.40845070422
##$SYMM= 0
##$S_DEV= 0
##$TDeff= 16384
##$TDoff= 0
##$TI= <>
##$TILT= no
##$TM1= 0
##$TM2= 0
##$TOPLEV= 0
##$USERP1= <user>
##$USERP2= <user>
##$USERP3= <user>
##$USERP4= <user>
##$USERP5= <user>
##$WDW= 1
##$XDIM= 32768
##$YMAX_p= 461974850
##$YMIN_p= -490579
$$ End of Bruker specific parameters
$$ ---------------------------------
##NTUPLES= NMR SPECTRUM
##VAR_NAME=  FREQUENCY,     SPECTRUM/REAL,   SPECTRUM/IMAG
##SYMBOL=    X,             R,               I
##VAR_TYPE=  INDEPENDENT,   DEPENDENT,       DEPENDENT
##VAR_FORM=  AFFN,          ASDF,            ASDF
##VAR_DIM=   32768,         32768,           32768
##UNITS=     HZ,            ARBITRARY UNITS, ARBITRARY UNITS
##FACTOR=    0.134324425510551, 1,           1
##FIRST=     4401.40845070422, 92635,        -1145629
##LAST=      0,             -66077,          -1383156
##MIN=       0,             -490579,         0
##MAX=       4401.40845070422, 461974850,    0
$$ Real data points
##PAGE= N=1
##DATA TABLE= (X++(R..R)), XYDATA
$$ [...]
$$ plain form
14738 -305029 -308250 -276652 -272620 -343195 -425447 -421563 -347275 -315541 -369490 -424329 -403103 -343803
14726 -343803 -322521 -342328 -360115 -366725 -373312 -363743 -330984 -322631 -373749 -423882 -386482 -287113
14714 -287113 -242848 -299061 -373332 -383806 -353442 -347035 -370447 -385609 -382595 -382537 -390107 -386665 -362733
14701 -362733 -330250 -309003 -314056 -342252 -361689 -335990 -271751 -221058 -224633 -271929 -324138 -350670
14689 -350670 -336461 -288393 -249659 -270989 -343322 -392078 -368082 -315086 -310765 -362477 -404199 -390613
14677 -390613 -354394 -358018 -410211 -449478 -415244 -327771 -274067 -299438 -343085 -323310 -262183 -255383
14665 -255383 -319784 -358874 -312439 -254111 -274721 -338385 -343789 -285679 -255877 -296691 -348263 -351699
14653 -351699 -321939 -294034 -266779 -234618 -222693 -251703 -301048 -335049 -341044 -326944 -309954 -316396
$$ packed form
14738c05029l221L1598M032p0575q2252L884P4288L1734n3949n4839K1226N9300
14726c43803K1282j9807j7787o610o587R569L2759Q353n1118n0133L7400R9369
14714b87113M4265n6213p4271j0474L0364O407k3412j5162L014N8p570L442K3932
14701c62733L2483K1247n053k8196j9437K5699O4239N0693l575m7296n2209k6532
14689c50670J4209M8068L8734k1330p2333m8756K3996N2996M321n1712m1722J3586
14677c90613L6219l624n2193l9267L4234Q7473N3704k5371m3647J9775O1127O800
14665b55383o4401l9090M6435N8328k0610o3664n404N8110K9802m0814n1572l436
14653c51699K9760K7905K7255L2161J1925k9010m9345l4001n995J4100J6990o442
$$ plain form
14641 -316396 -356054 -386923 -349715 -255152 -190597 -211721 -269804 -282594 -241125 -202712 -203204 -223590
14629 -223590 -233802 -228340 -217333 -211393 -218069 -234076 -242495 -233211 -221049 -228378 -255465 -282596 -295195
14616 -295195 -292604 -278354 -256897 -236633 -223730 -214707 -203492 -192488 -189377 -195331 -201652 -198786 -190197
14603 -190197 -195674 -227843 -260531 -244843 -177327 -125433 -147461 -208245 -225154 -184801 -151715 -163138
14591 -163138 -187704 -201254 -223578 -247821 -214956 -112350 -24984 -20919 -50514 -38399 -14166
14580 -14166 -51123 -120177 -123226 -55412 -13910 -38029 -55876 -16200 34008 43870 33572 27310
14568 27310 3215 -33739 -18610 64488 123849 91983 37830 51084 86976 47792 -32791 -30930
14556 -30930 56859 93913 18445 -60853 -41725 19390 16353 -39207 -62952 -48749 -61609 -104975
$$ packed form
14641c16396l9658l0869L7208R4563O4555k1124n8083j2790M1469L8413m92k0386
14629b23590j0212N462J1007N940o676j6007q419R284J2162p329k7087k7131j2599
14616b95195K591J4250K1457K0264J2903R023J1215J1004L111n954o321K866Q589
14603a90197n477l2169l2688J5688O7516N1894k2028o0784j6909M0353L3086j1423
14591a63138k4566j3550k2324k4243L2865J02606Q7366M065k9595J2115K4233
14580a4166l6957o9054l049O7814M1502k4119j7847L9676N0208R862j0298o262
14568B7310k4095l6954J5129Q3098N9361l1866n4153J3254L5892l9184q0583J861
14556c0930Q7789L7054p5468p9298J9128O1115l037n5560k3745J4203j2860m3366
$$ plain form
14544 -104975 -103842 -30630 39840 32229 -33662 -85217 -93763 -92093 -117229 -165999 -201994 -194122
14532 -194122 -153223 -128277 -150054 -184181 -169858 -106535 -62874 -83438 -127473 -134489 -116813 -135019
14520 -135019 -195916 -235646 -214828 -175326 -172266 -193951 -194751 -178112 -188860 -230613 -251645 -228282
14508 -228282 -209360 -244855 -308865 -334313 -299567 -239796 -191115 -167543 -179633 -225035 -263670
14497 -263670 -254391 -220000 -220541 -253377 -247487 -184601 -151923 -217091 -313187 -329097 -272668 -248102
14485 -248102 -288183 -314267 -277059 -236620 -259944 -320731 -356023 -357031 -344401 -310502 -253646 -222748
14473 -222748 -254615 -302530 -301607 -273515 -283879 -321027 -313067 -257346 -230348 -257231 -273983 -248416
14461 -248416 -237257 -274600 -300423 -269418 -245265 -297659 -372749 -368825 -296984 -259220 -290234 -328707
$$ packed form
14544a04975J133P3212P0470p611o5891n1555q546J670k5136m8770l5995P872
14532a94122M0899K4946k1777l4127J4323O3323M3661k0564m4035p016J7676j8206
14520a35019o0897l9730K0818L9502L060k1685q00J6639j0748m1753k1032K3363
14508b28282J8922l5495o4010k5448L4746N9771M8681K3572j2090m5402l8635
14497b63670R279L4391n41l2836N890O2886L2678o5168r6096j5910N6429K4566
14485b48102m0081k6084L7208M0439k3324o0787l5292j008J2630L3899N6856L0898
14473b22748l1867m7915R23K8092j0364l7148P960N5721K6998k6883j6752K5567
14461b48416J1159l7343k5823L1005K4153n2394p5090L924P1841L7764l1014l8473
$$ plain form
14449 -328707 -340132 -359684 -396568 -397267 -341391 -289918 -291946 -313369 -307751 -295574 -314880 -342723
14437 -342723 -330261 -284636 -255729 -260547 -274653 -287018 -313169 -354662 -384880 -380085 -341387 -288263
14425 -288263 -246877 -234771 -242400 -244930 -241996 -256883 -282912 -275646 -229360 -210787 -263917 -325649
14413 -325649 -307865 -232351 -198182 -228338 -245595 -211496 -188446 -223154 -259023 -231184 -180123
14402 -180123 -189461 -253776 -293179 -278229 -257030 -259976 -256652 -225572 -199713 -209825 -232943 -235914
14390 -235914 -233396 -259547 -303641 -316576 -276687 -217302 -187782 -208384 -261796 -308942 -314881 -280461
14378 -280461 -249932 -266765 -318526 -347267 -321526 -273825 -251435 -253651 -245852 -221901 -216017 -249268
14366 -249268 -296754 -322566 -322738 -314417 -303386 -289169 -288986 -322518 -371560 -386871 -348996 -298310
$$ packed form
14449c28707j1425j9552l6884o99N5876N1473k028k1423N618J2177j9306k7843
14437c42723J2462M5625K8907m818j4106j2365k6151m1493l0218M795L8698N3124
14425b88263M1386J2106p629k530K934j4887k6029P266M6286J8573n3130o1732
14413c25649J7784P5514L4169l0156j7257L4099K3050l4708l5869K7839N1061
14402a80123r338o4315l9403J4950K1199k946L324L1080K5859j0112k3118k971
14390b35914K518k6151m4094j2935L9889N9385K9520k0602n3412m7146n939L4420
14378b80461L0529j6833n1761k8741K5741M7701K2390k216P799K3951N884l3251
14366b49268m7486k5812j72Q321J1031J4217J83l3532m9042j5311L7875N0686
$$ plain form
14354 -298310 -284678 -305046 -318087 -311741 -319571 -358889 -386892 -353246 -282433 -259032 -319595 -398369
14342 -398369 -410231 -359330 -322314 -337609 -364020 -355697 -326088 -311905 -315649 -320194 -329262 -351525
14330 -351525 -365976 -348355 -319540 -320552 -343194 -334724 -280627 -237604 -261836 -335130 -386645 -370898
14318 -370898 -307581 -256814 -265699 -328843 -396713 -430211 -438592 -448340 -454278 -436589 -410467 -407406
14306 -407406 -411499 -376947 -319462 -318736 -396517 -461932 -435387 -369604 -370923 -436572 -459006 -385177
14294 -385177 -286943 -255458 -294524 -348995 -384359 -398849 -393664 -373236 -357916 -364707 -383704 -393653
14282 -393653 -390700 -383544 -369784 -338767 -298325 -281033 -311089 -366913 -391779 -357534 -311042 -328641
14270 -328641 -416615 -490579 -477228 -405120 -357852 -363421 -379585 -374738 -365805 -372447 -385704 -394984
$$ packed form
14354b98310J3632k0368j3041O346p830l9318k8003L3646P0813K3401o0563p8774
14342c98369j1862N0901L7016j5295k6411Q323K9609J4183l744m545r068k2263
14330c51525j4451J7621K8815j012k2642Q470N4097M3023k4232p3294n1515J5747
14318c70898O3317N0767q885o3144o7870l3498q381r748n938J7689K6122L061
14306d07406m093L4552N7485P26p7781o5415K6545O5783j319o5649k2434P3829
14294c85177R8234L1485l9066n4471l5364j4490N185K0428J5320o791j8997r949
14282c93653K953P156J3760L1017M0442J7292l0056n5824k4866L4245M6492j7599
14270c28641q7974p3964J3351P2108M7268n569j6164M847Q933o642j3257r280
$$ plain form
14258 -394984 -402458 -398148 -363654 -315130 -299534 -330362 -368702 -385352 -395201 -407856 -396684 -352509
14246 -352509 -319537 -332950 -362413 -366413 -362820 -387237 -415416 -396592 -343884 -318746 -332730 -337705
14234 -337705 -317202 -313125 -343329 -363110 -341973 -318624 -336378 -372002 -378002 -359344 -355035 -367736
14222 -367736 -367555 -356219 -372609 -426458 -470244 -456623 -397637 -348081 -344411 -373504 -393206 -375023
14210 -375023 -331536 -304392 -319576 -356995 -375810 -367708 -366113 -396147 -435680 -443864 -414719 -377255
14198 -377255 -347285 -311747 -271858 -268123 -328744 -409933 -431426 -376554 -317578 -322895 -372437 -395442
14186 -395442 -368759 -338478 -350816 -398072 -438786 -444284 -415431 -372294 -338410 -327026 -337949 -367481
14174 -367481 -408435 -433448 -405210 -330831 -281611 -314415 -387227 -407684 -363045 -335956 -374777
$$ packed form
14258c94984p474M310L4494M8524J5596l0828l8340j6650r849j2655J1172M4175
14246c52509L2972j3413k9463m000L593k4417k8179J8824N2708K5138j3984m975
14234c37705K0503M077l0204j9781K1137K3349j7754l5624o000J8658M309j2701
14222c67736J81J1336j6390n3849m3786J3621N8986M9556L670k9093j9702J8183
14210c75023M3487K7144j5184l7419j8815Q102J595l0034l9533q184K9145L7464
14198c77255K9970L5538L9889L735o0621q1189k1493N4872N8976n317m9542k3005
14186c95442K6683L0281j2338m7256m0714n498K8853M3137L3884J1384j0923k9532
14174c67481m0954k5013K8238P4379M9220l2804p2812k0457M4639K7089l8821
$$ plain form
14163 -374777 -420379 -405462 -363084 -367999 -411968 -420104 -376485 -349054 -377981 -414719 -404016 -366490
14151 -366490 -355516 -374800 -387808 -381838 -373493 -365523 -346062 -326568 -335272 -367338 -382451 -365439
14139 -365439 -352164 -373114 -403468 -401459 -374060 -364482 -383019 -393248 -373050 -348422 -346665 -350999
14127 -350999 -334501 -314694 -331877 -382434 -418277 -416023 -401929 -393119 -361033 -288939 -228933 -247546
14115 -247546 -327423 -379469 -360169 -324912 -340284 -387800 -398074 -356244 -321852 -343412 -397342
14104 -397342 -428788 -422113 -406235 -407589 -423459 -435759 -430501 -404994 -372014 -355763 -368401 -391347
14092 -391347 -396050 -383804 -386280 -421258 -465243 -479082 -448257 -391994 -346098 -339950 -371628 -401032
14080 -401032 -390773 -358850 -358116 -392952 -402565 -356274 -314809 -343330 -405652 -418932 -386440 -384945
$$ packed form
14163c74777m5602J4917M2378m915m3969q136M3619K7431k8927l6738J0703L7526
14151c66490J0974j9284j3008N970Q345P970J9461J9494q704l2066j5113J7012
14139c65439J3275k0950l0354K009K7399R578j8537j0229K0198K4628J757m334
14127c50999J6498J9807j7183n0557l5843K254J4094Q810L2086P2094O0006j8613
14115b47546p9877n2046J9300L5257j5372m7516j0274M1830L4392k1560n3930
14104c97342l1446O675J5878j354j5870j2300N258K5507L2980J6251j2638k2946
14092c91347m703J2246k476l4978m3985j3839L0825N6263M5896O148l1678k9404
14080d01032J0259L1923P34l4836r613M6291M1465k8521o2322j3280L2492J495
$$ plain form
14068 -384945 -425587 -430847 -374848 -342956 -395321 -460841 -446756 -384088 -368731 -405161 -413238 -368182
14056 -368182 -329486 -331070 -339892 -338496 -358508 -404223 -423804 -393715 -361281 -362651 -364796 -336260
14044 -336260 -312433 -331967 -362072 -354603 -334810 -359618 -414090 -427519 -384632 -347484 -359675 -393153
14032 -393153 -406957 -403055 -398884 -391052 -378377 -385133 -422906 -451425 -420074 -345559 -308947 -357180
14020 -357180 -432474 -433791 -346990 -273964 -306109 -401041 -436816 -377086 -314118 -329629 -383221 -388687
14008 -388687 -345429 -321752 -338153 -347892 -328854 -318234 -339915 -361288 -349710 -322922 -313617 -322107
13996 -322107 -332281 -342849 -355836 -359782 -347938 -332115 -322327 -316428 -321284 -351187 -388108 -380917
13984 -380917 -312196 -234589 -209394 -235051 -267571 -285291 -295836 -299316 -286561 -265664 -255123 -254682
$$ packed form
14068c84945m0642n260N5999L1892n2365o5520J4085O2668J5357l6430q077M5056
14056c68182L8696j584q822J396k0012m5715j9581L0089L2434j370k145K8536
14044c36260K3827j9534l0105P469J9793k4808n4472j3429M2887L7148j2191l3478
14032c93153j3804L902M171P832J2675o756l7773k8519L1351P4515L6612m8233
14020c57180p5294j317Q6801P3026l2145r4932l5775N9730O2968j5511n3592n466
14008c88687M3258K3677j6401r739J9038J0620k1681k1373J1578K6788R305q490
13996c22107j0174j0568j2987l946J1844J5823R788N899m856k9903l6921P191
13984c80917O8721P7607K5195k5657l2520j7720j0545l480J2755K0897J0541M41
$$ plain form
13972 -254682 -251160 -248007 -262436 -295285 -323993 -324819 -294951 -263948 -280934 -356450 -414252 -360017
13960 -360017 -224110 -162394 -254312 -372191 -349609 -226246 -191731 -300500 -395346 -351458 -249155
13949 -249155 -220072 -245792 -231296 -191800 -221085 -313754 -365006 -346409 -345715 -401661 -423303 -337294
13937 -337294 -219971 -199497 -284773 -371837 -385171 -339168 -280068 -238209 -235522 -279130 -335153
13926 -335153 -351951 -321880 -288533 -286510 -306201 -326104 -345945 -369371 -378735 -351959 -297084 -253848
13914 -253848 -257995 -304451 -346253 -340783 -303681 -296980 -344718 -386026 -352527 -274811 -252035 -312011
13902 -312011 -369612 -352881 -303855 -299096 -324254 -306924 -246257 -219869 -260180 -310319 -326343 -341762
13890 -341762 -385058 -404974 -347867 -261780 -241736 -291701 -322171 -287120 -246439 -266453 -319682
$$ packed form
13972b54682L522L153j4429l2849k8708q26K9868L1003j6986p5516n7802N4235
13960c60017J35907O1716r1918j17879K2582J23363L4515j08769r4846M3888J02303
13949b49155K9083k5720J4496L9496k9285r2669n1252J8597O94n5946k1642Q6009
13937c37294J17323K0474q5276q7064j3334M6003N9100M1859K687m3608n6023
13926c35153j6798L0071L3347K023j9691j9903j9841k3426r364K6776N4875M3236
13914b53848m147m6456m1802N470L7102O701m7738m1308L3499P7716K2776n9976
13902c12011n7601J6731M9026M759k5158J7330O0667K6388m0311n0139j6024j5419
13890c41762m3296j9916N7107Q6087K0044m9965l0470L5051M0681k0014n3229
$$ plain form
13879 -319682 -326390 -261238 -178730 -148304 -190456 -265331 -307100 -282072 -223923 -196013 -214559 -236342
13867 -236342 -229706 -217666 -227558 -239363 -224383 -203324 -214576 -242964 -236238 -189455 -158480 -178613
13855 -178613 -216299 -221713 -193611 -168663 -171032 -193926 -215881 -220784 -211237 -205030 -206964 -193030 -145572
13842 -145572 -91602 -70324 -73361 -64913 -54192 -84543 -144923 -167142 -135373 -119214 -155828 -182021
13830 -182021 -147920 -116569 -158605 -217833 -199056 -139302 -151420 -219906 -211357 -103548 -39898
13819 -39898 -98939 -166285 -132340 -78110 -129624 -234048 -242787 -155116 -109946 -157580 -203630 -188919
13807 -188919 -169596 -181613 -168710 -106601 -73501 -117412 -159550 -122493 -65921 -89740 -169459
13796 -169459 -201270 -167162 -140305 -148150 -142928 -108239 -90948 -109970 -124481 -119385 -140542 -208569
$$ packed form
13879c19682o708O5152Q2508L0426m2152p4875m1769K5028N8149K7910j8546k1783
13867b36342O636J2040r892j1805J4980K1059j1252k8388O726M6783L0975k0133
13855a78613l7686n414K8102K4948k369k2894k1955m903R547O207j934J3934M7458
13842a45572N3970K1278l037Q448J0721l0351o0380k2219L1769J6159l6614k6193
13830a82021L4101L1351m2036n9228J8777N9754j2118o8486Q549J07809O3650
13819c9898n9041o7346L3945N4230n1514j04424q739Q7671M5170m7634m6050J4711
13807a88919J9323j2017J2903O2109L3100m3911m2138L7057N6572k3819p9719
13796a69459l1811L4108K6857p845N222L4689J7291j9022j4511N096k1157o8027
$$ plain form
13784 -208569 -267558 -262403 -211874 -165798 -141156 -138727 -168513 -210189 -198969 -111923 -30656 -51066
13772 -51066 -154136 -233137 -234117 -199029 -174303 -155151 -138259 -154286 -205126 -226043 -167417 -79725
13760 -79725 -56991 -111481 -163971 -159009 -131407 -136762 -164153 -159680 -112864 -73835 -85005 -131496
13748 -131496 -169555 -176575 -157210 -123307 -92142 -89428 -123187 -158002 -146861 -94914 -60500 -77309
13736 -77309 -106590 -96134 -61852 -64786 -112673 -137326 -90911 -22486 -18294 -86444 -147017 -138180
13724 -138180 -91197 -80012 -123116 -166839 -160993 -122313 -108494 -142386 -183734 -181769 -139371 -106681
13712 -106681 -117174 -154739 -188923 -213883 -232451 -228093 -188832 -145203 -140527 -164476 -163769 -129904
13700 -129904 -123980 -184482 -258466 -272407 -235525 -212002 -212735 -188297 -131080 -108124 -162272 -241297
$$ packed form
13784b08569n8989N155N0529M6076K4642K429k9786m1676J1220Q7046Q1267k0410
13772e1066j03070p9001r80L5088K4726J9152J6892j6027n0840k0917N8626Q7692
13760g9725K2734n4490n2490M962K7602n355k7391M473M6816L9029j1170m6491
13748a31496l8059p020J9365L3903L1165K714l3759l4815J1141N1947L4414j6809
13736g7309k9281J0456L4282k934m7887k4653M6415O8425M192o8150o0573Q837
13724a38180M6983J1185m3104m3723N846L8680J3819l3892m1348J965M2398L2690
13712a06681j0493l7565l4184k4960j8568M358L9261M3629M676k3949P07L3865
13700a29904N924o0502p3984j3941L6882K3523p33K4438N7217K2956n4148p9025
$$ plain form
13688 -241297 -270044 -249957 -236413 -246849 -248516 -227686 -215952 -236098 -260624 -245936 -189931 -137262
13676 -137262 -129522 -158035 -173350 -148147 -120373 -148647 -225926 -276058 -253147 -205046 -205418 -255987
13664 -255987 -299850 -306738 -292975 -270922 -236029 -204585 -209158 -243103 -255651 -221577 -179644 -180934
13652 -180934 -224390 -260044 -240485 -166698 -99364 -111736 -202185 -274632 -252128 -186322 -185103 -248046
13640 -248046 -269859 -216227 -183418 -236049 -294438 -265105 -193550 -181858 -220058 -220073 -178241 -174691
13628 -174691 -219879 -229303 -171060 -123868 -147433 -193728 -201770 -197441 -231128 -277854 -274079 -218494
13616 -218494 -169143 -157157 -158101 -144083 -122789 -119535 -140902 -160071 -140021 -84280 -52857 -93044
13604 -93044 -162241 -171982 -113349 -75933 -120404 -196034 -221993 -192173 -151744 -122040 -105371 -120893
$$ packed form
13688b41297k8747K0087J3544j0436j667K0830J1734k0146k4526J4688N6005N2669
13676a37262P740k8513j5315K5203K7774k8274p7279n0132K2911M8101l72n0569
13664b55987m3863o888J3763K2053L4893L1444m573l3945j2548L4074M1933j290
13652a80934m3456l5654J9559P3787O7334j2372r0449p2447K2504O5806J219o2943
13640b48046k1813N3632L2809n2631n8389K9333P1555J1692l8200j5M1832L550
13628a74691m5188r424N8243M7192k3565m6295q042M329l3687m6726L775N5585
13616b18494M9351J1986r44J4018K1294L254k1367j9169K0050N5741L1423m0187
13604i3044o9197r741N8633L7416m4471p5630k5959K9820M0429K9704J6669j5522
$$ plain form
13592 -120893 -172685 -213635 -201582 -164933 -154874 -161111 -139364 -96609 -76354 -76876 -62224 -46188
13580 -46188 -80992 -154451 -181423 -123708 -48450 -33717 -73307 -110172 -115982 -102349 -91116 -102123
13568 -102123 -137622 -161948 -137329 -92783 -103040 -177111 -230106 -202925 -148220 -145123 -183711 -200298
13556 -200298 -185062 -178912 -188024 -177886 -144435 -122497 -123602 -127115 -134275 -167961 -211454 -212495 -166636
13543 -166636 -134975 -151380 -170598 -148571 -122809 -156563 -233658 -269464 -220887 -137833 -99154
13532 -99154 -130316 -192837 -232586 -229057 -206806 -200305 -207574 -195667 -160066 -147593 -190053 -241778
13520 -241778 -232153 -169579 -135054 -164489 -198262 -176932 -132263 -133823 -183673 -223494 -224650 -209107
13508 -209107 -190620 -161198 -140039 -167261 -227077 -240039 -167550 -72610 -37244 -66200 -114304
$$ packed form
13592a20893n1792m0950J2053L6649J0059o237K1747M2755K0255n22J4652J6036
13580d6188l4804p3459k6972N7715P5258J4733l9590l6865n810J3633J1233j1007
13568a02123l5499k4326K4619M4546j0257p4071n2995K7181N4705L097l8588j6587
13556b00298J5236O150r112J0138L3451K1938j105l513p160l3686m3493j041M5859
13543a66636L1661j6405j9218K2027K5762l3754p7095l5806M8577Q3054L8679
13532i9154l1162o2521l9749L529K2251O501p269J1907L5601J2473m2460n1725
13520b41778R625O2574L4525k9435l3773K1330M4669j560m9850l9821j156J5543
13508b09107J8487K9422K1159k7222n9816j2962P2489R4940L5366k8956m8104
$$ plain form
13497 -114304 -159011 -190803 -178193 -112337 -53272 -59072 -97421 -104729 -99784 -137895 -175788 -113423
13485 -113423 18600 57897 -49541 -145616 -88621 34382 50327 -34318 -64036 14541 90798
13474 90798 80031 33225 26590 58422 99260 148527 193771 194290 152816 133680 166047 195939
13462 195939 177175 141341 129239 122126 99321 98008 144936 184454 154344 91544 79928 122962
13450 122962 152474 144534 138958 147428 129178 74743 40493 69926 132569 168673 157132 120412
13438 120412 95259 111637 169890 229652 249215 236444 230042 238457 240310 238036 255941 283593
13426 283593 282705 261458 276143 336025 374628 353459 329075 363064 421438 432476 404615 408170
13414 408170 458213 494813 483346 464274 482231 519227 527362 493438 446730 426818 459668 539973
$$ packed form
13497a14304m4707l1792J2610O5856N9065n800l8349p308M945l8111l7893O2365
13485a13423J32023L9297j07438r6075N6995J23003J5945q4645k9718P8577P6257
13474I0798j0767m6806o635L1832M0838M9267M5244N19m1474j9136L2367K9892
13462A95939j8764l5834j2102p113k2805j313M6928L9518l0110o2800j1616M3034
13450A22962K9512p940n576Q470j8250n4435l4250K9433O2643L6104j1541l6720
13438A20412k5153J6378N8253N9762J9563j2771o402Q415J853k274J7905K7652
13426B83593q88k1247J4685N9882L8603k1169k4384L3989N8374J1038k7861L555
13414D08170N0043L6600j1467j9072J7957L6996Q135l3924m6708j9912L2850Q0305
$$ plain form
13402 539973 619889 639913 593703 545715 561726 632129 686576 680860 646608 647227 700510 762209
13390 762209 784293 770229 760178 775670 803482 831384 869297 922568 969376 985264 974817
13379 974817 961472 959721 971966 995110 1013962 1010012 996662 1018620 1087587 1147743 1145480 1107239
13367 1107239 1097363 1120612 1130674 1124009 1147397 1202030 1219653 1166720 1102665 1089445 1103268 1090799
13355 1090799 1061027 1055948 1069149 1064863 1052028 1065833 1090226 1074398 1024241 1002221 1026481 1043558
13343 1043558 1023120 1008168 1033713 1059622 1037814 998623 1007999 1066503 1112403 1113379 1098262 1097471
13331 1097471 1104162 1107383 1120992 1157100 1200123 1231733 1261831 1308254 1356190 1367441 1334695 1300656
13319 1300656 1302911 1314499 1272992 1174951 1104320 1134187 1222501 1253690 1183883 1094626 1083112
$$ packed form
13402E39973P9916K0024m6210m7988J6011P0403N4447n716l4252O19N3283O1699
13390G62209K2084j4064j0051J5492K7812K7902L7913N3271M6808J5888j0447
13379I74817j3345j751J2245K3144J8852l950j3350K1958O8967O0156k263l8241
13367A107239r876K3249J0062o665K3388N4633J7623n2933o4055j3220J3823j2469
13355A090799k9772n079J3201m286j2835J3805K4393j5828n0157k2020K4260J7077
13343A043558k0438j4952K5545K5909k1808l9191R376N8504M5900R76j5117p91
13331A097471O691L221J3609L6108M3023L1610L0098M6423M7936J1251l2746l4039
13319A300656K255J1588m1507r8041p0631K9867Q8314L1189o9807q9257j1514
$$ plain form
13308 1083112 1143271 1190238 1169998 1100782 1024964 968827 948453 971529 1019856 1057042 1064822
13297 1064822 1054507 1041201 1029553 1027913 1050476 1095011 1138771 1167705 1193806 1233681 1283609
13286 1283609 1325375 1347609 1356069 1369340 1401482 1439143 1446481 1412164 1377461 1384300 1405522 1375290
13274 1375290 1291628 1228670 1222607 1208824 1124801 1023755 1007750 1071474 1100784 1034152 941783
13263 941783 911181 927143 921172 885352 864537 865214 850868 822493 826543 867241 882760 843247
13251 843247 809380 840845 896706 895197 841209 816057 851118 893360 905155 915117 939868 935606
13239 935606 880738 838785 867459 915348 891039 802076 736729 725162 714204 681750 676714 717728
13227 717728 741861 700160 631706 593023 579236 569032 582332 624808 632805 557598 463755 451705
$$ packed form
13308A083112O0159M6967k0240o9216p5818n6137k0374K3076M8327L7186P780
13297A064822j0315j3306j1648j640K2563M4535M3760K8934K6101L9875M9928
13286A283609M1766K2234Q460J3271L2142L7661P338l4317l4703O839K1222l0232
13274A375290q3662o2958o063j3783q4023j01046j6005O3724K9310o6632r2369
13263I41783l0602J5962n971l5820k0815O77j4346k8375M050M0698J5519l9513
13251H43247l3867L1465N5861j509n3988k5152L5061M2242J1795R962K4751m262
13239I35606n4868m1953K8674M7889k4309q8963o5347j1567j0958l2454n036M1014
13227G17728K4133m1701o8454l8683j3787j0204J3300M2476P997p5207r3843j2050
$$ plain form
13215 451705 506198 519055 457349 407523 432198 477994 471489 430734 419142 440185 446367 425945
13203 425945 414683 425829 425337 391465 358327 372423 425241 459591 442185 402161 383065 381683
13191 381683 367632 348623 365125 414944 441792 424472 416912 454678 482626 445243 397668 433078
13179 433078 528522 568701 517773 459072 450772 453574 436705 445509 503338 542734 511305 467660
13167 467660 488387 545169 563082 545943 548679 567686 558050 531539 538521 568691 566208 536075
13155 536075 540171 585393 608270 582289 554039 556338 566990 571341 584590 593501 562156 519609
13143 519609 547445 642351 690377 636582 583043 634027 727724 731853 650908 614212 677060 755173
13131 755173 770020 750386 749338 750598 722406 704035 758712 860730 903989 838520 746828 748440
$$ packed form
13215D51705N4493J2857o1706m9826K4675M5796o505m0755j1592K1043O182k0422
13203D25945j1262J1146m92l3872l3138J4096N2818L4350j7406m0024j9096j382
13191C81683j4051j9009J6502M9819K6848j7320p560L7766K7948l7383m7575L5410
13179D33078R5444M0179n0928n8701q300K802j6869Q804N7829L9396l1429m3645
13167D67660K0727N6782J7913j7139K736J9007r636k6511O982L0170k483l0133
13155E36075M096M5222K2877k5981k8250K299J0652M351J3249Q911l1345m2547
13143E19609K7836R4906M8026n3795n3539N0984R3697M129q0945l6696O2848P8113
13131G55173J4847j9634j048J260k8192j8371N4677J02018M3259o5469r1692J612
$$ plain form
13119 748440 852856 950017 947538 877205 843103 894221 985636 1050778 1068121 1055407 1039250
13108 1039250 1043248 1075568 1116393 1140826 1154734 1178192 1200808 1200214 1201434 1253772 1337529 1369302
13096 1369302 1332482 1323704 1412614 1527154 1558421 1525755 1542479 1647639 1770288 1851409 1904533
13085 1904533 1946118 1956894 1940413 1944826 1991404 2042029 2070310 2107289 2179408 2254943 2297794
13074 2297794 2331706 2401641 2501989 2591454 2658403 2725955 2804796 2883721 2963343 3061208 3177276
13063 3177276 3282753 3356865 3421096 3523153 3685260 3873344 4026886 4123347 4199784 4299893
13053 4299893 4419174 4526711 4621313 4725585 4834167 4918374 4986784 5087419 5229057 5349247
13043 5349247 5394709 5397677 5434850 5536095 5670193 5800753 5916467 6014524 6091398 6156646 6234712
$$ packed form
13119G48440J04416R7161k479p0333l4102N1118R1415O5142J7343j2714j6157
13108A039250L998L2320M0825K4433J3908K3458K2616n94J220N2338Q3757L1773
13096A369302l6820q778Q8910J14540L1267l2666J6724J05160J22649Q1121N3124
13085A904533M1585J0776j6481M413M6578N0625K8281L6979P2119P5535M2851
13074B297794L3912O9935J00348Q9465O6949O7552P8841P8925P9622R7865J16068
13063C177276J05477P4112O4231J02057J62107J88084J53542R6461P6437J00109
13053D299893J19281J07537R4602J04272J08582Q4207O8410J00635J41638J20190
13043E349247M5462K968L7173J01245J34098J30560J15714R8057P6874O5248P8066
$$ plain form
13032 6234712 6344113 6479394 6613841 6722959 6812955 6917467 7050062 7175955 7264873 7358960
13022 7358960 7534734 7792888 8045251 8232907 8400024 8615534 8874292 9123387 9345378
13013 9345378 9563465 9793612 10039632 10309328 10589507 10831880 11011331 11171459 11363181
13004 11363181 11567698 11736582 11877869 12033451 12192895 12307546 12382300 12475030 12602112 12720448
12994 12720448 12812601 12913741 13036590 13144419 13223838 13311934 13420544 13508663 13572602 13687753
12984 13687753 13897875 14125843 14272830 14364744 14516932 14773842 15065512 15323210 15563166
12975 15563166 15834542 16143071 16463317 16794488 17164703 17583807 18017050 18420254 18799652
12966 18799652 19218731 19723874 20271186 20763698 21171259 21575857 22073957 22665974 23274756
$$ packed form
13032F234712J09401J35281J34447J09118Q9996J04512J32595J25893Q8918R4087
13022G358960J75774K58154K52363J87656J67117K15510K58758K49095K21991
13013I345378K18087K30147K46020K69696K80179K42373J79451J60128J91722
13004A1363181K04517J68884J41287J55582J59444J14651P4754R2730J27082J18336
12994A2720448R2153J01140J22849J07829P9419Q8096J08610Q8119O3939J15151
12984A3687753K10122K27968J46987R1914J52188K56910K91670K57698K39956
12975A5563166K71376L08529L20246L31171L70215M19104M33243M03204L79398
12966A8799652M19079N05143N47312M92512M07561M04598M98100N92017O08782
$$ plain form
12957 23274756 23847598 24400107 24973441 25588955 26244963 26928509 27626716 28343576 29102478
12948 29102478 29919515 30784609 31681966 32613951 33590727 34616956 35706889 36889114 38172961
12939 38172961 39532447 40947796 42439772 44040057 45758148 47604664 49608353 51770686
12931 51770686 54045245 56414385 58945248 61701262 64630019 67616643 70622368 73679719
12923 73679719 76767505 79800378 82750731 85666093 88530340 91217129 93641037 95862773
12915 95862773 97975021 99966058 101776317 103418391 104950572 106388933 107740595 109077147
12907 109077147 110473314 111903863 113298137 114665928 116063078 117456881 118747679 119920136
12899 119920136 121048128 122139834 123114377 123970377 124843125 125828639 126875903 127945063
$$ packed form
12957B3274756N72842N52509N73334O15514O56008O83546O98207P16860P58902
12948B9102478Q17037Q65094Q97357R31985R76776J026229J089933J182225J283847
12939C8172961J359486J415349J491976J600285J718091J846516K003689K162333
12931E1770686K274559K369140K530863K756014K928757K986624L005725L057351
12923G3679719L087786L032873K950353K915362K864247K686789K423908K221736
12915I5862773K112248J991037J810259J642074J532181J438361J351662J336552
12907A09077147J396167J430549J394274J367791J397150J393803J290798J172457
12899A19920136J127992J091706R74543Q56000Q72748R85514J047264J069160
$$ plain form
12891 127945063 129163838 130712841 132638649 134902959 137548662 140673528 144270712 148234684
12883 148234684 152515330 157126992 161990647 166904059 171715021 176413171 180998425 185363199
12875 185363199 189372713 192971280 196129989 198768147 200824928 202361479 203497745 204273890
12867 204273890 204656034 204659832 204389309 203961208 203458235 202941858 202425360 201816958 200953301
12858 200953301 199714779 198073901 196034360 193578019 190684048 187357284 183633336 179601693
12850 179601693 175427493 171301252 167358353 163685624 160387999 157570757 155247978 153350828
12842 153350828 151852312 150802139 150199430 149918948 149831478 149924894 150221535 150633843 151007089
12833 151007089 151278597 151488348 151633067 151613918 151356833 150896972 150293459 149521004 148504360
$$ packed form
12891A27945063J218775J549003J925808K264310K645703L124866L597184L963972
12883A48234684M280646M611662M863655M913412M810962M698150M585254M364774
12875A85363199M009514L598567L158709K638158K056781J536551J136266P76145
12867B04273890L82144L798k70523m28101n02973n16377n16498o08402q63657
12858B00953301j238522j640878k039541k456341k893971l326764l723948m031643
12850A79601693m174200m126241l942899l672729l297625k817242k322779j897150
12842A53350828j498516j050173o02709k80482q7470R3416K96641M12308L73246
12833A51007089K71508K09751J44719j9149k57085m59861o03513p72455j016644
$$ plain form
12824 148504360 147227927 145759424 144176715 142508439 140742389 138861358 136859381 134730702
12816 134730702 132451097 129980287 127290816 124385793 121277693 117965931 114458874 110807110
12808 110807110 107087500 103361513 99676448 96095335 92683645 89462775 86411011 83513838
12800 83513838 80781003 78215722 75808837 73567886 71507061 69599329 67787460 66058662
12792 66058662 64456090 62992071 61606748 60252548 58964133 57785570 56672935 55547307
12784 55547307 54422858 53394376 52486474 51593977 50609559 49553244 48524236 47560516 46607578
12775 46607578 45618747 44625575 43682239 42778997 41857880 40908197 39998441 39190561 38458376
12766 38458376 37732840 37007250 36338910 35743709 35155804 34526227 33904993 33367101 32893994
$$ packed form
12824A48504360j276433j468503j582709j668276j766050j881031k001977k128679
12816A34730702k279605k470810k689471k905023l108100l311762l507057l651764
12808A10807110l719610l725987l685065l581113l411690l220870l051764k897173
12800H3513838k732835k565281k406885k240951k060825j907732j811869j728798
12792F6058662j602572j464019j385323j354200j288415j178563j112635j125628
12784E5547307j124449j028482r07902q92497r84418j056315j029008r63720r52938
12775D6607578r88831r93172r43336r03242r21117r49683r09756q07880p32185
12766C8458376p25536p25590o68340n95201n87905o29577o21234n37892m73107
$$ plain form
12757 32893994 32402315 31878736 31405437 31031912 30693098 30302078 29875258 29503190 29217489
12748 29217489 28950978 28638094 28301843 28010852 27780749 27556483 27284596 26968294 26642610
12739 26642610 26322615 25998871 25671467 25359292 25067771 24766519 24416567 24015918 23604685
12730 23604685 23221654 22864242 22499515 22112545 21731753 21397175 21111466 20839670 20556935
12721 20556935 20273432 20002511 19730142 19440888 19157428 18921795 18739810 18570112 18369383
12712 18369383 18129714 17876422 17649305 17476033 17338031 17175330 16958722 16742561 16599627
12703 16599627 16512920 16391871 16201630 16011662 15892499 15822638 15733268 15599482 15451439 15331978
12693 15331978 15270439 15258963 15233518 15128663 14973265 14868197 14839629 14795344 14676766 14561882
$$ packed form
12757C2893994m91679n23579m73299l73525l38814l91020m26820l72068k85701
12748B9217489k66511l12884l36251k90991k30103k24266k71887l16302l25684
12739B6642610l19995l23744l27404l12175k91521l01252l49952m00649m11233
12730B3604685l83031l57412l64727l86970l80792l34578k85709k71796k82735
12721B0556935k83503k70921k72369k89254k83460k35633j81985j69698k00729
12712A8369383k39669k53292k27117j73272j38002j62701k16608k16161j42934
12703A6599627q6707j21049j90241j89968j19163o9861q9370j33786j48043j19461
12693A5331978o1539j1476k5445j04855j55398j05068k8568m4285j18578j14884
$$ plain form
12683 14561882 14532362 14521488 14409842 14215355 14059277 13974510 13880675 13739931 13604126 13495684
12673 13495684 13368279 13212448 13082494 12984329 12851119 12673056 12538246 12490651 12457033 12379400
12663 12379400 12310909 12297962 12268961 12144578 11980452 11889753 11879528 11870178 11833877 11807477 11795976
12652 11795976 11763979 11709754 11661549 11611903 11533375 11446556 11397407 11378420 11342502 11281287 11220025
12641 11220025 11150288 11040269 10899784 10764967 10631547 10472980 10308598 10180000 10075594
12632 10075594 9954760 9829336 9738411 9659118 9532959 9368239 9221598 9090700 8931431 8771873
12622 8771873 8684839 8640912 8525862 8333405 8198833 8186400 8182705 8082331 7949877 7890382
12612 7890382 7868229 7783043 7646894 7552118 7511426 7455886 7362923 7272024 7192262 7100308 7016862
$$ packed form
12683A4561882k9520j0874j11646j94487j56078q4767r3835j40744j35805j08442
12673A3495684j27405j55831j29954r8165j33210j78063j34810m7595l3618p7633
12663A2379400o8491j2947k9001j24383j64126r0699j0225r350l6301k6400j1501
12652A1795976l1997n4225m8205m9646p8528q6819m9149j8987l5918o1215o1262
12641A1220025o9737j10019j40485j34817j33420j58567j64382j28598j04406
12632A0075594j20834j25424r0925p9293j26159j64720j46641j30898j59269j59558
12622H771873q7034m3927j15050j92457j34572j2433l695j00374j32454n9495
12612G890382k2153q5186j36149r4776m0692n5540r2963r0899p9762r1954q3446
$$ plain form
12601 7016862 6982309 6963396 6884708 6753365 6654123 6613102 6564980 6474276 6392122 6357775 6330172
12590 6330172 6263263 6177277 6105625 6033108 5940954 5861218 5827459 5809590 5757136 5680575 5629977
12579 5629977 5607161 5559963 5467834 5379072 5340192 5326364 5276974 5182947 5099115 5064951 5049443
12568 5049443 5001547 4931133 4895577 4909414 4917869 4878352 4821265 4794106 4782575 4736604 4654033
12557 4654033 4585881 4562370 4558431 4536772 4490207 4436597 4399307 4393578 4408202 4404975 4360304 4298171
12545 4298171 4255688 4230984 4199243 4164326 4150398 4151267 4135449 4099231 4067780 4042740 3997280 3929438
12533 3929438 3872850 3843232 3817738 3779870 3743793 3721038 3701127 3676489 3650993 3619004 3576030
12522 3576030 3549312 3566120 3590342 3555633 3473993 3437329 3481042 3520815 3474683 3382819 3341421
$$ packed form
12601G016862l4553j8913p8688j31343r9242m1021m8122r0704q2154l4347k7603
12590F330172o6909q5986p1652p2517r2154p9736l3759j7869n2454p6561n0598
12579E629977k2816m7198r2129q8762l8880j3828m9390r4027q3832l4164j5508
12568E049443m7896p0414l5556J3837Q455l9517n7087k7159j1531m5971q2571
12557D654033o8152k3511l939k1659m6565n3610l7290n729J4624l227m4671o2133
12545D298171m2483k4704l1741l4917j3928Q69j5818l6218l1451k5040m5460o7842
12533C929438n6588k9618k5494l7868l6077k2755j9911k4638k5496l1989m2974
12522C576030k6718J6808K4222l4709q1640l6664M3713L9773m6132r1864m1398
$$ plain form
12511 3341421 3365632 3388056 3363233 3307618 3253240 3218592 3213884 3228222 3224769 3189274 3163199 3185266
12499 3185266 3223855 3217640 3162710 3105363 3066406 3031815 3006726 3015460 3048329 3065339 3054863 3036820
12487 3036820 3010987 2961713 2913641 2914131 2948806 2946078 2890122 2857855 2902922 2968956 2977071 2948590
12475 2948590 2966965 3043032 3094397 3062185 2986552 2945452 2960720 2993158 3007695 3013795 3041700
12464 3041700 3094225 3132600 3115209 3048098 2985232 2972243 3000907 3029955 3040409 3051502 3081961
12453 3081961 3114195 3111145 3066377 3024038 3035681 3096774 3142891 3123380 3066345 3044644 3079904
12442 3079904 3115031 3098106 3060453 3072961 3139518 3184079 3156243 3103685 3102697 3148372 3170663 3151413
12430 3151413 3154946 3216281 3267316 3237040 3178055 3203888 3314915 3388641 3364956 3338877 3408643
$$ packed form
12511C341421K4211K2424k4823n5615n4378l4648m708J4338l453l5495k6075K2067
12499C185266L8589o215n4930n7347l8957l4591k5089Q734L2869J7010j0476j8043
12487C036820k5833m9274m8072M90L4675k728n5956l2267M5067O6034Q115k8481
12475B948590J8375P6067N1365l2212p5633m1100J5268L2438J4537O100K7905
12464C041700N2525L8375j7391o7111o2866j2989K8664K9048J0454J1093L0459
12453C081961L2234l050m4768m2339J1643O1093M6117j9511n7035k1701L5260
12442C079904L5127j6925l7653J2508O6557M4561k7836n2558r88M5675K2291j9250
12430C151413L533O1335N1035l0276n8985K5833J11027P3726k3685k6079O9766
$$ plain form
12419 3408643 3517971 3543361 3484110 3454996 3507681 3570345 3578915 3567334 3587883 3625617 3648391
12408 3648391 3677746 3743919 3814383 3836741 3827598 3851676 3923615 3995291 4042560 4100540 4192085
12397 4192085 4276737 4310215 4318326 4363187 4451319 4525686 4553812 4577208 4648454 4753647 4836138
12386 4836138 4879943 4926280 5009954 5121616 5239931 5359335 5471199 5559488 5638401 5752905
12376 5752905 5909989 6049109 6121738 6163248 6235546 6331840 6401759 6448455 6526777 6648135 6759616
12365 6759616 6830706 6897322 6997179 7114148 7214184 7296205 7380603 7474579 7567623 7644616 7701698
12354 7701698 7765305 7876893 8030296 8156791 8219478 8280954 8404968 8533139 8563583 8526644
12344 8526644 8554915 8678433 8788203 8826232 8864013 8943165 8991127 8975472 8994984 9110397 9219618
$$ packed form
12419C408643J09328K5390n9251k9114N2685O2664Q570j1581K0549L7734K2774
12408C648391K9355O6173P0464K2358r143K4078P1939P1676M7269N7980R1545
12397D192085Q4652L3478Q111M4861Q8132P4367K8126K3396P1246J05193Q2491
12386D836138M3805M6337Q3674J11662J18315J19404J11864Q8289P8913J14504
12376E752905J57084J39120P2629M1510P2298R6294O9919M6696P8322J21358J11481
12365F759616P1090O6616R9857J16969J00036Q2021Q4398R3976R3044P6993N7082
12354G701698O3607J11588J53403J26495O2687O1476J24014J28171L0444l6939
12344H526644K8271J23518J09770L8029L7781P9152M7962j5655J9512J15413J09221
$$ plain form
12333 9219618 9227317 9212268 9279366 9363843 9357366 9328361 9414398 9565754 9616548 9574367 9608058
12322 9608058 9748643 9838908 9819608 9835619 9978357 10133038 10191859 10235131 10370779 10549348
12312 10549348 10676927 10778504 10905942 11001232 11004119 10999383 11100029 11258019 11344079 11354268
12302 11354268 11383355 11441468 11456896 11435314 11460745 11541451 11594529 11590453 11587241 11612544 11631451
12291 11631451 11642540 11688516 11754600 11771308 11742516 11759819 11857639 11958743 12001141 12020514 12065813
12280 12065813 12128783 12204170 12327445 12496275 12637232 12712138 12785637 12925527 13101079 13243306
12270 13243306 13348274 13456891 13582047 13717260 13873972 14053462 14223449 14374787 14555042
12261 14555042 14790582 15025588 15203737 15363111 15574266 15824229 16049300 16256807 16517179
$$ packed form
12333I219618P699j5049O7098Q4477o477k9005Q6037J51356N0794m2181L3691
12322I608058J40585R0265j9300J6011J42738J54681N8821M3272J35648J78569
12312A0549348J27579J01577J27438R5290K887m736J00646J57990Q6060J0189
12302A1354268K9087N8113J5428k1582K5431Q0706N3078m076l212K5303J8907
12291A1631451J1089M5976O6084J6708k8792J7303R7820J01104M2398J9373M5299
12280A2065813O2970P5387J23275J68830J40957P4906P3499J39890J75552J42227
12270A3243306J04968J08617J25156J35213J56712J79490J69987J51338J80255
12261A4555042K35540K35006J78149J59374K11155K49963K25071K07507K60372
$$ plain form
12252 16517179 16837635 17139485 17383949 17638579 17975334 18361676 18707080 18987389 19271941
12243 19271941 19631822 20057971 20483178 20869420 21253215 21696412 22204784 22718819 23187542
12234 23187542 23627724 24100995 24653910 25287920 25960725 26606325 27187217 27745194 28366234
12225 28366234 29073764 29796952 30475035 31148542 31900914 32747814 33642141 34561848 35529027
12216 35529027 36555088 37628291 38750957 39933564 41156772 42396421 43683954 45082128
12208 45082128 46597970 48180683 49810941 51524580 53333614 55197191 57102011 59102847
12200 59102847 61238576 63467913 65742978 68097003 70596601 73244473 75997684 78860212
12192 78860212 81888824 85113857 88515901 92083253 95837181 99792574 103944879 108310387
$$ packed form
12252A6517179L20456L01850K44464K54630L36755L86342L45404K80309K84552
12243A9271941L59881M26149M25207L86242L83795M43197N08372N14035M68723
12234B3187542M40182M73271N52915O34010O72805O45600N80892N57977O21040
12225B8366234P07530P23188O78083O73507P52372Q46900Q94327R19707R67179
12216C5529027J026061J073203J122666J182607J223208J239649J287533J398174
12208D5082128J515842J582713J630258J713639J809034J863577J904820K000836
12200E9102847K135729K229337K275065K354025K499598K647872K753211K862528
12192G8860212L028612L225033L402044L567352L753928L955393M152305M365508
$$ plain form
12184 108310387 112934678 117844373 123032501 128511708 134338044 140547428 147099858 153926794
12176 153926794 161015295 168402513 176088411 183987798 191975878 199957926 207884545 215714281
12168 215714281 223374608 230760694 237775758 244375987 250566029 256342345 261658336 266469802
12160 266469802 270808683 274787202 278532490 282143662 285706152 289298300 292956607 296662424
12152 296662424 300386388 304117699 307821465 311399444 314740913 317800896 320586989 323081253
12144 323081253 325226090 326989176 328396943 329501437 330365420 331093115 331826622 332692076
12136 332692076 333790013 335244037 337185316 339640813 342481868 345523530 348626796 351661546
12128 351661546 354435147 356737674 358418554 359337339 359274157 357991571 355378419 351434475
$$ packed form
12184A08310387M624291M909695N188128N479207N826336O209384O552430O826936
12176A53926794P088501P387218P685898P899387P988080P982048P926619P829736
12168B15714281P660327P386086P015064O600229O190042N776316N315991M811466
12160B66469802M338881L978519L745288L611172L562490L592148L658307L705817
12152B96662424L723964L731311L703766L577979L341469L059983K786093K494264
12144C23081253K144837J763086J407767J104494Q63983P27695P33507Q65454
12136C32692076J097937J454024J941279K455497K841055L041662L103266L034750
12128C51661546K773601K302527J680880R18785o3182j282586k613152l943944
$$ plain form
12120 351434475 346113683 339304976 331020222 321512779 311151811 300252805 289090696
12113 289090696 277992506 267294502 257204574 247767278 238955655 230748545 223137937
12106 223137937 216124966 209715344 203883329 198553516 193663235 189231333 185315008 181905826
12098 181905826 178924233 176320036 174121131 172366786 171045875 170130883 169629568 169557106
12090 169557106 169870119 170460506 171212594 172049268 172925467 173789112 174548432 175075941 175252639
12081 175252639 175011492 174329886 173181396 171511774 169269917 166452147 163110952 159330395
12073 159330395 155197877 150789665 146176792 141449356 136732703 132162128 127827449 123744910
12065 123744910 119889125 116246518 112828259 109636204 106637211 103788120 101080065 98536386
$$ packed form
12120C51434475n320792o808707q284754r507443j0360968j0899006j1162109
12113B89090696j1098190j0698004j0089928r437296q811623q207110p610608
12106B23137937p012971o409622n832015n329813m890281m431902l916325l409182
12098A81905826k981593k604197k198905j754345j320911r14992n01315p2462
12090A69557106L13013N90387P52088Q36674Q76199Q63645P59320N27509J76698
12081A75252639k41147o81606j148490j669622k241857k817770l341195l780557
12073A59330395m132518m408212m612873m727436m716653m570575m334679m082539
12065A23744910l855785l642607l418259l192055k998993k849091k708055k543679
$$ plain form
12057 98536386 96161905 93918902 91770129 89720639 87786050 85940171 84140486 82397137
12049 82397137 80760642 79234754 77761449 76311496 74924441 73621367 72344909 71047871
12041 71047871 69786308 68642872 67591529 66528232 65422214 64345065 63345921 62390871
12033 62390871 61451682 60568575 59777639 59041716 58308595 57591733 56939371 56355435 55801104
12024 55801104 55255705 54734799 54258065 53826545 53421135 53008601 52567305 52115434 51685201
12015 51685201 51262716 50795680 50274604 49755582 49276444 48801877 48286068 47737651 47179092
12006 47179092 46593447 45966249 45335496 44740231 44159792 43566764 42997751 42496458 42023969
11997 42023969 41513204 40985984 40519706 40112843 39688936 39235492 38828738 38500317 38188258
$$ packed form
12057I8536386k374481k243003k148773k049490j934589j845879j799685j743349
12049H2397137j636495j525888j473305j449953j387055j303074j276458j297038
12041G1047871j261563j143436j051343j063297j106018j077149r99144r55050
12033F2390871r39189q83107p90936p35923p33121p16862o52362n83936n54331
12024E5801104n45399n20906m76734m31520m05410m12534m41296m51871m30233
12015E1685201m22485m67036n21076n19022m79138m74567n15809n48417n58559
12006D7179092n85645o27198o30753n95265n80439n93028n69013n01293m72489
11997D2023969n10765n27220m66278m06863m23907m53444m06754l28421l12059
$$ plain form
11988 38188258 37855543 37548060 37280946 36976370 36595937 36240407 36011690 35844734 35596956
11979 35596956 35264728 34983469 34818780 34679349 34464010 34193489 33947075 33742494 33536569
11970 33536569 33300460 33042773 32782063 32532942 32302964 32079827 31838547 31575684 31314206
11961 31314206 31064246 30810487 30553259 30323916 30132802 29938638 29707368 29471248 29282935
11952 29282935 29132620 28967164 28784160 28643924 28573504 28517941 28421880 28312511 28250070 28224874
11942 28224874 28165288 28042651 27907512 27807084 27721144 27611101 27488785 27392273 27321753 27248403
11932 27248403 27172136 27121621 27101939 27088734 27074386 27073898 27083235 27084729 27103743 27200035 27375949 27548987
11920 27548987 27654330 27725170 27825267 27948665 28044931 28106151 28161402 28211202 28239600 28274778
$$ packed form
11988C8188258l32715l07483k67114l04576l80433l55530k28717j66956k47778
11979C5596956l32228k81259j64689j39431k15339k70521k46414k04581k05925
11970C3536569k36109k57687k60710k49121k29978k23137k41280k62863k61478
11961C1314206k49960k53759k57228k29343j91114j94164k31270k36120j88313
11952B9282935j50315j65456j83004j40236p0420n5563r6061j09369o2441k5196
11942B8224874n9586j22637j35139j00428q5940j10043j22316r6512p0520p3350
11932B7248403p6267n0515j9682j3205j4348m88R337J494J9014R6292J75914J73038
11920B7548987J05343P0840J00097J23398R6266O1220N5251M9800K8398L5178
$$ plain form
11910 28274778 28361457 28479770 28570741 28644481 28777991 28990362 29210641 29404601 29644273 29993279
11900 29993279 30398317 30767467 31097713 31445305 31817315 32183920 32569819 33036291 33576720
11891 33576720 34119638 34645999 35220749 35885219 36594135 37295747 38010884 38787167 39623065
11882 39623065 40484624 41362315 42266790 43195270 44143902 45132641 46178583 47259495 48337932
11873 48337932 49408851 50495018 51613074 52775755 54008450 55325316 56704003 58124889
11865 58124889 59621300 61241062 62964672 64720817 66494224 68360568 70388273 72557943
11857 72557943 74819417 77185260 79712721 82418532 85271334 88258872 91400486 94685653
11849 94685653 98062036 101514265 105109158 108926023 112976988 117238642 121737445 126556501
$$ packed form
11910B8274778Q6679J18313R0971P3740J33510K12371K20279J93960K39672L49006
11900B9993279M05038L69150L30246L47592L72010L66605L85899M66472N40429
11891C3576720N42918N26361N74750O64470P08916P01612P15137P76283Q35898
11882C9623065Q61559Q77691R04475R28480R48632R88739J045942J080912J078437
11873D8337932J070919J086167J118056J162681J232695J316866J378687J420886
11865E8124889J496411J619762J723610J756145J773407J866344K027705K169670
11857G2557943K261474K365843K527461K705811K852802K987538L141614L285167
11849I4685653L376383L452229L594893L816865M050965M261654M498803M819056
$$ plain form
11841 126556501 131770376 137418642 143537780 150173747 157363761 165153019 173638975 182962847
11833 182962847 193261122 204677189 217416931 231711822 247692694 265356218 284651794
11826 284651794 305444917 327264184 349183617 370177083 389666806 407630749 424116795
11819 424116795 438706421 450475360 458425203 461974850 461159630 456399098 447968455 435656984
11811 435656984 419099918 398595497 375535373 351892692 329269257 308425734 289504280
11804 289504280 272394587 256857169 242574388 229313615 217027218 205730313 195343144
11797 195343144 185719198 176765661 168457784 160770414 153657521 147068391 140930812 135149007
11789 135149007 129669485 124524462 119769362 115406074 111400333 107726798 104345642 101178258
$$ packed form
11841A26556501N213875N648266O119138O635967P190014P789258Q485956R323872
11833A82962847J0298275J1416067J2739742J4294891J5980872J7663524J9295576
11826B84651794K0793123K1819267K1919433K0993466J9489723J7963943J6486046
11819D24116795J4589626J1768939P949843L549647q15220m760532q430643j2311471
11811D35656984j6557066k0504421k3060124k3642681k2623435k0843523j8921454
11804B89504280j7109693j5537418j4282781j3260773j2286397j1296905j0387169
11797A95343144r623946q953537q307877p687370p112893o589130o137579n781805
11789A35149007n479522n145023m755100m363288m005741l673535l381156l167384
$$ plain form
11781 101178258 98167231 95326220 92672332 90151072 87702282 85362597 83208704 81216182
11773 81216182 79275341 77350640 75521522 73836865 72224839 70602409 69002271 67522113
11765 67522113 66187965 64929454 63671040 62399696 61151164 59965225 58855371 57806022
11757 57806022 56798205 55830634 54899427 53977532 53058328 52204314 51482840 50847455 50165082
11748 50165082 49392999 48646255 48033433 47503421 46937640 46331558 45776151 45290163 44789842
11739 44789842 44231235 43670750 43148087 42603806 41973085 41293146 40647963 40047634 39429593
11730 39429593 38757180 38055923 37359853 36674979 35999501 35338015 34687252 34040149 33411077
11721 33411077 32826293 32279636 31728624 31152897 30591439 30095491 29658999 29225120 28758673
$$ packed form
11781A01178258l011027k841011k653888k521260k448790k339685k153893j992522
11773H1216182j940841j924701j829118j684657j612026j622430j600138j480158
11765F7522113j334148j258511j258414j271344j248532j185939j109854j049349
11757E7806022j007817r67571r31207r21895r19204q54014p21474o35385o82373
11748E0165082p72083p46744o12822n30012n65781o06082n55407m85988n00321
11739D4789842n58607n60485n22663n44281o30721o79939o45183o00329o18041
11730C9429593o72413p01257o96070o84874o75478o61486o50763o47103o29072
11721C3411077n84784n46657n51012n75727n61458m95948m36492m33879m66447
$$ plain form
11712 28758673 28283985 27844317 27449402 27079586 26721755 26374961 26028933 25665658 25284748
11703 25284748 24902829 24522642 24128628 23723022 23337768 22991585 22661578 22322880 21990139
11694 21990139 21684041 21381060 21049219 20724531 20488555 20355367 20239875 20069572 19874718
11685 19874718 19720248 19593568 19429786 19228373 19065863 18981107 18917434 18811998 18688113 18611222
11675 18611222 18588784 18566198 18502550 18399575 18267746 18120226 18001787 17963502 17987323 17986875 17915027
11664 17915027 17827117 17797712 17814841 17811699 17775526 17757254 17779007 17801102 17796370 17795935 17828869 17862233
11652 17862233 17841658 17764642 17678263 17620111 17586454 17544195 17457720 17322905 17184452 17088867 17009551
11641 17009551 16865458 16639048 16420055 16285801 16191941 16049448 15865285 15717657 15615217
$$ packed form
11712B8758673m74688m39668l94915l69816l57831l46794l46028l63275l80910
11703B5284748l81919l80187l94014m05606l85254l46183l30007l38698l32741
11694B1990139l06098l02981l31841l24688k35976j33188j15492j70303j94854
11685A9874718j54470j26680j63782k01413j62510q4756o3673j05436j23885p6891
11675A8611222k2438k2586o3648j02975j31829j47520j18439l8285K3821m48p1848
11664A7915027q7910k9405J7129l142l6173j8272K1753K2095m732m35L2934L3364
11652A7862233k0575p7016q6379n8152l3657m2259q6475j34815j38453r5585p9316
11641A7009551j44093k26410k18993j34254r3860j42493j84163j47628j02440
$$ plain form
11632 15615217 15482922 15292918 15109903 14978883 14859359 14714746 14582489 14492765 14388750
11623 14388750 14207281 13990621 13833641 13746265 13649368 13496969 13327132 13188016 13078964 12977293
11613 12977293 12870041 12746313 12603842 12471750 12381119 12307102 12193213 12043752 11930243 11880610
11603 11880610 11826291 11705182 11560733 11474231 11439082 11381022 11284012 11207203 11166415 11086917 10919000
11592 10919000 10732945 10631365 10604562 10545864 10398731 10218736 10081347 9991893 9913124 9829453
11582 9829453 9742698 9637991 9499571 9346747 9218997 9131194 9065009 8991636 8885661 8741258
11572 8741258 8600131 8531940 8546607 8553720 8460937 8293570 8159027 8106512 8088135 8053954 8009724
11561 8009724 7967754 7914349 7852721 7813696 7795299 7754150 7685654 7644307 7648412 7638512 7578477 7520737
$$ packed form
11632A5615217j32295j90004j83015j31020j19524j44613j32257q9724j04015
11623A4388750j81469k16660j56980q7376r6897j52399j69837j39116j09052j01671
11613A2977293j07252j23728j42471j32092r0631p4017j13889j49461j13509m9633
11603A1880610n4319j21109j44449q6502l5149n8060r7010p6809m0788p9498j67917
11592A0919000j86055j01580k6803n8698j47133j79995j37389q9454p8769q3671
11582I829453q6755j04707j38420j52824j27750q7803o6185p3373j05975j44403
11572H741258j41127o8191J4667P113r2783j67367j34543n2515j8377l4181m4230
11561H009724m1970n3405o1628l9025j8397m1149o8496m1347M105r900o0035n7740
$$ plain form
11549 7520737 7507362 7483180 7391154 7286504 7254360 7265368 7225266 7132548 7066583 7036818 6969940
11538 6969940 6850454 6749763 6692895 6613961 6481494 6358451 6288161 6221528 6116909 6019977
11528 6019977 5975717 5942987 5871756 5793420 5753840 5719125 5634690 5528693 5467853 5446074 5402928
11517 5402928 5327114 5259663 5213600 5169848 5139488 5150686 5177563 5158083 5090073 5043935 5066896
11506 5066896 5127189 5164110 5149901 5096936 5043443 5032905 5070925 5107563 5097110 5060407 5047457
11495 5047457 5060299 5065025 5058916 5062715 5061352 5021992 4964707 4945127 4968844 4993682 5013793 5061073
11483 5061073 5119962 5132336 5105209 5117986 5188534 5228500 5184244 5129244 5143299 5182217 5161244
11472 5161244 5105841 5110392 5179262 5219289 5186821 5142308 5142126 5162554 5162655 5150085 5140503 5108855
$$ packed form
11549G520737j3375k4182r2026j04650l2144J1008m0102r2718o5965k9765o6878
11538F969940j19486j00691n6868p8934j32467j23043p0290o6633j04619r6932
11528F019977m4260l2730p1231p8336l9580l4715q4435j05997o0840k1779m3146
11517E402928p5814o7451m6063m3752l0360J1198K6877j9480o8010m6138K2961
11506E066896O0293L6921j4209n2965n3493j0538L8020L6638j0453l6703j2950
11495E047457J2842M726o109L799j363l9360n7285j9580K3717K4838K0111M7280
11483E061073N8889J2374k7127J2777P0548L9966m4256n5000J4055L8918k0973
11472E161244n5403M551O8870M0027l2468m4513j82K0428J01j2570r582l1648
$$ plain form
11460 5108855 5037064 4974548 4988468 5061126 5092782 5022341 4904801 4839006 4845096 4857519 4832173
11449 4832173 4803968 4813287 4826129 4781957 4693539 4632715 4621776 4607881 4559576 4521249 4536877
11438 4536877 4574157 4570664 4518341 4457488 4414338 4386005 4365967 4347216 4317379 4279756 4257476
11427 4257476 4251210 4223985 4159742 4101048 4086701 4085965 4045358 3972252 3915962 3888381 3863369 3838478
11415 3838478 3833225 3833087 3798649 3731915 3676074 3647165 3621918 3594365 3583661 3580661 3552380 3512015
11403 3512015 3515554 3565446 3586621 3534450 3463052 3439929 3449168 3435788 3399507 3378368 3370529 3342551
11391 3342551 3301230 3288858 3304981 3294813 3232535 3167026 3158665 3203636 3246376 3244173 3196957 3132768
11379 3132768 3088725 3092152 3131646 3152793 3113621 3046460 3029585 3082129 3124629 3079806 2983223
$$ packed form
11460E108855p1791o2516J3920P2658L1656p0441j17540o5795O090J2423k5346
11449D832173k8205R319J2842m4172q8418o0824j0939j3895m8305l8327J5628
11438D536877L7280l493n2323o0853m3150k8333k0038j8751k9837l7623k2280
11427D257476o266k7225o4243n8694j4347p36m0607p3106n6290k7581k5012k4891
11415C838478n253j38l4438o6734n5841k8909k5247k7553j0704l000k8281m0365
11403C512015L539M9892K1175n2171p1398k3123R239j3380l6281k1139p839k7978
11391C342551m1321j2372J6123j0168o2278o5509q361M4971M2740k203m7216o4189
11379C132768m4043L427L9494K1147l9172o7161j6875N2544M2500m4823r6583
$$ plain form
11368 2983223 2938494 2973570 3008425 2977087 2912431 2876772 2873588 2878830 2900540 2939758 2942115 2871541
11356 2871541 2796497 2809443 2882534 2905902 2861418 2844647 2900128 2953258 2945768 2926422 2945938
11345 2945938 2963705 2937080 2913994 2944500 2975548 2938213 2881221 2903142 2988431 3028604 2992889
11334 2992889 2965161 3004663 3070928 3108020 3118737 3127901 3139361 3153826 3175893 3191487 3188808 3198810
11322 3198810 3253251 3311881 3311432 3283268 3323456 3431037 3486364 3432533 3370005 3401482 3478876
11311 3478876 3497758 3469709 3490207 3577640 3655695 3681957 3693597 3721432 3747748 3767028 3811677
11300 3811677 3888471 3949989 3962054 3953911 3970705 4012744 4051373 4076473 4099909 4130972 4169980
11289 4169980 4211845 4243116 4253227 4258965 4294848 4364972 4428577 4453360 4460122 4486075 4520522 4514946
$$ packed form
11368B983223m4729L5076L4855l1338o4656l5659l184N242K1710L9218K357p0574
11356B871541p5044J2946P3091K3368m4484j6771N5481N3130p490j9346J9516
11345B945938J7767k6625k3086L0506L1048l7335n6992K1921Q5289M0173l5715
11334B992889k7728L9502O6265L7092J0717R164J1460J4465K2067J5594k679J0002
11322C198810N4441N8630m49k8164M0188J07581N5327n3831o2528L1477P7394
11311C478876J8882k8049K0498Q7433P8055K6262J1640K7835K6316J9280M4649
11300C811677P6794O1518J2065q143J6794M2039L8629K5100K3436L1063L9008
11289D169980M1865L1271J0111N738L5883P0124O3605K4783O762K5953L4447n576
$$ plain form
11277 4514946 4458005 4405285 4416970 4486731 4553781 4574614 4560297 4546455 4552207 4577101 4615819
11266 4615819 4657001 4680724 4677803 4664891 4662750 4667700 4664756 4658750 4664013 4669199 4647761 4605710 4581589
11253 4581589 4588871 4595028 4572950 4536576 4506025 4475660 4443000 4430083 4440420 4430970 4370726 4295657
11241 4295657 4255916 4237918 4199577 4160303 4180986 4257388 4309489 4292061 4247889 4228889 4230314
11230 4230314 4234218 4252474 4281945 4277221 4225298 4194959 4241818 4306883 4295564 4232641 4236757 4334290
11218 4334290 4404253 4354694 4266059 4279995 4398922 4490961 4481110 4444457 4483301 4585296 4659014
11207 4659014 4668949 4667807 4701574 4746768 4766264 4780225 4835819 4927336 4997276 5018908 5031086 5073179
11195 5073179 5127276 5158709 5181805 5238319 5326893 5406207 5465803 5539419 5638285 5728192 5797207
$$ packed form
11277D514946n6941n2720J1685O9761O7050K0833j4317j3842N752K4894L8718
11266D615819M1182K3723k921j2912k141M950k944o006N263N186k1438m2051k4121
11253D581589P282O157k2078l6374l0551l0365l2660j2917J0337r450o0244p5069
11241D295657l9741j7998l8341l9274K0683P6402N2101j7428m4172j9000J425
11230D230314L904J8256K9471m724n1923l0339M6859O5065j1319o2923M116R7533
11218D334290O9963m9559q8635J3936J18927R2039r851l6653L8844J01995P3718
11207D659014R935j142L3767M5194J9496J3961N5594R1517O9940K1632J2178M2093
11195E073179N4097L1433K3096N6514Q8574P9314N9596P3616R8866Q9907O9015
$$ plain form
11184 5797207 5888665 6024459 6148098 6205352 6240562 6334419 6470119 6555183 6578253 6643219 6813247
11173 6813247 7013614 7150348 7248770 7393272 7584780 7753040 7882696 8030624 8220494 8407528
11163 8407528 8563087 8721451 8920764 9157179 9416536 9694726 9968564 10205311 10424495
11154 10424495 10693514 11036288 11403125 11758380 12135130 12565012 13017248 13459468 13925309
11145 13925309 14463571 15065838 15707207 16423724 17287000 18325941 19523646 20861270 22313387
11136 22313387 23831540 25382944 26970577 28568876 30091694 31481540 32764337 33937739
11128 33937739 34883456 35503995 35870424 36076311 35997297 35401613 34310409 33036921 31802184
11119 31802184 30513609 29040844 27528765 26259730 25319816 24582992 23954045 23445679 23049350
$$ packed form
11184E797207R1458J35794J23639N7254L5210R3857J35700Q5064K3070O4966J70028
11173F813247K00367J36734R8422J44502J91508J68260J29656J47928J89870J87034
11163H407528J55559J58364J99313K36415K59357K78190K73838K36747K19184
11154A0424495K69019L42774L66837L55255L76750M29882M52236M42220M65841
11145A3925309N38262O02267O41369P16517Q63276J038941J197705J337624J452117
11136B2313387J518153J551404J587633J598299J522818J389846J282797J173402
11128C3937739R45717O20539L66429K05887p9014n95684j091204j273488j234737
11119C1802184j288575j472765j512079j269035r39914p36824o28947n08366l96329
$$ plain form
11110 23049350 22707028 22419811 22238965 22130019 21976729 21751429 21565463 21509214 21542153 21586530
11100 21586530 21639702 21740233 21896853 22105588 22377527 22699301 23017945 23312633 23635791
11091 23635791 24037269 24489755 24938056 25388287 25895554 26480803 27107623 27741794 28402820
11082 28402820 29145364 29997191 30927921 31900191 32952698 34183161 35611134 37110639 38552419
11073 38552419 39973826 41506977 43155067 44757371 46184475 47441288 48546538 49453430
11065 49453430 50159246 50747280 51200736 51302645 50892846 50153314 49450528 48912021 48341762
11056 48341762 47578689 46759389 46142087 45805809 45636622 45527057 45469810 45489644 45588445 45765955
11046 45765955 46030644 46374076 46765793 47178695 47603970 48049382 48535663 49079724 49669392
$$ packed form
11110B3049350l42322k87217j80846j08946j53290k25300j85966n6249L2939M4377
11100B1586530N3172J00531J56620K08735K71939L21774L18644K94688L23158
11091B3635791M01478M52486M48301M50231N07267N85249O26820O34171O61026
11082B8402820P42544Q51827R30730R72270J052507J230463J427973J499505J441780
11073C8552419J421407J533151J648090J602304J427104J256813J105250R06892
11065D9453430P05816N88034M53456J01909m09799p39532p02786n38507n70259
11056D8341762p63073q19300o17302l36278j69187j09565n7247J9834R8801J77510
11046D5765955K64689L43432L91717M12902M25275M45412M86281N44061N89668
$$ plain form
11037 49669392 50272634 50881638 51525642 52231080 52994909 53805033 54654185 55523457 56393288
11028 56393288 57290312 58279562 59379970 60528601 61667471 62829732 64093303 65477399
11020 65477399 66936869 68440761 70003446 71646264 73378688 75216563 77173420 79230577
11012 79230577 81356693 83560559 85885262 88346142 90914906 93571075 96325631 99181782
11004 99181782 102117937 105132118 108261751 111526801 114884503 118277348 121705524 125214685
10996 125214685 128822649 132493610 136185540 139895512 143649905 147465124 151327379 155209120
10988 155209120 159102539 163029779 167012695 171045974 175123585 179279818 183561646 187957504
10980 187957504 192405720 196894979 201502335 206290759 211215093 216179960 221145442 226106687
$$ packed form
11037D9669392O03242O09004O44004P05438P63829Q10124Q49152Q69272Q69831
11028E6393288Q97024R89250J100408J148631J138870J162261J263571J384096
11020F5477399J459470J503892J562685J642818J732424J837875J956857K057157
11012G9230577K126116K203866K324703K460880K568764K656169K754556K856151
11004I9181782K936155L014181L129633L265050L357702L392845L428176L509161
10996A25214685L607964L670961L691930L709972L754393L815219L862255L881741
10988A55209120L893419L927240L982916M033279M077611M156233M281828M395858
10980A87957504M448216M489259M607356M788424M924334M964867M965482M961245
$$ plain form
10972 226106687 231005648 235751881 240315788 244704683 248842533 252575628 255821995 258610793
10964 258610793 260928726 262636230 263614229 263899665 263574325 262599370 260887379 258484697
10956 258484697 255538113 252105228 248154173 243760454 239141244 234442275 229639646 224735165
10948 224735165 219910825 215366081 211102172 207005781 203072977 199392399 195939294 192551216
10940 192551216 189125629 185701105 182301117 178821869 175144704 171268951 167258096 163121736
10932 163121736 158829810 154403069 149919640 145453754 141058023 136782107 132662790 128716738
10924 128716738 124979917 121522418 118377835 115487176 112766432 110207929 107858808 105718211
10916 105718211 103723129 101834859 100075227 98466539 96994679 95649922 94446936 93373118
$$ packed form
10972B26106687M898961M746233M563907M388895M137850L733095L246367K788798
10964B58610793K317933J707504R77999K85436l25340r74955j711991k402682
10956B58484697k946584l432885l951055m393719m619210m698969m802629m904481
10948B24735165m824340m544744m263909m096391l932804l680578l453105l388078
10940A92551216l425587l424524l399988l479248l677165l875753m010855m136360
10932A63121736m291926m426741m483429m465886m395731m275916m119317l946052
10924A28716738l736821l457499l144583k890659k720744k558503k349121k140597
10916A05718211j995082j888270j759632j608688j471860j344757j202986j073818
$$ plain form
10908 93373118 92366829 91389963 90485799 89715327 89058324 88429852 87786612 87162301 86587239
10899 86587239 86023989 85416232 84770038 84141406 83549254 82942798 82269360 81543814 80824670
10890 80824670 80138329 79459129 78760909 78053066 77351645 76643993 75911771 75176249 74485927
10881 74485927 73852983 73230540 72572928 71901449 71281238 70733395 70201650 69626161 69028658
10872 69028658 68489574 68046056 67654199 67264820 66892916 66578169 66312786 66061982 65838659
10863 65838659 65696030 65644436 65636546 65650530 65727696 65899327 66135746 66412920 66776694 67278655
10853 67278655 67885471 68523670 69194603 69969420 70872581 71846000 72845716 73907581 75085452
10844 75085452 76374731 77731888 79130662 80565186 82029899 83530003 85085695 86694606
$$ packed form
10908I3373118j006289r76866r04164p70472o57003o28472o43240o24311n75062
10899H6587239n63250o07757o46194o28632n92152o06456o73438p25546p19144
10890H0824670o86341o79200o98220p07843p01421p07652p32222p35522o90322
10881G4485927o32944o22443o57612o71479o20211n47843n31745n75489n97503
10872F9028658n39084m43518l91857l89379l71904l14747k65383k50804k23323
10863F5838659j42629n1594p890J3984P7166J71631K36419K77174L63774N01961
10853F7278655O06816O38199O70933P74817R03161R73419R99716J061865J177871
10844G5085452J289279J357157J398774J434524J464713J500104J555692J608911
$$ plain form
10836 86694606 88312880 89902273 91472121 93043677 94598286 96101078 97558552 99007588
10828 99007588 100452981 101859288 103208746 104528898 105852021 107180367 108508073 109849668
10820 109849668 111223722 112627050 114053417 115532500 117123034 118857864 120712908 122646586
10812 122646586 124661893 126809103 129126248 131601487 134207448 136947141 139835806 142852712
10804 142852712 145949984 149104837 152319434 155563489 158765569 161880638 164918358 167872320
10796 167872320 170665156 173207683 175475879 177478042 179180046 180531875 181552347 182312782
10788 182312782 182832878 183062792 182984538 182665945 182187986 181577331 180842274 180018730 179140439
10779 179140439 178215965 177283213 176438383 175752819 175201059 174734821 174391154 174249672 174309781
$$ packed form
10836H6694606J618274J589393J569848J571556J554609J502792J457474J449036
10828I9007588J445393J406307J349458J320152J323123J328346J327706J341595
10820A09849668J374054J403328J426367J479083J590534J734830J855044J933678
10812A22646586K015307K147210K317145K475239K605961K739693K888665L016906
10804A42852712L097272L154853L214597L244055L202080L115069L037720K953962
10796A67872320K792836K542527K268196K002163J702004J351829J020472P60435
10788A82312782N20096K29914p8254l18593m77959o10655p35057q23544q78291
10779A79140439r24474r32752q44830o85564n51760m66238l43667j41482O0109
$$ plain form
10770 174309781 174505571 174839603 175398922 176209611 177170136 178184297 179284128 180548589 181954865
10761 181954865 183391866 184788285 186142324 187436187 188605208 189603181 190426971 191053461
10753 191053461 191412835 191455652 191195845 190651759 189789368 188568035 187008251 185164831 183056513
10744 183056513 180676100 178061910 175305831 172481009 169600171 166657328 163679627 160724717
10736 160724717 157850296 155094442 152460953 149915541 147424473 145010331 142741356 140647177
10728 140647177 138673496 136747817 134866684 133082297 131416851 129831007 128276414 126740274
10720 126740274 125226442 123723779 122211196 120672657 119090644 117443183 115724607 113953511
10712 113953511 112142829 110277819 108343099 106353685 104331155 102262678 100121484 97926499
$$ packed form
10770A74309781J95790L34032N59319Q10689R60525J014161J099831J264461J406276
10761A81954865J437001J396419J354039J293863J169021R97973Q23790O26490
10753A91053461L59374M2817k59807n44086q62391j221333j559784j843420k108318
10744A83056513k380413k614190k756079k824822k880838k942843k977701k954910
10736A60724717k874421k755854k633489k545412k491068k414142k268975k094179
10728A40647177j973681j925679j881133j784387j665446j585844j554593j536140
10720A26740274j513832j502663j512583j538539j582013j647461j718576j771096
10712A13953511j810682j865010j934720j989414k022530k068477k141194k194985
$$ plain form
10704 97926499 95741319 93602142 91482629 89350977 87230843 85176543 83209517 81310945
10696 81310945 79462790 77665084 75923308 74249861 72668965 71187418 69769296 68377721
10688 68377721 67034888 65794246 64653084 63548456 62454854 61427585 60515881 59684114
10680 59684114 58866844 58064572 57331576 56692677 56123871 55599480 55109375 54641894 54198744
10671 54198744 53818493 53537515 53333117 53149349 52968328 52807503 52662540 52516975 52399972
10662 52399972 52359999 52377995 52386304 52386072 52457268 52624833 52811606 52975510 53197258 53552185 53977319
10651 53977319 54368908 54753513 55245918 55868840 56534695 57200204 57921603 58737654 59604538
10642 59604538 60485612 61417803 62442412 63543436 64703763 65956776 67324970 68760633
$$ packed form
10704I7926499k185180k139177k119513k131652k120134k054300j967026j898572
10696H1310945j848155j797706j741776j673447j580896j481547j418122j391575
10688F8377721j342833j240642j141162j104628j093602j027269r11704q31767
10680E9684114q17270q02272p32996o38899n68806n24391m90105m67481m43150
10671E4198744l80251k80978k04398j83768j81021j60825j44963j45565j17003
10662E2399972l9973J7996Q309k32P1196J67565J86773J63904K21748L54927M25134
10651E3977319L91589L84605M92405O22922O65855O65509P21399Q16051Q66884
10642E9604538Q81074R32191J024609J101024J160327J253013J368194J435663
$$ plain form
10634 68760633 70210988 71707136 73328791 75102142 76984035 78933758 80957374 83090301
10626 83090301 85370214 87817329 90412701 93107203 95875693 98746505 101754979 104890739
10618 104890739 108121154 111446718 114899038 118499171 122253318 126181970 130324541 134722060
10610 134722060 139416078 144449130 149844306 155608793 161789460 168499440 175848499 183871383
10602 183871383 192577850 202052869 212431859 223762729 235949018 248836284 262270685
10595 262270685 276014115 289657598 302712239 314803147 325727554 335303764 343201319
10588 343201319 348966875 352234523 352903607 351097191 346943804 340418664 331427495 320060463
10580 320060463 306764756 292278079 277403357 262811333 248959813 236089785 224246497
$$ packed form
10634F8760633J450355J496148J621655J773351J881893J949723K023616K132927
10626H3090301K279913K447115K595372K694502K768490K870812L008474L135760
10618A04890739L230415L325564L452320L600133L754147L928652M142571M397519
10610A34722060M694018N033052N395176N764487O180667O709980P349059Q022884
10602A83871383Q706467R475019J0378990J1330870J2186289J2887266J3434401
10595B62270685J3743430J3643483J3054641J2090908J0924407R576210P897555
10588C43201319N765556L267648O69084j806416m153387o525140q991169j1367032
10580C20060463j3295707j4486677j4874722j4592024j3851520j2870028j1843288
$$ plain form
10573 224246497 213330372 203191001 193723608 184898715 176709464 169106157 161998242 155316698
10565 155316698 149051676 143216728 137790859 132712180 127919250 123379603 119080029 115006524
10557 115006524 111138434 107454227 103943633 100620166 97512580 94627413 91922946 89338034
10549 89338034 86847893 84474291 82238688 80127329 78113659 76193304 74372472 72632483
10541 72632483 70938388 69290031 67734047 66300175 64944798 63594818 62244910 60969421
10533 60969421 59822936 58767885 57728454 56681143 55651890 54653511 53680784 52751590
10525 52751590 51892504 51086577 50293578 49519917 48801887 48117204 47395960 46640417 45943352
10516 45943352 45343723 44754618 44100976 43443422 42874968 42367218 41831219 41278945 40794854
$$ packed form
10573B24246497j0916125j0139371r467393q824893q189251p603307p107915o681544
10565A55316698o265022n834948n425869n078679m792930m539647m299574m073505
10557A15006524l868090l684207l510594l323467l107586k885167k704467k584912
10549H9338034k490141k373602k235603k111359k013670j920355j820832j739989
10541G2632483j694095j648357j555984j433872j355377j349980j349908j275489
10533F0969421j146485j055051j039431j047311j029253r98379r72727r29194
10525E2751590q59086q05927p92999p73661p18030o84683p21244p55543o97065
10516D5943352n99629n89105o53642o57554n68454n07750n35999n52274m84091
$$ plain form
10507 40794854 40369596 39896839 39344430 38804217 38342430 37912450 37457741 36998281 36558543
10498 36558543 36097922 35577645 35027876 34488578 33946331 33387818 32855170 32385011 31944798
10489 31944798 31490727 31038241 30612920 30183945 29720133 29269328 28901888 28602817 28295367
10480 28295367 27950580 27600539 27260351 26912703 26563744 26243246 25946614 25637886 25312832
10471 25312832 25001355 24704168 24385092 24036072 23696986 23395656 23111931 22818049 22520676
10462 22520676 22248213 22018707 21824925 21634603 21414884 21176045 20970267 20819607 20673901
10453 20673901 20479271 20256987 20062248 19893694 19708760 19508250 19331777 19177933 19006026
10444 19006026 18819518 18670519 18568375 18458037 18311133 18169052 18066547 17975833 17861399
$$ packed form
10507D0794854m25258m72757n52409n40213m61787m29980m54709m59460m39738
10498C6558543m60621n20277n49769n39298n42247n58513n32648m70159m40213
10489C1944798m54071m52486m25321m28975m63812m50805l67440k99071l07450
10480B8295367l44787l50041l40188l47648l48959l20498k96632l08728l25054
10471B5312832l11477k97187l19076l49020l39086l01330k83725k93882k97373
10462B2520676k72463k29506j93782j90322k19719k38839k05778j50660j45706
10453B0673901j94630k22284j94739j68554j84934k00510j76473j53844j71907
10444A9006026j86508j48999j02144j10338j46904j42081j02505r0714j14434
$$ plain form
10435 17861399 17735513 17622462 17513789 17393954 17271253 17153995 17033221 16912428 16813661
10426 16813661 16731638 16625666 16481528 16336579 16218159 16104086 15972526 15842577 15732441
10417 15732441 15624394 15506497 15401598 15315920 15207285 15050766 14891109 14777942 14689283 14577013
10407 14577013 14453127 14363810 14298623 14195619 14036893 13880374 13783008 13732173 13668876 13555692
10397 13555692 13410677 13284413 13206570 13154689 13083334 12977956 12859565 12744944 12636644 12546414
10387 12546414 12483142 12418799 12319061 12206888 12131130 12072160 11964561 11825899 11754890 11761132 11715557
10376 11715557 11546992 11374791 11334425 11363987 11302191 11136491 11002073 10960959 10932038 10846248
10366 10846248 10736954 10648810 10567049 10470519 10367224 10253754 10119121 10000334 9948550 9930282
$$ packed form
10435A7861399j25886j13051j08673j19835j22701j17258j20774j20793r8767
10426A6813661q2023j05972j44138j44949j18420j14073j31560j29949j10136
10417A5732441j08047j17897j04899q5678j08635j56519j59657j13167q8659j12270
10407A4577013j23886q9317o5187j03004j58726j56519r7366n0835o3297j13184
10397A3555692j45015j26264p7843n1881p1355j05378j18391j14621j08300r0230
10387A2546414o3272o4343r9738j12173p5758n8970j07599j38662p1009O242m5575
10376A1715557j68565j72201m0366K9562o1796j65700j34418m1114k8921q5790
10366A0846248j09294q8144q1761r6530j03295j13470j34633j18787n1784j8268
$$ plain form
10356 9930282 9854559 9711469 9586569 9520176 9457292 9365939 9294709 9265504 9214179 9101779 8993630
10345 8993630 8955696 8948247 8896161 8802194 8719677 8665302 8623577 8591250 8560629 8504236 8424452
10334 8424452 8367328 8342615 8292588 8192002 8109265 8102453 8121287 8089298 8022564 7980232 7949681
10323 7949681 7879077 7789579 7754915 7782098 7799402 7759846 7685158 7612032 7558782 7538746 7547462
10312 7547462 7542611 7486150 7393004 7295966 7193965 7087922 7026565 7042750 7074329 7029200 6911818
10301 6911818 6808256 6759603 6726539 6669578 6589843 6496202 6399640 6329800 6292968 6236285 6126371
10290 6126371 6031239 6030759 6073054 6033116 5904572 5811073 5817127 5851054 5843560 5821493 5817024 5794879
10278 5794879 5732318 5678957 5672537 5673253 5641202 5605967 5602676 5609660 5603889 5606359 5617819 5585896 5498191
$$ packed form
10356I930282p5723j43090j24900o6393o2884r1353p1230k9205n1325j12400j08149
10345H993630l7934p449n2086r3967q2517n4375m1725l2327l0621n6393p9784
10334H424452n7124k4713n0027j00586q2737o812J8834l1989o6734m2332l0551
10323G949681p0604q9498l4664K7183J7304l9556p4688p3126n3250k0036Q716
10312G547462m851n6461r3146r7038j02001j06043o1357J6185L1579m5129j17382
10301F911818j03562m8653l3064n6961p9735r3641r6562o9840l6832n6683j09914
10290F126371r5132m80M2295l9938j28544r3499O054L3927p494k2067m469k2145
10278E794879o2561n3361o420P16l2051l5235l291O984n771K470J1460l1923q7705
$$ plain form
10265 5498191 5432179 5442969 5473729 5451843 5402500 5384053 5379474 5346632 5316502 5337480 5368820
10254 5368820 5337272 5265362 5234921 5247951 5234776 5186976 5168578 5192909 5199240 5169638 5164656 5209428
10242 5209428 5236424 5188380 5106386 5065708 5075767 5087741 5064899 5012994 4967883 4968161 5010301 5029526
10230 5029526 4968001 4861896 4806951 4833180 4875162 4877480 4859020 4846816 4819080 4761626 4721465
10219 4721465 4743352 4790333 4786161 4715660 4634302 4594786 4607885 4660446 4724672 4755050 4721948
10208 4721948 4655304 4618903 4630240 4638165 4599963 4553017 4571556 4656855 4717017 4684942 4622056
10197 4622056 4647575 4771755 4870902 4854544 4787436 4788171 4863214 4924149 4937486 4960891 5032072
10186 5032072 5113384 5167413 5210603 5265248 5326498 5402781 5518745 5648226 5719743 5729368 5770142
$$ packed form
10265E498191o6012J0790L0760k1886m9343j8447m579l2842l0130K0978L1340
10254E368820l1548p1910l0441J3030j3175m7800j8398K4331O331k9602m982M4772
10242E209428K6996m8044q1994m0678J0059J1974k2842n1905m5111K78M2140J9225
10230E029526o1525j06105n4945K6229M1982K318j8460j2204k7736n7454m0161
10219D721465K1887M6981m172p0501q1358l9516J3099N2561O4226L0378l3102
10208D721948o6644l6401J1337P925l8202m6946J8539Q5299O0162l2075o2886
10197D622056K5519J24180R9147j6358o7108P35P5043O0935J3337K3405P1181
10186E032072Q1312N4029M3190N4645O1250P6283J15964J29481P1517R625M0774
$$ plain form
10175 5770142 5894691 6027997 6091461 6138998 6268885 6454910 6585875 6649650 6751431 6940332
10165 6940332 7138577 7278714 7401133 7554531 7692732 7753258 7769886 7811361 7851633 7805988
10155 7805988 7680708 7577362 7530887 7447770 7257484 7039364 6916785 6880725 6817866 6692473
10145 6692473 6592980 6580798 6593444 6550875 6479621 6454633 6467983 6443051 6358686 6273887 6227118
10134 6227118 6188530 6130688 6079111 6060366 6052241 6022798 5981674 5958175 5956755 5964079 5976261 5992575
10122 5992575 6002938 6004808 6014231 6041427 6072960 6091312 6091886 6072040 6030439 5987460 5975419 5996268
10110 5996268 6020079 6034850 6059814 6098145 6121400 6118750 6116506 6131098 6153838 6199938 6305894
10099 6305894 6446106 6527641 6521433 6525940 6629207 6774687 6853526 6873842 6929033 7030843 7092932
$$ packed form
10175E770142J24549J33306O3464M7537J29887J86025J30965O3775J01781J88901
10165F940332J98245J40137J22419J53398J38201O0526J6628M1475M0272m5645
10155G805988j25280j03346m6475q3117j90286k18120j22579l6060o2859j25393
10145F692473r9493j2182J2646m2569p1254k4988J3350k4932q4365q4799m6769
10134F227118l8588n7842n1577j8745q125k9443m1124k3499j420P324J2182J6314
10122E992575J0363J870R423K7196L1533J8352N74j9846m1601m2979j2041K0849
10110E996268K3811J4771K4964L8331K3255k650k244J4592K2740M6100J05956
10099F305894J40212Q1535o208M507J03267J45480P8839K0316N5191J01810O2089
$$ plain form
10088 7092932 7077696 7049038 7061335 7089721 7095150 7076652 7033288 6950220 6850438 6789578 6771063
10077 6771063 6733723 6650513 6569303 6525075 6485331 6422859 6369865 6348201 6312985 6228713 6146384
10066 6146384 6135417 6178364 6200151 6171809 6121101 6064595 5994980 5923272 5873197 5837566 5791647
10055 5791647 5746030 5734893 5749489 5734549 5666742 5595248 5576984 5595506 5576899 5485067 5373719
10044 5373719 5322520 5334123 5333685 5281286 5234028 5252435 5291116 5259671 5169498 5124861 5163840 5209132
10032 5209132 5204006 5193689 5220389 5237150 5201129 5164914 5182947 5202153 5153426 5092007 5123018
10021 5123018 5222702 5263735 5208842 5153335 5164312 5196444 5196531 5184143 5184620 5172656 5132434 5099859
10009 5099859 5098482 5098593 5080616 5072582 5082244 5061274 4989578 4930544 4939226 4968722 4936248 4842572
$$ packed form
10088G092932j5236k8658J2297K8386N429j8498m3364q3068r9782o0860j8515
10077F771063l7340q3210q1210m4228l9744o2472n2994k1664l5216q4272q2329
10066F146384j0967M2947K1787k8342n0708n6506o9615p1708n0075l5631m5919
10055E791647m5617j1137J4596j4940o7807p1494j8264J8522j8607r1832j11348
10044E373719n1199J1603m38n2399m7258J8407L8681l1445r0173m4637L8979M5292
10032E209132n126j0317K6700J6761l6021l6215J8033J9206m8727o1419L1011
10021E123018R9684M1033n4893n5507J0977L2132Q7j2388M77j1964m0222l2575
10009E099859j377J11j7977q034R662k0970p1696n9034Q682K9496l2474r3676
$$ plain form
9997 4842572 4757699 4717066 4699191 4688212 4692995 4706941 4702733 4673977 4646176 4641744 4656920 4670632
9985 4670632 4661790 4629580 4605670 4622035 4658440 4661458 4631718 4637796 4707816 4765082 4730268 4640751
9973 4640751 4594500 4606663 4604578 4552879 4499258 4487239 4496009 4485610 4443923 4373898 4289749 4238328
9961 4238328 4262236 4320968 4312555 4205749 4090604 4055856 4072284 4052425 3979547 3910363 3877857
9950 3877857 3861356 3843143 3829571 3812313 3766309 3699492 3656434 3655413 3663342 3651590 3636493 3639834
9938 3639834 3645289 3625898 3587676 3554108 3530421 3515425 3524553 3561071 3584607 3557068 3507610 3496728
9926 3496728 3520132 3514119 3467733 3455206 3518823 3587524 3574411 3505739 3477479 3513542 3548334 3538080
9914 3538080 3506029 3472501 3423825 3374181 3380825 3456744 3529915 3534913 3494260 3464548 3452626 3437948
$$ packed form
9997D842572q4873m0633j7875j0979M783J3946m208k8756k7801m432J5176J3712
9985D670632q842l2210k3910J6365L6405L018k9740O078P0020N7266l4814q9517
9973D640751m6251J2163k085n1699n3621j2019Q770j0399m1687p0025q4149n1421
9961D238328K3908N8732q413j06806j15145l4748J6428j9859p2878o9184l2506
9950C877857j6501j8213j3572j7258m6004o6817m3058j021P929j1752j5097L341
9938C639834N455j9391l8222l3568k3687j4996R128L6518K3536k7539m9458j0882
9926C496728K3404o013m6386j2527O3617O8701j3113o8672k8260L6063L4792j0254
9914C538080l2051l3528m8676m9644O644P5919P3171M998m0653k9712j1922j4678
$$ plain form
9902 3437948 3432186 3453977 3477999 3473379 3466682 3499996 3546199 3539077 3481283 3448786 3480481 3531259
9890 3531259 3551283 3549059 3550472 3551155 3543395 3545765 3569382 3588559 3579973 3564211 3574809 3606579 3627116
9877 3627116 3626707 3628273 3652674 3692836 3719860 3708555 3666716 3640054 3668496 3734422 3779936 3782430
9865 3782430 3781673 3816118 3864163 3876780 3848519 3826369 3854078 3925517 3989240 3994030 3943279 3905719
9853 3905719 3947744 4049145 4117925 4102330 4052207 4045123 4087355 4124889 4125984 4109086 4102188 4115898
9841 4115898 4152724 4207418 4256821 4277454 4275957 4283059 4319701 4382629 4450553 4488364 4468613 4416906
9829 4416906 4410347 4488822 4587869 4613109 4571009 4562250 4639509 4740303 4788694 4800517 4837576 4902170
9817 4902170 4940838 4934745 4925370 4947720 4987702 5020047 5049584 5092703 5144912 5192565 5240514 5301244
$$ packed form
9902C437948n762K1791K4022m620o697L3314M6203p122n7794l2497L1695N0778
9890C531259K0024k224J413O83p760K370K3617J9177q586j5762J0598L1770K0537
9877C627116m09J566K4401M0162K7024j1305m1839k6662K8442O5926M5514K494
9865C782430p57L4445M8045J2617k8261k2150K7709P1439O3723M790n0751l7560
9853C905719M2025J01401O8780j5595n0123p084M2232L7534J095j6898o898J3710
9841D115898L6826N4694M9403K0633j497P102L6642O2928O7924L7811j9751n1707
9829D416906o559P8475R9047K5240m2100q759P7259J00794M8391J1823L7059O4594
9817D902170L8668o093r375K2350L9982L2345K9537M3119N2209M7653M7949O0730
$$ plain form
9805 5301244 5363405 5398866 5406511 5425948 5491936 5588460 5667238 5705917 5726931 5759076 5805813 5862367
9793 5862367 5940002 6049869 6175637 6287283 6377126 6460052 6543038 6620878 6701463 6804280 6924897
9782 6924897 7031009 7110643 7196611 7318091 7452214 7559808 7654748 7791835 7982412 8168877
9772 8168877 8305579 8426166 8592689 8803655 9001952 9166157 9339605 9556611 9791375 10010866
9762 10010866 10235380 10500144 10785444 11041621 11272614 11535941 11855252 12190173 12510022
9753 12510022 12841806 13212082 13588383 13925728 14242346 14599607 15018650 15458487 15873091
9744 15873091 16258075 16642195 17054749 17495483 17922627 18290897 18620937 19000071 19479586
9735 19479586 20001560 20473259 20885842 21300715 21741344 22175546 22602585 23074451 23607097
$$ packed form
9805E301244O2161L5461P645J9437O5988R6524P8778L8679K1014L2145M6737N6554
9793E862367P7635J09867J25768J11646Q9843Q2926Q2986P7840Q0585J02817J20617
9782F924897J06112P9634Q5968J21480J34123J07594R4940J37087J90577J86465
9772H168877J36702J20587J66523K10966J98297J64205J73448K17006K34764K19491
9762A0010866K24514K64764K85300K56177K30993K63327L19311L34921L19849
9753A2510022L31784L70276L76301L37345L16618L57261M19043M39837M14604
9744A5873091L84984L84120M12554M40734M27144L68270L30040L79134M79515
9735A9479586N21974M71699M12583M14873M40629M34202M27039M71866N32646
$$ plain form
9726 23607097 24141667 24629195 25095645 25586721 26103335 26632500 27187356 27765582 28317843
9717 28317843 28819396 29332559 29926142 30558915 31121140 31583949 32030957 32534181 33072650
9708 33072650 33599358 34122437 34673288 35238008 35776583 36294681 36846819 37461121 38094246
9699 38094246 38681732 39221637 39785323 40435392 41146616 41832248 42448760 43043029 43679972
9690 43679972 44357805 45032195 45701137 46413008 47190534 47997352 48796921 49604211 50453630
9681 50453630 51345998 52257457 53181860 54134103 55120203 56129622 57153828 58190376 59226497
9672 59226497 60235633 61196885 62110160 62988912 63843459 64673969 65475504 66245141 66983656
9663 66983656 67694773 68388158 69079931 69779541 70476489 71156597 71836144 72556384 73327711
$$ packed form
9726B3607097N34570M87528M66450M91076N16614N29165N54856N78226N52261
9717B8317843N01553N13163N93583O32773N62225M62809M47008N03224N38469
9708C3072650N26708N23079N50851N64720N38575N18098N52138O14302O33125
9699C8094246N87486N39905N63686O50069P11224O85632O16512N94269O36943
9690D3679972O77833O74390O68942P11871P77526Q06818P99569Q07290Q49419
9681E0453630Q92368R11459R24403R52243R86100J009419J024206J036548J036121
9672E9226497J009136R61252R13275Q78752Q54547Q30510Q01535P69637P38515
9663F6983656P11117O93385O91773O99610O96948O80108O79547P20240P71327
$$ plain form
9654 73327711 74103396 74837909 75552154 76301267 77089639 77868465 78619245 79381777 80179091
9645 80179091 80973787 81742568 82545609 83456953 84450590 85428760 86365608 87355248 88494938
9636 88494938 89777773 91138662 92561091 94083663 95721514 97438620 99203348 101027053
9628 101027053 102927495 104880293 106830032 108740919 110621212 112496382 114359816 116151916
9620 116151916 117802511 119306312 120735638 122146013 123484580 124646026 125624761 126544984
9612 126544984 127501160 128425959 129180214 129735452 130187460 130604482 130951606 131179789 131305474
9603 131305474 131363109 131346993 131251957 131120303 130992979 130853809 130677437 130497356 130364508 130265310
9593 130265310 130150677 130036355 130006039 130108713 130309178 130550407 130814870 131110323 131439288
$$ packed form
9654G3327711P75685P34513P14245P49113P88372P78826P50780P62532P97314
9645H0179091P94696P68781Q03041R11344R93637R78170R36848R89640J139690
9636H8494938J282835J360889J422429J522572J637851J717106J764728J823705
9628A01027053J900442J952798J949739J910887J880293J875170J863434J792100
9620A16151916J650595J503801J429326J410375J338567J161446R78735R20223
9612A26544984R56176R24799P54255N55238M52008M17022L47124K28183J25685
9603A31305474N7635j6116r5036j31654j27324j39170j76372j80081j32848r9198
9593A30265310j14633j14322l0316J02674K00465K41229K64463K95453L28965
$$ plain form
9584 131439288 131802179 132200043 132621279 133048419 133477444 133902038 134286981 134597199 134847737
9575 134847737 135076996 135269094 135354260 135295188 135122144 134867850 134516361 134035868 133418287 132667017
9565 132667017 131785985 130796808 129725544 128559689 127262375 125836371 124319437 122711000
9557 122711000 120978389 119157460 117362330 115650306 113955233 112210201 110459458 108780605
9549 108780605 107173122 105613832 104157166 102871191 101715891 100597095 99515827 98549911
9541 98549911 97699186 96869122 96019267 95213210 94490413 93791803 93058621 92318608 91620810
9532 91620810 90953629 90278516 89587297 88881092 88147263 87399972 86687687 86014409 85309513
9523 85309513 84529815 83739570 83025023 82370904 81692853 80964653 80235840 79529069 78794553
$$ packed form
9584A31439288L62891L97864M21236M27140M29025M24594L84943L10218K50538
9575A34847737K29259J92098Q5166n9072j73044k54294l51489m80493o17581p51270
9565A32667017q81032r89177j071264j165855j297314j426004j516934j608437
9557A22711000j732611j820929j795130j712024j695073j745032j750743j678853
9549A08780605j607483j559290j456666j285975j155300j118796j081268r65916
9541I8549911q50725q30064q49855q06057p22797o98610p33182p40013o97798
9532I1620810o67181o75113o91219p06205p33829p47291p12285o73278p04896
9523H5309513p79698p90245p14547o54119o78051p28200p28813p06771p34516
$$ plain form
9514 78794553 77986752 77131875 76284128 75443256 74554016 73586118 72582691 71604957 70642983
9505 70642983 69625566 68532466 67445095 66440222 65478656 64474266 63446878 62509198
9497 62509198 61696393 60908807 60056980 59172990 58328877 57526930 56734808 55960797 55223031
9488 55223031 54498159 53767966 53065306 52406674 51735844 51013087 50305075 49691506 49127601
9479 49127601 48507712 47836834 47220832 46692987 46170111 45597640 45024480 44494206 43959884
9470 43959884 43363279 42726157 42106550 41517920 40939998 40363997 39782357 39171820 38527889
9461 38527889 37886704 37280392 36697057 36108467 35508634 34905828 34307482 33729685 33189237
9452 33189237 32673067 32150025 31620800 31113878 30625973 30120546 29598323 29107950 28663792
$$ packed form
9514G8794553q07801q54877q47747q40872q89240r67898j003427r77734r61974
9505G0642983j017417j093100j087371j004873r61566j004390j027388r37680
9497F2509198q12805p87586q51827q83990q44113q01947p92122p74011p37766
9488E5223031p24872p30193p02660o58632o70830p22757p08012o13569n63905
9479D9127601o19889o70878o16002n27845n22876n72471n73160n30274n34322
9470D3959884n96605o37122o19607n88630n77922n76001n81640o10537o43931
9461C8527889o41185o06312n83335n88590n99833o02806n98346n77797n40448
9452C3189237n16170n23042n29225n06922m87905n05427n22223m90373m44158
$$ plain form
9443 28663792 28217276 27742319 27283470 26874284 26470525 26022320 25559986 25142901 24764615
9434 24764615 24376966 23976855 23598875 23241593 22868973 22476204 22094744 21736851 21387614
9425 21387614 21047039 20729309 20422221 20094446 19744413 19402494 19086568 18791409 18515269
9416 18515269 18258677 18003443 17730248 17449991 17183695 16926401 16669979 16440617 16261596
9407 16261596 16095438 15885002 15645188 15446892 15305317 15152976 14942266 14711286 14517813
9398 14517813 14362034 14211965 14061771 13921824 13779387 13611247 13423244 13246501 13098462
9389 13098462 12965284 12820272 12653258 12485477 12349849 12246518 12133521 11983285 11827546
9380 11827546 11709750 11612839 11486821 11337602 11223750 11158336 11080407 10947007 10794219 10674935
$$ packed form
9443B8663792m46516m74957m58849m09186m03759m48205m62334m17085l78286
9434B4764615l87649m00111l77980l57282l72620l92769l81460l57893l49237
9425B1387614l40575l17730l07088l27775l50033l41919l15926k95159k76140
9416A8515269k56592k55234k73195k80257k66296k57294k56422k29362j79021
9407A6261596j66158k10436k39814j98296j41575j52341k10710k30980j93473
9398A4517813j55779j50069j50194j39947j42437j68140j88003j76743j48039
9389A3098462j33178j45012j67014j67781j35628j03331j12997j50236j55739
9380A1827546j17796r6911j26018j49219j13852o5414p7929j33400j52788j19284
$$ plain form
9370 10674935 10587277 10501051 10410594 10322337 10226858 10120354 10021345 9934296 9832886 9711863 9614082
9359 9614082 9566075 9527856 9453586 9361750 9288648 9209590 9079054 8929369 8848506 8851822 8844908
9348 8844908 8741211 8571089 8443315 8420990 8456505 8441508 8316540 8134367 8002580 7958496
9338 7958496 7932421 7854709 7754035 7700131 7685140 7634652 7526944 7426583 7386349 7379222 7351723
9327 7351723 7292881 7221579 7147079 7072199 7005451 6947051 6889483 6844673 6833286 6830711 6771190 6639303
9315 6639303 6515104 6480206 6506533 6492128 6395609 6280724 6222544 6218134 6211310 6170080 6107094
9304 6107094 6041183 5975120 5914439 5878209 5872229 5867919 5832395 5773595 5728087 5702260 5658037 5572595
9292 5572595 5483029 5444693 5462821 5490538 5480523 5417695 5320405 5233898 5200090 5204858 5181384 5100088
$$ packed form
9370A0674935q7658q6226r0457q8257r5479j06504r9009q7049j01410j21023r7781
9359I614082m8007l8219p4270r1836p3102p9058j30536j49685q0863L316o914
9348H844908j03697j70122j27774k2325L5515j4997j24968j82173j31787m4084
9338G958496k6075p7712j00674n3904j4991n0488j07708j00361m0234p127k7499
9327G351723n8842p1302p4500p4880o6748n8400n7568m4810j1387k575n9521j31887
9315F639303j24199l4898K6327j4405r6519j14885n8180m410o824m1230o2986
9304F107094o5911o6063o0681l6230n980m310l5524n8800m5508k5827m4223q5442
9292E572595q9566l8336J8128K7717j0015o2828r7290q6507l3808M768k3474q1296
$$ plain form
9280 5100088 5021811 5012243 5037290 5011794 4929248 4862012 4842158 4831492 4814190 4821918 4844517 4815560
9268 4815560 4728453 4671429 4690941 4712449 4667662 4610274 4613587 4633817 4588593 4509994 4490598 4514969
9256 4514969 4483556 4394343 4359545 4420144 4474613 4439241 4367408 4345917 4363515 4355073 4308584 4257035
9244 4257035 4214707 4185915 4194543 4243594 4279998 4257224 4204915 4184243 4200627 4212581 4204309 4195876
9232 4195876 4193845 4179222 4139882 4082401 4022506 3989110 4014100 4084598 4130190 4098486 4025145 3989592
9220 3989592 4018003 4068796 4097757 4097488 4084782 4083785 4107453 4128050 4094310 4011826 3965844 4012915
9208 4012915 4092051 4112503 4090491 4108130 4163108 4172056 4125324 4116978 4185506 4238875 4201786 4139882
9196 4139882 4152780 4218699 4242348 4206131 4172451 4164339 4144261 4104841 4087289 4097076 4080401 4009444
$$ packed form
9280E100088p8277r568K5047k5496q2546o7236j9854j0666j7302P728K2599k8957
9268D815560q7107n7024J9512K1508m4787n7388L313K0230m5224p8599j9396K4371
9256D514969l1413q9213l4798O0599N4469l5372p1833k1491J7598q442m6489n1549
9244D257035m2328k8792Q628M9051L6404k2774n2309k0672J6384J1954q272q433
9232D195876k031j4623l9340n7481n9895l3396K4990P0498M5592l1704p3341l5553
9220C989592K8411N0793K8961k69j2706r97K3668K0597l3740q2484m5982M7071
9208D012915P9136K0452k2012J7639N4978Q948m6732q346O8528N3369l7089o1904
9196D139882J2898O5919K3649l6217l3680q112k0078l9420j7552R787j6675p0957
$$ plain form
9184 4009444 3930588 3901394 3924079 3959777 3970058 3934669 3869113 3829614 3854205 3896493 3874971
9173 3874971 3793626 3742090 3756960 3767248 3722121 3686145 3728940 3789296 3754810 3640361 3572804
9162 3572804 3603284 3647568 3634777 3608243 3627998 3662266 3647013 3590855 3546964 3526410 3511800
9151 3511800 3517468 3555961 3574607 3516733 3433673 3437671 3533696 3596459 3546633 3456674 3428220 3448932
9139 3448932 3447837 3426341 3437409 3471326 3463678 3408715 3371339 3377312 3377468 3343085 3315398 3322208 3317964
9126 3317964 3261332 3195567 3186390 3216457 3209251 3140697 3064824 3032447 3039494 3061763 3091969 3124734
9114 3124734 3139251 3118484 3069535 3015068 2976554 2965774 2975491 2978915 2956657 2923550 2910626 2923580
9102 2923580 2940715 2949692 2960322 2976654 2980130 2950707 2891981 2832452 2810842 2849827 2924194 2966912
$$ packed form
9184D009444p8856k9194K2685L5698J0281l5389o5556l9499K4591M2288k1522
9173C874971q1345n1536J4870J0288m5127l5976M2795O0356l4486j14449o7557
9162C572804L0480M4284j2791k6534J9755L4268j5253n6158m3891k0554j4610
9151C511800N668L8493J8646n7874q3060L998R6025O2763m9826q9959k8454K0712
9139C448932j095k1496J1068L3917p648n4963l7376N973J56l4383k7687O810m244
9126C317964n6632o5765r177L0067p206o8554p5873l2377P047K2269L0206L2765
9114C124734J4517k0767m8949n4467l8514j0780R717L424k2258l3107j2924J2954
9102B923580J7135Q977J0630J6332L476k9423n8726n9529k1610L8985P4367M2718
$$ plain form
9090 2966912 2936386 2869624 2834658 2839440 2834473 2803101 2787710 2807992 2816015 2772437 2715211 2700118
$$ packed form
9090B966912l0526o6762l4966M782m967l1372j5391K0282Q023m3578n7226j5093
$$ [...]
##END NTUPLES=NMR SPECTRUM
##END=
