##TITLE=1H ikalashn
EC-3336(2)x
21.11.2024
##JCAMPDX= 6.0         $$ Bruker NMR JCAMP-DX V2.0
##DATA TYPE= NMR SPECTRUM
##DATA CLASS= NTUPLES
##ORIGIN= UXNMR, Bruker Analytische Messtechnik GmbH
##OWNER= root
$$ TOPSPIN		Version 1.3
$$ 2024-11-21 13:54:34.343 +0400  Irina@DPX200
$$ Compression mode = diff/dup
##.OBSERVE FREQUENCY= 200.131300845
##.OBSERVE NUCLEUS= ^1H
##.ACQUISITION MODE= SIMULTANEOUS
##.ACQUISITION SCHEME= undefined
##.AVERAGES= 32
##.DIGITISER RES= 18
##SPECTROMETER/DATA SYSTEM= spect
##.PULSE SEQUENCE= zg
##.SOLVENT NAME= CDCl3
##.SHIFT REFERENCE= INTERNAL, CDCl3, 1, 17.49637
##AUDIT TRAIL= $$ (NUMBER, WHEN, WHO, WHERE, WHAT)
$$ ##TITLE= Audit trail, TOPSPIN		Version 1.3
$$ ##JCAMPDX= 5.01
$$ ##ORIGIN= Bruker BioSpin GmbH
$$ ##OWNER= Irina
$$ $$ F:/spectra/data/iren/nmr/1H/4/pdata/1/auditp.txt
$$ ##AUDIT TRAIL=  $$ (NUMBER, WHEN, WHO, WHERE, VERSION, WHAT)
(   1,<2024-11-21 13:54:13.140 +0400>,<Irina>,<DPX200>,<TOPSPIN 1.3>,
      <created by zg
	started at 2024-11-21 13:52:04.890 +0400,
	POWCHK disabled, PULCHK disabled
       configuration hash MD5:
       BE 6D 3F 07 2A EA 11 49 91 17 2B D3 AF B3 58 0D
       data hash MD5: 16K
       4B 41 53 25 9A 4F EF DB 96 3D D4 FA 0C D4 3A 92>)
(   2,<2024-11-21 13:54:15.359 +0400>,<Irina>,<DPX200>,<TOPSPIN 1.3>,
      <Start of raw data processing
       fp BC_mod = 2 FT_mod = 6 PKNL = 1 PHC0 = 322.8444 PHC1 = 4.6935 SI = 32K 
       data hash MD5: 32K
       03 89 5A BA 79 13 07 D5 61 1A 88 86 BB 96 0E EC>)
(   3,<2024-11-21 13:54:20.562 +0400>,<Irina>,<DPX200>,<TOPSPIN 1.3>,
      <apk 
       data hash MD5: 32K
       2F 89 A6 1C 8F 46 90 7E 5A C7 68 25 8C 5A 7F 78>)
(   4,<2024-11-21 13:54:22.734 +0400>,<Irina>,<DPX200>,<TOPSPIN 1.3>,
      <abs n ABSG = 5 
       data hash MD5: 32K
       38 A1 72 79 91 1C 14 9E DC 8A 61 6B FF 6B 55 7E>)
$$ ##END=
$$ 
$$ $$ hash MD5
$$ $$ 76 54 11 F8 F6 93 53 43 B8 BA 09 5C EF A6 C7 14
##$RELAX= 
##$RELAX= 
##$RELAX= 
##$RELAX= 
##$RELAX= 
##$RELAX= 
##$RELAX= 
##$RELAX= 
##$RELAX= 
$$ Bruker specific parameters
$$ --------------------------
##$DU= <F:/spectra>
##$EXPNO= 4
##$NAME= <1H>
##$PROCNO= 1
##$TYPE= <nmr>
##$USER= <iren>
##$AMP= (0..31)
100 100 100 100 100 100 100 100 100 100 100 100 100 100 100 100 100 100 
100 100 100 100 100 100 100 100 100 100 100 100 100 100 
##$ANAVPT= -1
##$AQSEQ= 0
##$AQ_mod= 1
##$AUNM= <au_zg>
##$AUTOPOS= <>
##$BF1= 200.13
##$BF2= 200.13
##$BF3= 200.13
##$BF4= 200.13
##$BF5= 200.13
##$BF6= 200.13
##$BF7= 200.13
##$BF8= 200.13
##$BYTORDA= 1
##$CFDGTYP= 0
##$CFRGTYP= 5
##$CHEMSTR= <none>
##$CNST= (0..63)
1 1 145 1 1 1 1 1 1 1 1 1 1 1 1 1 1 1 1 1 1 1 1 1 1 1 1 1 1 1 1 1 1 1 
1 1 1 1 1 1 1 1 1 1 1 1 1 1 1 1 1 1 1 1 1 1 1 1 1 1 1 1 1 1 
##$CPDPRG= <>
##$CPDPRG1= <>
##$CPDPRG2= <>
##$CPDPRG3= <>
##$CPDPRG4= <mlev>
##$CPDPRG5= <mlev>
##$CPDPRG6= <mlev>
##$CPDPRG7= <mlev>
##$CPDPRG8= <mlev>
##$CPDPRGB= <>
##$CPDPRGT= <>
##$D= (0..63)
0 2 0 0 0 0 0 0 0 0.06 0 0.03 0 0 0 0 0.0002 0 0 0 0 0 0 0 0 0 0 0 0 0 
$$ [...]
##$SW_h= 4401.40845070422
##$TD= 16384
##$TD0= 1
##$TE= 300
##$TE2= 300
##$TE3= 300
##$TEG= 300
##$TL= (0..7)
0 120 120 120 120 120 120 120 
##$TP= (0..7)
150 150 150 150 150 150 150 150 
##$TP07= 0
##$TPNAME0= <>
##$TPNAME1= <>
##$TPNAME2= <>
##$TPNAME3= <>
##$TPNAME4= <>
##$TPNAME5= <>
##$TPNAME6= <>
##$TPNAME7= <>
##$TPOAL= (0..7)
0.5 0.5 0.5 0.5 0.5 0.5 0.5 0.5 
##$TPOFFS= (0..7)
0 0 0 0 0 0 0 0 
##$TUNHIN= 0
##$TUNHOUT= 0
##$TUNXOUT= 0
##$USERA1= <user>
##$USERA2= <user>
##$USERA3= <user>
##$USERA4= <user>
##$USERA5= <user>
##$V9= 5
##$VALIST= <valist>
##$VCLIST= <CCCCCCCCCCCCCCC>
##$VD= 0
##$VDLIST= <DDDDDDDDDDDDDDD>
##$VPLIST= <PPPPPPPPPPPPPPP>
##$VTLIST= <TTTTTTTTTTTTTTT>
##$WBST= 1024
##$WBSW= 25
##$XGAIN= (0..3)
0 0 0 0 
##$XL= 0
##$YL= 0
##$YMAX_a= 964838
##$YMIN_a= -1703950
##$ZGOPTNS= <>
##$ZL1= 120
##$ZL2= 120
##$ZL3= 120
##$ZL4= 120
##$ABSF1= 17.49637
##$ABSF2= -4.496376
##$ABSG= 5
##$ABSL= 3
##$ALPHA= 0
##$AQORDER= 0
##$ASSFAC= 0
##$ASSFACI= 0
##$ASSFACX= 0
##$ASSWID= 0
##$AUNMP= <proc_1d>
##$AXLEFT= 0
##$AXRIGHT= 0
##$AXTYPE= 0
##$AXUNIT= <>
##$AZFE= 0.1
##$AZFW= 0.1
##$BCFW= 0
##$BC_mod= 2
##$BYTORDP= 0
##$COROFFS= 0
##$CY= 7568.61572265625
##$DATMOD= 1
##$DC= 0
##$DFILT= <>
##$DTYPP= 0
##$F1P= 17.9538593292236
##$F2P= -4.03888763876832
##$FCOR= 0.5
##$FTSIZE= 32768
##$FT_mod= 6
##$GAMMA= 0
##$GB= 0
##$INTBC= 0
##$INTSCL= 5.656564e-011
##$ISEN= 128
##$LB= 0
##$LEV0= 0
##$LPBIN= 0
##$MAXI= 945.577
##$MC2= 0
##$MEAN= 0
##$ME_mod= 0
##$MI= -402.1523
##$NCOEF= 0
##$NC_proc= -6
##$NLEV= 6
##$NOISF1= 8.587773
##$NOISF2= 6.764455
##$NSP= 0
##$NTH_PI= 0
##$NZP= 0
##$OFFSET= 17.49637
##$PC= 1
##$PHC0= 323.0213
##$PHC1= 4.6935
##$PH_mod= 1
##$PKNL= yes
##$PPARMOD= 0
##$PPDIAG= 0
##$PPIPTYP= 0
##$PPMPNUM= 100
##$PPRESOL= 1
##$PSCAL= 0
##$PSIGN= 0
##$REVERSE= no
##$SF= 200.13
##$SI= 32768
##$SIGF1= 16.12182
##$SIGF2= -4.496377
##$SINO= 3.521527
##$SIOLD= 32768
##$SREGLST= <1H.CDCl3>
##$SSB= 0
##$STSI= 32768
##$STSR= 0
##$SW_p= 4401.40845070422
##$SYMM= 0
##$S_DEV= 0
##$TDeff= 16384
##$TDoff= 0
##$TI= <>
##$TILT= no
##$TM1= 0
##$TM2= 0
##$TOPLEV= 0
##$USERP1= <user>
##$USERP2= <user>
##$USERP3= <user>
##$USERP4= <user>
##$USERP5= <user>
##$WDW= 0
##$XDIM= 32768
##$YMAX_p= 323208365
##$YMIN_p= -857978
$$ End of Bruker specific parameters
$$ ---------------------------------
##NTUPLES= NMR SPECTRUM
##VAR_NAME=  FREQUENCY,     SPECTRUM/REAL,   SPECTRUM/IMAG
##SYMBOL=    X,             R,               I
##VAR_TYPE=  INDEPENDENT,   DEPENDENT,       DEPENDENT
##VAR_FORM=  AFFN,          ASDF,            ASDF
##VAR_DIM=   32768,         32768,           32768
##UNITS=     HZ,            ARBITRARY UNITS, ARBITRARY UNITS
##FACTOR=    0.134324425510551, 1,           1
##FIRST=     4401.40845070422, -196865,      -2325545
##LAST=      0,             -100845,         -2799609
##MIN=       0,             -857978,         0
##MAX=       4401.40845070422, 323208365,    0
$$ Real data points
##PAGE= N=1
##DATA TABLE= (X++(R..R)), XYDATA
$$ [...]
14428A3690113o022j27650j82872k9233J46139N8645j70807j74626L2062O4286
14418A3300035j58479k65116p6838J04568L8363r4959j01363r7920j72839j43360
14408A2332092O1584J76138N1501o1450R326K2329j77403k77537o1866R7286j40619
14397A2031381l88609j23502L59816L54635r9890k96800m1751R9930j50876l23157
14387A1421177o4679K47412J69695j10271j81828o3149r022k8470o427j1368j08425
14376A1254645j32469J1119R1034o2264j96426m8002J53086L4142k65100k72257
14366A0567508P4889L29469J88185j43247k96879j64668Q1864J88055K6224k36796
14356A0614604k62358O758J84115k4257l23391k34222J53419K88997j0039l13615
$$ y = [13690113, 13684091, 13556441, 13373569, 13344336, 13490475, 13549120, 13378313, 13203687, 13235749, 13300035, 13141556, 12876440, 12799602, 12904170, 12942533, 12847574, 12746211, 12648291, 12475452, 12332092, 12393676, 12569814, 12621315, 12559865, 12569191, 12591520, 12414117, 12136580, 12074714, 12172000, 12031381, 11642772, 11519270, 11879086, 12233721, 12133831, 11837031, 11795280, 11895210, 11744334, 11421177, 11356498, 11603910, 11773605, 11663334, 11481506, 11418357, 11409335, 11380865, 11374438, 11363070, 11254645, 11122176, 11133295, 11224329, 11162065, 10965639, 10917637, 11070723, 11104865, 10839765, 10567508, 10642397, 10971866, 11160051, 11016804, 10719925, 10555257, 10637121, 10825176, 10851400, 10614604, 10352246, 10359004, 10543119, 10518862, 10195471, 9961249, 10114668, 10403665, 10393626, 10080011]
14346A0080011k52762m129Q6293J2932p425O6907P7424o2632k43473k76307q4675
14335I392164J77785K40606M4457j40523q6994L9003l7456k04391j30539J40678
14325I434790K18449J2886j26120l1535J9462j27125j79708L3956J56541j05420
14315I306176l82797j83564K57248K84066j59971m50476k34800J20329J80615
14306H736826L5013j5506L3184J693j01706j21378l3431M3411L6871l3918j22432
14295H458627j47885k5816J76033K21177r415k94112k99048m367K53645J95835
14285H524674p0480k17978j22169J4506j5716j19258n9002J48844K15996R358
14275H308775k22911j96779J1391J09997Q390j30151j68260j06850K1790J51685
$$ y = [10080011, 9827249, 9823120, 9909413, 9922345, 9914920, 9981827, 10059251, 9996619, 9753146, 9476839, 9392164, 9569949, 9810555, 9855012, 9714489, 9627495, 9666498, 9629042, 9424651, 9294112, 9434790, 9653239, 9666125, 9540005, 9508470, 9527932, 9400807, 9221099, 9255055, 9411596, 9306176, 8923379, 8739815, 8997063, 9281129, 9121158, 8670682, 8435882, 8556211, 8736826, 8771839, 8756333, 8789517, 8791210, 8689504, 8568126, 8534695, 8578106, 8614977, 8581059, 8458627, 8310742, 8284926, 8460959, 8682136, 8672721, 8378609, 8079561, 8075194, 8328839, 8524674, 8454194, 8236216, 8114047, 8128553, 8112837, 7993579, 7934577, 8083421, 8299417, 8308775, 8085864, 7889085, 7900476, 8010473, 8018863, 7888712, 7720452, 7613602, 7635392, 7787077]
14265G787077J27865j08772l23631k35976N7853J89998N0444r5823n6915M8801
14255G440921Q9278J20241J53682M6090k00614l22541j84801j2703j4488n6475
14245G058590L1717J14565K3879q6177j4324Q4195l4351k19459j50103R2761J42853
14234G044146l5738j25838l0899J2253o9245n8878Q2701R8136p5185j50086r936
14223F681431O3595q7582j88287k9138J41109O3411p3621j1398Q8787l0900k07509
14212F409898j35292P5841J02938k5949o1067m1900j52655k29909k275K93895
14202F233525J91854j58428j43962K51705L31585j52112n19541k54398J65375
14193E945603J00523k12353j61942J70546K30765j5755j05302N1372Q3112q3818
$$ y = [7787077, 7914942, 7806170, 7482539, 7246563, 7304416, 7494414, 7544858, 7449035, 7392120, 7440921, 7530199, 7650440, 7804122, 7850212, 7649598, 7327057, 7142256, 7129553, 7115065, 7058590, 7090307, 7204872, 7228751, 7142574, 7128250, 7212445, 7178094, 6958635, 6808532, 6901293, 7044146, 7008408, 6882570, 6851671, 6863924, 6794679, 6735801, 6818502, 6916638, 6841453, 6691367, 6681431, 6745026, 6657444, 6469157, 6440019, 6581128, 6644539, 6570918, 6559520, 6648307, 6617407, 6409898, 6274606, 6350447, 6453385, 6427436, 6366369, 6324469, 6171814, 5941905, 5939630, 6233525, 6425379, 6266951, 6122989, 6374694, 6706279, 6554167, 6034626, 5780228, 5945603, 6046126, 5833773, 5671831, 5842377, 6073142, 6057387, 5952085, 6003457, 6086569, 6002751]
14183F002751j08299O6369Q4258j22725j66587O6484J57637r2969k66361n0078
14173E570480J93916N5187k04944j10217K09031K47614l9794k23356j18307J9657
14163E599267N086m7536m2668m6125n7788P273P9760J2346r9954l4455J20651
14152E495857N1730k10318k58252K5961K34904Q3711j43854j03871M6399r649
14142E212618j59134p9902J49267J54862q8036j96878m511J85865R7447j16651
14132E154947j54554P87J31910J10837m150r8700j00088j5609M7228j6719j33173
14121D922716r6748J24302K71558J21180j78827k70675m9442K07191J99054m3303
14111E207006k38975k06561l6300O8682L3207n0681p7428m5459j1414N177K1400
$$ y = [6002751, 5894452, 5960821, 6045079, 5922354, 5755767, 5822251, 5979888, 5886919, 5620558, 5570480, 5764396, 5819583, 5614639, 5504422, 5713453, 5961067, 5921273, 5697917, 5579610, 5599267, 5604353, 5556817, 5514149, 5468024, 5410236, 5417509, 5497269, 5509615, 5409661, 5375206, 5495857, 5547587, 5337269, 5079017, 5104978, 5339882, 5423593, 5279739, 5175868, 5222267, 5212618, 5053484, 4973582, 5122849, 5277711, 5189675, 4992797, 4988286, 5174151, 5271598, 5154947, 5000393, 5001180, 5133090, 5243927, 5239777, 5141077, 5040989, 5025380, 5072608, 5055889, 4922716, 4825968, 4950270, 5221828, 5343008, 5164181, 4893506, 4844064, 5051255, 5250309, 5207006, 4968031, 4761470, 4725170, 4793852, 4827059, 4776378, 4698950, 4653491, 4642077, 4647254, 4668654]
14100D668654L1467N445o1399j33665j56363p4816J11473K76298K33815k6535
14090D874374k47753j90616L6010J11636l7489j40470r268J69726J33738n4557
14080D645331j32344m7663J5385k2027l7483K2004L6546l0767k0165J32504K05858
14069D767179R005k73151l07354q9822P9248N8719O119K9508J5430q2900q6441
14058D125540Q4462J87611K7469j67666p1139J85367J78351j29086l06372j29699
14048C984838Q1624j332k08315j84007N5833K14161J82626Q7935j4528j54507
14038D044328k17676m7917K20305K58971K3696j70369j25419j1902k2828p3345
14028C877844l2230K350r7791k01117r4658J53566K65799J46277j6988l8175N3050
$$ y = [4668654, 4700121, 4705566, 4644167, 4510502, 4354139, 4279323, 4390796, 4667094, 4900909, 4874374, 4626621, 4436005, 4472015, 4583651, 4546162, 4405692, 4396424, 4566150, 4699888, 4645331, 4512987, 4465324, 4480709, 4458682, 4421199, 4443203, 4479749, 4448982, 4428817, 4561321, 4767179, 4776184, 4503033, 4195679, 4105857, 4185105, 4243824, 4249943, 4279451, 4294881, 4211981, 4125540, 4210002, 4397613, 4425082, 4257416, 4186277, 4371644, 4549995, 4420909, 4114537, 3984838, 4066462, 4065130, 3856815, 3672808, 3728641, 3942802, 4125428, 4213363, 4198835, 4044328, 3826652, 3778735, 3999040, 4258011, 4281707, 4111338, 3985919, 3974017, 3951189, 3877844, 3845614, 3847964, 3750173, 3549056, 3454398, 3607964, 3873763, 4020040, 4003052, 3964877, 4017927]
14017D017927R8455q070k17858l22439j25056K66660M34866J37077k95425l21659
14007C664478O7063L01739L2062l66027l26919J07022L80945K21179n9275j06693
13997C915574j0280l1476j28689p3767R8525J19994m5214j23093m832N2060j13499
13986C655303k35249n7433J73467P4461j97206j46308K25008L51880N10l31200
13976C513233j93599J26338J18215j36534j82714K3862J12897k5044j07449p861
13966C241344O8179K5518L3450J24556Q4277j01478j23700J10170K33062j431
13956C693947k79282k18876K5545O6596o8303n8074J03748J14128o9878j34924
13946C174627N4607K27166J33856j06199k29354j56103J8189J58262J33373p5726
$$ y = [4017927, 4116382, 4108312, 3890454, 3568015, 3442959, 3709619, 4144485, 4281562, 3986137, 3664478, 3731541, 4033280, 4065342, 3699315, 3372396, 3479418, 3860363, 4081542, 4022267, 3915574, 3905294, 3873818, 3745129, 3671362, 3769887, 3889881, 3844667, 3721574, 3716742, 3768802, 3655303, 3420054, 3362621, 3536088, 3610549, 3413343, 3267035, 3492043, 3843923, 3844433, 3513233, 3319634, 3445972, 3564187, 3427653, 3244939, 3268801, 3381698, 3356654, 3249205, 3241344, 3309523, 3335041, 3368491, 3493047, 3577324, 3475846, 3352146, 3462316, 3695378, 3693947, 3414665, 3195789, 3221334, 3287930, 3219627, 3161553, 3265301, 3379429, 3309551, 3174627, 3229234, 3456400, 3590256, 3484057, 3254703, 3098600, 3116789, 3275051, 3408424, 3332698]
13936C332698k58225j74185Q5120J86514N1353m0654N9050J20149l4078j81482
13926C146260p1709J33795J28690m4121j25679r9384j27094j54394q261J79649
13916B957752J08199j36654j46860J15438K07105m5626k18615q789K26732Q2623
13906C141305j83919j09032J48809R4974j86674j41992K57816L91281J8342k89323
13896C141587q2938K40543J28792k30169k84821k8014J01332P344n446J19431
13886C107641R0470j48489k73113j22037P7355J46872J87612K34930J19349j37327
13876C283263k06456J8829J69528k1259k44394r8067K42453K84622k1157k39515
13866C167847j21960R6294J23065r134j02592q6757j5874O5977J31966J26346
$$ y = [3332698, 3074473, 2900288, 2985408, 3171922, 3223275, 3182621, 3241671, 3361820, 3327742, 3146260, 3074551, 3208346, 3337036, 3292915, 3167236, 3067852, 2940758, 2786364, 2778103, 2957752, 3065951, 2929297, 2782437, 2897875, 3104980, 3059354, 2840739, 2831950, 3058682, 3141305, 2957386, 2848354, 2997163, 3092137, 2905463, 2763471, 3021287, 3412568, 3430910, 3141587, 3058649, 3299192, 3427984, 3197815, 2912994, 2884980, 2986312, 2993656, 2988210, 3107641, 3198111, 3049622, 2776509, 2654472, 2731827, 2878699, 3066311, 3301241, 3420590, 3283263, 3076807, 3095636, 3265164, 3243905, 2999511, 2901444, 3143897, 3428519, 3407362, 3167847, 3045887, 3142181, 3265246, 3256112, 3153520, 3066763, 3050889, 3116866, 3248832, 3375178]
13856C375178O066j79963k83358j67577J11209K73862J15771j72855k01808O0620
13846B937145K08865J2374k15098j12328J59248K03003K2775n4425M2149P7005
13836C280713j1571l2396L8761k020j54067j41151R8251K46311J05813r5699j04801
13825C228144j3492j098r378O0810Q9847l8659j66014r1451Q9706J45609O0749
13814C354773j9840o0469r9957p5893O1659J70734J02523l3105l4585N7978N9417
13803C483235j7939n577Q8930Q5704l9515j09531m7876L0768O4022J22805J94505
13792C849531J32910q0882k40962j95196m9406J9244K415n305J1228J039l2586
13781C412030l3856K2683J15565J99429K04520P7350j23682k30634j36526N8189
$$ y = [3375178, 3381244, 3201281, 2917923, 2750346, 2861555, 3135417, 3251188, 3078333, 2876525, 2937145, 3146010, 3158384, 2943286, 2830958, 2990206, 3193209, 3215984, 3161559, 3203708, 3280713, 3269142, 3236746, 3275507, 3273487, 3119420, 2978269, 3076520, 3322831, 3428644, 3332945, 3228144, 3214652, 3213554, 3204176, 3264986, 3354833, 3316174, 3150160, 3058709, 3148415, 3294024, 3354773, 3334933, 3274464, 3174507, 3098614, 3160273, 3331007, 3433530, 3400425, 3365840, 3423818, 3483235, 3465296, 3459719, 3548649, 3634353, 3594838, 3485307, 3437431, 3468199, 3532221, 3655026, 3849531, 3982441, 3901559, 3660597, 3465401, 3415995, 3435239, 3437654, 3432349, 3443577, 3444616, 3412030, 3378174, 3400857, 3516422, 3715851, 3920371, 3997721, 3874039, 3643405, 3506879, 3565068]
13771C565068J36311J5698j37547j01308J09755K36797J13357j01290j54934o6739
13761C615168m3579r3151j9634J69676J98355j2455j55448k0291J66662J51668
13751C956971O8809J03692P6733j83415l44474k5860M42715L83193j64191m38712
13741C875461j11502K64811J91114o4964o9139N3663n853r8416P7177L29157K24454
13730D665963j69730l43432j04088J93691K14322M4720n7282k0066N0739N6995
13720D531832L883r923Q3583J68025N3676j78466j77451J56120M11764K16444
13710E259487j89848k89285k9063J83575J37298L2375M2207P3687M1415K9337
13700E291185P2484O6227j0553l3864L1532P6991P6446J15447J57911O6369r3382
$$ y = [3565068, 3701379, 3717077, 3579530, 3478222, 3587977, 3824774, 3938131, 3836841, 3681907, 3615168, 3571589, 3478438, 3458804, 3628480, 3826835, 3814380, 3658932, 3638641, 3805303, 3956971, 4025780, 4129472, 4206205, 4022790, 3678316, 3652456, 4095171, 4478364, 4314173, 3875461, 3763959, 4028770, 4219884, 4154920, 4085781, 4139444, 4133591, 4035175, 4112352, 4441509, 4665963, 4496233, 4152801, 4048713, 4242404, 4456726, 4501446, 4444164, 4424098, 4474837, 4531832, 4535715, 4525792, 4609375, 4777400, 4831076, 4652610, 4475159, 4631279, 5043043, 5259487, 5069639, 4780354, 4751291, 4934866, 5072164, 5104539, 5146746, 5220433, 5261848, 5291185, 5363669, 5429896, 5419343, 5385479, 5417011, 5494002, 5570448, 5685895, 5843806, 5910175, 5816793]
13689E816793p6007J28759K22651O6634r3395m0337P6959M4976l8982L6427K15346
13678F359824K68567J51233K3359r969K3206P9376J24498J01329J6513p518J01314
13667G231732K24418K08966Q6480M143J1161M4260O4450Q5212J09740J34294J64899
13656H369755J70815J06375L1670Q3492K49652L25159K04863O1232Q4995K01993
13646I890001K26580J59797J27441J32301R6042O7850J49867K60439K20745P0776
13636A1401839M9685K23123L67487L11398J83509J88418K95115L13519J93715
13627A3527808Q4804J12604K28199L04490K94966K46757K10359K03451K42338
13618A5455776L28663L94014L48115K25694J86957K94774L99609L64924K89545
$$ y = [5816793, 5740786, 5869545, 6092196, 6158830, 6065435, 6025098, 6102057, 6147033, 6108051, 6144478, 6359824, 6628391, 6779624, 6802983, 6793014, 6816220, 6895596, 7020094, 7121423, 7137936, 7130418, 7231732, 7456150, 7665116, 7751596, 7755739, 7766900, 7811160, 7875610, 7960822, 8070562, 8204856, 8369755, 8540570, 8646945, 8678615, 8762107, 9011759, 9336918, 9541781, 9603013, 9688008, 9890001, 10116581, 10276378, 10403819, 10536120, 10632162, 10700012, 10849879, 11110318, 11331063, 11401839, 11451524, 11674647, 12042134, 12353532, 12537041, 12725459, 13020574, 13334093, 13527808, 13612612, 13725216, 13953415, 14257905, 14552871, 14799628, 15009987, 15213438, 15455776, 15784439, 16178453, 16526568, 16752262, 16939219, 17233993, 17633602, 17998526, 18288071]
13609A8288071L27849L99957L31362K08038K78239N09762N98267M74374M20355
13600B1836274N51612N90713L87918K62845M85799P70138P10047M46406M05986
13591B6447738N77145N91739M27241M40831O78537P35782M70416L23031O33607
13582C1326067J056503J033000N87569K72890M28052Q02784R25675O55629L14521
13573C7402690L18035O89001J005993R23009O17440N01841N96509N45601K63269
13564D2863388J36866M14653P67442P44650L96896J29189J21089K15088K69100
13555D6058361L04184L30711K90446J92852J24501J10607J05003J00006J14230
13546D7730901R9744k394j33932j75705j20462p2251q3371j08360j24470j82179
$$ y = [18288071, 18615920, 19015877, 19347239, 19555277, 19833516, 20343278, 20941545, 21415919, 21836274, 22387886, 22978599, 23366517, 23629362, 24115161, 24885299, 25595346, 26041752, 26447738, 27024883, 27616622, 28043863, 28484694, 29163231, 29899013, 30369429, 30692460, 31326067, 32382570, 33415570, 34003139, 34276029, 34704081, 35506865, 36432540, 37088169, 37402690, 37720725, 38409726, 39415719, 40338728, 40956168, 41458009, 42054518, 42600119, 42863388, 43000254, 43414907, 44182349, 44926999, 45323895, 45453084, 45574173, 45789261, 46058361, 46362545, 46693256, 46983702, 47176554, 47301055, 47411662, 47516665, 47616671, 47730901, 47830645, 47828251, 47694319, 47518614, 47398152, 47325901, 47242530, 47134170, 47009700, 46827521]
13536D6827521k96436l75477l30560k23675k21128l66899m79656l84420k02156
13527D3947114k16361m22856m75958k28665l1850k05320m78508l89825n7513n754
13517D1434504k84888l87042j26272M4947j57323l46113j55493J14711M4325j73090
13507D0008266j18293Q6677L4327j86589j31753J91042L11367R5638n4433J00394
13497D0336643K84131K18805M0989J0035J50330L49531N19002N38914L30509P8263
13487D2857152R3955L75556N85059N32029L79956L08320K93375L10654M26443
13478D6162499N77753N75241M35565M00487N25078N81745M83791M36563N19448
13469E0698170N07905L17777K37828M44837O41427N09154K28136J79849L55331
$$ y = [46827521, 46531085, 46155608, 45825048, 45601373, 45380245, 45013346, 44533690, 44149270, 43947114, 43730753, 43307897, 42831939, 42603274, 42571424, 42366104, 41887596, 41497771, 41440258, 41434504, 41149616, 40762574, 40636302, 40681249, 40523926, 40177813, 40022320, 40137031, 40181356, 40008266, 39889973, 39976650, 40010977, 39824388, 39692635, 39883677, 40195044, 40290682, 40236249, 40336643, 40620774, 40839579, 40880568, 40890603, 41040933, 41390464, 41909466, 42448380, 42778889, 42857152, 42951107, 43326663, 43911722, 44443751, 44823707, 45132027, 45425402, 45736056, 46162499, 46740252, 47315493, 47751058, 48151545, 48676623, 49258368, 49742159, 50178722, 50698170, 51206075, 51523852, 51761680, 52206517, 52847944, 53357098, 53585234, 53765083, 54120414]
13460E4120414M32930K97456J29403O0434M6519M4167O6260Q3552M8710j8695
13450E5311150r2470j98478l08469l06920j83924j16145k25835m01044m73552
13441E3004313m29964l52693l16663m05703o19828p33691n44097k98328m67125
13432D8836221r74504j151770p12922k58239m04731q85663j036586p94958o13276
13423D2003572o47532o70570o41347p39425q93556q45822o64439o61575q10227
13414C5429079p71955n27495m51459o79607q89244q25692o24500n03567n08778
13405B9646782o30385q12693q33804n55135k59170l08068n30011m67241j83432
13396B5066843j92017n48125p14601m84406l18839n00014o42377m19178j38453
$$ y = [54120414, 54553344, 54850800, 54980203, 55040637, 55087156, 55131323, 55197583, 55281135, 55329845, 55311150, 55218680, 55020202, 54711733, 54404813, 54220889, 54104744, 53878909, 53477865, 53004313, 52574349, 52221656, 51904993, 51499290, 50879462, 50145771, 49601674, 49303346, 48836221, 47861717, 46709947, 45997025, 45738786, 45334055, 44448392, 43411806, 42616848, 42003572, 41356040, 40685470, 40044123, 39304698, 38411142, 37565320, 36900881, 36239306, 35429079, 34657124, 34129629, 33678170, 32998563, 32109319, 31283627, 30659127, 30155560, 29646782, 29016397, 28203704, 27369900, 26814765, 26555595, 26247527, 25717516, 25250275, 25066843, 24874826, 24326701, 23612100, 23127694, 22808855, 22308841, 21666464, 21247286, 21108833]
13387B1108833j59068l05337l23156l72995n71744n77544j95067J01218j25256
13378A8579884m89766l97846m7098n0936l59655l92170q7386K4110k16555l73010
13368A6189572k51462k02644l87613m34820j25213J68771P6658k11792l26802
13359A4494655k57622j76295p9231M7146J2451k56632m34496k25955J12485R9592
13349A3336098k26592l42478m7163K07202L63l93498l98566j3574J77454q8638
13339A2210608l40219j46919J42767l0937m39063l63202J79061L55147j39457
13330A1427786n25146j89860L02810J63061l25732l51717M0500J16019k36206
13321A0421515l85266j15208Q5114j5291o3782O3062J4262k28786j87398J64775
$$ y = [21108833, 20949765, 20644428, 20321272, 19948277, 19376533, 18798989, 18603922, 18705140, 18579884, 18090118, 17692272, 17645174, 17594238, 17234583, 16842413, 16755027, 16779137, 16562582, 16189572, 15938110, 15735466, 15347853, 14913033, 14787820, 14956591, 15033249, 14821457, 14494655, 14237033, 14060738, 13981507, 14028653, 14041104, 13784472, 13349976, 13124021, 13236506, 13336098, 13109506, 12767028, 12719865, 12927067, 12927430, 12533932, 12135366, 12121792, 12299246, 12210608, 11870389, 11723470, 11866237, 11835300, 11396237, 11033035, 11212096, 11567243, 11427786, 10902640, 10712780, 11015590, 11178651, 10852919, 10501202, 10541702, 10657721, 10421515, 10036249, 9921041, 10006155, 9990864, 9927082, 9990144, 10004406, 9775620, 9588222, 9752997]
13311I752997J91638k59263m28465P8921M99492J39322m28371l17629J87135J73451
13301I589228l23535m37947K2450L14234N3933k38981j26756Q2750Q278j61086
13291H782568j07024M5284L684j90593k79551j71625K7076J77569J66157j4492
13281H439053j76082j33056M347j0814j41996j36220O545K1460j30294j76516
13271G566427k9528N6624l3306n7993J14677K20610M3977j92459j86199k9633
13261G473197n364j15646j40491l3305M1796P252l7015n327O3551R1362N6216
13250G396226M237q664j2614j09908k74209k73242J0506K93052K21945p5571j58821
13239G012937K6395P7850j44752k46474K2032K97780J82055j22170j86784m9945
$$ y = [9752997, 9944635, 9685372, 9256907, 9335828, 9835320, 9974642, 9546271, 9228642, 9415777, 9589228, 9265693, 8827746, 8850196, 9164430, 9218363, 8979382, 8852626, 8935376, 8943654, 8782568, 8675544, 8720828, 8724512, 8533919, 8254368, 8082743, 8109819, 8287388, 8453545, 8439053, 8262971, 8129915, 8134262, 8123448, 7981452, 7845232, 7851777, 7873237, 7742943, 7566427, 7536899, 7593523, 7560217, 7502224, 7616901, 7837511, 7881488, 7689029, 7502830, 7473197, 7467833, 7352187, 7211696, 7178391, 7220187, 7227439, 7190424, 7185097, 7248648, 7340010, 7396226, 7400463, 7391799, 7379185, 7269277, 6995068, 6721826, 6732332, 7025384, 7247329, 7171758, 7012937, 7039332, 7117182, 6972430, 6725956, 6747988, 7045768, 7227823, 7105653, 6918869, 6868924]
13229F868924l8933j35886n9602J36948J02739j67019k42657N0320L01615J18784
13219F935233k71403l41216p861K69325J35342j89132k35039N9538K73151J13071
13209F741009j64923j54737R2943J97682O4433m9587n9918j57929l01823j43134
13199F064016L10510M94827J10259l45573l18476j8789M5953n1678P6615L01202
13189F668866J78509j69427j85174J36019J96946j59113l54746o5138K49956J57607
13179F654305p2623m9165O2218m7110k05761j06854Q2425J2744k01468j63595
13169E965116J41458L48149K72653O4034j17111k13952j64775L489R3426K8664
13159F421151L3501K17362K57514q4106m13474k31026K09903K39561j32260k13732
$$ y = [6868924, 6829991, 6694105, 6634503, 6771451, 6874190, 6707171, 6464514, 6514834, 6816449, 6935233, 6663830, 6322614, 6314753, 6584078, 6719420, 6530288, 6295249, 6354787, 6627938, 6741009, 6576086, 6421349, 6514292, 6711974, 6776407, 6726820, 6666902, 6508973, 6207150, 6064016, 6374526, 6869353, 6979612, 6634039, 6315563, 6296774, 6342727, 6291049, 6367664, 6668866, 6847375, 6677948, 6492774, 6628793, 6825739, 6666626, 6311880, 6246742, 6496698, 6654305, 6581682, 6532517, 6594735, 6547625, 6341864, 6235010, 6317435, 6330179, 6128711, 5965116, 6106574, 6454723, 6727376, 6791410, 6674299, 6460347, 6295572, 6299061, 6392487, 6421151, 6454652, 6672014, 6929528, 6845422, 6431948, 6200922, 6410825, 6650386, 6518126, 6304394]
13149F304394K00174M44993P1505l95519k76898K16401L60516J7760k62041j24572
13139F556713J56271J83840k9875j78211p1960J82992L19137J83239p8221j69574
13129G054351k6833R2292o848j63820j24241P5341K01359J69502O4371p0544k07842
13118G057088k01413L5438K80759K39314k468q3200O5553J21427p4596k37888
13108G200014j01398J61050K30010J17252N6639Q5824M5511q4069j32827k1921
13098G556085J26230J75638J13544R79q1267o1510L2436O8963J1339R902J42395
13087H094734K15042N9129j24200m1364J81471J72237m2191n2858J98563K46170
13077H906733j10154l71204r2728L70110L96483N7718o6945J44534K33363k867
$$ y = [6304394, 6504568, 6949561, 7021066, 6625547, 6348649, 6565050, 6925566, 6943326, 6681285, 6556713, 6712984, 6896824, 6866949, 6688738, 6616778, 6799770, 7118907, 7302146, 7223925, 7054351, 7027518, 7119810, 7112962, 6949142, 6824901, 6900242, 7101601, 7271103, 7335474, 7264930, 7057088, 6855675, 6891113, 7171872, 7411186, 7408718, 7325518, 7391071, 7512498, 7437902, 7200014, 7098616, 7259666, 7489676, 7606928, 7663567, 7749391, 7794902, 7710833, 7578006, 7556085, 7682315, 7857953, 7971497, 7972476, 7891209, 7829699, 7862135, 7931098, 7942437, 7952339, 8094734, 8309776, 8368905, 8244705, 8203341, 8384812, 8557049, 8514858, 8462000, 8660563, 8906733, 8796579, 8425375, 8332647, 8702757, 9099240, 9156958, 9090013, 9234547, 9467910, 9465043]
13067I465043j85429k5959K15808J99389P255r6372p4748j4349J02468K49287
13057I842393K30262j9973k22307j13818J54817K47638J14537k2497j9580R5010
13047A0286482K50605L32959J94442j04911k26033K0764L36693L17292K5828j44578
13037A1289543n5865R3431J83308K72501L13914J71023n4196q6381P9344J61965
13027A2368587Q1331P6473K38106L16122J58193j8468O551J35852K02768K40026
13017A3805541K89556K38750P2257J135J09818J74073P9807Q3916L35251M84889
13007A5674993K06691j84024j46656K46427M39516K55452N8955P6489J26194J01255
12997A6855292J69037L32399L11021P6458J6402K93109N06102L36244Q5710J48630
$$ y = [9465043, 9279614, 9253655, 9469463, 9668852, 9676107, 9579735, 9504987, 9490638, 9593106, 9842393, 10072655, 10052682, 9830375, 9716557, 9871374, 10119012, 10233549, 10211052, 10191472, 10286482, 10537087, 10870046, 11064488, 10959577, 10733544, 10754308, 11091001, 11408293, 11434121, 11289543, 11233678, 11327109, 11510417, 11782918, 12096832, 12267855, 12213659, 12127278, 12206622, 12368587, 12449918, 12526391, 12764497, 13080619, 13238812, 13220344, 13226895, 13362747, 13565515, 13805541, 14095097, 14333847, 14406104, 14407239, 14517057, 14691130, 14770937, 14854853, 15190104, 15674993, 15881684, 15697660, 15551004, 15797431, 16236947, 16492399, 16551354, 16627843, 16754037, 16855292, 17024329, 17356728, 17667749, 17744207, 17760609, 18053718, 18559820, 18896064, 18981774, 19130404]
12987A9130404L33577K38686N488R1743M49853N65610L02457R8840K24598M07345
12977B1848601L88741L27728L77100L37963R3905k7423K40605N75665N30173K56069
12967B4949127K24556M14251L94672J45980J30059M63401O71808M84123K60635
12958B8138612L16033L96665K58273K16398N53444Q43140N71872J00463J93284
12949C1588184P53819R14849M25572M8111L17606P51289P43296N15258N63905
12940C6621889P38495N98208L08309M04383Q40148J013532P30242M73182O02192
12931D2330580Q61072Q81913P19244O35339O91539P89108Q75112R18390Q70082
12922D9572379P87808Q31514J035159J241158J325737J324087J296238J253662
$$ y = [19130404, 19463981, 19702667, 19708155, 19799898, 20249751, 20815361, 21117818, 21216658, 21441256, 21848601, 22237342, 22565070, 22942170, 23280133, 23374038, 23346615, 23587220, 24162885, 24693058, 24949127, 25173683, 25587934, 25982606, 26128586, 26258645, 26722046, 27393854, 27877977, 28138612, 28454645, 28851310, 29109583, 29325981, 29879425, 30722565, 31294437, 31394900, 31588184, 32342003, 33256852, 33682424, 33730535, 34048141, 34799430, 35542726, 36057984, 36621889, 37360384, 37958592, 38266901, 38671284, 39511432, 40524964, 41255206, 41728388, 42330580, 43191652, 44073565, 44792809, 45428148, 46119687, 46908795, 47783907, 48702297, 49572379, 50360187, 51191701, 52226860, 53468018, 54793755, 56117842, 57414080, 58667742]
12914E8667742J243855J312328J376367J353250J385297J653742J989111K030270
12906G1011962J812340J781490K095599K346539K216730K001843K134198K516995
12898H7917696K745088K751524K783969K869699K769126K462822K273895K396055
12890A08969874K597562K539470K197716J836052J667469J644360J549426J256037
12882A24257966Q93219P09455P67306Q72359Q38830O93940N58981M88092N22641
12873A30602789P32290J061038J291698J324633J344164J539676J815753J973465
12865A41685506K031192K142018K315334K456121K588092K809612L096470L344969
12857A62469314L535090L684394L756180L776880L877033M027141L951066L540869
$$ y = [58667742, 59911597, 61223925, 62600292, 63953542, 65338839, 66992581, 68981692, 71011962, 72824302, 74605792, 76701391, 79047930, 81264660, 83266503, 85400701, 87917696, 90662784, 93414308, 96198277, 99067976, 101837102, 104299924, 106573819, 108969874, 111567436, 114106906, 116304622, 118140674, 119808143, 121452503, 123001929, 124257966, 125151185, 125860640, 126627946, 127500305, 128339135, 129033075, 129592056, 130080148, 130602789, 131335079, 132396117, 133687815, 135012448, 136356612, 137896288, 139712041, 141685506, 143716698, 145858716, 148174050, 150630171, 153218263, 156027875, 159124345, 162469314, 166004404, 169688798, 173444978, 177221858, 181098891, 185126032, 189077098, 192617967]
12849A92617967L096292K839745K492926J763058R48279M84833J32676o64428
12841B03711348j714060k205779j997834j910603k437970k990312k911058k512042
12833A85031690k431042k543140k308550j818571j638149j779095j669279j156266
12825A69687598p61949p71950p70162l91186M0402N2827j93090j50884K92460
12816A67034066P00401P43658N92213N73420P14148P88168O80240N14115M25211
12807A72765640L58970J79954j09610l88107o07959q18791j009984j116200j205969
12798A68047944j441599j764367j862960j619510j355305j395473j585713j545572
12790A55477445j265839j092834j153657j169022r22259o00785m98611n86915
$$ y = [192617967, 195714259, 198554004, 201046930, 202809988, 203758267, 204243100, 204375776, 203711348, 201997288, 199791509, 197793675, 195883072, 193445102, 190454790, 187543732, 185031690, 182600648, 180057508, 177748958, 175930387, 174292238, 172513143, 170843864, 169687598, 168925649, 168153699, 167383537, 166992351, 167032753, 167085580, 166892490, 166741606, 167034066, 167734467, 168478125, 169070338, 169643758, 170357906, 171146074, 171826314, 172340429, 172765640, 173124610, 173304564, 173194954, 172806847, 172198888, 171380097, 170370113, 169253913, 168047944, 166606345, 164841978, 162979018, 161359508, 160004203, 158608730, 157023017, 155477445, 154211606, 153118772, 151965115, 150796093, 149873834, 149273049, 148774438, 148187523]
12782A48187523n79940l32869l800J73339J67728J49560K38505L47254L53535
12773A48700835L41912M84324P04434P33923N71630N65588Q57492J076003Q84180
12764A54920321N41691N18765P65503Q41194O53205N51065O87537P90890O75161
12755A60945332N34097N69802O96406P70943P99086P79276O54205N27829O02543
12746A66879519Q03759Q37863P26175Q34515J200111J335539J003284O87300Q57093
12737A75165158J193320J102669O94006N98055R45162J170866R00214M68708L59597
12728A82597755N24627N34238J87015k67013m50633k88238j00035k52283p18859
12719A81766574j112143j186966j112650j136768j231209j277085j350930j537525
$$ y = [148187523, 147607583, 147274714, 147270914, 147444253, 147611981, 147761541, 148000046, 148347300, 148700835, 149042747, 149527071, 150231505, 150965428, 151537058, 152102646, 152960138, 154036141, 154920321, 155462012, 155980777, 156746280, 157587474, 158240679, 158791744, 159479281, 160270171, 160945332, 161479429, 162049231, 162745637, 163516580, 164315666, 165094942, 165749147, 166276976, 166879519, 167683278, 168521141, 169247316, 170081831, 171281942, 172617481, 173620765, 174308065, 175165158, 176358478, 177461147, 178155153, 178753208, 179698370, 180869236, 181769450, 182238158, 182597755, 183122382, 183656620, 183843635, 183576622, 183125989, 182837751, 182737716, 182485433, 181766574, 180654431, 179467465, 178354815, 177218047, 175986838, 174709753, 173358823, 171821298]
12711A71821298j667504j575737j445736j527061j658082j490844j102801r36387
12703A60417146j141700j409098j484766j436341j348125j169893r74483r72865
12695A50479875j137644j174602j007399r26955j098200j283899j260639j164980
12687A41425557j194791j285157j331752j436032j653153j774498j663110j556664
12679A29530400j709745j948814j936846j717291j623342j740450j818905j696667
12671A15338340j496904j387272j389321j445479j481247j409383j240671j142224
12663A04345839j208381j255115j067192p76813p18245r22159j054179r15844
12655I6427911p18999p17612q01868o87514l91679k63172n05844q64824r27206
$$ y = [171821298, 170153794, 168578057, 167132321, 165605260, 163947178, 162456334, 161353533, 160417146, 159275446, 157866348, 156381582, 154945241, 153597116, 152427223, 151452740, 150479875, 149342231, 148167629, 147160230, 146233275, 145135075, 143851176, 142590537, 141425557, 140230766, 138945609, 137613857, 136177825, 134524672, 132750174, 131087064, 129530400, 127820655, 125871841, 123934995, 122217704, 120594362, 118853912, 117035007, 115338340, 113841436, 112454164, 111064843, 109619364, 108138117, 106728734, 105488063, 104345839, 103137458, 101882343, 100815151, 100038338, 99320093, 98397934, 97343755, 96427911, 95708912, 94991300, 94189432, 93501918, 93110239, 92847067, 92341223, 91476399, 90549193]
12646I0549193o49401l95270m25827n62386n07188l18971l02189n07895o61763
12637H6218303n99398m62219l99184l81375m03702n48668p22439o62356l68879
12628H1670083j80822k36307k59355j25933j71645n53000p76328m10859J15984
12619G9071818R4057l74393n79922l40308j51128k42626k91086j69102j93563
12610G6823747m09513l84027k9886R0192k99888o32369m06109m0042j67868n81961
12600G3962276o27866l06237j87642m04994n15871l51090k69305m53203n98949
12591G0247119n11907m52042o10118p14257n03884k30302k89286n86703o75922
12582F5672698m33994k22857l32467n69336n68424l32481k09668l57402n02632
$$ y = [90549193, 89899792, 89504522, 89078695, 88516309, 88009121, 87690150, 87387961, 86880066, 86218303, 85618905, 85156686, 84757502, 84376127, 83972425, 83423757, 82701318, 82038962, 81670083, 81489261, 81252954, 80993599, 80867666, 80696021, 80143021, 79366693, 78955834, 79071818, 79165875, 78791482, 78211560, 77871252, 77720124, 77477498, 77186412, 77017310, 76823747, 76414234, 76030207, 76000321, 76090513, 75790625, 75158256, 74752147, 74712105, 74544237, 73962276, 73334410, 73028173, 72840531, 72435537, 71919666, 71568576, 71299271, 70846068, 70247119, 69735212, 69283170, 68673052, 67958795, 67454911, 67224609, 66935323, 66348620, 65672698, 65238704, 65015847, 64683380, 64114044, 63545620, 63213139, 63003471, 62646069, 62143437]
12573F2143437l81503j81683k42933m56718l95962n2583N8430k81484n76404l74122
12563E9258475Q969K2377k22839k20932J931m5782l87617m67543r5850K04323
12553E8055512O3804j58765n2352J50917M2739k28767k42625l2366K4994j23521
12543E7499570j86885j04937j32116l19559l73664j49034R1590P5853j06616k13830
12533E6080372k15977k49233l36178l50009k28238q3951o9240j83321k70803k27798
12523E3865624j54365k10429l49234l56579j91203q7337k01397l50833k95767
12514E1668480j23069j03696k63294l63488k82500j59498j38025j87809k29720
12505D9817381k52608k52971k12547j77211k22231l18411l65258l52659l40542
$$ y = [62143437, 61761934, 61580251, 61337318, 60880600, 60484638, 60432055, 60490485, 60209001, 59632597, 59258475, 59267444, 59289821, 59066982, 58846050, 58847981, 58802199, 58414582, 57947039, 57851189, 58055512, 58119316, 57960551, 57908199, 58059116, 58101855, 57873088, 57630463, 57598097, 57623091, 57499570, 57312685, 57207748, 57075632, 56756073, 56382409, 56233375, 56324965, 56400818, 56294202, 56080372, 55864395, 55615162, 55278984, 54928975, 54700737, 54616786, 54547546, 54364225, 54093422, 53865624, 53711259, 53500830, 53151596, 52795017, 52603814, 52516477, 52315080, 51964247, 51668480, 51545411, 51441715, 51178421, 50814933, 50532433, 50372935, 50234910, 50047101, 49817381, 49564773, 49311802, 49099255, 48922044, 48699813, 48381402, 48016144, 47663485, 47322943]
12496D7322943l03592j87582j03374k31016n07902o57249n77734m53171m11923
12487D3889400l67396l05508m02162o56806p31440m45421j53485k67336o19686
12478C9940160p31568n60620m85294n92246n35987k18839o4772l40132o62242
12469C5748460n77305k77093k64458n32061o10654l63881j91193l48008n48330
12460C2035477m63575k32382j78258k96728l52445l05701l04206l47653k92823
12451B9261706j71464j90805l70936m59303l08842j09540r9816k27228k71840
12442B7051932j90052j42918k17488k91761k21494o0456j2047j70022l70304l64531
12432B5010859j32652P6095O2873p4711j26340q4878r6422j70585j75306j03347
$$ y = [47322943, 47019351, 46831769, 46728395, 46497379, 45989477, 45332228, 44754494, 44301323, 43889400, 43522004, 43216496, 42814334, 42157528, 41426088, 40980667, 40827182, 40559846, 39940160, 39208592, 38647972, 38162678, 37570432, 37034445, 36815606, 36750834, 36410702, 35748460, 35171155, 34894062, 34629604, 34097543, 33486889, 33123008, 32931815, 32583807, 32035477, 31571902, 31339520, 31161262, 30864534, 30512089, 30206388, 29902182, 29554529, 29261706, 29090242, 28899437, 28528501, 28069198, 27760356, 27650816, 27551000, 27323772, 27051932, 26861880, 26718962, 26501474, 26209713, 25988219, 25927763, 25915716, 25745694, 25375390, 25010859, 24878207, 24954302, 25017175, 24942464, 24816124, 24731246, 24634824, 24464239, 24288933, 24185586]
12422B4185586q9649j34714q3287M6995J2632k34045l65682j49717J59534J85272
12412B3532925k2803j34553p8350n7362j06253l3881J65948K18435o383k64354
12402B3213369k70096m1730J96721K69471J27306j34448k70317j06599J67160
12393B3150837J69188j25817k88483m2022L09259L03630l7187k85367k07042R564
12383B2956560R7628L1466l9264o945J02952J80559J49092N6083Q842J6068k762
12372B3550279l4761L8181K10859L05642K54813K24280L06262L13324J00629j14219
12362B5155289n0051J67877J77323n7131k06317j03887L5501M120r4713o8328
12352B4959683O4005J40343Q0238p0113k07181k23414r8172M0761O3066K8943
$$ y = [24185586, 24095937, 23961223, 23877936, 23924931, 23937563, 23703518, 23337836, 23188119, 23347653, 23532925, 23510122, 23375569, 23297219, 23239857, 23133604, 23099723, 23265671, 23484106, 23477723, 23213369, 22943273, 22901543, 23098264, 23367735, 23495041, 23360593, 23090276, 22983677, 23150837, 23320025, 23194208, 22905725, 22863703, 23172962, 23476592, 23439405, 23154038, 22946996, 22956560, 23054188, 23085654, 23046390, 23039445, 23142397, 23322956, 23472048, 23528131, 23536973, 23553041, 23550279, 23515518, 23553699, 23764558, 24070200, 24325013, 24549293, 24855555, 25168879, 25269508, 25155289, 25105238, 25273115, 25450438, 25393307, 25186990, 25083103, 25118604, 25122724, 25028011, 24959683, 25023688, 25164031, 25244269, 25174156, 24966975, 24743561, 24645389, 24686150, 24749216, 24778159]
12342B4778159Q2791J86636J68080K3946o3755l1061M720J3208R3385J94228J23480
12331B5573817o0394l0390K59547L94432J40234j13077O0953M15928M06672O2970
12321B7110692p1062J98834M78353M69457L68249M16356N16325N27027N52756
12312C0566987O65898O69596M30793J68684J02902P2222j49508l88275l34594
12303C1804705j15373j37984m16800n29188k95117m6433o9240j86257j24840M1262
12293B9924735J01086Q2847J08292R0836p7284k03400l9075K54354K90020P5640
12283C0608051J7939K46739L85772J89634r742J73487N21434N12001J24609j08279
12273C2661645J34459N48667O84054N21732L66463L76572M54563N13783O05468
$$ y = [24778159, 24860950, 25047586, 25215666, 25239612, 25175857, 25144796, 25149516, 25162724, 25256109, 25450337, 25573817, 25513423, 25483033, 25742580, 26137012, 26277246, 26164169, 26225122, 26641050, 27047722, 27110692, 27039630, 27238464, 27716817, 28186274, 28554523, 28970879, 29487204, 30014231, 30566987, 31232885, 31902481, 32333274, 32501958, 32604860, 32677082, 32527574, 32139299, 31804705, 31689332, 31551348, 31134548, 30605360, 30310243, 30263810, 30194570, 30008313, 29883473, 29924735, 30025821, 30108668, 30216960, 30307796, 30230512, 30027112, 29988037, 30242391, 30532411, 30608051, 30625990, 30872729, 31258501, 31448135, 31438393, 31611880, 32133314, 32645315, 32769924, 32661645, 32796104, 33344771, 34028825, 34550557, 34917020, 35293592, 35748155, 36261938, 36867406]
12264C6867406P52576Q40408P75116O56497O64452P87570P94411N36170J73484
12255D2848090j6915P999O3769N8130Q2877J50437R6239j15059k18815r635L03556
12244D3250673L70566K10174J48054L00449M36230L77803K48367K33326L24624
12235D5900266M01939L97117L08359J98292K03570L83769N64294N26839L42446
12226D9226891K77511L80319M47954M15521M43783N63684N97025N33211O01126
12217E3487025Q18475Q76268O75652N57688P33740R21053Q78059Q51857J062763
12208F0862580J189719R23589O39831Q45462J250643J160978O33948M19751P57817
12199F8684318J060170R29304P00668P18027Q00163P69228Q40538J083296J113180
$$ y = [36867406, 37619982, 38460390, 39235506, 39892003, 40556455, 41344025, 42138436, 42674606, 42848090, 42831175, 42839174, 42902943, 42961073, 43043950, 43194387, 43290626, 43175567, 42956752, 42947117, 43250673, 43621239, 43831413, 43979467, 44279916, 44716146, 45093949, 45342316, 45575642, 45900266, 46302205, 46699322, 47007681, 47205973, 47409543, 47793312, 48357606, 48884445, 49226891, 49504402, 49884721, 50332675, 50748196, 51191979, 51755663, 52352688, 52885899, 53487025, 54305500, 55181768, 55857420, 56415108, 57148848, 58069901, 58947960, 59799817, 60862580, 62052299, 62975888, 63615719, 64461181, 65711824, 66872802, 67506750, 67926501, 68684318, 69744488, 70673792, 71374460, 72092487, 72892650, 73661878, 74502416, 75585712, 76698892]
12190G6698892P83737O05849R51228J374597J336749J119428J306002J730475
12182H5906957J759533J416120J373787J838146K225882K114817J835260J855148
12174A00325650K121882K321723K373395K353959K249043K066770J978055K103412
12166A17893889K310859K383648K257099K007568J762401J659692J715568J729309
12158A33720033J536924J315059J331457J441067J247949Q00094O28988R35578
12150A42957149J233291J083293P32444O45409P92645Q55960Q38956R72146J209794
12141A51321087J319207J345525J507953J724510J734422J647808J848515K315903
12133A64764930K574851K440841K295836K419206K545849K397629K205959K292841
$$ y = [76698892, 77482629, 78088478, 79039706, 80414303, 81751052, 82870480, 84176482, 85906957, 87666490, 89082610, 90456397, 92294543, 94520425, 96635242, 98470502, 100325650, 102447532, 104769255, 107142650, 109496609, 111745652, 113812422, 115790477, 117893889, 120204748, 122588396, 124845495, 126853063, 128615464, 130275156, 131990724, 133720033, 135256957, 136572016, 137903473, 139344540, 140592489, 141392583, 142021571, 142957149, 144190440, 145273733, 146006177, 146651586, 147444231, 148300191, 149139147, 150111293, 151321087, 152640294, 153985819, 155493772, 157218282, 158952704, 160600512, 162449027, 164764930, 167339781, 169780622, 172076458, 174495664, 177041513, 179439142, 181645101, 183937942]
12125A83937942K472240K336184J917844J602643J508749J407734J195856J000576
12117A97379768Q22984N06755J14214q4680r4809k52659o53085r39255q88860
12108A95910373q00068r77749j209795j166175j009253j103878j327050j231835
12100A87084570q20374n72717o61855p03284m36101j26333n0788n2921P6218J91976
12090A83928391J35395J16574L49900O11852O05715N06052O49330Q89976Q17444
12081A88610629N03089M45010P59636R92882Q47543N87052N33822O15523O38844
12072A94534030O32706O70955O71266O05777O25388P53379P42829M81131K63304
12063A99980765L85651O91918Q07581O53729M64880M29159N35855O67919O76309
$$ y = [183937942, 186410182, 188746366, 190664210, 192266853, 193775602, 195183336, 196379192, 197379768, 198202752, 198709507, 198823721, 198739041, 198644232, 198391573, 197738488, 196799233, 195910373, 195110305, 194132556, 192922761, 191756586, 190747333, 189643455, 188316405, 187084570, 186264196, 185691479, 185029624, 184326340, 183890239, 183763906, 183713118, 183660197, 183736415, 183928391, 184063786, 184180360, 184530260, 185142112, 185747827, 186253879, 186903209, 187793185, 188610629, 189113718, 189558728, 190318364, 191311246, 192158789, 192745841, 193279663, 193895186, 194534030, 195166736, 195837691, 196508957, 197114734, 197740122, 198493501, 199236330, 199717461, 199980765, 200366416, 201058334, 201865915, 202519644, 202984524, 203413683, 203949538, 204617457, 205293766]
12054B05293766M89183K61914K36492L68364L65972K02948K12804M81338N85897
12045B08498678K65962q1050j6422K26090J95625N6490K93127P89962R45010O60495
12035B11833967M96648P46557J030372J006222Q87773R82132J205501J348303
12027B19537475J422461J487546J481630J431808J480999J533355J264772O68017
12019B30308063J64024l6583k30187o37427j017489j183997j404082j871134k254275
12010B21836913k264065k229921k541252k894290k755880k296050k142261k366537
12002B02346657k449211k204146k014315k074401k080493j846591j626374j592386
11994A86458740j528498j303201j171213j307152j452854j345123j145792j129392
$$ y = [205293766, 205782949, 206044863, 206281355, 206649719, 207015691, 207218639, 207431443, 207912781, 208498678, 208764640, 208683590, 208667168, 208893258, 209088883, 209145373, 209438500, 210228462, 211173472, 211833967, 212330615, 213077172, 214107544, 215113766, 216001539, 216983671, 218189172, 219537475, 220959936, 222447482, 223929112, 225360920, 226841919, 228375274, 229640046, 230308063, 230472087, 230435504, 230205317, 229567890, 228550401, 227366404, 225962322, 224091188, 221836913, 219572848, 217342927, 214801675, 211907385, 209151505, 206855455, 204713194, 202346657, 199897446, 197693300, 195678985, 193604584, 191524091, 189677500, 188051126, 186458740, 184930242, 183627041, 182455828, 181148676, 179695822, 178350699, 177204907, 176075515]
11986A76075515j237528j253475j176273j135736j145438j188725j338681j559011
11978A66040648j611384j408884j240484j381691j690146j854451j833395j763441
11970A53256772j650590j488546j480545j751689j990827j810196j377139j230873
11962A40476367j479267j652816j448448j154246j125190j236924j173282r69607
11954A30236587q99802r74400r25678o74441m81606n40830o68910n76320l03433
11945A24191167j70370l13049m80033l87315j18392J1970q2763j73708j09001
11936A22368506l6491j04282j68943l2193J85858J96375K526q7310P1002K55991
11926A22651039K42561J21754J08432K15786L03085L24643L46626L87353M13475
$$ y = [176075515, 174837987, 173584512, 172408239, 171272503, 170127065, 168938340, 167599659, 166040648, 164429264, 163020380, 161779896, 160398205, 158708059, 156853608, 155020213, 153256772, 151606182, 150117636, 148637091, 146885402, 144894575, 143084379, 141707240, 140476367, 138997100, 137344284, 135895836, 134741590, 133616400, 132379476, 131206194, 130236587, 129336785, 128362385, 127436707, 126762266, 126280660, 125739830, 125070920, 124494600, 124191167, 124020797, 123707748, 123227715, 122840400, 122722008, 122733978, 122651215, 122477507, 122368506, 122332015, 122227733, 122058790, 122026597, 122212455, 122408830, 122411356, 122324046, 122395048, 122651039, 122893600, 123015354, 123123786, 123339572, 123642657, 123967300, 124313926, 124701279, 125114754]
11917A25114754M56758N68438O64074N81332L37461J84813L13148N89663P17955
11908A29528396O15653M95589N48229O81420O78643N25667M23305M91341O22647
11899A34610890O74172O53215O34436O32416O69191Q29431J085669J189590R62725
11890A41941735O33210O19888R63930J240277J128562Q29092P40600R12206J047930
11881A50057430R63003P91882P34966P97593Q54086Q41833P95904P55362P25335
11872A57317394P18906P70272Q86676J019286J106438J133530J132266J138950
11864A65223718J184923J305108J493376J655208J688404J627386J614044J701482
11856A77493649J809865J918337K123845K400590K505686K331295K172351K354004
$$ y = [125114754, 125571512, 126139950, 126804024, 127385356, 127722817, 127907630, 128220778, 128810441, 129528396, 130144049, 130639638, 131187867, 131869287, 132547930, 133073597, 133496902, 133988243, 134610890, 135285062, 135938277, 136572713, 137205129, 137874320, 138703751, 139789420, 140979010, 141941735, 142574945, 143194833, 144158763, 145399040, 146527602, 147356694, 148097294, 149009500, 150057430, 151020433, 151812315, 152547281, 153344874, 154198960, 155040793, 155836697, 156592059, 157317394, 158036300, 158806572, 159693248, 160712534, 161818972, 162952502, 164084768, 165223718, 166408641, 167713749, 169207125, 170862333, 172550737, 174178123, 175792167, 177493649, 179303514, 181221851, 183345696, 185746286, 188251972, 190583267, 192755618, 195109622]
11848A95109622K716454K821311K611303K461386K550079K622489K513551K465967
11840B15872162K673833K894545K850808K710190K784845K995567L044294K944306
11832B38770550K953480L091562L146758L101886L140821L255846L253787L151460
11824B63866150L157625L244244L163871K942741K897422L052775L022035K655847
11816B88002710K343669K397739K561379K460809K174600J986392J898024J784901
11808C05610223J744971J862816J877413J550563J161912J138628J347805J296653
11800C17590984R46083P39775Q11514P69769M21955J52677L00986O04548O01083
11791C22939374K68991n3787j59385r1847M0369J19868K8946j91876l29029l02283
$$ y = [195109622, 197826076, 200647387, 203258690, 205720076, 208270155, 210892644, 213406195, 215872162, 218545995, 221440540, 224291348, 227001538, 229786383, 232781950, 235826244, 238770550, 241724030, 244815592, 247962350, 251064236, 254205057, 257460903, 260714690, 263866150, 267023775, 270268019, 273431890, 276374631, 279272053, 282324828, 285346863, 288002710, 290346379, 292744118, 295305497, 297766306, 299940906, 301927298, 303825322, 305610223, 307355194, 309218010, 311095423, 312645986, 313807898, 314946526, 316294331, 317590984, 318537067, 319276842, 320088356, 320858125, 321280080, 321432757, 321733743, 322338291, 322939374, 323208365, 323154578, 322995193, 322903346, 322943715, 323063583, 323092529, 322900653, 322571624, 322269341]
11781C22269341l15423n29164p77011q23717p38715p69083r61783j148934j225140
11772C14980371j227010j199654j165719j169179j204570j185124j110119j138915
11764C05580081j344984j541728j548358j498204j661336k061453k488201k804440
11756B90631377l031223l213802l409558l714566m095906m316370m253973m151210
11748B60444769m265582m423627m281887l921895l757768l875235l912687l667286
11740B28338802l383853l294983l272018l143315l018784l046301l116587l072769
11732B02990192l002222l061552l169014l117775k897365k699644k664575k760756
11724A79617289k862723k858370k740877k620506k554892k418283k125699j906676
$$ y = [322269341, 321953918, 321424754, 320647743, 319824026, 319085311, 318316228, 317354445, 316205511, 314980371, 313753361, 312553707, 311387988, 310218809, 309014239, 307829115, 306718996, 305580081, 304235097, 302693369, 301145011, 299646807, 297985471, 295924018, 293435817, 290631377, 287600154, 284386352, 280976794, 277262228, 273166322, 268849952, 264595979, 260444769, 256179187, 251755560, 247473673, 243551778, 239794010, 235918775, 232006088, 228338802, 224954949, 221659966, 218387948, 215244633, 212225849, 209179548, 206062961, 202990192, 199987970, 196926418, 193757404, 190639629, 187742264, 185042620, 182378045, 179617289, 176754566, 173896196, 171155319, 168534813, 165979921, 163561638, 161435939, 159529263]
11716A59529263k034681k306987k218085j735451j425964j602171j835347j668526
11708A44702051j357512j401207j673740j627329j197398q98357j014990j235282
11700A34296236j208753j042559j049768j285796j518657j514204j258901r84583
11692A24433015r61550j185190j363809j320226j223497j253018j271443j102220
11684A14752062r00360q98491r81966r08329p72658q18925r44652q79214p29406
11675A06918061q09906j012565r32383o02548m84865o82124p97792o84155o67322
11666A00244401q51422q79017o45275n71061q17794q99874n22285j69940l27014
11657I4560719o82730p19085n72292o29508p13338m32502k7701p4721n22172p73925
$$ y = [159529263, 157494582, 155187595, 152969510, 151234059, 149808095, 148205924, 146370577, 144702051, 143344539, 141943332, 140269592, 138642263, 137444865, 136546508, 135531518, 134296236, 133087483, 132044924, 130995156, 129709360, 128190703, 126676499, 125417598, 124433015, 123471465, 122286275, 120922466, 119602240, 118378743, 117125725, 115854282, 114752062, 113851702, 112953211, 111971245, 111062916, 110290258, 109471333, 108526681, 107647467, 106918061, 106108155, 105095590, 104163207, 103560659, 103075794, 102393670, 101595878, 100911723, 100244401, 99392979, 98513962, 97868687, 97297626, 96479832, 95579958, 95057673, 94887733, 94560719, 93877989, 93158904, 92586612, 91957104, 91243766, 90811264, 90783563, 90708842, 90186670, 89412745]
11647H9412745o30674m43992l93589l07549j96612k89067m87477m39281k17682
11638H6006822k78456o26510p02397l07637J1864j77853n36664n38551k54740
11629H2595878j16174k31758l61816l56694k79983k33500k88170m49320n56395
11620G9722068m17447j41653o6944k46008l34864j57348j9511k09086n07185n22388
11610G7099634k75668j19754k19582m01294m36831k68661k0416Q3456q9663l82155
11600G4969066m88055l54648k38610k94765l65455k88355j46655p2723n8032r8265
11590G2563503k64294m84148n28378l66072k57140l40393m30154l80667l27155
11581F9185102l84229m39085m31790m87620n84958m94204k56032k57502n66042
$$ y = [89412745, 88782071, 88338079, 87944490, 87636941, 87440329, 87151262, 86663785, 86224504, 86006822, 85728366, 85101856, 84399459, 84091822, 84103686, 83925833, 83389169, 82850618, 82595878, 82479704, 82247946, 81886130, 81529436, 81249453, 81015953, 80727783, 80278463, 79722068, 79304621, 79162968, 79096024, 78850016, 78515152, 78357804, 78338293, 78129207, 77622022, 77099634, 76823966, 76704212, 76484630, 76083336, 75646505, 75377844, 75357428, 75440884, 75351221, 74969066, 74481011, 74126363, 73887753, 73592988, 73227533, 72939178, 72792523, 72719800, 72661768, 72563503, 72299209, 71815061, 71286683, 70920611, 70663471, 70323078, 69892924, 69512257, 69185102, 68800873, 68361788, 67929998, 67442378, 66857420, 66363216, 66107184, 65849682, 65283640]
11572F5283640p01208m19348j79139l68005o15413m60156j91314l18210o24821
11563F1406026n51778k18357k17672n69364p22256n27598l86363m27346l48173
11554E7437119j48419k29508o07868p67792n08098k54998l03253l96600l21048
11545E3899535k92185m51575n44049m11680l04842m06550n14621m60720l93005
11536E0120308m12781l86852l12556l81133n17252m06429j36672j77907n30487
11527D6858239o14748k78545j24591m46610o62777l39979J6470j44224m68248
11518D3794987l92902j42414k12394m24129l41351j35878j85199k78542r9037
11509D1583141j0664m03064p30231l01175L72718K50045m92750p14376j98982
$$ y = [65283640, 64582432, 64163084, 63983945, 63615940, 63000527, 62540371, 62349057, 62030847, 61406026, 60854248, 60635891, 60418219, 59848855, 59126599, 58599001, 58212638, 57785292, 57437119, 57288700, 57059192, 56451324, 55683532, 55175434, 54920436, 54617183, 54220583, 53899535, 53607350, 53155775, 52611726, 52200046, 51895204, 51488654, 50974033, 50513313, 50120308, 49707527, 49320675, 49008119, 48626986, 48109734, 47703305, 47566633, 47388726, 46858239, 46243491, 45964946, 45840355, 45393745, 44730968, 44390989, 44407459, 44263235, 43794987, 43402085, 43259671, 43047277, 42623148, 42281797, 42145919, 41960720, 41682178, 41583141, 41572477, 41169413, 40439182, 40138007, 40510725, 40760770, 40268020, 39553644, 39354662]
11500C9354662J07582j67149k89301P0577J96598k70392n77290j98163K18803
11491C8445927L5057k82436j28252J11080j25715m29395j60367L08226K04050
11482C7978175k68861l03861Q3057J42779k42839l89477k7354L07124K36353K8787
11472C7543883o2071j64125k80488j37630K15406L16354N8844p9058J34966K61385
11462C7807466k2017k93374o2206L83314L97196k8426k81915n3492K94448L37559
11452C8478553J45101M9403J37754K13148J52717P6227J20143K09482J88713R0893
11442C9862134Q3797J68622J69572O9950Q2428K60458L40316J80060M8904J79592
11432D1445833L29991J89721l5717N4047L32341L21971J8035q5677J62868L30892
$$ y = [39354662, 39462244, 39295095, 39005794, 39076371, 39272969, 39002577, 38425287, 38227124, 38445927, 38480984, 38198548, 38070296, 38181376, 38055661, 37626266, 37465899, 37774125, 37978175, 37709314, 37405453, 37488510, 37631289, 37388450, 36998973, 36971619, 37278743, 37515096, 37543883, 37481812, 37317687, 37037199, 36899569, 37114975, 37431329, 37490173, 37411115, 37546081, 37807466, 37785449, 37492075, 37429869, 37813183, 38210379, 38181953, 37900038, 37846546, 38140994, 38478553, 38623654, 38673057, 38810811, 39023959, 39176676, 39252903, 39373046, 39582528, 39771241, 39862134, 39945931, 40114553, 40284125, 40354075, 40436503, 40696961, 41037277, 41217337, 41266241, 41445833, 41775824, 41965545, 41929828, 41983875, 42316216, 42638187, 42656222, 42570545, 42733413, 43064305]
11422D3064305J58193l5581M1182J77865J28499P0477K02132L01396J34802m1790
11412D4201480J13539L92680L39477K2300n1335K44676M54155K59229m8378k9720
11402D5898103K76204M51246K79855J755k3221K25775M08865K80287M1361O6645
11392D7906875L41695M63839K55664L7351J08595K91405K78788J55228J94888
11383E0034328L45888L33004J53254N4860R5595J29794J76674L62321N21951L49476
11373E2557145j3196n7314K93349N00831K61683l1J48988M30383L53267N6419
11363E4531524M7203L19718L82332J14575l7973J68849L86197K81630O6451R0125
11353E6350631K68044K91433J66847J51804K82003L42928K75781K60467L51976
$$ y = [43064305, 43222498, 43186917, 43228099, 43405964, 43534463, 43604940, 43807072, 44108468, 44243270, 44201480, 44315019, 44707699, 45047176, 45069476, 45018141, 45262817, 45716972, 45976201, 45927823, 45898103, 46174307, 46625553, 46905408, 46907163, 46883942, 47109717, 47518582, 47798869, 47840230, 47906875, 48248570, 48712409, 48968073, 49005424, 49114019, 49405424, 49684212, 49839440, 50034328, 50380216, 50713220, 50866474, 50921334, 51016929, 51146723, 51323397, 51685718, 52207669, 52557145, 52543949, 52486635, 52779984, 53280815, 53542498, 53542467, 53691455, 54121838, 54475105, 54531524, 54578727, 54898445, 55280777, 55395352, 55357379, 55526228, 55912425, 56194055, 56260506, 56350631, 56618675, 56910108, 57076955, 57228759, 57510762, 57853690, 58129471, 58389938, 58741914]
11344E8741914L49032J46991k9279P1137L44954M55419K66255j6151j22288k49
11334F0207735K08906L60504M01033L41693K32678J59946J86506K61640K51294
11325F2611935J19254K2128J21878L34026M07138K72952J46459J93811K81753
11316F4511334K23136J16535J93543M09707M77215L10015J49150J72938K52410
11307F6815983K19200J31731J08473J09255P3859R2005K25240L23807K46735J19356
11297F8465644J35470K41334K72815K69431L53970M19553K84617Q2035J07683
11288G0632552L06364L26019J23078O9947L31576N74169N17485L77179M52374
11279G3710743O10171N55838L74420L93609O34256P84602O87521N26472N07505
$$ y = [58741914, 59090946, 59237937, 59208658, 59279795, 59624749, 60080168, 60346423, 60330272, 60207984, 60207735, 60416641, 60777145, 61178178, 61519871, 61752549, 61912495, 62099001, 62360641, 62611935, 62731189, 62753317, 62875195, 63209221, 63616359, 63889311, 64035770, 64229581, 64511334, 64734470, 64851005, 65044548, 65454255, 65931470, 66241485, 66390635, 66563573, 66815983, 67035183, 67166914, 67275387, 67384642, 67458501, 67550506, 67775746, 68099553, 68346288, 68465644, 68601114, 68842448, 69115263, 69384694, 69738664, 70158217, 70442834, 70524869, 70632552, 70938916, 71264935, 71388013, 71457960, 71789536, 72363705, 72881190, 73258369, 73710743, 74320914, 74876752, 75251172, 75644781, 76279037, 77063639, 77751160, 78277632, 78785137]
11270G8785137O12338P02945O83443N44208L93377M18595O67839R13010Q95864
11261H4616756O72135N44789O77972R30612J064181R94171Q48164Q50450J096318
11252I2295548J398174J483687J394157J462926J784441K004897J884093J760589
11244A05468512K072761K646586K941826K889291K955272L369932L826604M079567
11236A30250351M352445M912892N629859O235812O734069P261601P769679Q106077
11228A81252785Q237731Q143924P635837O538796M983626L317619J761007K80594
11220B22151919j238968k783513m128704m973631n274948n417991n837063o454183
11212A86042918o773365o596794o311168o290769o347991o069641n461109m910825
$$ y = [78785137, 79397475, 80100420, 80783863, 81328071, 81721448, 82140043, 82807882, 83720892, 84616756, 85288891, 85833680, 86511652, 87442264, 88506445, 89500616, 90348780, 91199230, 92295548, 93693722, 95177409, 96571566, 98034492, 99818933, 101823830, 103707923, 105468512, 107541273, 110187859, 113129685, 116018976, 118974248, 122344180, 126170784, 130250351, 134602796, 139515688, 145145547, 151381359, 158115428, 165377029, 173146708, 181252785, 189490516, 197634440, 205270277, 211809073, 216792699, 220110318, 221871325, 222151919, 220912951, 218129438, 214000734, 209027103, 203752155, 198334164, 192497101, 186042918, 179269553, 172672759, 166361591, 160070822, 153722831, 147653190, 142192081, 137281256]
11204A37281256m632190m460665m176894l777388l401050l149571l004889k854104
11196A07824505k624860k406085k321048k287951k113679j843012j721748j736881
11188I0769241j562418j140619r09194j138151j422018j263138q49138p27010
11180H1757555r17571r45473o68592m70636n68973o88964n91615m45719m45344
11171G6014668m54071l02318j34367j71640l34465l63059j99151m2033p6865k66419
11161G3670280l87642k56998L2368J69208L0126j09492K4798K62603K65938J04832
11151G3806021J21554K99125K92774J14196J89715N76247P33167L88370N8415
11142G6579584K59387O92290P67716N55749N75584Q82234J034123Q83910P65917
$$ y = [137281256, 132649066, 128188401, 124011507, 120234119, 116833069, 113683498, 110678609, 107824505, 105199645, 102793560, 100472512, 98184561, 96070882, 94227870, 92506122, 90769241, 89206823, 88066204, 87157010, 86018859, 84596841, 83333703, 82484565, 81757555, 80839984, 79894511, 79225919, 78755283, 78186310, 77497346, 76905731, 76460012, 76014668, 75560597, 75258279, 75123912, 74952272, 74617807, 74254748, 74055597, 74013564, 73936699, 73670280, 73282638, 73025640, 73058008, 73227216, 73257342, 73147850, 73172648, 73435251, 73701189, 73806021, 73927575, 74226700, 74519474, 74633670, 74823385, 75399632, 76132799, 76521169, 76579584, 76838971, 77531261, 78298977, 78854726, 79430310, 80312544, 81346667, 82230577, 82996494]
11133H2996494Q64798R70619R70580J069375J345735J534266J466232J357980
11125I2576079J430556J557738J532874J416908J367847J338381J194537R76204
11117A03391124Q16635P33405O90335P31359Q64007R47951R00066Q75873J029386
11108A10980141J228186J268662J259434J468341J837724K016461J923121J912033
11100A23894103K228138K625051K764469K728767K830153L103056L341370L527458
11092A47042565L832959M218681M448451M575494M998628N849070O700379P167906
11084A88834133P478488Q093501R012860R852766J0434596J0847959J1016335
11077B55570638J0663973R728932Q402449O742531M678878K448068N41621r25650
$$ y = [82996494, 83861292, 84831911, 85802491, 86871866, 88217601, 89751867, 91218099, 92576079, 94006635, 95564373, 97097247, 98514155, 99882002, 101220383, 102414920, 103391124, 104207759, 104941164, 105631499, 106362858, 107226865, 108174816, 109074882, 109950755, 110980141, 112208327, 113476989, 114736423, 116204764, 118042488, 120058949, 121982070, 123894103, 126122241, 128747292, 131511761, 134240528, 137070681, 140173737, 143515107, 147042565, 150875524, 155094205, 159542656, 164118150, 169116778, 174965848, 181666227, 188834133, 196312621, 204406122, 213418982, 223271748, 233706344, 244554303, 255570638, 266234611, 275963543, 284365992, 291108523, 295787401, 298235469, 298777090, 297851440]
11069B97851440k334657l850736n061797n619176n803754o068674o374614o408287
11061B56329745o173850n902049n570902m975039m150942l335635k619710k000600
11053B21601018j611205j489534j298948p43391j02089J69030K20371N72427J176065
11044B18493744J438950J268039J315485J918963K523317K587705K437982K657112
11036B34641297L127691L332110L263563L347002L630097L733878L584198L559957
11028B62219793L803859L938302L689446L352417L332154L525917L501233L129924
11020B90493045K722653K557850K540632K412998K130488J870543J717071J518788
11012C07964068J139755P15234M98100N14686N56525M91331L80016K76230J35101
$$ y = [297851440, 295516783, 291666047, 286604250, 280985074, 275181320, 269112646, 262738032, 256329745, 250155895, 244253846, 238682944, 233707905, 229556963, 226221328, 223601618, 221601018, 219989813, 218500279, 217201331, 216457940, 216355851, 216524881, 216745252, 217317679, 218493744, 219932694, 221200733, 222516218, 224435181, 226958498, 229546203, 231984185, 234641297, 237768988, 241101098, 244364661, 247711663, 251341760, 255075638, 258659836, 262219793, 266023652, 269961954, 273651400, 277003817, 280335971, 283861888, 287363121, 290493045, 293215698, 295773548, 298314180, 300727178, 302857666, 304728209, 306445280, 307964068, 309103823, 309819057, 310317157, 310831843, 311388368, 311879699, 312259715, 312535945, 312671046]
11003C12671046k5652r6124p8946j04034j74053j56001j05064k66070o05351p23498
10993C10336253m90060l74804p68991j330742j501729j395464j565999k052066
10985C00856398k339630k287268k385995k904574l419097l533473l524981l822111
10977B76639269m260989m394676m272756m343076m677930m844684m608784m307593
10969B40928781m341043m613624m721348m512041m227831m148716m270347m362550
10961B05731281m257125m015021l808995l694894l580776l427576l354875l445749
10953A76146270l535451l363330k940063k605092k633738k882866k946937k645224
10945A52593569k235886k094350k264036k440266k378928k167452k018277j942311
$$ y = [312671046, 312645394, 312549270, 312470324, 312366290, 312192237, 312036236, 311931172, 311665102, 311059751, 310336253, 309846193, 309471389, 308702398, 307371656, 305869927, 304474463, 302908464, 300856398, 298516768, 296229500, 293843505, 290938931, 287519834, 283986361, 280461380, 276639269, 272378280, 267983604, 263710848, 259367772, 254689842, 249845158, 245236374, 240928781, 236587738, 231974114, 227252766, 222740725, 218512894, 214364178, 210093831, 205731281, 201474156, 197459135, 193650140, 189955246, 186374470, 182946894, 179592019, 176146270, 172610819, 169247489, 166307426, 163702334, 161068596, 158185730, 155238793, 152593569, 150357683, 148263333, 145999297, 143559031, 141180103, 139012651, 136994374, 135052063]
10937A35052063j805742j637662j638547j835020j949098j754361j409523j253990
10929A21768120j356609j464753j380045j191086j090455j120625j185869j201028
10921A11777650j131299r71286p93532p51656r04169j068255r97224p13989n14610
10912A03931630n85292p66101p97651o64470n38520m88226m44998m04880m38000
10903I8803492m95780m37268k94177k82004m56222n78997m68122k81071k71281
10894I5238570m19693n08767m44898l08054j74019q3675j12138k70260l91707
10885I2525359l05986q7437L0080n5060k43053l83708l64471j59708N7154M008
10875I1017178l13398m81969k21730J51075J52489j48568k78651j23145k8826
$$ y = [135052063, 133246321, 131608659, 129970112, 128135092, 126185994, 124431633, 123022110, 121768120, 120411511, 118946758, 117566713, 116375627, 115285172, 114164547, 112978678, 111777650, 110646351, 109675065, 108881533, 108129877, 107225708, 106157453, 105160229, 104446240, 103931630, 103346338, 102580237, 101782586, 101118116, 100579596, 100091370, 99646372, 99241492, 98803492, 98307712, 97870444, 97576267, 97294263, 96838041, 96259044, 95790922, 95509851, 95238570, 94818877, 94310110, 93865212, 93557158, 93383139, 93299464, 93187326, 92917066, 92525359, 92219373, 92131936, 92162016, 92106956, 91863903, 91480195, 91115724, 90956016, 91013170, 91017178, 90703780, 90221811, 90000081, 90151156, 90303645, 90155077, 89876426, 89753281, 89724455]
10866H9724455j45352k03913o7642O255j49259l15380l01579k40935k39403j49752
10856H7917495L9291K1243k90373m63400j88077J68274J14722j90364k50811n2654
10846H6825346J4335j07161r4516J08525J78077n66j41274o3541N3104M9616K8468
10835H6850413P6329R7885O2700R3968J86085J56420Q246O317K26846L70261K44522
10824H8379992J20516L08757O23028O22607K77337M2987K49291O78440Q70073
10815I2173028O99352M91027N66579Q26623R17834P52339O32262P92296J066876
10806I8918216J188206J186751J237787J308348J283202J282262J468403J658912
10798A09532087J574782J411227J638208K192515K430025K064887J628041J690886
$$ y = [89724455, 89579103, 89375190, 89307548, 89313803, 89164544, 88849164, 88547585, 88306650, 88067247, 87917495, 87956786, 87978029, 87687656, 87224256, 87036179, 87204453, 87319175, 87128811, 86878000, 86825346, 86839681, 86732520, 86638004, 86746529, 86924606, 86924040, 86782766, 86719225, 86772329, 86821945, 86850413, 86926742, 87024627, 87087327, 87181295, 87367380, 87523800, 87532046, 87538363, 87765209, 88135470, 88379992, 88500508, 88809265, 89432293, 90054900, 90332237, 90375224, 90624515, 91302955, 92173028, 92872380, 93363407, 93929986, 94756609, 95674443, 96426782, 97059044, 97851340, 98918216, 100106422, 101293173, 102530960, 103839308, 105122510, 106404772, 107873175, 109532087, 111106869, 112518096, 114156304, 116348819, 118778844, 120843731, 122471772, 124162658]
10790A24162658K087659K294616K219263K165449K253910K334576K359991K437335
10782A42315457K537662K491714K297762K170057K232946K356338K347074K182246
10774A60931256K008696J960991J996623J938731J731455J569400J626065J750733
10766A75513950J688339J532842J613437J926282K086469J936464J782911J872578
10758A89953272K053783K157795K280101K436642K404125K214381K318698K855613
10750B08674410L250217L061009K758559L018125L627923L852390L611174L482777
10742B35336584L672814L811997L766712L827359L997099L887576L497954L327837
10734B65125932L467096L336113K677935K069047J978006J991018J546644Q59176
$$ y = [124162658, 126250317, 128544933, 130764196, 132929645, 135183555, 137518131, 139878122, 142315457, 144853119, 147344833, 149642595, 151812652, 154045598, 156401936, 158749010, 160931256, 162939952, 164900943, 166897566, 168836297, 170567752, 172137152, 173763217, 175513950, 177202289, 178735131, 180348568, 182274850, 184361319, 186297783, 188080694, 189953272, 192007055, 194164850, 196444951, 198881593, 201285718, 203500099, 205818797, 208674410, 211924627, 214985636, 217744195, 220762320, 224390243, 228242633, 231853807, 235336584, 239009398, 242821395, 246588107, 250415466, 254412565, 258300141, 261798095, 265125932, 268593028, 271929141, 274607076, 276676123, 278654129, 280645147, 282191791, 283050967]
10726B83050967M48876K20606k53265q52628j084983r88981j115981j606333j959590
10717B75858688j846447j564446j478922j502529j407708j269504j262666j269885
10709B64256581j036297o02115k84765k39673k63097q3845L04682O93427R42384
10700B63687282J096281J248690J426319J635949J889886K111629K158049K053204
10692B77307289K047504K268686K467756K352053K025484J786204J614092J261072
10684B93130140P78128M65016K74945j89138r56369j535157j719867j971906k621777
10675B85654015l247841l375941l324483l692489m332714m566856m267252l990942
10667B54855497m041864m092712l867934l590696l518198l518417l373368l135248
$$ y = [283050967, 283499843, 283720449, 283467184, 282614556, 281529573, 280540592, 279424611, 277818278, 275858688, 274012241, 272447795, 270968873, 269466344, 268058636, 266789132, 265526466, 264256581, 263220284, 262618169, 262333404, 262093731, 261830634, 261746789, 262051471, 262744898, 263687282, 264783563, 266032253, 267458572, 269094521, 270984407, 273096036, 275254085, 277307289, 279354793, 281623479, 284091235, 286443288, 288468772, 290254976, 291869068, 293130140, 293908268, 294373284, 294648229, 294459091, 293502722, 291967565, 290247698, 288275792, 285654015, 282406174, 279030233, 275705750, 272013261, 267680547, 263113691, 258846439, 254855497, 250813633, 246720921, 242852987, 239262291, 235744093, 232225676, 228852308, 225717060]
10659B25717060k941464k765365k544264k311688k073371j797189j598301j634440
10651B08050978j749797j585436j158912r39302j160246j451643j413825j197954
10643A97393863j190927j417692j613536j671275j674123j664836j705437j982325
10635A84473712k505457k881559k787536k528762k663488l139663l331799k999588
10627A61635860k666720k815866l183220l223257k919727k679321k641518k597837
10619A38908394k508837k571592k716281k556782k044450j699336j868440k164142
10611A20778534k066684j731829j650556j774447j664153j382658j448834j837976
10603A07221397j874223j386051j115662j503334j889568j618561j183446j358396
$$ y = [225717060, 222775596, 220010231, 217465967, 215154279, 213080908, 211283719, 209685418, 208050978, 206301181, 204715745, 203556833, 202617531, 201457285, 200005642, 198591817, 197393863, 196202936, 194785244, 193171708, 191500433, 189826310, 188161474, 186456037, 184473712, 181968255, 179086696, 176299160, 173770398, 171106910, 167967247, 164635448, 161635860, 158969140, 156153274, 152970054, 149746797, 146827070, 144147749, 141506231, 138908394, 136399557, 133827965, 131111684, 128554902, 126510452, 124811116, 122942676, 120778534, 118711850, 116980021, 115329465, 113555018, 111890865, 110508207, 109059373, 107221397, 105347174, 103961123, 102845461, 101342127, 99452559, 97833998, 96650552, 95292156]
10595I5292156j806158j670560j142410j154558j680810j722136j103635q58946
10587H4152943j407203j749146j210009o84583j105602j767751j480708n94715
10579G4153226m17724j077039j461142j135206q43340r85086r87639n69785l75205
10570F6301060p68746j075959p30023k74591m22526q56925q54379n34959n41319
10561F0241633q38757q08817l97795k49555o26208r91692q79548n36603m23972
10552E4488686n69833p17149p48069o84211n45708m46803n84395r08428j036924
10543D8247166p48425l64327l53721o79359q48815o02472k58458k65801o15506
10534D3510282q81460p79801m95543l89050n12750n85975m30141k30145k53830
$$ y = [95292156, 93485998, 91815438, 90673028, 89518470, 87837660, 86115524, 85011889, 84152943, 82745740, 80996594, 79786585, 79102002, 77996400, 76228649, 74747941, 74153226, 73735502, 72658463, 71197321, 70062115, 69218775, 68233689, 67246050, 66676265, 66301060, 65532314, 64456355, 63726332, 63451741, 63029215, 62172290, 61317911, 60782952, 60241633, 59402876, 58594059, 58196264, 57946709, 57320501, 56328809, 55449261, 54912658, 54488686, 53918853, 53201704, 52453635, 51769424, 51223716, 50776913, 50192518, 49284090, 48247166, 47498741, 47134414, 46780693, 46101334, 45252519, 44650047, 44391589, 44125788, 43510282, 42628822, 41849021, 41353478, 40964428, 40451678, 39865703, 39435562, 39205417, 38951587]
10525C8951587m60167n77771n08158m28609m70445n07242l72299j40024m7485
10516C5439387k01859m75423o52885o11115m03731k29132k48979l82250l80720
10507C1853293j86787o7046k31565m70757m32401j72393r0896l04957m60715l08698
10497B9127078j02927j70438l85810m14275k55477j62980j79748j63915j65136
10488B7126372l21876m44914k16616J72848J52398l32204o32053l67700j0370
10479B5125885r1283l66323l21299q0443j35916m35789m65335j47187L6961j33822
10469B2985449l16594k57935j77161k81038l81557k61633m5388M2784q290j08395
10459B1190242k14230k38788j07939R936j20388l37279k38215J06263J41569k63238
$$ y = [38951587, 38491420, 37913649, 37405491, 36976882, 36506437, 35999195, 35626896, 35486872, 35439387, 35237528, 34762105, 34109220, 33498105, 33094374, 32865242, 32616263, 32234013, 31853293, 31666506, 31599460, 31367895, 30897138, 30464737, 30292344, 30201448, 29896491, 29435776, 29127078, 29024151, 28853713, 28467903, 28053628, 27798151, 27635171, 27455423, 27291508, 27126372, 26804496, 26359582, 26142966, 26315814, 26468212, 26136008, 25503955, 25136255, 25125885, 25034602, 24668279, 24346980, 24266537, 24130621, 23694832, 23229497, 23082310, 23119271, 22985449, 22668855, 22410920, 22233759, 21952721, 21571164, 21309531, 21264143, 21306927, 21298637, 21190242, 20976012, 20737224, 20629285, 20639221, 20518833, 20181554, 19943339, 20049602, 20191171, 19927933]
10449A9927933n02830j92420J59938l1165m53396m13479K8132J93858j10137l77554
10439A8228880k82868r8365j10943k00896j94650j71366k07537j89791p6677l3969
10429A6661818j40148k33416j95075j24847j10231q2061k3893o5148k26427l14703
10419A5145869k20763j00692j11627j71675j41340o3692n4536q8351n3216N8187
10409A4198164J22525J5367k51784m72806l95402n1349J76058K4133k38153j79449
10399A2947304J20145J81603j07988l28852k22641n4712p9017j21187J839Q1569
10389A2418063p7739k25097p5693J45690O4099j78323j56424P8611N9079k85843
10379A1766423m50313j30112K99907L27523k6544l39544l49842j53214P697l4089
$$ y = [19927933, 19425103, 19232683, 19392621, 19361456, 18908060, 18494581, 18522713, 18716571, 18606434, 18228880, 17946012, 17847647, 17736704, 17535808, 17341158, 17169792, 16962255, 16772464, 16695787, 16661818, 16521670, 16288254, 16093179, 15968332, 15858101, 15776040, 15752147, 15686999, 15460572, 15145869, 14925106, 14824414, 14712787, 14541112, 14399772, 14336080, 14281544, 14193193, 14139977, 14198164, 14320689, 14336056, 14084272, 13611466, 13216064, 13164715, 13340773, 13364906, 13126753, 12947304, 13067449, 13249052, 13141064, 12812212, 12589571, 12534859, 12455842, 12334655, 12336494, 12418063, 12340324, 12115227, 12039534, 12185224, 12249323, 12071000, 11914576, 11993187, 12052266, 11766423, 11316110, 11185998, 11485905, 11813428, 11786884, 11447340, 11097498, 10944284, 10951981, 10917892]
10369A0917892k44991l70427j68464K44708M48538K33059j16722k09659n6624
10360A0677310K6896q4439j93703j38958k9800k5844o2910K4309J86274J69523
10350A0548658j12398l84555l27950r680J88438P4240j22143j14355K6437K0741
10340I787433j60121k40447o5154J56052J47231n4049j80726j14945l222l014
10330I269038q0993j19362r2130l9690L5979J26121J33230q242j62048j30314
10320H931589K8940N1407j04319j50296M8881J82056k4490k79880j18902L12956
10310H877942L86024o8152m62067k92783J78046L74809J74625j15699k68485k61261
10300H522999r9253J34730J99073j5829k42638j82911M2227J05497m432l7955
$$ y = [10917892, 10672901, 10302474, 10134010, 10378718, 10827256, 11060315, 10943593, 10733934, 10677310, 10704206, 10619767, 10426064, 10287106, 10257306, 10231462, 10168552, 10192861, 10379135, 10548658, 10436260, 10051705, 9723755, 9714075, 9902513, 9976753, 9854610, 9740255, 9766692, 9787433, 9627312, 9386865, 9321711, 9477763, 9624994, 9570945, 9390219, 9275274, 9272052, 9269038, 9188045, 9068683, 8976553, 8936863, 8972842, 9098963, 9232193, 9223951, 9061903, 8931589, 8960529, 9011936, 8907617, 8757321, 8806202, 8988258, 8963768, 8683888, 8564986, 8877942, 9263966, 9195814, 8733747, 8440964, 8619010, 8993819, 9168444, 9052745, 8784260, 8522999, 8423746, 8558476, 8757549, 8741720, 8499082, 8316171, 8358398, 8463895, 8459463, 8421508]
10290H421508M3858M9141l8423l0367Q1038Q5789n0921j13044j7067O2791K9662
10279H523965J387K9093L039o3491P102J87868J85097p7870k55781r8754J35930
10268H577585R1140j22197j25209J09261K18137J5949k26350j72591J17999K78481
10258H762205J15804j41268j46672Q4137J80878m0930k76527j78412R7428J36063
10248H592706o7101j23030O6390J30370j21114l36702j80204J38401K22142P9042
10238H400900l401M4329O3135J0062j4675J503o371j6862J6605L8703Q670P494
10226H550092N8463K7622j08249j30803M5850J39467n1784k37323o6759K58572
10216H485148K74133r524j62107m2651O2033k862o4263l5742n7860j37334q2459
$$ y = [8421508, 8465366, 8514507, 8476084, 8445717, 8526755, 8612544, 8561623, 8448579, 8431512, 8494303, 8523965, 8525352, 8554445, 8557484, 8493993, 8501095, 8688963, 8874060, 8796190, 8540409, 8441655, 8577585, 8668725, 8546528, 8421319, 8530580, 8748717, 8764666, 8538316, 8365725, 8483724, 8762205, 8878009, 8736741, 8590069, 8674206, 8855084, 8814154, 8537627, 8359215, 8456643, 8592706, 8525605, 8402575, 8468965, 8599335, 8478221, 8141519, 7961315, 8099716, 8321858, 8400900, 8397499, 8441828, 8504963, 8515025, 8500350, 8501853, 8495482, 8478620, 8495225, 8533928, 8542598, 8550092, 8608555, 8636177, 8527928, 8397125, 8442975, 8582442, 8530658, 8293335, 8226576, 8485148, 8759281, 8749757, 8587650, 8544999, 8607032, 8604170, 8539907, 8504165, 8446305, 8308971, 8226512]
10205H226512J03574J83995J32295J71570K68865R2881l37880m86922q3574L90257
10195H661573L76630J0762k10092j87058j61445j46721M0330K90386K64420l9021
10185H899764k25113r5184Q1286K4864j36560j07524J21838K76148J67335r3539
10175H913315k52073j89064j4097R2054Q0288L9983M2078O5115O8772L6924m9349
10164H833946j61053j61959K9183K28280J72648n3435p5518J85351L19639M0977
10154I358059l22530k78644J11601L47669J97818q2160j92399j07078N6068J89087
10144I277491J93631O8913q931P9559J51244j3456k45426j95560P4762J53978
10134I536205k8295o4272K14076L80220Q7790l27927l45854m2705R9749k6394
$$ y = [8226512, 8330086, 8514081, 8646376, 8817946, 9086811, 9179692, 8841812, 8354890, 8271316, 8661573, 9038203, 9048965, 8838873, 8651815, 8490370, 8343649, 8383979, 8674365, 8938785, 8899764, 8674651, 8579467, 8660753, 8685617, 8549057, 8441533, 8563371, 8839519, 9006854, 8913315, 8661242, 8472178, 8458081, 8550135, 8630423, 8670406, 8712484, 8777599, 8846371, 8883295, 8833946, 8672893, 8510934, 8540117, 8768397, 8941045, 8887610, 8812092, 8997443, 9317082, 9358059, 9035529, 8756885, 8868486, 9216155, 9413973, 9331813, 9139414, 9032336, 9088404, 9277491, 9471122, 9540035, 9531104, 9610663, 9761907, 9748451, 9503025, 9307465, 9382227, 9536205, 9507910, 9443638, 9657714, 10037934, 10125724, 9797797, 9451943, 9409238, 9508987, 9482593]
10124I482593p9257R5800K43475J68059J3986l4655J430O9084J91640K80417J44383
10113A0576955j49727k28094O4110L66477L06301N1797J9401K10131K50785L0575
10103A1498711j34649l4067J31199J26206M5315Q0897J73621J46622L0061k521
10093A2061395O4124Q3214J5303j940J20893K74208K79423J07743o5610l3706
10083A2905047J91906L50643K50906N5937O0438K25191K34449N2942L7614L21837
10073A4686910N00099K49437j02358p0644K17954K84944J25064J59228M36879
10064A6487513N30533K95297J21977K61021M47487M31348L78039M67197N52534
10055A9972946N26209O00943Q99675J146576J107481R84574J028182J097512R65616
$$ y = [9482593, 9403336, 9499136, 9742611, 9910670, 9924656, 9890001, 9891431, 9960515, 10152155, 10432572, 10576955, 10427228, 10199134, 10263244, 10629721, 10936022, 10987819, 11007220, 11217351, 11468136, 11498711, 11364062, 11329995, 11461194, 11587400, 11632715, 11713612, 11887233, 12033855, 12063916, 12061395, 12125519, 12208733, 12224036, 12222096, 12342989, 12617197, 12896620, 13004363, 12938753, 12905047, 13096953, 13447596, 13698502, 13754439, 13814877, 14040068, 14274517, 14327459, 14365073, 14686910, 15187009, 15436446, 15334088, 15263444, 15481398, 15766342, 15891406, 16050634, 16487513, 17018046, 17313343, 17435320, 17696341, 18143828, 18575176, 18953215, 19420412, 19972946, 20499155, 21100098, 21999773, 23146349, 24253830, 25238404, 26266586, 27364098, 28329714]
10046B8329714P30243N48739K92271j39082m81151n16108n05591p45189r81366
10037B6532480p97632l44725j32783k57978l67244k72984j03536N6719K13487
10028B4525804K57163J37004R0438K89827M84676M31570L68956N43414O46206
10019B7775058L82623J96945N98472J129825J004698M96475N34741J061092J091742
10010C4271671M76649J99675O26433Q62558L90960j5303K44534N04697J26825
10001C7688699k69419N0361N61785M28850j8221K4387L78692L73074J78685L97766
9991C9794659Q42426R76378J067302J616343K176884K140054K131682L011896
9983E3757624M030102L949677L669187N319645Q514378J0015614Q022528M510423
$$ y = [28329714, 29059957, 29608696, 29900967, 29761885, 29280734, 28764626, 28259035, 27513846, 26532480, 25734848, 25390123, 25257340, 24999362, 24632118, 24359134, 24255598, 24312317, 24525804, 24782967, 24919971, 25010409, 25300236, 25784912, 26216482, 26585438, 27128852, 27775058, 28157681, 28354626, 28953098, 30082923, 31087621, 31584096, 32118837, 33179929, 34271671, 34748320, 34947995, 35574428, 36436986, 36827946, 36812643, 37057177, 37561874, 37688699, 37419280, 37469641, 38031426, 38460276, 38442055, 38466442, 38845134, 39218208, 39396893, 39794659, 40637085, 41613463, 42680765, 44297108, 46473992, 48614046, 50745728, 53757624, 57787726, 61737403, 65406590, 70726235, 79240613, 89256227, 97278755, 101789178]
9975A01789178K038026L70141j963974m580305n987393o287060o769139p353544
9967G1255930o691049m733864l136260k791850k757175k146328j525369j660833
9959D5813202k143959k167769j785471j539423j479096j323663j137954j155342
9951C3080525j243758j121785q72355p74056q21986q13130p29427o87942o65651
9942B5350435n78594m98231n21795n50378m36934k53209j93984k84505l55817
9933B1676988k73441q3817M0337k3216j73661j53806Q9233K35021J8797k99411
9923B1053024k58994P2734J59750j64932m31642k92851n0167r7271k69491j94834
9913A9525326J6281n1839m02791n93727m14604j67607j75561l57769m51995m08135
$$ y = [101789178, 103827204, 104197345, 102233371, 97653066, 91665673, 85378613, 78609474, 71255930, 64564881, 59831017, 56694757, 53902907, 51145732, 48999404, 47474035, 45813202, 43669243, 41501474, 39716003, 38176580, 36697484, 35373821, 34235867, 33080525, 31836767, 30714982, 29842627, 29068571, 28246585, 27433455, 26704028, 26016086, 25350435, 24771841, 24273610, 23751815, 23201437, 22764503, 22511294, 22317310, 22032805, 21676988, 21403547, 21319730, 21360067, 21336851, 21163190, 21009384, 21098617, 21333638, 21352435, 21053024, 20794030, 20866764, 21026514, 20861582, 20429940, 20137089, 20086922, 19989651, 19720160, 19525326, 19541607, 19489768, 19086977, 18493250, 18078646, 17911039, 17735478, 17377709, 16925714, 16517579]
9903A6517579l61981l52197k65446n5611J21735P3648j71770l70918l56991k19042
9893A4559006j13595l8677M2038j301k63295m93522l50947L8350J85913k7206
9883A3536764j81971n1899R874k56019m53597j62465K55336J40359l82186n33250
9873A1920946p6161L42238K12884j37846j96869n0044o3280j84865r4324J74798
9863A1847477K69487R3451q9190j17004j09833j39879q0365J01792J96630O0142
9853A2032708j43144j81586p8984j5539k8493j3431L9251K2880o0973n9028O7467
9842A1581128J06445j03461l39567k15002K43081N07987K22602k65751l45066
9833A1392396N703K10712j7517k54343p0533K56680J86240j99993l14896L453
$$ y = [16517579, 16155598, 15803401, 15537955, 15482344, 15604079, 15677727, 15505957, 15135039, 14778048, 14559006, 14445411, 14406734, 14448772, 14447471, 14184176, 13690654, 13339707, 13378057, 13563970, 13536764, 13354793, 13302894, 13312768, 13056749, 12603152, 12440687, 12696023, 12836382, 12454196, 11920946, 11844785, 12187023, 12399907, 12262061, 12065192, 12015148, 11951868, 11767003, 11672679, 11847477, 12116964, 12210415, 12121225, 12004221, 11894388, 11754509, 11674144, 11775936, 11972566, 12032708, 11889564, 11707978, 11628994, 11613455, 11584962, 11571531, 11610782, 11633662, 11572689, 11513661, 11581128, 11687573, 11584112, 11244545, 11029543, 11272624, 11780611, 12003213, 11737462, 11392396, 11398099, 11608811, 11591294, 11336951, 11266418, 11523098, 11709338, 11509345, 11194449, 11197902]
9823A1197902K62944J19721j36792j40000q924j0875n4694N9497J82703O9765
9813A1541247j22152o6247J46352J46752o6452j37953L477M9343q0272p5999J56854
9802A1494950K58335K7080j98297q5950J67992K14709R7471M8689M6817l3274
9792A2038522q2467L6924J63788R7691j8720L9964J44566M7276j31327r4350J02131
9781A2343998J65123Q5124P6712J08353j6451j84497r5215J69958K16302j4978
9771A2854429j70053q3941M1818J00385K05893L06106J94258k5299k0739J56537
9761A3559394J26872q7103n0759K43136K73560n2473j47768K06432L92402L1728
9751A4495421k87038q096M13664L20003k0820J0150K22074L6388l23283j47198
$$ y = [11197902, 11460846, 11580567, 11443775, 11303775, 11294851, 11283976, 11229282, 11288779, 11471482, 11541247, 11419095, 11352848, 11499200, 11645952, 11579500, 11441547, 11445024, 11494367, 11414095, 11338096, 11494950, 11753285, 11780365, 11582068, 11496118, 11664110, 11878819, 11976290, 12024979, 12071796, 12038522, 11956055, 11992979, 12156767, 12254458, 12235738, 12275702, 12420268, 12467544, 12336217, 12241867, 12343998, 12509121, 12594245, 12670957, 12779310, 12762859, 12578362, 12483147, 12653105, 12869407, 12854429, 12684376, 12600435, 12642253, 12742638, 12948531, 13254637, 13448895, 13423596, 13402857, 13559394, 13686266, 13599163, 13548404, 13791540, 14065100, 14012627, 13864859, 14071291, 14463693, 14495421, 14208383, 14200287, 14613951, 14933954, 14913134, 14923284, 15145358, 15181746, 14858463, 14711265]
9741A4711265M48701O08638J27435k57159r1222K00855J82889M9455R1233J99138
9731A6271228K21063K52994L10023K12165N206P13K28366L50690K58898K15421
9721A8326767K75824J64558j05095j14723K27494M58611L29625J88337L00150
9712B0051548M07213L01669K20661K97104K40754j8445j4254M37190P44485M49599
9702B3117524K1935P6818L62901K97159L4157J41284N37054O36942L77963K59270
9692B5863007M39755N69181M99813M53604M71611L66838K46163M24867P77863
9683C0112702Q20643N12871L49601N39354P11103O06211M77632N77678P55500
9674C5463295P98669P51782P03704O37839O22268P65467R09695P92658N55102
$$ y = [14711265, 15159966, 15768604, 15896039, 15638880, 15547658, 15748513, 15931402, 15980857, 16072090, 16271228, 16492291, 16745285, 17055308, 17267473, 17272679, 17273392, 17501758, 17852448, 18111346, 18326767, 18602591, 18767149, 18662054, 18547331, 18774825, 19233436, 19563061, 19751398, 20051548, 20458761, 20760430, 20981091, 21278195, 21518949, 21500504, 21486250, 21923440, 22667925, 23117524, 23139459, 23216277, 23579178, 23876337, 23910494, 24051778, 24588832, 25225774, 25603737, 25863007, 26302762, 26871943, 27371756, 27825360, 28296971, 28663809, 28909972, 29334839, 30112702, 30933345, 31446216, 31795817, 32335171, 33046274, 33652485, 34130117, 34707795, 35463295, 36261964, 37013746, 37717450, 38355289, 38977557, 39743024, 40652719, 41445377, 42000479]
9665D2000479N94453Q68250R18331O84789O47413R59629J123002Q51118O02912
9656D9250376Q04749J114355J001251O10129M73989O91730R33195J028568J066537
9647E6974879J083575J066731J099566J174206J082274Q04558P09074R95982J277730
9638F6268575J152891Q73188R18436J188738J211724R55158Q11082Q86127R31066
9629G5196985R27003J112520J399234J376623J011857P80990R44076J205532J275696
9620H5230516J268761J315851J263506J054144R88578J261656J565415J514099
9612I5462526J219908J101097J289481J541232J625718J543908J431044J428582
9604A06643496J582592J753662J741673J578220J515889J641598J737464J651019
$$ y = [42000479, 42594932, 43463182, 44381513, 45066302, 45713715, 46673344, 47796346, 48647464, 49250376, 50055125, 51169480, 52170731, 52780860, 53254849, 53946579, 54879774, 55908342, 56974879, 58058454, 59125185, 60224751, 61398957, 62481231, 63285789, 63994863, 64990845, 66268575, 67421466, 68294654, 69213090, 70401828, 71613552, 72568710, 73379792, 74265919, 75196985, 76123988, 77236508, 78635742, 80012365, 81024222, 81805212, 82749288, 83954820, 85230516, 86499277, 87815128, 89078634, 90132778, 91121356, 92383012, 93948427, 95462526, 96682434, 97783531, 99073012, 100614244, 102239962, 103783870, 105214914, 106643496, 108226088, 109979750, 111721423, 113299643, 114815532, 116457130, 118194594, 119845613]
9596A19845613J531522J519128J487640J338182J262038J399697J500723J303011
9588A31187554J034468J095831J392761J470784J248901J107101J222574J336949
9580A41096923J293495J298136J451645J504373J345164J280258J488070J630806
9572A52388870J435265J256512J520497J934460J910326J568392J573162K018372
9564A65605856K271974K063651J928211K245591K588161K523232K414945K770135
9556A84411756L285413L308340K927281K803545L076847L231814L033861K831993
9548B08910850K830033K769632K526939K371959K391279K259749J866974J586589
9540B27514004J600462J535343J157653Q54380R42691J041932P16746K78429K71820
$$ y = [119845613, 121377135, 122896263, 124383903, 125722085, 126984123, 128383820, 129884543, 131187554, 132222022, 133317853, 134710614, 136181398, 137430299, 138537400, 139759974, 141096923, 142390418, 143688554, 145140199, 146644572, 147989736, 149269994, 150758064, 152388870, 153824135, 155080647, 156601144, 158535604, 160445930, 162014322, 163587484, 165605856, 167877830, 169941481, 171869692, 174115283, 176703444, 179226676, 181641621, 184411756, 187697169, 191005509, 193932790, 196736335, 199813182, 203044996, 206078857, 208910850, 211740883, 214510515, 217037454, 219409413, 221800692, 224060441, 225927415, 227514004, 229114466, 230649809, 231807462, 232661842, 233604533, 234646465, 235363211, 235641640, 235913460]
9531B35913460N27890M68783J20919M7316L58858N53819L92318K31132L32114
9522B38946609M56435L84729L21050M85854P01792O77109M24193J64565L6301
9513B42598637O7688K43576M53510N27418M14371K17857O7250Q0693L38826O88701
9503B45698527P44072L78097K2360Q9422L11183J64630k33091l18657r2092j64668
9493B46599783p10882j160028j171864j161994j497512j880366j986887k067252
9485B34962998k374499k596103k463838k387285k782439l226166l058872k493194
9477B13580602k291519k538044k588306k202884j893317j997024k144487j933379
9469A95991642j567767j484295j723611j979547k026906j873652j656308j532423
$$ y = [235913460, 236441350, 236910133, 237031052, 237078368, 237437226, 237991045, 238383363, 238614495, 238946609, 239403044, 239787773, 240108823, 240594677, 241296469, 241973578, 242397771, 242562336, 242598637, 242666325, 242909901, 243363411, 243890829, 244305200, 244523057, 244590307, 244671000, 245009826, 245698527, 246442599, 246820696, 246843056, 246932478, 247243661, 247408291, 247175200, 246856543, 246764451, 246599783, 245888901, 244728873, 243557009, 242395015, 240897503, 239017137, 237030250, 234962998, 232588499, 229992396, 227528558, 225141273, 222358834, 219132668, 216073796, 213580602, 211289083, 208751039, 206162733, 203959849, 202066532, 200069508, 197925021, 195991642, 194423875, 192939580, 191215969, 189236422, 187209516, 185335864, 183679556, 182147133]
9461A82147133j565729j666158j730540j779574j827147j758032j539509j384320
9453A68896124j441139j508111j370798j224619j364156j627469j617291j361514
9445A57381027j254557j396388j498831j445990j442622j562284j628282j605786
9437A45546287j657317j761129j736707j678303j855061k141195k111649j787715
9429A30817211j672331j894723j975324j684686j467233j651123j867480j715253
9421A16889058j447329j473198j654558j650434j558954j641070j743084j579167
9413A04141264j317159j306188j444770j388121j195365j198389j373618j413893
9405I3503761j316573j332430j406171j248652r43469r01231j167102j325463
$$ y = [182147133, 180581404, 178915246, 177184706, 175405132, 173577985, 171819953, 170280444, 168896124, 167454985, 165946874, 164576076, 163351457, 161987301, 160359832, 158742541, 157381027, 156126470, 154730082, 153231251, 151785261, 150342639, 148780355, 147152073, 145546287, 143888970, 142127841, 140391134, 138712831, 136857770, 134716575, 132604926, 130817211, 129144880, 127250157, 125274833, 123590147, 122122914, 120471791, 118604311, 116889058, 115441729, 113968531, 112313973, 110663539, 109104585, 107463515, 105720431, 104141264, 102824105, 101517917, 100073147, 98685026, 97489661, 96291272, 94917654, 93503761, 92187188, 90854758, 89448587, 88199935, 87256466, 86355235, 85188133, 83862670]
9397H3862670j181192j012483j023305j048537r73331r75386j136409j230689
9389G5281338j132131j055717j153791j225630j095602r57199j035969j179051
9381F6446248j111712r02527q32861r29248r60354q54816q13211r56227j100730
9372E7984562j008921p35521n85109p28199r66248r72030p29808n77300p41974
9363E0939452j008013j015091p58415n56557n87791p17260p78567p69847p24454
9354D4023457o20668n02865n03471o55040q20125q59974p46723n08778k33768
9345C8572045j16123k84454n60803o25024m59620l72716n01370n81421l79032
9336C4691482r8291j09717m19998o65532n83566k82932l8057K7664j2056p3741
$$ y = [83862670, 82681478, 81668995, 80645690, 79597153, 78623822, 77648436, 76512027, 75281338, 74149207, 73093490, 71939699, 70714069, 69618467, 68661268, 67625299, 66446248, 65334536, 64432009, 63599148, 62669900, 61709546, 60854730, 60041519, 59085292, 57984562, 56975641, 56240120, 55655011, 54926812, 53960564, 52988534, 52258726, 51681426, 50939452, 49931439, 48916348, 48157933, 47601376, 47013585, 46296325, 45517758, 44747911, 44023457, 43402789, 42899924, 42396453, 41741413, 40921288, 40061314, 39314591, 38805813, 38572045, 38455922, 38171468, 37610665, 36985641, 36526021, 36153305, 35651935, 35070514, 34691482, 34593191, 34483474, 34063476, 33397944, 32814378, 32531446, 32493389, 32521053, 32508997, 32435256]
9326C2435256j85365l70727m91630l73997j14341l9093k33986l59120j61815P8057
9316C0183239k8507l17655l13102k3701O1728j95065l54659j74456k0783j92003
9306B8625036l63999j58175J64478J15777k01167k60695M0656K68485J70571J0365
9296B8411332P9770K83199L75215L25822K70176K77078L19159L68713M18991M63493
9286C1592948N02467N42358N94235O93663Q70894J077883J240217J419877J783729
9277D0318271K315220K690683K572087J936781J028153R1356p45731j443878k012305
9268D6750637k430769k598166k484245k288196k208629k090777j648919j051387
9260B9949549q23660j042951j150429q22221m83614n59454p46244n84739k99258
$$ y = [32435256, 32249891, 31879164, 31387534, 31013537, 30899196, 30860103, 30626117, 30266997, 30105182, 30183239, 30154732, 29837077, 29523975, 29500274, 29562002, 29366937, 29012278, 28837822, 28817039, 28625036, 28261037, 28102862, 28267340, 28383117, 28181950, 27921255, 27961911, 28230396, 28400967, 28411332, 28491102, 28774301, 29149516, 29475338, 29745514, 30022592, 30341751, 30710464, 31129455, 31592948, 32095415, 32637773, 33232008, 33925671, 34796565, 35874448, 37114665, 38534542, 40318271, 42633491, 45324174, 47896261, 49833042, 50861195, 50952551, 50206820, 48762942, 46750637, 44319868, 41721702, 39237457, 36949261, 34740632, 32649855, 31000936, 29949549, 29125889, 28082938, 26932509, 26110288, 25626674, 25067220, 24320976, 23736237, 23436979]
$$ [...]
##END NTUPLES=NMR SPECTRUM
##END=
