##TITLE=1H ikalashn
EC-3336(2)
19.11.2024
##JCAMPDX= 6.0         $$ Bruker NMR JCAMP-DX V2.0
##DATA TYPE= NMR SPECTRUM
##DATA CLASS= NTUPLES
##ORIGIN= UXNMR, Bruker Analytische Messtechnik GmbH
##OWNER= root
$$ TOPSPIN		Version 1.3
$$ 2024-11-19 10:38:25.234 +0400  Irina@DPX200
$$ Compression mode = diff/dup
##.OBSERVE FREQUENCY= 200.131300845
##.OBSERVE NUCLEUS= ^1H
##.ACQUISITION MODE= SIMULTANEOUS
##.ACQUISITION SCHEME= undefined
##.AVERAGES= 9
##.DIGITISER RES= 18
##SPECTROMETER/DATA SYSTEM= spect
##.PULSE SEQUENCE= zg
##.SOLVENT NAME= CDCl3
##.SHIFT REFERENCE= INTERNAL, CDCl3, 1, 17.49637
##AUDIT TRAIL= $$ (NUMBER, WHEN, WHO, WHERE, WHAT)
$$ ##TITLE= Audit trail, TOPSPIN		Version 1.3
$$ ##JCAMPDX= 5.01
$$ ##ORIGIN= Bruker BioSpin GmbH
$$ ##OWNER= Irina
$$ $$ F:/spectra/data/iren/nmr/1H/4/pdata/1/auditp.txt
$$ ##AUDIT TRAIL=  $$ (NUMBER, WHEN, WHO, WHERE, VERSION, WHAT)
(   1,<2024-11-19 10:38:04.875 +0400>,<Irina>,<DPX200>,<TOPSPIN 1.3>,
      <created by zg
	started at 2024-11-19 10:37:25.625 +0400,
	POWCHK disabled, PULCHK disabled
       terminated by command 'halt'
       configuration hash MD5:
       BE 6D 3F 07 2A EA 11 49 91 17 2B D3 AF B3 58 0D
       data hash MD5: 16K
       7A 37 2E C8 6E D2 E8 9E 51 C5 30 1E A5 2F E3 58>)
(   2,<2024-11-19 10:38:05.265 +0400>,<Irina>,<DPX200>,<TOPSPIN 1.3>,
      <Start of raw data processing
       efp BC_mod = 2 LB = 0.02 FT_mod = 6 PKNL = 1 PHC0 = 319.7567 PHC1 = 6.510891 SI = 32K 
       data hash MD5: 32K
       27 26 EB 17 27 32 46 9A 7C B9 03 91 3F 52 24 34>)
(   3,<2024-11-19 10:38:14.562 +0400>,<Irina>,<DPX200>,<TOPSPIN 1.3>,
      <apk 
       data hash MD5: 32K
       77 6E F0 1D E0 2C F8 CF A7 56 9E FC 81 78 F0 F5>)
(   4,<2024-11-19 10:38:16.640 +0400>,<Irina>,<DPX200>,<TOPSPIN 1.3>,
      <abs n ABSG = 5 
       data hash MD5: 32K
       E5 C4 27 8F 9A B2 F7 76 F3 B8 1F 48 03 7C B2 53>)
$$ ##END=
$$ 
$$ $$ hash MD5
$$ $$ 8A C7 7B 45 C0 90 FC DD 6F B7 8E 72 04 D4 1F 23
##$RELAX= 
##$RELAX= 
##$RELAX= 
##$RELAX= 
##$RELAX= 
##$RELAX= 
##$RELAX= 
##$RELAX= 
##$RELAX= 
$$ Bruker specific parameters
$$ --------------------------
##$DU= <F:/spectra>
##$EXPNO= 4
##$NAME= <1H>
##$PROCNO= 1
##$TYPE= <nmr>
##$USER= <iren>
##$AMP= (0..31)
100 100 100 100 100 100 100 100 100 100 100 100 100 100 100 100 100 100 
100 100 100 100 100 100 100 100 100 100 100 100 100 100 
##$ANAVPT= -1
##$AQSEQ= 0
##$AQ_mod= 1
##$AUNM= <au_zg>
##$AUTOPOS= <>
##$BF1= 200.13
##$BF2= 200.13
##$BF3= 200.13
##$BF4= 200.13
##$BF5= 200.13
##$BF6= 200.13
##$BF7= 200.13
##$BF8= 200.13
##$BYTORDA= 1
##$CFDGTYP= 0
##$CFRGTYP= 5
##$CHEMSTR= <none>
##$CNST= (0..63)
1 1 145 1 1 1 1 1 1 1 1 1 1 1 1 1 1 1 1 1 1 1 1 1 1 1 1 1 1 1 1 1 1 1 
1 1 1 1 1 1 1 1 1 1 1 1 1 1 1 1 1 1 1 1 1 1 1 1 1 1 1 1 1 1 
##$CPDPRG= <>
##$CPDPRG1= <>
##$CPDPRG2= <>
##$CPDPRG3= <>
##$CPDPRG4= <mlev>
##$CPDPRG5= <mlev>
##$CPDPRG6= <mlev>
##$CPDPRG7= <mlev>
##$CPDPRG8= <mlev>
##$CPDPRGB= <>
##$CPDPRGT= <>
##$D= (0..63)
$$ [...]
##$SW_h= 4401.40845070422
##$TD= 16384
##$TD0= 1
##$TE= 300
##$TE2= 300
##$TE3= 300
##$TEG= 300
##$TL= (0..7)
0 120 120 120 120 120 120 120 
##$TP= (0..7)
150 150 150 150 150 150 150 150 
##$TP07= 0
##$TPNAME0= <>
##$TPNAME1= <>
##$TPNAME2= <>
##$TPNAME3= <>
##$TPNAME4= <>
##$TPNAME5= <>
##$TPNAME6= <>
##$TPNAME7= <>
##$TPOAL= (0..7)
0.5 0.5 0.5 0.5 0.5 0.5 0.5 0.5 
##$TPOFFS= (0..7)
0 0 0 0 0 0 0 0 
##$TUNHIN= 0
##$TUNHOUT= 0
##$TUNXOUT= 0
##$USERA1= <user>
##$USERA2= <user>
##$USERA3= <user>
##$USERA4= <user>
##$USERA5= <user>
##$V9= 5
##$VALIST= <valist>
##$VCLIST= <CCCCCCCCCCCCCCC>
##$VD= 0
##$VDLIST= <DDDDDDDDDDDDDDD>
##$VPLIST= <PPPPPPPPPPPPPPP>
##$VTLIST= <TTTTTTTTTTTTTTT>
##$WBST= 1024
##$WBSW= 25
##$XGAIN= (0..3)
0 0 0 0 
##$XL= 0
##$YL= 0
##$YMAX_a= 420587
##$YMIN_a= -645130
##$ZGOPTNS= <>
##$ZL1= 120
##$ZL2= 120
##$ZL3= 120
##$ZL4= 120
##$ABSF1= 17.49637
##$ABSF2= -4.496376
##$ABSG= 5
##$ABSL= 3
##$ALPHA= 0
##$AQORDER= 0
##$ASSFAC= 0
##$ASSFACI= 0
##$ASSFACX= 0
##$ASSWID= 0
##$AUNMP= <proc_1d>
##$AXLEFT= 0
##$AXRIGHT= 0
##$AXTYPE= 0
##$AXUNIT= <>
##$AZFE= 0.1
##$AZFW= 0.1
##$BCFW= 0
##$BC_mod= 2
##$BYTORDP= 0
##$COROFFS= 0
##$CY= 7568.61572265625
##$DATMOD= 1
##$DC= 0
##$DFILT= <>
##$DTYPP= 0
##$F1P= 17.9538593292236
##$F2P= -4.03888763876832
##$FCOR= 0.5
##$FTSIZE= 32768
##$FT_mod= 6
##$GAMMA= 0
##$GB= 0
##$INTBC= 0
##$INTSCL= 1.367314e-010
##$ISEN= 128
##$LB= 0.02
##$LEV0= 0
##$LPBIN= 0
##$MAXI= 945.577
##$MC2= 0
##$MEAN= 0
##$ME_mod= 0
##$MI= -402.1523
##$NCOEF= 0
##$NC_proc= -6
##$NLEV= 6
##$NOISF1= 8.587773
##$NOISF2= 6.764455
##$NSP= 0
##$NTH_PI= 0
##$NZP= 0
##$OFFSET= 17.49637
##$PC= 1
##$PHC0= 320.3553
##$PHC1= 5.485922
##$PH_mod= 1
##$PKNL= yes
##$PPARMOD= 0
##$PPDIAG= 0
##$PPIPTYP= 0
##$PPMPNUM= 100
##$PPRESOL= 1
##$PSCAL= 0
##$PSIGN= 0
##$REVERSE= no
##$SF= 200.13
##$SI= 32768
##$SIGF1= 16.12182
##$SIGF2= -4.496377
##$SINO= 3.521527
##$SIOLD= 32768
##$SREGLST= <1H.CDCl3>
##$SSB= 0
##$STSI= 32768
##$STSR= 0
##$SW_p= 4401.40845070422
##$SYMM= 0
##$S_DEV= 0
##$TDeff= 16384
##$TDoff= 0
##$TI= <>
##$TILT= no
##$TM1= 0
##$TM2= 0
##$TOPLEV= 0
##$USERP1= <user>
##$USERP2= <user>
##$USERP3= <user>
##$USERP4= <user>
##$USERP5= <user>
##$WDW= 1
##$XDIM= 32768
##$YMAX_p= 326230712
##$YMIN_p= -296195
$$ End of Bruker specific parameters
$$ ---------------------------------
##NTUPLES= NMR SPECTRUM
##VAR_NAME=  FREQUENCY,     SPECTRUM/REAL,   SPECTRUM/IMAG
##SYMBOL=    X,             R,               I
##VAR_TYPE=  INDEPENDENT,   DEPENDENT,       DEPENDENT
##VAR_FORM=  AFFN,          ASDF,            ASDF
##VAR_DIM=   32768,         32768,           32768
##UNITS=     HZ,            ARBITRARY UNITS, ARBITRARY UNITS
##FACTOR=    0.134324425510551, 1,           1
##FIRST=     4401.40845070422, 11387,        -926124
##LAST=      0,             -103381,         -1114291
##MIN=       0,             -296195,         0
##MAX=       4401.40845070422, 326230712,    0
$$ Real data points
##PAGE= N=1
##DATA TABLE= (X++(R..R)), XYDATA
$$ [...]
14811i5132M6531k0295q4952o1263K2313N9655J9241j9430l66K6452O205k2604
$$ -95132 -48601 -68896 -153848 -215111 -192798 -133143 -113902 -133332 -133698 -107246 -101041 -123645
14799a23645p392J3713j7810o1210l6508L1173M3934o465k7005J8223N2743K0921
$$ -123645 -131037 -117324 -135134 -196344 -232852 -201679 -157745 -164210 -191215 -172992 -120249 -99328
14787i9328k5392k1650R648J1561j3847k2005J339L0643M0136K0595k1908n9807
$$ -99328 -124720 -146370 -136722 -125161 -139008 -161013 -159674 -129031 -88895 -68300 -90208 -150015
14775a50015n7124r183M5579O4588L8946p557l8864l1095J619J4779r888l3855
$$ -150015 -207139 -216322 -170743 -106155 -67209 -74766 -113630 -144725 -143106 -128327 -138215 -172070
14763a72070j9374Q081K428k1438j1945K5389L1906k254j6110J9583M8149J5853
$$ -172070 -191444 -183363 -180935 -202373 -214318 -188929 -157023 -159277 -175387 -155804 -107655 -91802
14751i1802l9630m1228J7129O0635K8642n0228q6381l0814N7069O8718j3157p6614
$$ -91802 -131432 -172660 -155531 -94896 -66254 -116482 -202863 -233677 -176608 -107890 -121047 -197661
14739a97661k6960P2750Q4109q909q2199n5438R583K8222J4017J9728L4189J6130
$$ -197661 -224621 -151871 -67762 -76671 -158870 -214308 -204725 -176503 -162486 -142758 -108569 -92439
14727i2439j8226k1176n62o646m1118m6683K710N4220M4178j5350m8278r755N3706
$$ -92439 -110665 -131841 -132403 -139049 -180167 -226850 -224140 -169920 -125742 -141092 -189370 -199125 -145419
14714a45419N8996n871o3560n0584K302K7665J8150J0132N305j7494l4219m416
$$ -145419 -86423 -92294 -155854 -206438 -204136 -176471 -158321 -148189 -142884 -160378 -194597 -199013
14702a99013M2199L9879L724P892M2305J6604o4877p4642K6201R1311J0567j00479
$$ -199013 -156814 -116935 -113211 -105319 -63014 -46410 -111287 -185929 -159728 -68417 -57850 -158329
14690a58329p5738L7427O2612j7723n0443K1351O9652M014q0937o4156J7474M5536
$$ -158329 -234067 -196640 -134028 -151751 -202194 -180843 -111191 -107177 -188114 -252270 -234796 -189260
14678a89260K164k8227r66L6963L2378k933k1210k974K5886L0782R900q434o721
$$ -189260 -187096 -215323 -216289 -179326 -146948 -149881 -171091 -174065 -148179 -117397 -107497 -115931 -122652
14665a22652K889O965R308N605k2680o0818n1794J9324P5370M3783l2449n4157
$$ -122652 -119763 -112798 -103490 -97885 -120565 -181383 -233177 -213853 -138483 -94700 -127149 -181306
14653a81306q758K9594K5053J3739J5192L093k4685l2667j8736j6459j7185J8557
$$ -181306 -190064 -160470 -135417 -121678 -106486 -103393 -128078 -160745 -179481 -195940 -213125 -194568
14641a94568O0942L1291n0620o1634L0292R2632L1665n1094k2721O0536M5664
$$ -194568 -133626 -102335 -152955 -214589 -184297 -91665 -60000 -111094 -133815 -73279 -27615
14630b7615o3403j08544k4874O7647N3039k4964n5171j7641K0349J6153n370n100
$$ -27615 -91018 -199562 -224436 -156789 -103750 -128714 -183885 -201526 -181177 -165024 -170394 -175494
14618a75494J6070K1617r845m3795k3592M1382O3377n175q2373n7079M6213R1621
$$ -175494 -159424 -137807 -147652 -191447 -215039 -173657 -110280 -115455 -197828 -254907 -208694 -117073
14606a17073K2711o3192o0479P154M5283K2946j2857j9447K202L0994M3417K0731
$$ -117073 -94362 -157554 -218033 -210879 -165596 -142650 -155507 -174954 -172752 -141758 -98341 -77610
14594g7610k6593n4742l6320J286J5394O515L594R031J229j5559j0881J5058J7749
$$ -77610 -104203 -158945 -195265 -193979 -178585 -172070 -168476 -159445 -158216 -173775 -184656 -169598 -151849
14581a51849k5521o8511n0314J7885O0033L4483j1211j0184K6406K7641k6126
$$ -151849 -177370 -245881 -296195 -278310 -218277 -183794 -195005 -205189 -178783 -151142 -177268
14570a77268o5833l1964L7173O1644L1907N383P630N978j4338j8709Q033K5543
$$ -177268 -243101 -275065 -237892 -176248 -144341 -138958 -131328 -125350 -139688 -158397 -150364 -124821
14558a24821Q041p469Q541J3805l4389q6430o1168K1803N9677J8038k3250J042
$$ -124821 -116780 -124249 -115708 -101903 -136292 -222722 -283890 -262087 -202410 -184372 -207622 -206580
14546b06580M8458M8813J0365j1665n290O44j718K416R764O670J211M800L188
$$ -206580 -158122 -109309 -98944 -110609 -115899 -115255 -116973 -114557 -104793 -98123 -96912 -92112 -88924
14533h8924j1269r356K0477K6307k5767o3333k349R3301P5863n4115j24072m6265
$$ -88924 -100193 -109549 -89072 -62765 -88532 -151865 -154214 -60913 14950 -39165 -163237 -209502
14521b09502M7971K1701n5128m0600L8525M8825j1729k1740L7393M8021k9029
$$ -209502 -161531 -139830 -194958 -235558 -197033 -148208 -159937 -181677 -144284 -96263 -125292
14510a25292p8350k3884N0799N1049J1791M100J1704n731j9350L223J8576j3480
$$ -125292 -203642 -227526 -176727 -125678 -113887 -109787 -98083 -103814 -123164 -119941 -101365 -114845
14498a14845m5582k8812p372k9192l9602K1127Q3820M5562n2460q0115j7285L9160
$$ -114845 -160427 -189239 -196611 -225803 -265405 -244278 -160458 -114896 -167356 -247471 -264756 -225596
14486b25596M2414L0185R625m4623q2149k1111Q7654R8430j449o3255j8044K4311
$$ -225596 -183182 -152997 -143372 -187995 -270144 -291255 -203601 -105171 -106620 -169875 -187919 -163608
14474a63608j4790m6846O025N7019J2415n1335k1789M6966L2775l6207l7415K5907
$$ -163608 -178398 -225244 -219219 -162200 -149785 -201120 -222909 -175943 -143168 -179375 -216790 -190883
14462a90883L9003j5411l6271Q051L4742Q262m408K6506L7914J140k3596q156
$$ -190883 -151880 -167291 -203562 -195511 -160769 -152507 -156915 -130409 -92495 -91355 -114951 -123107
14450a23107q489m1685l5697L0040N7911n829n9173n407P6346N4880l7360o3107
$$ -123107 -131596 -173281 -208978 -178938 -121027 -126856 -186029 -191436 -115090 -60210 -97570 -160677
14438a60677o438K0109k0121l8314N001K9960n499j9419M1376Q4987K2172o5814
$$ -160677 -167115 -147006 -167127 -205441 -200440 -170480 -175979 -195398 -154022 -69035 -46863 -112677
14426a12677m4245N0514N9021m4038j01917k0689Q5698P6732o523k9928J6802
$$ -112677 -156922 -106408 -47387 -91425 -193342 -214031 -128333 -51601 -58124 -88052 -71250
14415g1250K8053k7063o1887k8512R622l65j6019M895J9329j3622l9105N328O6568
$$ -71250 -43197 -70260 -132147 -160659 -151037 -151402 -167421 -162526 -143197 -156819 -195924 -190596 -124028
14402a24028M8948k4587m2103J4467L9563j7520o3447j2754O8360O2046k0102
$$ -124028 -75080 -99667 -141770 -127303 -87740 -105260 -168707 -181461 -113101 -51055 -71157
14391g1157o1053j7269L1761K0982r195Q28K7516J2152l2589l6853J6962O4672
$$ -71157 -132210 -149479 -117718 -96736 -105931 -105103 -77587 -65435 -98024 -134877 -117915 -53243
14379e3243N0999k505m0726m2487j8144K0635N2782M3041j1280n4736m1556m754
$$ -53243 -2244 -4749 -45475 -87962 -106106 -85471 -32689 10352 -928 -55664 -97220 -101974
14367a01974l264k4946j3486K3395K1281k1356k9331J6771L6531j0675m2890Q671
$$ -101974 -105238 -130184 -143670 -120275 -98994 -120350 -149681 -132910 -96379 -107054 -149944 -141273
14355a41273P0665L9177m7270o8089j3657J1756l0477n7587q561O4082Q0911L3432
$$ -141273 -70608 -31431 -78701 -146790 -160447 -148691 -179168 -236755 -245316 -181234 -100323 -66891
14343f6891l4020p3310m7035L7219R7254N6383l9077o7529o461M1207J6015j7017
$$ -66891 -100911 -174221 -221256 -184037 -86783 -30400 -69477 -137006 -143467 -102260 -86245 -103262
14331a03262r91J5999j1589k9061J4780N5665J5416n3777m7013J8111L1865k1918
$$ -103262 -104253 -88254 -99843 -128904 -114124 -58459 -43043 -96820 -143833 -125722 -93857 -115775
14319a15775m0507K3296P8779L6872n4402q0276j7571M4739L3301j7564k6931
$$ -115775 -156282 -132986 -54207 -17335 -71737 -152013 -169584 -124845 -91544 -109108 -136039
14308a36039J0272J6690l9007p1983l877R2130P5256m5345j05949l0582N8669
$$ -136039 -125767 -109077 -148084 -220067 -223944 -131814 -56558 -101903 -207852 -238434 -179765
14297a79765M4125q506J1725N7639J3790q2532q4954K0112Q4466K7374n6341n9426
$$ -179765 -135640 -144146 -132421 -74782 -60992 -143524 -228478 -208366 -123900 -96526 -152867 -212293
14285b12293n631K8790L3402L4779K6148n665l3362k5313M639K2053J8568Q300
$$ -212293 -217924 -189134 -155732 -120953 -94805 -100470 -133832 -159145 -154506 -132453 -113885 -105585
14273a05585L003N836Q468n073k8174k3556J8970M5750J2505l7304l4191P230
$$ -105585 -102582 -96746 -88278 -93351 -121525 -145081 -126111 -80361 -67856 -105160 -139351 -132121
14261a32121J9138m305j2531O73k45m611K4556N4394K1211m0649l5884K4054L0365
$$ -132121 -112983 -117288 -129819 -129146 -129391 -134002 -109446 -55052 -33841 -74490 -110374 -86320 -55955
14248e5955l1418n2412K152K7879k5834n7431O396P8853O3097K171k6523m0007
$$ -55955 -87373 -139785 -137633 -109754 -135588 -193019 -186623 -107770 -44673 -42502 -69025 -109032
14236a09032o2216l6435M9482P6874k0911j08068m1596Q8386R5608r285n8823
$$ -109032 -171248 -207683 -158201 -81327 -102238 -210306 -251902 -163516 -67908 -77193 -136016
14225a36016o224L6856J3499j7420k6636m5884n3143P391Q6086P1037k0618n4907
$$ -136016 -142240 -105384 -91885 -109305 -135941 -181825 -234968 -227577 -141491 -70454 -91072 -145979
14213a45979K620M4542J5171j7213j1793j6954m1243k0480M0355M6960j3682l8040
$$ -145979 -143359 -98817 -83646 -100859 -112652 -129606 -170849 -191329 -150974 -104014 -117696 -155736
14201a55736O313K0368l5607n9763J296M7421Q888k6221J6761N5652J0203m0723
$$ -155736 -149423 -129055 -164662 -224425 -223129 -175708 -166820 -193041 -176280 -120628 -110425 -151148
14189a51148o715M1820P866m4145o621O5204M7496l0361m2915J0595K5170j2299
$$ -151148 -157863 -116043 -108177 -152322 -158943 -93739 -46243 -76604 -119519 -108924 -83754 -96053
14177i6053k3405o558k7551o0078j4201P8104Q2331j8076q7165m9842J6250L5470
$$ -96053 -119458 -126016 -153567 -213645 -227846 -149742 -67411 -85487 -172652 -222494 -206244 -170774
14165a70774K9737J9144k5643q0742n9124L7442Q8353L9003j3716Q963M2401J0478
$$ -170774 -141037 -121893 -147536 -228278 -287402 -249960 -161607 -122604 -136320 -127357 -84956 -74478
14153g4478l7632k7382N567p511l6997j5887L0374K8857r835j2998K8923N3202
$$ -74478 -112110 -139492 -133925 -141436 -178433 -194320 -163946 -135089 -144924 -157922 -128999 -75797
14141g5797K5465k7205o7877p3023l0215L0675M2099n350k3189M3248J02323M1365
$$ -75797 -50332 -77537 -145414 -218437 -248652 -217977 -175878 -181228 -204417 -161169 -58846 -17481
14129a7481q0753r9839N681P7632J9115o5481m3913M3288O2135m935m9681j6787
$$ -17481 -98234 -198073 -192392 -114760 -95645 -161126 -205039 -161751 -99616 -104551 -154232 -171019
14117a71019K2526k996n4758n1989N680M4591K5055j2182j0906K9124O1332N0604
$$ -171019 -148493 -151489 -206247 -258236 -252556 -207965 -182910 -195092 -205998 -176874 -115542 -64938
14105f4938Q005k3042j1532K2240K2997k5240o1352k6047L7763L3314l7439o0348
$$ -64938 -56933 -79975 -91507 -69267 -46270 -71510 -132862 -158909 -121146 -87832 -125271 -185619
14093a85619J3853P7152K7533o2778n8514K0684L7418l2961o6558k961O0205L8049
$$ -185619 -171766 -94614 -67081 -129859 -188373 -167689 -130271 -163232 -229790 -232751 -172546 -134497
14081a34497j2738j3230P003p719k4367N999L8905J0762l7929k6635K3421K6531
$$ -134497 -147235 -160465 -153462 -161181 -185548 -179549 -140644 -129882 -167811 -194446 -171025 -144494
14069a44494j8457l2288L756K3075l819k3672J878L7688M1490K1744L610q746
$$ -144494 -162951 -195239 -191483 -168408 -172227 -195899 -194021 -156333 -114843 -93099 -89489 -98235
14057i8235j5366r716K613R854J6862K5517Q656m6522q8264n6949J9584N5876
$$ -98235 -113601 -123317 -120704 -110850 -93988 -68471 -59815 -106337 -194601 -251550 -231966 -176090
14045a76090K8961j770M724K2488J9490J051j8516k9534j0914L7803N6460n968
$$ -176090 -147129 -148899 -144175 -121687 -102197 -101146 -119662 -149196 -160110 -122307 -65847 -71815
14033g1815q7185p2392L1246Q6626K4032n9520n1943J8249M9605J6379k7816m1653
$$ -71815 -159000 -231392 -200146 -113520 -89488 -149008 -200951 -182702 -133097 -116718 -144534 -186187
14021a86187k1820K1491N7141M1002k0261n7550l4384O84J786m93K7612M5355
$$ -186187 -208007 -186516 -129375 -88373 -108634 -166184 -200568 -199884 -198098 -198591 -170979 -125624
14009a25624J0125l2881k1248J5232R083k4257k1042R913Q929j4808J67M0347
$$ -125624 -115499 -148380 -169628 -154396 -145313 -169570 -190612 -180699 -171770 -186578 -186411 -146064
13997a46064K7238l5785m9376J6583O1153J2174n5644m0526K8514M5870p449m7800
$$ -146064 -118826 -154611 -203987 -187404 -126251 -114077 -169721 -210247 -181733 -135863 -143312 -191112
13985a91112j9081L9253N9361K5470k4722m5406k0866K2005L8174J3918j6001
$$ -191112 -210193 -170940 -111579 -86109 -110831 -156237 -177103 -155098 -116924 -103006 -119007
13974a19007j3937J0245J3732k0698o0151n8987j1728L7905M4526J4011o950K410
$$ -119007 -132944 -122699 -108967 -129665 -189816 -248803 -260531 -222626 -178100 -164089 -171039 -168629
13962a68629J0165q174j9403J2773N1914L3151k8298m9832j0529J6246j0358k5449
$$ -168629 -158464 -166638 -186041 -173268 -121354 -88203 -116501 -166333 -176862 -160616 -170974 -196423
13950a96423K7634Q4447M9504m6289q0367j7510M7375L9981M605R119L2747J7334
$$ -196423 -168789 -84342 -34838 -81127 -161494 -179004 -131629 -91648 -87043 -77924 -45177 -27843
13938b7843k2705k4086J3513K2849j7180m0665n30M8627K9676l5728n5319k957
$$ -27843 -50548 -74634 -61121 -38272 -55452 -96117 -96647 -48020 -18344 -54072 -109391 -112348
13926a12348M5122K5360k5398l3630M990L1492J2070k5245l5943p782L4257N0718
$$ -112348 -67226 -41866 -67264 -100894 -95904 -64412 -52342 -77587 -113530 -121312 -87055 -36337
13914c6337K2049k5443m3294k2410k699m816L733L9971N4404Q058m3392k2165
$$ -36337 -14288 -39731 -83025 -105435 -108134 -112950 -109217 -69246 -14842 -6784 -50176 -72341
13902g2341M4870O4420K5786N433K1100J888o4711q0632J767P8942N0476j8911
$$ -72341 -27471 36949 62735 68168 89268 91156 26445 -54187 -52420 26522 76998 58087
13890E8087p353O3723P1415k866m9792j3613L3980K8113L398O453J2810j0206
$$ 58087 50734 114457 185872 183006 133214 119601 153581 181694 185092 191545 204355 194149
13878A94149l4535k6854j1405j7737k1528J15P479l4070o9657k5889N9426P5177
$$ 194149 159614 132760 121355 103618 82090 82205 89684 55614 -14043 -39932 19494 94671
13866I4671L152n1610k1356K6258M222n5380n8186J941L8985J0453k7904j9426
$$ 94671 97823 46213 24857 51115 55337 -43 -58229 -56288 -17303 -6850 -34754 -54180
13854e4180J2370J5040j2075l0547k2637J15K3414L3053J5869j2958j3881J4265
$$ -54180 -41810 -26770 -38845 -69392 -92029 -91914 -68500 -35447 -19578 -32536 -46417 -32152
13842c2152J6263l0122n5293K099P8768O6236j6776m6834N721K9871l4062q4670
$$ -32152 -15889 -46011 -101304 -99205 -20437 45799 29023 -17811 -12090 17781 -16281 -100951
13830a00951k4845O9717O2048l5102q4145k6682N3744O8262K2761k8683n0515
$$ -100951 -125796 -56079 5969 -29133 -113278 -139960 -86216 -17954 4807 -23876 -74391
13819g4391l1156J5871M5722K6077j4090k3745k618J4525K0671K4023L918m7951
$$ -74391 -105547 -89676 -43954 -17877 -31967 -55712 -58330 -43805 -23134 889 4807 -43144
13807d3144p4256k5492M3112M4998K841J556K8077r40o0732l3108P6612J12318
$$ -43144 -117400 -142892 -99780 -54782 -51941 -50385 -22308 -23248 -83980 -117088 -40476 71842
13795G1842J6296o6461k4420M4057J3850n4295l7239L1560L5485j7820l2112l648
$$ 71842 88138 21677 -2743 41314 55164 869 -36370 -4810 30675 12855 -19257 -22905
13783b2905r36j2012K2847O4388K8908l9085k3644N0165M5291m5232p8380p241
$$ -22905 -23841 -35853 -13006 51382 80290 41205 17561 67726 113017 67785 -10595 -17836
13771a7836M7879K0140p117Q941j7585j02051r9956M6845J55390O5546r2929r6875
$$ -17836 30043 50183 43066 52007 34422 -67629 -167585 -120740 34650 100196 7267 -89608
13759h9608K4710O5313j3249m8848K4460P8655K6813m2601l5583M029M278j0717
$$ -89608 -64898 415 -12834 -61682 -37222 41433 68246 25645 -9938 -5909 -1631 -12348
13747a2348N078K2962M619j6480j575J2542j8468n2528k1681M8336O5142O140
$$ -12348 -7270 15692 20311 3831 2256 14798 -3670 -56198 -77879 -29543 35599 41739
13735D1739m7499k6262L3668M3356j6629o6259l2589M1516M6327l2834p6460l802
$$ 41739 -5760 -32022 1646 45002 28373 -37886 -70475 -28959 17368 -15466 -91926 -95728
13723i5728Q9311O3633m3627o7988K3902Q1222J3373o8158m0219L4959L0155l0788
$$ -95728 -6417 57216 13589 -54399 -30497 50725 64098 -4060 -44279 -9320 20835 -9953
13711i953k9563L3995M6824j8705o5202m1430j1379j6785j557O5677J06149N0427
$$ -9953 -39516 -5521 41303 22598 -42604 -84034 -95413 -112198 -113755 -48078 58071 108498
13699A08498m0634o3545k0911O329p142j5800M4R098j531o575K65n837k3023j3040
$$ 108498 67864 4319 -16592 -10263 -17405 -33205 -33161 -24063 -25594 -32169 -31904 -37741 -60764 -73804
13685g3804K9206N0689J5731l7546n1662k5014O358L1525O0419P5095M1585k6696
$$ -73804 -44598 6091 21822 -15724 -67386 -92400 -86042 -54517 5902 80997 122582 95886
13673I5886o7143m5850J768K7252K8078K3460Q579k4757m7678k6776J3386J4644
$$ 95886 28743 -17107 -15339 11913 39991 63451 72030 47273 -405 -27181 -13795 849
13661H49k6176m8173j9171J7662J6885j483K395J8415J3307m798m699O475j374
$$ 849 -25327 -73500 -92671 -75009 -58124 -59607 -57212 -38797 -25490 -30288 -34987 -28512 -29886
13648b9886j7838n389K7893L2777K813j0273J6124L3600l87n4554p1010m1733
$$ -29886 -47724 -53113 -25220 7557 10370 97 16221 49821 49434 -5120 -76130 -117863
13636a17863j136K5111K8828P592k0218j6764K3549N1246K7447j6311k5664l269
$$ -117863 -118999 -93888 -65060 -57468 -77686 -94450 -70901 -19655 7792 -8519 -34183 -37452
13624c7452Q450K465Q118K6874K5081n794l1953k9737j3302l76J1489K3585K4299
$$ -37452 -29002 -26537 -18419 8455 33536 27742 -4211 -33948 -47250 -47626 -36137 -12552 11747
13611A1747R948q915k6267m0031l6219o754K1168J3192j5542j5761K1035M9608
$$ 11747 21695 12780 -13487 -53518 -89737 -96491 -75323 -62131 -77673 -93434 -72399 -22791
13599b2791M0094J2029j0397k6175k7711J162L8239L2309j5055l8451j1219R137
$$ -22791 17303 29332 18935 -7240 -34951 -33789 4450 36759 21704 -16747 -27966 -18829
13587a8829j7034l7515k810L4718O924l9070p521P6693Q9115P95o8972l1736M3906
$$ -18829 -35863 -73378 -76188 -41470 -34546 -73616 -81137 -4444 84671 85466 16494 -15242 28664
13574B8664M5801k3648p5133o2086j1222L8361O0039L1067l6252p2298k2000O7403
$$ 28664 74465 50817 -24316 -86402 -97624 -59263 776 31843 -4409 -76707 -98707 -31304
13562c1304Q9909J6620o5579o6548N10N0208L2965j7656l5614M4M2506L1865k8159
$$ -31304 58605 75225 9646 -56902 -56392 -6184 26781 9125 -26489 -26445 16061 47926 19767
13549A9767o4055k0045O3285R0754L1511m2168m9759j369K9073P087k7772k9147
$$ 19767 -44288 -64333 -1048 89706 121217 79049 29290 27921 56994 64081 36309 7162
13537G162n072O757k636r658j862N799K114m85P623P483k2257o0922n7346M123
$$ 7162 2090 8847 6211 -3447 -5309 490 2604 2119 9742 17225 -5032 -65954 -123300 -119177
13523a19177P1233P8693K6341k2610k3396j388l453k3841j8518J5747K9459J845
$$ -119177 -47944 30749 57090 34480 11084 9696 6243 -17598 -36116 -20369 9090 10935
13511A0935k0504j878J8096m676k9974K670N3055K9894m5389m9761L8573Q2970
$$ 10935 -9569 -11447 6649 1973 -28001 -25331 27724 57618 12229 -37532 1041 84011
13499H4011L196q2000l8392O6471P5548n691l9850l74J533o3072p8605Q382Q4830
$$ 84011 87207 5207 -33185 33286 108834 103143 63293 62919 64452 1380 -77225 -68843 15987
13486A5987N2764k1037k9642J2472L1051K1889J8987R911k0646k9701J0489M1422
$$ 15987 68751 47714 18072 30544 61595 83484 102471 112382 91736 62035 72524 113946
13474A13946J0573k9170n897M6308M7096R8l4328m3999m5594j7830M3243O3397
$$ 113946 124519 95349 89452 135760 182856 182954 148626 104627 59033 41203 84446 147843
13462A47843j984o2731k3072M9573L2265l8234l1562L8879M0846l1120m3963K6135
$$ 147843 145859 83128 60056 109629 141894 103660 72098 110977 151823 120703 76740 102875
13450A02875M7221k4035o1316r44M7857J5198m772M6763O2102k5887q6679q491
$$ 102875 150096 126061 64745 63801 111658 126856 122084 168847 230949 205062 118383 109892
13438A09892Q9786N2420m4916l0917O4486P4816r809m1824J9470N6429R068m5638
$$ 109892 199678 252098 207182 176265 240751 315567 305758 263934 283404 339833 348901 303263
13426C03263m8674l0760j1479K7132N4912K1828k4515O584P7544O2826l2478o4807
$$ 303263 254589 223829 212350 239482 294394 316222 291707 298291 375835 438661 406183 341376
13414C41376J0983P1323L8482n437J1691K9000j0859m3971n987M6514L7001o267
$$ 341376 352359 423682 462164 456727 468418 497418 486559 442588 436601 483115 520116 513849
13402E13849j9025p350k753N210J7763m875n5263n2506K4554P7364L8040k2107
$$ 513849 494824 487474 484721 489931 507694 502819 447556 395050 419604 496968 535008 512901
13390E12901j7930J9461K8575K8388M4537L0510l0068m9392J9719P4919K9409
$$ 512901 494971 514432 543007 571395 615932 646442 616374 566982 586701 661620 691029
13379F91029k8871P015O4374K7265l5396J0243R9256O4705n2441n2166P3244J09290
$$ 691029 662158 669173 733547 760812 725416 735659 834915 899620 847179 795013 868257 977547
13367I77547j6839j10196l8686N7216K1833o1607m3985L1526L1044l2490m8906
$$ 977547 960708 850512 811826 869042 890875 829268 785283 816809 847853 815363 766457
13356G66457j3907p701k7802p078L6528K1060m4250o3327j2268K9100J3960j3174
$$ 766457 752550 744849 717047 709969 746497 767557 723307 659980 647712 676812 690772 677598
13344F77598j2704o699j3041o325K2570L4608M845l4445m3725k8698j4225P45
$$ 677598 664894 658195 645154 638829 661399 696007 700852 666407 622682 593984 579759 580504
13332E80504K8976N4333M1564p548l5388L789O4741N0393m6925j05587l8512O1772
$$ 580504 609480 663813 705377 697829 662441 666230 730971 781364 734439 628852 590340 652112
13320F52112M6385n9517r0657m376N5335R38o2305l3606J2142j8523n4410K40
$$ 652112 698497 638980 548323 543947 599282 600220 537915 504309 516451 497928 443518 443758
13308D43758O3505R962q4538n3660O0594O2341n9548j03058J713P5450N834o2224
$$ 443758 507263 517225 432687 379027 439621 501962 442414 339356 341069 416519 422353 360129
13296C60129O541R3399L4949q8060q6518K1999N7639j8963o5742j2186M3976K2937
$$ 360129 366670 460069 495018 406958 320440 342439 400078 381115 315373 303187 347163 370100
13284C70100k0568k0097m273j7281l4269j9465O126Q360o069j7158k1965j4051
$$ 370100 349532 329435 325162 307881 273612 254147 260273 268633 262564 245406 223441 209390
13272B09390J3138K9430L97l3701L801Q7183Q9991k4313j16688o1199O7491J04747
$$ 209390 222528 251958 252355 218654 222455 309638 399629 375316 258628 197429 264920 369667
13260C69667L2391k4731r525K192l7092n6584K14O1125L4784l6818m0620K8488
$$ 369667 402058 377327 367802 369994 332902 276318 276532 337657 372441 335623 295003 323491
13248C23491O1353Q009m8377k7827K5114K3226k2655l2377L750J1571l3580n5107
$$ 323491 384844 392853 344476 316649 341763 364989 342334 309957 313707 325278 291698 236591
13236B36591R46O8046N4527j5618m2387m823J6907k0985n8071l3789J7889L2466
$$ 236591 237537 305583 360110 344492 302105 297282 314189 293204 235133 201344 219233 251699
13224B51699J5233J2046K1256P948j7612j2024J7615J7028k1152l8640o099L1666
$$ 251699 266932 278978 300234 308182 290570 278546 296161 313189 292037 253397 247298 278964
13212B78964L4216K3681K5337J4496k3578m0473j055L7472P693m5079k3977N3428
$$ 278964 313180 336861 362198 376694 353116 312643 311588 349060 356753 311674 287697 341125
13200C41125O7137j4533p5983l2131M4782N0207N579o034R145j3294n5619l6590
$$ 341125 408262 393729 317746 285615 330397 380604 386183 380149 389294 376000 320381 283791
13188B83791L7414O5260J5481k0098J7076N1449M675o1341l6330N6275Q5157Q092
$$ 283791 321205 386465 401946 381848 398924 450373 455048 393707 357377 413652 498809 506901
13176E06901o6883m3176L2726N6097J7037n667K2893M5627J1114m2458m2536J1270
$$ 506901 440018 396842 429568 485665 502702 497035 519928 565555 576669 534211 491675 502945
13164E02945M7227K2990k1204k6799M437K7020K1739J0069P920M128r440j7189
$$ 502945 550172 573162 551958 525159 529596 556616 578355 588424 596344 600472 591032 573843
13152E73843k584K6801M7776M4488J9234r544k0759j1971j312K192J4782M4202
$$ 573843 571259 598060 645836 690324 709558 700014 679255 667284 665972 668164 682946 727148
13140G27148N9027K6816k7878m5769j2142K8045L8849L2973L0602K2745n43j9511
$$ 727148 786175 812991 785113 739344 727202 755247 794096 827069 857671 880416 879873 860362
13128H60362r817K2352M9085M8549J7142k4486l6657j841M0506L8178L211n097
$$ 860362 850545 872897 921982 970531 987673 963187 926530 924689 965195 1003373 1006584 1001487
13116A001487K3768L5734P980r388J8727M9034L1981q393j9483J671K6119M4636
$$ 1001487 1025255 1060989 1068969 1059581 1078308 1127342 1159323 1150930 1131447 1133118 1159237 1203873
13104A203873N1727K5077k5917m0341P241N2351L8648J2677L8995P7176M7365
$$ 1203873 1255600 1280677 1254760 1214419 1221660 1274011 1312659 1325336 1364331 1441507 1488872
13093A488872k2199l1317K6758N7061K2888l349K8423O9613O4333K9505N835J245
$$ 1488872 1466673 1435356 1462114 1519175 1542063 1538714 1567137 1636750 1701083 1730588 1736423 1737668
13081A737668J3637M4234O6902M9707J8827K8707O4409O1131K6044L4860Q9828
$$ 1737668 1751305 1795539 1862441 1912148 1930975 1959682 2024091 2085222 2111266 2146126 2235954
13070B235954J00916M4706J5351N9497Q8632L8173q372L8716J14900J08233M4033
$$ 2235954 2336870 2381576 2396927 2456424 2545056 2583229 2574857 2613573 2728473 2836706 2880739
13059B880739K8473O7404P8736M8691M2302P4217R0100P3500O5879Q1488R6538
$$ 2880739 2909212 2976616 3055352 3104043 3146345 3220562 3310662 3384162 3450041 3531529 3628067
13048C628067J17302J66193K07543J82901J16832R2459J22294J39645J21005J16213
$$ 3628067 3745369 3911562 4119105 4302006 4418838 4511297 4633591 4773236 4894241 5010454
13038E010454J43471J52383J16257P4699N8728N0651L8916L8064L8549J2749j7865
$$ 5010454 5153925 5306308 5422565 5497264 5555992 5606643 5645559 5683623 5722172 5734921 5717056
13027E717056l104L9553L9617l906j5754K0230L0143j0980k5185K9091P5226M7032
$$ 5717056 5713952 5753505 5793122 5789216 5773462 5793692 5823835 5812855 5787670 5816761 5891987 5939019
13015E939019j231N733M4743O0588O8980R9081J08659O0142J7577N7138J30661
$$ 5939019 5937788 5943521 5988264 6048852 6117832 6216913 6325572 6385714 6403291 6460429 6591090
13004F591090J33048P0275M3432Q4384J22359J12899R4073J02044J22619J43240
$$ 6591090 6724138 6794413 6837845 6922229 7044588 7157487 7251560 7353604 7476223 7619463
12994G619463J72254J91042J64558J16497J16802J70824J96684J48214R1794J11671
$$ 7619463 7791717 7982759 8147317 8263814 8380616 8551440 8748124 8896338 8988132 9099803
12984I099803J89205K32050J97194J35537J19365J59273K01628J96484J55808
$$ 9099803 9289008 9521058 9718252 9853789 9973154 10132427 10334055 10530539 10686347
12975A0686347J33482J52195J78562J80644J72805J78212J87380J92671K22014
$$ 10686347 10819829 10972024 11150586 11331230 11504035 11682247 11869627 12062298 12284312
12966A2284312K83955L18471K75048K11936K31092L23911L75576L34562K84107
$$ 12284312 12568267 12886738 13161786 13373722 13604814 13928725 14304301 14638863 14922970
12957A4922970L10241L81844M16575M03548L96778M24426M64171M91182N04991
$$ 14922970 15233211 15615055 16031630 16435178 16831956 17256382 17720553 18211735 18716726
12948A8716726N16857N39496N79297O20204O33266O20016O23619O74640P46223
$$ 18716726 19233583 19773079 20352376 20972580 21605846 22225862 22849481 23524121 24270344
12939B4270344P88910P96616Q13736Q80676R86426J075529J103751J095061J131686
$$ 24270344 25059254 25855870 26669606 27550282 28536708 29612237 30715988 31811049 32942735
12930C2942735J263919J439540J558416J595465J627849J732187J897651K058456
$$ 32942735 34206654 35646194 37204610 38800075 40427924 42160111 44057762 46116218
12922D6116218K172301K239701K277278K303417K331540K351444K329127K241737
$$ 46116218 48288519 50528220 52805498 55108915 57440455 59791899 62121026 64362763
12914F4362763K100260J929147J745554J571686J441496J370271J331140J283064
$$ 64362763 66463023 68392170 70137724 71709410 73150906 74521177 75852317 77135381
12906G7135381J215066J146573J089345J026324R35056Q24742P32758O71488N96638
$$ 77135381 78350447 79497020 80586365 81612689 82547745 83372487 84105245 84776733 85373371
12897H5373371M65420L20466K58782L00391L53502L49108L39791M01583N08534
$$ 85373371 85838791 86159257 86418039 86718430 87071932 87421040 87760831 88162414 88670948
12888H8670948N98333P04949R06911J178217J423533J649452J958792K364368
$$ 88670948 89269281 89974230 90881141 92059358 93482891 95132343 97091135 99455503
12880I9455503K754759L075923L395439L731189L968838M034069M005361L951446
$$ 99455503 102210262 105286185 108681624 112412813 116381651 120415720 124421081 128372527
12872A28372527L792135L452601L037253K691859K382488J984948J534784J203136
$$ 128372527 132164662 135617263 138654516 141346375 143728863 145713811 147248595 148451731
12864A48451731J039317R08018O94736M21815J32316k00597n93559r89262j332459
$$ 148451731 149491048 150399066 151093802 151515617 151647933 151447336 150853777 149864515 148532056
12855A48532056j638258j942823k243180k513200k731694k883340k974305l038135
$$ 148532056 146893798 144950975 142707795 140194595 137462901 134579561 131605256 128567121
12847A28567121l079889l044926k905995k735642k601005k431445k109416j664228
$$ 128567121 125487232 122442306 119536311 116800669 114199664 111768219 109658803 107994575
12839A07994575j241341q91785n38840j60578J52099L55842N23538O96313Q02678
$$ 107994575 106753234 105861449 105322609 105162031 105314130 105669972 106193510 106889823 107692501
12830A07692501P92161P25608O60505N60254L90196J95773J5420j75920l71224
$$ 107692501 108484662 109210270 109870775 110431029 110821225 111016998 111032418 110856498 110485274
12821A10485274n01919n78510p26919r91259j238796j374688j506661j750415
$$ 110485274 109983355 109404845 108677926 107686667 106447871 105073183 103566522 101816107
12813A01816107k010318k138402k197290k348565k555007k629651k553615k508800
$$ 101816107 99805789 97667387 95470097 93121532 90566525 87936874 85383259 82874459
12805H2874459k576151k623936k552599k448542k401604k338151k155394j902178
$$ 82874459 80298308 77674372 75121773 72673231 70271627 67933476 65778082 63875904
12797F3875904j705148j591636j489954j356600j218900j119376j073892j063251
$$ 63875904 62170756 60579120 59089166 57732566 56513666 55394290 54320398 53257147
12789E3257147j040066r77517r20700r36932j008449j044150j013456r90165j034185
$$ 53257147 52217081 51239564 50318864 49381932 48373483 47329333 46315877 45325712 44291527
12780D4291527j105532j135303j116022j080716j049579j033425j037164j030876
$$ 44291527 43185995 42050692 40934670 39853954 38804375 37770950 36733786 35702910
12772C5702910r71243q73773q04480p81834p54747o95954o39713o03870n59385
$$ 35702910 34731667 33857894 33053414 32271580 31516833 30820879 30181166 29577296 29017911
12763B9017911n06302m87926m92799m42909l29452k55277k75568l01736k48798
$$ 29017911 28511609 28023683 27530884 27087975 26758523 26503246 26227678 25925942 25677144
12754B5677144j77092j80595k21327j99890j29048j07400j56808k07170k22254
$$ 25677144 25500052 25319457 25098130 24898240 24769192 24661792 24504984 24297814 24075560
12745B4075560k31629k51058k68211k93254l35658l54749l24307l12894l93046
$$ 24075560 23843931 23592873 23324662 23031408 22695750 22341001 22016694 21703800 21310754
12736B1310754n01067n11257m32144l92621m33183m57563m16576l89707m27070
$$ 21310754 20809687 20298430 19866286 19473665 19040482 18582919 18166343 17776636 17349566
12727A7349566m48605l84681l01846k88946l09594k76978k08566j92292k37774
$$ 17349566 16900961 16516280 16214434 15925488 15615894 15338916 15130350 14938058 14700284
12718A4700284k69247k50585k21554k10694j97188j71996j64991j87076k00428
$$ 14700284 14431037 14180452 13958898 13748204 13551016 13379020 13214029 13026953 12826525
12709A2826525j75592j38380j30139j49525j64158j62009j58238j57164j42571
$$ 12826525 12650933 12512553 12382414 12232889 12068731 11906722 11748484 11591320 11448749
12700A1448749j15440j08211j35479j57879j36280j01367j10173j43081j24955
$$ 11448749 11333309 11225098 11089619 10931740 10795460 10694093 10583920 10440839 10315884
12691A0315884o0059m5785j08808j39085p0302j3696q1781j75598j26726Q316
$$ 10315884 10255825 10210040 10101232 9962147 9891845 9878149 9796368 9620770 9494044 9502360
12681I502360J2957j35934k15729j14993p559n2517j36308r0383R004k0426j45204
$$ 9502360 9515317 9379383 9163654 9048661 9041102 8988585 8852277 8761894 8770898 8750472 8605268
12670H605268j73295p6561k0670q0558j44674j31025j00953j04640r0627l9878
$$ 8605268 8431973 8355412 8334742 8254184 8109510 7978485 7877532 7772892 7682265 7642387
12660G642387l0848q7161j05371l0940K7542k6165j05474q1353Q31j469r1431
$$ 7642387 7611539 7524378 7419007 7388067 7415609 7389444 7283970 7202617 7203448 7201979 7110548
12649G110548j32555o8369M336j628n1484p5032o6020m7960j8104K1104K9234
$$ 7110548 6977993 6909624 6913960 6912332 6860848 6785816 6719796 6671836 6653732 6674836 6704070
12638F704070j9740q4249r8903n5396q119p371m7822q0954p0448l4985k7486o4201
$$ 6704070 6684330 6600081 6501178 6445782 6437663 6430292 6382470 6301516 6231068 6196083 6168597 6104396
12626F104396r5509p2697k2384j1854n0835q0941o8121m9382o3596q6028p2385
$$ 6104396 6008887 5936190 5913806 5901952 5851117 5770176 5702055 5652673 5589077 5503049 5430664
12615E430664l3597j8238l7228n3994m7821m3106o3377r1104r5964q0843p1996
$$ 5430664 5397067 5378829 5341601 5287607 5239786 5196680 5133303 5042199 4946235 4865392 4793396
12604D793396p3540o2374l2877j7257m0355p3829o8741k9393j4683n1759q7680
$$ 4793396 4719856 4657482 4624605 4607348 4566993 4493164 4424423 4395030 4380347 4328588 4240908
12593D240908o1975M48J8590l1559q8327r8572q5259r0133r5998n8368R040L9141
$$ 4240908 4178933 4179381 4197971 4166412 4078085 3979513 3894254 3804121 3708123 3649755 3658795 3697936
12581C697936L381m9822o3334m0258k3141l2300n1403n8931n0097l4179k6383
$$ 3697936 3701317 3651495 3588161 3547903 3524762 3492462 3441059 3382128 3332031 3297852 3271469
12570C271469l6128n2086m9327k3949p294k7069o4633p3639l7733J0609K8902
$$ 3271469 3235341 3183255 3133928 3109979 3102685 3075616 3010983 2937344 2899611 2910220 2939122
12559B939122O298l2430n0928l3545o098j3635o0772r2313o2841p297L006l4925
$$ 2939122 2945420 2912990 2862062 2828517 2822419 2808784 2748012 2655699 2592858 2585561 2588567 2553642
12547B553642n3297k1520R234l792k4447n385K6320J4073l2901n6193l9861j9857
$$ 2553642 2500345 2478825 2488059 2484267 2459820 2454435 2480755 2494828 2461927 2405734 2365873 2346016
12535B346016j3594n316K473j2260l8777m2407k8993l4725m7184j5020M6437M8517
$$ 2346016 2332422 2327106 2329579 2317319 2278542 2236135 2207142 2172417 2125233 2110213 2156650 2205167
12523B205167l0328q5031l1815N8831O4331j0036n5693l4468j5269l6148m0962
$$ 2205167 2174839 2089808 2057993 2116824 2181155 2171119 2115426 2080958 2065689 2029541 1988579
12512A988579R393N4411K5857l8758m8220O443M0975K789n5990n7253o739K0228
$$ 1988579 1997972 2052383 2078240 2039482 1991262 1997705 2038680 2041469 1985479 1928226 1921487 1941715
12500A941715r854m3439k5256J5573J2520k9619l9280O204M1551J8693j7256p912
$$ 1941715 1931861 1888422 1863166 1878739 1891259 1861640 1822360 1828564 1870115 1888808 1871552 1863640
12488A863640K0748R076l1018m0668j6921p660j8071q706J6022Q112k5432j7858
$$ 1863640 1884388 1893464 1862446 1821778 1804857 1797197 1779126 1770420 1786442 1794554 1769122 1751264
12476A751264L8024N9621P079m3110j9427K7236P484o1417q2393k0724O0299R2101
$$ 1751264 1789288 1848909 1855988 1812878 1793451 1820687 1828171 1766754 1684361 1663637 1723936 1816037
12464A816037O3818L245m7953m9633m032L1153J5647j0504R480N0085L9316k1669
$$ 1816037 1879855 1883100 1835147 1785514 1781482 1812635 1828282 1817778 1827258 1877343 1916659 1894990
12452A894990n4764k4383J6266J6424l175r61K1055L4627K5774n201m6158o0235
$$ 1894990 1840226 1815843 1832109 1848533 1845358 1844397 1865452 1900079 1925853 1920652 1874494 1814259
12440A814259j4816N9211Q4044L3736k8704l7863m356K2822K8018K6241K5100
$$ 1814259 1799443 1858654 1942698 1976434 1947730 1909867 1905511 1928333 1956351 1982592 2007692
12429B007692K6887L9667N3842L6970j6206n7894m3914R938N5794O8596M8792
$$ 2007692 2034579 2074246 2128088 2165058 2148852 2090958 2047044 2056982 2112776 2181372 2230164
12418B230164Q724j5306J6065P5803P5802p974p4186l1410N9427P3085J2179n952
$$ 2230164 2238888 2223582 2239647 2315450 2391252 2383278 2309092 2277682 2337109 2410194 2422373 2416421
12406B416421N4011Q9934L5445k8578k553P9465J09159O0506L811p329J2642L3510
$$ 2416421 2470432 2560366 2595811 2567233 2564680 2644145 2753304 2813810 2817621 2810292 2822934 2856444
12394B856444M9182N8651N1945K8067L299n203N913K4269L0721K2788K6463N8625
$$ 2856444 2905626 2964277 3016222 3044289 3047588 3042385 3048298 3072567 3103288 3126076 3152539 3211164
12382C211164Q3679N4450n69K673P1877J04512M0652k6895J5301J16856J30304
$$ 3211164 3294843 3349293 3348724 3351397 3423274 3527786 3568438 3541543 3556844 3673700 3804004
12371C804004L8930j6628L9756J03347O0858k8456k8011O3349J12673N3829k1959
$$ 3804004 3842934 3826306 3866062 3969409 4030267 4001811 3973800 4037149 4149822 4203651 4181692
12360D181692o016P7221J15691O5279k664q365L2097M1035m041l4991J0471R5853
$$ 4181692 4175676 4252897 4368588 4433867 4431203 4422838 4454935 4495970 4491929 4456938 4467409 4563262
12348D563262J30600Q8931L3074J9227L5064M5694M8240N1016M4738L1496M1063
$$ 4563262 4693862 4782793 4815867 4835094 4870158 4915852 4964092 5015108 5059846 5091342 5132405
12337E132405P6479Q4689L3973j7619K391O5797Q2254L8757J3074M2817P1971
$$ 5132405 5208884 5293573 5327546 5309927 5312318 5378115 5460369 5499126 5512200 5555017 5626988
12326E626988N5173K9467L5959M5098K0864k893J8886N5283M7534R687J835K6814
$$ 5626988 5682161 5711628 5747587 5792685 5813549 5810656 5829542 5884825 5932359 5942046 5943881 5970695
12314E970695L5612K2013K6228M7152L9144M281k646K0747J1158l5727l2241N0985
$$ 5970695 6006307 6028320 6054548 6101700 6140844 6145125 6142479 6163226 6174384 6138657 6106416 6157401
12302F157401J06446N1173k5909K162R0044R0631j725m4602J1418M7386q090n2691
$$ 6157401 6263847 6315020 6289111 6291273 6381317 6471948 6470223 6425621 6437039 6484425 6476335 6423644
12290F423644L531O8929K3680o4730m4769O3771R8499K2027k3871L5307Q1946
$$ 6423644 6427175 6496104 6519784 6455054 6410285 6474056 6572555 6594582 6570711 6606018 6687964
12279F687964J2762p5101l1276J08876J74546J05708J5246J0014O6645J08085
$$ 6687964 6700726 6625625 6594349 6703225 6877771 6983479 6998725 7008739 7075384 7183469
12269G183469J08996Q5428N0484K6142M8258J13478J56830J26975O0250L7099
$$ 7183469 7292465 7377893 7428377 7454519 7502777 7616255 7773085 7900060 7960310 7997409
12259G997409P7810J23473J21209R0487Q6626J21274J49214J35788J09364J21184
$$ 7997409 8075219 8198692 8319901 8410388 8497014 8618288 8767502 8903290 9012654 9133838
12249I133838J65725J81404J41664J03118J28388J92004K13269J69357J20873
$$ 9133838 9299563 9480967 9622631 9725749 9854137 10046141 10259410 10428767 10549640
12240A0549640J23007J64793K09805K44899K63669K49232K09757J93380K27234
$$ 10549640 10672647 10837440 11047245 11292144 11555813 11805045 12014802 12208182 12435416
12231A2435416K71925K79216K66710K84510L29451L53526L49491L61624M02293
$$ 12435416 12707341 12986557 13253267 13537777 13867228 14220754 14570245 14931869 15334162
12222A5334162M24130M01896L81500M04751M36878M26809M01268M26780M96053
$$ 15334162 15758292 16160188 16541688 16946439 17383317 17810126 18211394 18638174 19134227
12213A9134227N31678N07246M85309N10620N43221N42407N44111N87493O27462
$$ 19134227 19665905 20173151 20658460 21169080 21712301 22254708 22798819 23386312 24013774
12204B4013774O09550N84687O39650P39773P70144P33689P60808Q84066R62076
$$ 24013774 24623324 25208011 25847661 26587434 27357578 28091267 28852075 29736141 30698217
12195C0698217R14593Q79675R97199J165132J198273J140806J196835J384056
$$ 30698217 31612810 32492485 33489684 34654816 35853089 36993895 38190730 39574786
12187C9574786J501680J472294J471969J629996J821817J899509J934440K053049
$$ 39574786 41076466 42548760 44020729 45650725 47472542 49372051 51306491 53359540
12179E3359540K192816K235441K263665K444045K719879K872754K878562K957554
$$ 53359540 55552356 57787797 60051462 62495507 65215386 68088140 70966702 73924256
12171G3924256L233957L571886L822330M028125M277991M531742M717501M861697
$$ 73924256 77158213 80730099 84552429 88580554 92858545 97390287 102107788 106969485
12163A06969485M991197N024986M897572M687595M485629M226662L804635L277393
$$ 106969485 111960682 116985668 121883240 126570835 131056464 135283126 139087761 142365154
12155A42365154K793750K370257J914676J444692J099447R19653P88829O39276
$$ 142365154 145158904 147529161 149443837 150888529 151987976 152907629 153696458 154335734
12147A54335734N63149O48742Q38743J042732J286277J642454K085715K521515
$$ 154335734 154898883 155547625 156386368 157429100 158715377 160357831 162443546 164965061
12139A64965061K924263L349285L819670M282103M683646N035407N382235N741373
$$ 164965061 167889324 171238609 175058279 179340382 184024028 189059435 194441670 200183043
12131B00183043O088683O397191O680651O983661P310969P588726P744445P814156
$$ 200183043 206271726 212668917 219349568 226333229 233644198 241232924 248977369 256791525
12123B56791525P893125P957637P818951P316749O499508N536099M490813L281696
$$ 256791525 264684650 272642287 280461238 287777987 294277495 299813594 304304407 307586103
12115C07586103J850291K70668j337946k919758m444991n824632o948732p804516
$$ 307586103 309436394 309707062 308369116 305449358 301004367 295179735 288231003 280426487
12107B80426487q490331r091648r584139r881935r944860r800881r487532r025356
$$ 280426487 271936156 262844508 253260369 243378434 233433574 223632693 214145161 205119805
12099B05119805q453413p842423p247311o674122o112519n571397n060604m569461
$$ 205119805 196666392 188823969 181576658 174902536 168790017 163218620 158158016 153588555
12091A53588555m092582l648108l241411k846144k455502k105277j795256j444450
$$ 153588555 149495973 145847865 142606454 139760310 137304808 135199531 133404275 131959825
12083A31959825j006958n84209l08472j39977Q2799L83818N92805N96272M92763
$$ 131959825 130952867 130368658 130060186 129920209 130003008 130386826 130979631 131575903 132068666
12074A32068666M05712K79775j438l99039p81383j139130j566855k053566k460216
$$ 132068666 132474378 132754153 132752715 132353676 131572293 130433163 128866308 126812742 124352526
12065A24352526k720066k912290l105486l265574l362652l436153l490400l446021
$$ 124352526 121632460 118720170 115614684 112349110 108986458 105550305 102059905 98613884
12057I8613884l273142l067163k908799k750918k540872k352206k266162k203049
$$ 98613884 95340742 92273579 89364780 86613862 84072990 81720784 79454622 77251573
12049G7251573k026637j773836j617456j605600j598318j492432j357857j287607
$$ 77251573 75224936 73451100 71833644 70228044 68629726 67137294 65779437 64491830
12041F4491830j245996j160298j060678j016836j004330r50212q70553q45545
$$ 64491830 63245834 62085536 61024858 60008022 59003692 58053480 57182927 56337382
12033E6337382q72902q59197p66831o66794o17134n82800n23429m78552m95450
$$ 56337382 55464480 54605283 53838452 53171658 52554524 51971724 51448295 50969743 50474293
12024E0474293n29160m96107m01950l39645l62437m22945m50442m36118m16870
$$ 50474293 49945133 49449026 49047076 48707431 48344994 47922049 47471607 47035489 46618619
12015D6618619m10836m03227l85436l80600m17406m82544n19007m92974m50150
$$ 46618619 46207783 45804556 45419120 45038520 44621114 44138570 43619563 43126589 42676439
12006D2676439m65424n36428n82985n69025n53832n79234n87177n30021m86357
$$ 42676439 42211015 41674587 41091602 40522577 39968745 39389511 38802334 38272313 37785956
11997C7785956n45076o27377n81989m41941m03072n13403n78866m69165l29716
$$ 37785956 37240880 36613503 36031514 35589573 35186501 34673098 34094232 33625067 33295351
11988C3295351l39647m19257l81231k60328k50631l62192l95418k77837j83964
$$ 33295351 32955704 32536447 32155216 31894888 31644257 31282065 30886647 30608810 30424846
11979C0424846k41652l32375l06216k21679k19148k83522k97339k47912k21972
$$ 30424846 30183194 29850819 29544603 29322924 29103776 28820254 28522915 28275003 28053031
11970B8053031k41181k48337k33749k45736k83640k94208k73480k71049k92529
$$ 28053031 27811850 27563513 27329764 27084028 26800388 26506180 26232700 25961651 25669122
11961B5669122k93318k71166k70666k90326k81747k53901k77217l54910l89270
$$ 25669122 25375804 25104638 24833972 24543646 24261899 24007998 23730781 23375871 22986601
11952B2986601l26552k50512k64212l40147l62640k86283j84865j52239k02080
$$ 22986601 22660049 22409537 22145325 21805178 21442538 21156255 20971390 20819151 20617071
11943B0617071k66435k67623j94226j15782j07964j60046j86548j40566p5565
$$ 20617071 20350636 20083013 19888787 19773005 19665041 19504995 19318447 19177881 19102316
11934A9102316o8259j15995j51804j40774j14303j08033j08547q5119n1186n6151
$$ 19102316 19034057 18918062 18766258 18625484 18511181 18403148 18294601 18209482 18158296 18102145
11924A8102145j08809j43783r9937j4356J5907l0493o6831k9972K5231K1304j3869
$$ 18102145 17993336 17849553 17749616 17735260 17751167 17720674 17653843 17623871 17649102 17670406 17656537
11913A7656537M30N8500Q1806N3412L4231M6357M6767K9588M4501Q7669Q9563
$$ 17656537 17656967 17715467 17797273 17850685 17884916 17931273 17978040 18007628 18052129 18139798 18229361
11902A8229361N1771P1831J67579K07512J16825K9833R6330K33319K44871J33270
$$ 18229361 18281132 18352963 18520542 18728054 18844879 18874712 18971042 19204361 19449232 19582502
11892A9582502R3542K01134L04103K78526K11467K30746K97622L01795K63726
$$ 19582502 19676044 19877178 20181281 20459807 20671274 20902020 21199642 21501437 21765163
11883B1765163K93199L96008M67542M71088M91429N85082O86539P15591O98298
$$ 21765163 22058362 22454370 22921912 23393000 23884429 24469511 25156050 25871641 26569939
11874B6569939P15744P81940Q40187Q58202Q65560Q97524R48989R94077J018197
$$ 26569939 27285683 28067623 28907810 29766012 30631572 31529096 32478085 33472162 34490359
11865C4490359J019479J005194R98295J020857J054051J040717R56327Q59926
$$ 34490359 35509838 36515032 37513327 38534184 39588235 40628952 41585279 42445205
11857D2445205Q37805R00089R70993R89797R83653J016464J096423J174882J226608
$$ 42445205 43283010 44183099 45154092 46143889 47127542 48144006 49240429 50415311 51641919
11848E1641919J285274J384558J499859J583220J640623J730016J873749K017954
$$ 51641919 52927193 54311751 55811610 57394830 59035453 60765469 62639218 64657172
11840F4657172K113527K200257K347845K529256K639968K667667K750854L000106
$$ 64657172 66770699 68970956 71318801 73848057 76488025 79155692 81906546 84906652
11832H4906652L334841L600048L799106M081360M501355M927750N239199N496363
$$ 84906652 88241493 91841541 95640647 99722007 104223362 109151112 114390311 119886674
11824A19886674N843299O325121O896373P553730Q359339R347334J0483252J1717571
$$ 119886674 125729973 132055094 138951467 146505197 154864536 164211870 174695122 186412693
11816A86412693J3026105J4375919J5640490J6523148J6612959J5660758J3862565
$$ 186412693 199438798 213814717 229455207 245978355 262591314 278252072 292114637
11809B92114637J1744507R642733P363887M476526Q88422k966527o438478r032132
$$ 292114637 303859144 313501877 320865764 325342290 326230712 323264185 316825707 307793575
11801C07793575j0592099j1393208j2068754j3174545j4647276j5804240j5999051
$$ 307793575 297201476 285808268 273739514 260564969 245917693 230113453 214114402
11794B14114402j5205575j3901527j2532563j1244578j0038030q958539q079267
$$ 214114402 198908827 185007300 172474737 161230159 151192129 142233590 134154323
11787A34154323p405944o866050o367386n859634n362794m930295m571794m238306
$$ 134154323 126748379 119882329 113514943 107655309 102292515 97362220 92790426 88552120
11779H8552120l895038l562657l262936k978186k701401k472634k318677k202458
$$ 88552120 84657082 81094425 77831489 74853303 72151902 69679268 67360591 65158133
11771F5158133k077075j945578j826915j715270j616322j562592j540168j467304
$$ 65158133 63081058 61135480 59308565 57593295 55976973 54414381 52874213 51406909
11763E1406909j313142j172062j138048j163723j137973j054542r96490r83377
$$ 51406909 50093767 48921705 47783657 46619934 45481961 44427419 43430929 42447552
11755D2447552r46659q53829p58654p15705p19070p34411p33224o97289o38786
$$ 42447552 41500893 40647064 39888410 39172705 38453635 37719224 36986000 36288711 35649925
11746C5649925o00269n90961n61635m94956m58915m93259n15539m49529l76518
$$ 35649925 35049656 34458695 33897060 33402104 32943189 32449930 31934391 31484862 31108344
11737C1108344m14322n00271m72605l46714l10605m21181n08069m51421l69120
$$ 31108344 30694022 30193751 29721146 29374432 29063827 28642646 28134577 27683156 27314036
11728B7314036m15335n44811o11423n87613n48958n23133m86383m54148m56680
$$ 27314036 26898701 26353890 25742467 25154854 24605896 24082763 23596380 23142232 22685552
11719B2685552m63075m28028l77509l61340l61309l31743k91650k91255l20984
$$ 22685552 22222477 21794449 21416940 21055600 20694291 20362548 20070898 19779643 19458659
11710A9458659l33415l22531l06997k73009k10790j68970j91622k36130k34030
$$ 19458659 19125244 18802713 18495716 18222707 18011917 17842947 17651325 17415195 17181165
11701A7181165j98631j89932k07646k07200j91429j94055j95571j49993q1526
$$ 17181165 16982534 16792602 16584956 16377756 16186327 15992272 15796701 15646708 15565182
11692A5565182o3790j08414j55027j65434j53158j30384r9149q2992r8097j11600
$$ 15565182 15501392 15392978 15237951 15072517 14919359 14788975 14689826 14606834 14508737 14397137
11682A4397137r3581p5721q5399p3650n874L3483m2976j47793j14296M2232J26919
$$ 14397137 14303556 14227835 14142436 14068786 14062912 14096395 14053419 13905626 13791330 13833562 13960481
11671A3960481M9788n6536n4161J6028M3286J4273j6097k6561k3136l708J3627
$$ 13960481 14010269 13953733 13899572 13915600 13958886 13973159 13957062 13930501 13907365 13903657 13917284
11660A3917284l425l1214j0712L5310J3827p5005j12027m9253R166j1926l6508
$$ 13917284 13913859 13882645 13871933 13907243 13921070 13846065 13734038 13684785 13693951 13682025 13645517
11649A3645517P816M9665Q260n5070n3249k8999n0224n7980J7264Q4378K3512
$$ 13645517 13653333 13702998 13711258 13656188 13602939 13573940 13523716 13465736 13483000 13567378 13590890
11638A3590890q5141o8585M9304Q1194j3027o8717K140P8431M2632n0239r6748
$$ 13590890 13505749 13437164 13486468 13567662 13554635 13485918 13488058 13566489 13609121 13558882 13462134
11627A3462134r3054p9083n9478n3395j07953j94819k07491j27484p5444j24689
$$ 13462134 13369080 13289997 13230519 13177124 13069171 12874352 12666861 12539377 12463933 12339244
11617A2339244j86191j65843j15874j24125j60763j54797j31763j48256j64970
$$ 12339244 12153053 11987210 11871336 11747211 11586448 11431651 11299888 11151632 10986662
11608A0986662j16429m6552m1325p4499n7320o792k0564r7835j28582p2081j5298
$$ 10986662 10870233 10823681 10782356 10707857 10650537 10643745 10623181 10525346 10396764 10324683 10309385
11597A0309385k6528o6533q0554p5615o7012m2681k3587o8537j67213k12666j43159
$$ 10309385 10282857 10216324 10135770 10060155 9993143 9950462 9926875 9858338 9691125 9478459 9335300
11586I335300m0328j7752p1063j12798j09705j03979j22215j41062j41179j34155
$$ 9335300 9294972 9277220 9206157 9093359 8983654 8879675 8757460 8616398 8475219 8341064
11576H341064j28917j16277r4328p6497p1185p8198r9947j30318j43938j28792
$$ 8341064 8212147 8095870 8001542 7925045 7853860 7775662 7675715 7545397 7401459 7272667
11566G272667j16849j40790j69886j43589p3079m4960r5488j43387j03010j7416
$$ 7272667 7155818 7015028 6845142 6701553 6628474 6583514 6488026 6344639 6241629 6224213
11556F224213j350p2304j27489r9114m2934l1996m4462k6828m535l5569r0891
$$ 6224213 6222863 6150559 6023070 5923956 5881022 5849026 5804564 5777736 5773201 5737632 5646741
11545E646741q7699l2804k1554p6589j00186l4177L7182J8924m6646n8320j8380
$$ 5646741 5559042 5526238 5504684 5428095 5327909 5293732 5330914 5349838 5303192 5244872 5226492
11534E226492r320m7083o8923n3178m4454n6733n0792k2864k2393n7700p2172
$$ 5226492 5217172 5170089 5101166 5047988 5003534 4946801 4896009 4873145 4850752 4793052 4720880
11523D720880m5358l1529n6955o3705j1885L8067J4933n0581p6399m8117j5010
$$ 4720880 4675522 4643993 4587038 4523333 4511448 4549515 4564448 4513867 4437468 4389351 4374341
11512D374341o21J1403K4362K5771K1591J9754J638l7802n2120q249M1431K5465
$$ 4374341 4373720 4385123 4409485 4435256 4456847 4476601 4478239 4440437 4388317 4380068 4421499 4446964
11500D446964l3707n6251l4435k9076m4387j7862M8063O0844r524o1040j4249
$$ 4446964 4413257 4357006 4322571 4293495 4249108 4231246 4279309 4340153 4330629 4269589 4255340
11489D255340N6413L7815m5896p8451k9787J9454J4832j3197l0769m7608o2702
$$ 4255340 4311753 4349568 4303672 4225221 4195434 4214888 4229720 4216523 4185754 4138146 4075444
11478D075444m2768J3199M9705K9044j6610l4940j5902J5968L3047J3885l5701
$$ 4075444 4032676 4045875 4095580 4124624 4108014 4073074 4057172 4073140 4106187 4120072 4084371
11467D084371n9595m184Q7916J02300O221q7884o6144L6214R5620O7608J5339
$$ 4084371 4024776 4020592 4108508 4210808 4217029 4129145 4063001 4099215 4194835 4262443 4277782
11456D277782k926P395K5078M5025N4641L9024J7600K3152M2736L5174O470M089
$$ 4277782 4274856 4282251 4307329 4352354 4406995 4446019 4463619 4486771 4529507 4564681 4571151 4575240
11444D575240L2781M7290L9431N2915Q8243P8970N850m8141j8031M1293M7334
$$ 4575240 4608021 4655311 4694742 4747657 4835900 4914870 4920720 4872579 4854548 4895841 4943175
11433D943175J8743K2934M7663K9689j8798k4053J5830K2146k5024m5392O661
$$ 4943175 4961918 4984852 5032515 5062204 5043406 5019353 5035183 5057329 5032305 4986913 4993574
11422D993574O1737M7606L751J0486N7843O7440K0500j4799J1742O1261O4245
$$ 4993574 5055311 5102917 5106668 5117154 5174997 5242437 5262937 5248138 5259880 5321141 5385386
11411E385386J4985k3753l178N0601P4277N4012L9167N7969O4373J2353n3046
$$ 5385386 5400371 5376618 5373440 5424041 5498318 5552330 5591497 5649466 5713839 5726192 5673146
11400E673146m8421J8110N0354O340m5799m3487k0653l3069o2645o1264l6428
$$ 5673146 5624725 5642835 5693189 5699529 5653730 5610243 5589590 5556521 5493876 5432612 5396184
11389E396184k3259j3519J4679L1535j583m9160m4367q00M749m0587o4632k9962
$$ 5396184 5372925 5359406 5374085 5405620 5404037 5354877 5310510 5309710 5314459 5273872 5209240 5179278
11377E179278J2143J7320J6444M2057N6724J6938m1654n0257p258L1478M2784
$$ 5179278 5191421 5208741 5225185 5267242 5323966 5340904 5299250 5248993 5241735 5273213 5315997
11366E315997N1382O0647L4614l4061r1008q5623l5862L444J1572N604r261m5881
$$ 5315997 5367379 5428026 5462640 5428579 5337571 5251948 5216086 5219530 5231102 5236706 5227445 5181564
11354E181564q9078r2154m5119p079k9166p3703o6198j3105L257m4992q4331n7911
$$ 5181564 5092486 5000332 4955213 4948134 4918968 4845265 4779067 4765962 4769219 4724227 4639896 4581985
11342D581985j5479k4409n3848l1221K8126M5479J4021N918M0092M8382K694k4100
$$ 4581985 4566506 4542097 4488249 4457028 4485154 4530633 4544654 4550572 4590664 4639046 4641740 4617640
11330D617640K2329Q2282P6143K7268J0667K8533K6156K617J0244M7479M5227
$$ 4617640 4639969 4722251 4798394 4825662 4836329 4864862 4891018 4893635 4903879 4951358 4996585
11319D996585j6463n8203j5440N4056M1693n7026j27178q5309R675L7408k2982
$$ 4996585 4980122 4921919 4906479 4960535 5002228 4945202 4818024 4732715 4742390 4779798 4756816
11308D756816p4286m7165M253l295m8648m6475N299J8043l6314o9026j7103M8881
$$ 4756816 4682530 4635365 4639618 4636323 4587675 4541200 4546499 4564542 4528228 4459202 4442099 4490980
11296D490980L6070k2989l1754Q862J4480k5218k5812L6221O5549J717o7634l3486
$$ 4490980 4527050 4504061 4472307 4481169 4495649 4470431 4444619 4480840 4546389 4548106 4480472 4446986
11284D446986O1731Q3308P428m6304J067P3319O2447r004l2527J6219M8342Q931
$$ 4446986 4508717 4592025 4599453 4553149 4554216 4627535 4689982 4680978 4648451 4664670 4713012 4721943
11272D721943l7442j2596N2681O9642K4636j3692l305K7351M2450L9618K2733
$$ 4721943 4684501 4671905 4724586 4794228 4818864 4805172 4801867 4829218 4871668 4911286 4934019
11261D934019l911r687K8945O6043L5296l0075k2413O9149J22155O8989P517L8576
$$ 4934019 4930108 4920421 4949366 5015409 5050705 5020630 4998217 5067366 5189521 5258510 5266027 5304603
11249E304603J00315Q2628J9353K2694Q3142R0936L1098L89K9552M0065l48k2050
$$ 5304603 5404918 5487546 5506899 5529593 5612735 5703671 5734769 5735158 5764710 5804775 5804427 5782377
11237E782377R119L0397N566j1486J2222L1033K5911M5735Q4725N2324n4538q8615
$$ 5782377 5791496 5821893 5827459 5815973 5828195 5859228 5885139 5930874 6015599 6067923 6013385 5924770
11225E924770K6558J44221J06578l340K721J11651J40241M3246j7807N8630J64117
$$ 5924770 5951328 6095549 6202127 6198787 6201508 6313159 6453400 6496646 6478839 6537469 6701586
11214F701586J67395J03217P9750J06452J19787J10853J23108J55493J57520J16400
$$ 6701586 6868981 6972198 7051948 7158400 7278187 7389040 7512148 7667641 7825161 7941561
11204G941561Q1796R2945J26971J38462J22949J16454J40255J72469J85630J89623
$$ 7941561 8023357 8116302 8243273 8381735 8504684 8621138 8761393 8933862 9119492 9309115
11194I309115K08557K30388K23293J98441K03773K47987K87118K98536L04037
$$ 9309115 9517672 9748060 9971353 10169794 10373567 10621554 10908672 11207208 11511245
11185A1511245L05733K80214K60158L20362M36870M75380L93876L34687M09117
$$ 11511245 11816978 12097192 12357350 12677712 13114582 13589962 13983838 14318525 14727642
11176A4727642N14148N06710M46287M80981N81278O01983N54325N81116O79963
$$ 14727642 15241790 15748500 16194787 16675768 17257046 17859029 18413354 18994470 19674433
11167A9674433P00878O39890O78016Q63287J004052R82823R42722J029025J162214
$$ 19674433 20375311 21015201 21693217 22556504 23560556 24543379 25486101 26515126 27677340
11158B7677340J225762J280722J415865J566114J672859J854678K209924K615244
$$ 27677340 28903102 30183824 31599689 33165803 34838662 36693340 38903264 41518508
11150D1518508K952830L366030L993993M589325M755594M505909M212254L990574
$$ 41518508 44471338 47837368 51831361 56420686 61176280 65682189 69894443 73885017
11142G3885017L524754K607133J497231N55348j93821r09702j581879k087368
$$ 73885017 77409771 80016904 81514135 82069483 81875662 80965960 79384081 77296713
11134G7296713k448763k780527l067407l223818l313062l484897l709693l770743
$$ 77296713 74847950 72067423 69000016 65776198 62463136 58978239 55268546 51497803
11126E1497803l541256l118518k667601k272240j964280j761547j616033j423902
$$ 51497803 47956547 44838029 42170428 39898188 37933908 36172361 34556328 33132426
11118C3132426j154495r08065p91063p77892p46716o29828m84512m09375m13633
$$ 33132426 31977931 31069866 30278803 29500911 28754195 28124367 27639855 27230480 26816847
11109B6816847l98901k87751j40563q5590j36365j61258o9219N8034R0714M3348
$$ 26816847 26417946 26130195 25989632 25904042 25767677 25606419 25537200 25595234 25685948 25729296
11099B5729296M4383J41389K39645K47651K01308K03094K84547L75797M02294
$$ 25729296 25773679 25915068 26154713 26402364 26603672 26806766 27091313 27467110 27869404
11090B7869404L77421L78780M42251N18492N55750N80363O41897P19526P64526
$$ 27869404 28246825 28625605 29067856 29586348 30142098 30722461 31364358 32083884 32848410
11081C2848410Q05007R01604J016374J058386J062004J162473J365084J519425
$$ 32848410 33653417 34555021 35571395 36629781 37691785 38854258 40219342 41738767
11073D1738767J587313J735684K054867K399899K672771L028055L545942L916032
$$ 41738767 43326080 45061764 47116631 49516530 52189301 55217356 58763298 62679330
11065F2679330L811181L455248L385547L637892L602675K833919J632561O14371
$$ 62679330 66490511 69945759 73331306 76969198 80571873 83405792 85038353 85652724
11057H5652724O451l74014p15482j117769j717283k529049l215931l357721k992848
$$ 85652724 85659175 85285161 84569679 83451910 81734627 79205578 75989647 72631926 69639078
11048F9639078k626585k630229k849993k895480k617683k173527j762043j455760
$$ 69639078 67012493 64382264 61532271 58636791 56019108 53845581 52083538 50627778
11040E0627778j237264j072663r37266q21857p21427o14286m80592l44252k53988
$$ 50627778 49390514 48317851 47380585 46558728 45837301 45223015 44742423 44398171 44144183
11031D4144183k12567j66813q1330J5992P8027R8960J16964J71942K61961L34496
$$ 44144183 43931616 43764803 43683473 43699465 43777492 43876452 43993416 44165358 44427319 44761815
11021D4761815L39717L02683L04378L68091M17690L93498L53203L88436M86310
$$ 44761815 45101532 45404215 45708593 46076684 46494374 46887872 47241075 47629511 48115821
11012D8115821N56963N68851N69153N88431O14929O56043P36553Q32830Q89854
$$ 48115821 48672784 49241635 49810788 50399219 51014148 51670191 52406744 53239574 54129428
11003E4129428R08073R37874R89968J034378J086848J200611J358366J467376
$$ 54129428 55037501 55975375 56965343 57999721 59086569 60287180 61645546 63112922
10995F3112922J489599J493466J549578J653910J777234J905896K006147K034928
$$ 63112922 64602521 66095987 67645565 69299475 71076709 72982605 74988752 77023680
10987G7023680K019588K043560K122171K182035K193929K221204K291993K336861
$$ 77023680 79043268 81086828 83208999 85391034 87584963 89806167 92098160 94435021
10979I4435021K318044K306925K350441K372621K313109K257371K300108K369570
$$ 94435021 96753065 99059990 101410431 103783052 106096161 108353532 110653640 113023210
10971A13023210K340621K257237K271266K389747K461540K425937K404489K497122
$$ 113023210 115363831 117621068 119892334 122282081 124743621 127169558 129574047 132071169
10963A32071169K634041K706024K725537K768184K838756K889192K914539K943724
$$ 132071169 134705210 137411234 140136771 142904955 145743711 148632903 151547442 154491166
10955A54491166K967950K954541K911929K871718K815567K686930K483643K279201
$$ 154491166 157459116 160413657 163325586 166197304 169012871 171699801 174183444 176462645
10947A76462645K122367J956017J679833J279190Q44846M55076Q2507l48701q46728
$$ 176462645 178585012 180541029 182220862 183500052 184344898 184799974 184882481 184533780 183687052
10938A83687052j346109j801263k220664k603818k913798l136396l303528l425795
$$ 183687052 182340943 180539680 178319016 175715198 172801400 169665004 166361476 162935681
10930A62935681l462892l397904l276266l126013k909983k615970k321005k090668
$$ 162935681 159472789 156074885 152798619 149672606 146762623 144146653 141825648 139734980
10922A39734980j886118j662690j490098j458985j524820j578560j632657j787261
$$ 139734980 137848862 136186172 134696074 133237089 131712269 130133709 128501052 126713791
10914A26713791k029260k226382k332248k436137k574795k656244k632454k595256
$$ 126713791 124684531 122458149 120125901 117689764 115114969 112458725 109826271 107231015
10906A07231015k612940k606176k490068k321753k189345k054825j839328j588790
$$ 107231015 104618075 102011899 99521831 97200078 95010733 92955908 91116580 89527790
10898H9527790j416303j326542j228434j093730r78873r01323q10971o91939n94271
$$ 89527790 88111487 86784945 85556511 84462781 83483908 82582585 81771614 81079675 80485404
10889H0485404n46606n13915m59341l90671l37130l24226l64583m33107m73532
$$ 80485404 79938798 79424883 78965542 78574871 78237741 77913515 77548932 77115825 76642293
10880G6642293m74500n02875o05025p20274p68140p77573q34499r33903r93850
$$ 76642293 76167793 75664918 75059893 74339619 73571479 72793906 71959407 71025504 70031654
10871G0031654j001367j026799j087279j112735j073461j033153j034622j029631
$$ 70031654 69030287 68003488 66916209 65803474 64730013 63696860 62662238 61632607
10863F1632607r72870r01289q64011q45391q14006p82302p58456p00633n88427
$$ 61632607 60659737 59758448 58894437 58049046 57235040 56452738 55694282 54993649 54405222
10854E4405222m90430m82568n27167n10727l97546k78635k51141k96153l08837
$$ 54405222 53914792 53432224 52905057 52394330 51996784 51718149 51467008 51170855 50862018
10845E0862018k32212j24347p5439q2219n4519M6144J41916J60825J60142K39562
$$ 50862018 50629806 50505459 50430020 50347801 50293282 50339426 50481342 50642167 50802309 51041871
10835E1041871L71241M32065M01297M01289N07685O36718O87108O94809P54953
$$ 51041871 51413112 51845177 52246474 52647763 53155448 53792166 54479274 55174083 55929036
10826E5929036Q59404R17689R08777R11770R79490J057487J060157R90052R44172
$$ 55929036 56788440 57706129 58614906 59526676 60506166 61563653 62623810 63613862 64558034
10817F4558034R95540J088297J091641R73305Q59556Q63389R14799Q70146P48571
$$ 64558034 65553574 66641871 67733512 68706817 69566373 70429762 71344561 72214707 72963278
10808G2963278P06309P73366P94154O88811N96659O49230P56467P68005P22010
$$ 72963278 73669587 74442953 75237107 75925918 76522577 77171807 77928274 78696279 79418289
10799G9418289P58334Q74329R56071R96016J086044J220596J300127J331234J434724
$$ 79418289 80176623 81050952 82007023 83003039 84089083 85309679 86609806 87941040 89375764
10790H9375764J629643J790187J862223J948018K109552K254567K308974K351958
$$ 89375764 91005407 92795594 94657817 96605835 98715387 100969954 103278928 105630886
10782A05630886K466560K581375K584905K497585K405274K304748K142593J940496
$$ 105630886 108097446 110678821 113263726 115761311 118166585 120471333 122613926 124554422
10774A24554422J751455J541101J242504Q95497O03283L69835J07892j95126m47554
$$ 124554422 126305877 127846978 129089482 129984979 130588262 130958097 131065989 130870863 130423309
10765A30423309o08181p49936r26817j080700j141423j140041j150502j170162
$$ 130423309 129815128 129065192 128138375 127057675 125916252 124776211 123625709 122455547
10757A22455547j130816j005975q47465p17432o21717n13968l46737j20842J07273
$$ 122455547 121324731 120318756 119471291 118753859 118132142 117618174 117271437 117150595 117257868
10748A17257868K78890M00834N39367P32665R35538J079997J169780J268479J394973
$$ 117257868 117536758 117937592 118476959 119209624 120145162 121225159 122394939 123663418 125058391
10739A25058391J485365J486073J435808J400241J357377J226713J007770P94512
$$ 125058391 126543756 128029829 129465637 130865878 132223255 133449968 134457738 135252250
10731A35252250O20048L86201K1559l76163o66634q77111j148464j494842j773280
$$ 135252250 135872298 136258499 136280058 135903895 135237261 134360150 133211686 131716844 129943564
10722A29943564j914968k030939k219391k402324k455456k400330k352878k348601
$$ 129943564 128028596 125997657 123778266 121375942 118920486 116520156 114167278 111818677
10714A11818677k330398k264634k166048k039282j889369j764418j701176j651625
$$ 111818677 109488279 107223645 105057597 103018315 101128946 99364528 97663352 96011727
10706I6011727j544320j393002j265813j178247j101121j040356j014208r83150
$$ 96011727 94467407 93074405 91808592 90630345 89529224 88488868 87474660 86491510
10698H6491510r06206q38429q57886r19937r15244q61005q85911j011353j104856
$$ 86491510 85585304 84746875 83888989 82969052 82053808 81192803 80306892 79295539 78190683
10689G8190683j095841j084833j163666j265900j295689j289970j336291j416045
$$ 78190683 77094842 76010009 74846343 73580443 72284754 70994784 69658493 68242448
10681F8242448j448403j429293j415056j413199j392378j363573j353159j327741
$$ 68242448 66794045 65364752 63949696 62536497 61144119 59780546 58427387 57099646
10673E7099646j244179j148960j126424j159645j142049j032312r09032q55078
$$ 57099646 55855467 54706507 53580083 52420438 51278389 50246077 49337045 48481967
10665D8481967q60946q63403q22143p40457o55226o15072o28879o38741n86598
$$ 48481967 47621021 46757618 45935475 45195018 44539792 43924720 43295841 42657100 42070502
10656D2070502m97674m46759m51549m58587m31397l89432l54395l19872k87474
$$ 42070502 41572828 41126069 40674520 40215933 39784536 39395104 39040709 38720837 38433363
10647C8433363k76401k79472k59493k07217j58158j36456j25001j03460p1208
$$ 38433363 38156962 37877490 37617997 37410780 37252622 37116166 36991165 36887705 36816497
10638C6816497k2204N2056J21149J35285J09418J27333K24988L27307L52479L29812
$$ 36816497 36794293 36846349 36967498 37102783 37212201 37339534 37564522 37891829 38244308 38574120
10628C8574120L47202M14631M59350M50691M50277N13841O05807O54884O54644
$$ 38574120 38921322 39335953 39795303 40245994 40696271 41210112 41815919 42470803 43125447
10619D3125447O57314O87496P17592P30603P53533Q05553Q56386Q73023Q77268
$$ 43125447 43782761 44470257 45187849 45918452 46671985 47477538 48333924 49206947 50084215
10610E0084215R13041R77547J033706J077578J140048J227576J316261J399625
$$ 50084215 50997256 51974803 53008509 54086087 55226135 56453711 57769972 59169597
10602E9169597J481429J530545J525243J541254J687074J926023K085967K104029
$$ 59169597 60651026 62181571 63706814 65248068 66935142 68861165 70947132 73051161
10594G3051161K130989K297379K507395K610313K667292K856187L172758L441679
$$ 73051161 75182150 77479529 79986924 82597237 85264529 88120716 91293474 94735153
10586I4735153L616433L848895M215271M577964M814108N012015N319036N723691
$$ 94735153 98351586 102200481 106415752 110993716 115807824 120819839 126138875 131862566
10578A31862566O119309O490260O907414P401116P948461Q537868R149809R708228
$$ 131862566 137981875 144472135 151379549 158780665 166729126 175266994 184416803 194125031
10570A94125031J0118103J0303336J0161886R576986Q555146P261009N812915
$$ 194125031 204243134 214546470 224708356 234285342 242840488 250101497 255914412
10563B55914412M131429K110936j37561k349340m341248o042777p378370q324332
$$ 255914412 260045841 262156777 262019216 259669876 255328628 249285851 241907481 233583149
10555B33583149r054449r804197j0545021j0975946j0898652j0435880r810532
$$ 233583149 224528700 214724503 204179482 193203536 182304884 171869004 162058472
10548A62058472r084905q238187p357313o587085n958906n405733m907832m507483
$$ 162058472 152973567 144735380 137378067 130790982 124832076 119426343 114518511 110011028
10540A10011028m203048l933212l662846l405342l164715k926105k704216k540444
$$ 110011028 105807980 101874768 98211922 94806580 91641865 88715760 86011544 83471100
10532H3471100k443584k375769k301135k216944k138403k077659k033012j984170
$$ 83471100 81027516 78651747 76350612 74133668 71995265 69917606 67884594 65900424
10524F5900424j912886j837032j793613j773422j714017j585742j444501j361623
$$ 65900424 63987538 62150506 60356893 58583471 56869454 55283712 53839211 52477588
10516E2477588j335098j310422j259336j193535j122760j044407r64906q98270
$$ 52477588 51142490 49832068 48572732 47379197 46256437 45212030 44247124 43348854
10508D3348854q50657q23657q13718p95396p37247o52110n93035n78189n65677
$$ 43348854 42498197 41674540 40860822 40065426 39328179 38676069 38083034 37504845 36939168
10499C6939168n29317n03981n15258n21173m80275m28448m22071m42803m28482
$$ 36939168 36409851 35905870 35390612 34869439 34389164 33960716 33538645 33095842 32667360
10490C2667360l72427l26535l24027l54197l91925m05161l68264l17147l39160
$$ 32667360 32294933 31968398 31644371 31290174 30898249 30493088 30124824 29807677 29468517
10481B9468517m43795n07097m34765l16442k98656l58517l54989k76283k56933
$$ 29468517 29024722 28517625 28082860 27766418 27467762 27109245 26754256 26477973 26221040
10472B6221040l32570l64229k72444j76569j97139k62732k43851j67119j47933
$$ 26221040 25888470 25524241 25251797 25075228 24878089 24615357 24371506 24204387 24056454
10463B4056454j85887j82672j25697j04483j47626j74231j29731o6864n8607j05180
$$ 24056454 23870567 23687895 23562198 23457715 23310089 23135858 23006127 22939263 22880656 22775476
10453B2775476j56689j74220j50074j08182q8270r6259q9105m9943l8378r7744
$$ 22775476 22618787 22444567 22294493 22186311 22098041 22001782 21912677 21862734 21824356 21726612
10443B1726612j55397j14859j9793k955p3698r7018j8577L5801l4640j31520j10176
$$ 21726612 21571215 21456356 21436563 21433608 21359910 21262892 21244315 21280116 21245476 21113956 21003780
10432B1003780j2044L910q6575j45757r8566l8686o7636j46448j78498j55636
$$ 21003780 20991736 20995646 20909071 20763314 20664748 20626062 20558426 20411978 20233480 20077844
10422B0077844j38753j45173j41352j25428j37219j81624k05942j74628j21942
$$ 20077844 19939091 19793918 19652566 19527138 19389919 19208295 19002353 18827725 18705783
10413A8705783j02579j19675j33134j23742j15403j31747j57809j61078j37474
$$ 18705783 18603204 18483529 18350395 18226653 18111250 17979503 17821694 17660616 17523142
10404A7523142j15876j17915j33594j45231j55925j74200j84917j66657j35951
$$ 17523142 17407266 17289351 17155757 17010526 16854601 16680401 16495484 16328827 16192876
10395A6192876j37265j76421j99852j66925j13107j02572j37976j64158j53817
$$ 16192876 16055611 15879190 15679338 15512413 15399306 15296734 15158758 14994600 14840783
10386A4840783j37073j38714j38803j18946j02192j11577j22572r7786m8960k5346
$$ 14840783 14703710 14564996 14426193 14307247 14205055 14093478 13970906 13873120 13824160 13798814
10376A3798814m9320r3267j14096r2006m8213l6409q9349j60005j60874q8865
$$ 13798814 13749494 13656227 13542131 13450125 13401912 13365503 13276154 13116149 12955275 12866410
10366A2866410n0502j10826j84552j63762r5044j07096j93648k16772j35079p2276
$$ 12866410 12815908 12705082 12520530 12356768 12261724 12154628 11960980 11744208 11609129 11536853
10356A1536853j09659j61922j43547j17976j62029k02164j36338l1590l1571j19484
$$ 11536853 11427194 11265272 11121725 11003749 10841720 10639556 10503218 10471628 10440057 10320573
10346A0320573j48525q7658n8803j17256j67864j42553j02880j01687q7333k8299
$$ 10320573 10172048 10084390 10025587 9908331 9740467 9597914 9495034 9393347 9306014 9277715
10336I277715k865o4227j27724j04040m9822o3897j13117r7911l5613l2968j00226
$$ 9277715 9274850 9210623 9082899 8978859 8929037 8865140 8752023 8654112 8618499 8585531 8485305
10325H485305j33714q7197l3599l4622o0376p0979p9697r4160q0877l5974j7654
$$ 8485305 8351591 8264394 8230795 8196173 8135797 8064818 7985121 7890961 7810084 7774110 7756456
10314G756456n6373r4165o8173n975J7222j9068p0538r3129p5498k9796J1953
$$ 7756456 7700083 7605918 7537745 7531770 7548992 7529924 7459386 7366257 7290759 7260963 7272916
10303G272916J3314k2007m4250k7323j3396m5666q6176o0708K4487P5736L5726
$$ 7272916 7286230 7264223 7219973 7192650 7179254 7133588 7047412 6986704 7011191 7086927 7122653
10292G122653m0373o3006k1907K0361K4860J5554K1836L0344J8162K73O789K9841
$$ 7122653 7082280 7019274 6997367 7017728 7042588 7058142 7079978 7110322 7128484 7128757 7135546 7165387
10280G165387L4370J7327J2280K7538K5331j5475n6741n4280k2399q651k8397
$$ 7165387 7199757 7217084 7229364 7256902 7282233 7266758 7210017 7155737 7133338 7124687 7096290
10269G096290o0734q7057r6863p9138m8132n0526r9383j31338r0730k7695l2738
$$ 7096290 7035556 6948499 6851636 6772498 6724366 6673840 6574457 6443119 6352389 6324694 6291956
10258F291956r1092j00155l7697m601o1810j26197r8084j3880J5842k8730o5770
$$ 6291956 6200864 6100709 6063012 6058411 5996601 5870404 5772320 5758440 5774282 5745552 5679782
10247E679782m6816j7787l4684p9235q6071k9562L6866L3485m8747j21428j01292
$$ 5679782 5632966 5615179 5580495 5501260 5415189 5385627 5422493 5455978 5407231 5285803 5184511
10236E184511k2311J3460j2379j9918J7530J8386n4323r7012k2931P4059M4503
$$ 5184511 5162200 5175660 5163281 5143363 5160893 5179279 5124956 5027944 5005013 5079072 5123575
10225E123575q2791j36954n6600L8387L9450j8475n4527n7306m9194k6821M782
$$ 5123575 5040784 4903830 4847230 4885617 4925067 4906592 4852065 4794759 4745565 4718744 4723526
10214D723526Q378k4532m7374l2646j3430j6171j5142Q755K7305K2226J8958K3589
$$ 4723526 4731904 4707372 4659998 4627352 4613922 4597751 4582609 4591364 4618669 4640895 4659853 4683442
10202D683442m140o6503q8895k7471M8219M9470r286n2356n5643m3438j9092K0578
$$ 4683442 4679302 4612799 4523904 4496433 4544652 4594122 4584836 4532480 4476837 4433399 4414307 4434885
10190D434885L8149L285m1240l6814k473N222p235M029K3797L829l4224k5587
$$ 4434885 4473034 4476319 4435079 4398265 4395792 4401014 4393779 4397808 4421605 4425434 4391210 4365623
10178D365623J6803J7533k2566j9729L9439N8313r864p4433m7807K2405M3424
$$ 4365623 4382426 4399959 4377393 4357664 4397103 4455416 4445552 4371119 4323312 4345717 4389141
10167D389141J8954P186J732l7576p4629l3852O0959R5394L2134k8836j643N7500
$$ 4389141 4408095 4415281 4417013 4379437 4304808 4270956 4331915 4427309 4459443 4430607 4428964 4486464
10155D486464M3770l1705o1065o207M6773K2079l6689m5614r692L699j3454p460
$$ 4486464 4530234 4498529 4437464 4431257 4478030 4500109 4463420 4417806 4408114 4411813 4398359 4390899
10143D390899K3515J5746l6453m7032J9659P2339L6658j7334L080M6702J0187
$$ 4390899 4414414 4430160 4393707 4346675 4366334 4438673 4475331 4457997 4461077 4507779 4517966
10132D517966o3903m5140N4629Q8151J9801j9358L2021O2431M605k7687N2002
$$ 4517966 4454063 4408923 4463552 4551703 4571504 4552146 4584167 4646598 4651203 4623516 4675518
10121D675518J21628M7304o8984l9742R5308J27727J7814n1222K2435J10335Q0205
$$ 4675518 4797146 4844450 4775466 4735724 4831032 4958759 4976573 4925351 4947786 5058121 5138326
10110E138326l552j1896M4427O1954J6764k0743k044N2906J00309J04565N1932
$$ 5138326 5134774 5122878 5167305 5229259 5246023 5225280 5223236 5276142 5376451 5481016 5532948
10099E532948k1821m7062l376M6389M1976O225l127J6603K3966P866j900J4056
$$ 5532948 5511127 5464065 5460689 5507078 5549054 5555279 5552152 5568755 5592721 5600587 5598687 5612743
10087E612743M5144P3525Q3327N9691J1019k0207j927M1069N7662M1961M0138
$$ 5612743 5657887 5731412 5814739 5874430 5885449 5865242 5863315 5904384 5962046 6004007 6044145
10076F044145P9969J23025J07940L2373l0111q240P9604J38704J06003K1574k4750
$$ 6044145 6124114 6247139 6355079 6387452 6357341 6349101 6428705 6567409 6673412 6694986 6670236
10065F670236L991O6121R7749O7191q000o9864o6358j5265P856k6562n8038l8575
$$ 6670236 6674227 6740348 6838097 6905288 6897288 6827424 6761066 6745801 6753657 6727095 6669057 6630482
10053F630482j5781m1961o6977k6211K2141j7526r5638q2380O75K348q6392r3973
$$ 6630482 6614701 6572740 6505763 6479552 6501693 6484167 6388529 6306149 6306824 6309172 6222780 6128807
10041F128807L0335R6182j9294j47150r3079M2895L9979p4792r0889J7837O1927
$$ 6128807 6159142 6255324 6236030 6088880 5995801 6038696 6078675 6003883 5912994 5930831 5992758
10030E992758k6996q8989k2743N0080P722p2202o1276J2822L9108M011k2598j4964
$$ 5992758 5965762 5876773 5854030 5904110 5911832 5839630 5778354 5791176 5830284 5834295 5811697 5796733
10018E796733j003Q885K0350K1323J0834J7575M1011L0790k4070n0852j150N9538
$$ 5796733 5795730 5804615 5824965 5846288 5857122 5874697 5915708 5946498 5922428 5871576 5870426 5929964
10006E929964M4787k2077n1785k6095o996k7499n1708m4939k2193j3768k1668
$$ 5929964 5974751 5952674 5900889 5874794 5867798 5840299 5788591 5743652 5721459 5707691 5686023
9995E686023k4888j1992r92k1317o5766p9269k9790K9769K5740k5966m7744l0712
$$ 5686023 5661135 5649143 5648151 5626834 5561068 5481799 5452009 5481778 5507518 5481552 5433808 5403096
9983E403096m2483r3190j01984l6010K2537P209l1366k5554k127j1867k9625j6349
$$ 5403096 5360613 5267423 5165439 5129429 5151966 5159175 5127809 5102255 5100128 5088261 5058636 5042287
9971E042287r353n2206r4771o5574L732K6448n699l2004l0035k2401j1254O795
$$ 5042287 5032934 4980728 4885957 4820383 4824115 4850563 4844864 4812860 4782825 4760424 4749170 4755965
9959D755965j271m6148o2596p062M5772J0630n9880n7623J190J7840r238k722
$$ 4755965 4754694 4708546 4645950 4638888 4684660 4695290 4635410 4577787 4578977 4596817 4587579 4584857
9947D584857K2841j9080r9758q8986J7979O5679j5744r6702n6825L9339O6901
$$ 4584857 4607698 4588618 4488860 4399874 4417853 4483532 4467788 4371086 4314261 4353600 4420501
9936D420501J8761l4968o5313p4434n1253j0823j795k1144q329L4419K6191m0385
$$ 4420501 4439262 4404294 4338981 4264547 4213294 4202471 4200676 4179532 4171203 4205622 4231813 4191428
9924D191428o0506L518M3820n642m8566m469L8367j0920o3359n178Q1472N0390
$$ 4191428 4130922 4134440 4178260 4172618 4124052 4119583 4157950 4147030 4083671 4078493 4159965 4210355
9912D210355m4436l4237O7419Q3037k2921q5365k0346M7570J2682m3489j5380
$$ 4210355 4165919 4131682 4199101 4282138 4259217 4173852 4153506 4201076 4213758 4170269 4154889
9901D154889M5351L5119k2840l2512J0277K7065l191j8485J5075M8905L0309j5646
$$ 4154889 4200240 4235359 4212519 4180007 4190284 4217349 4214158 4195673 4210748 4259653 4289962 4274316
9889D274316j8427L7657Q1997M9028k2490l4093K9419P4170M0965q112k166K3502
$$ 4274316 4255889 4293546 4375543 4424571 4402081 4367988 4397407 4471577 4512542 4504430 4502264 4525766
9877D525766P806j7100P441M4035K3846j6389O791O5795O3728P307j0012J9148
$$ 4525766 4533572 4516472 4523913 4567948 4591794 4575405 4582196 4647991 4711719 4719026 4709014 4728162
9865D728162J7658r406J9587Q2735O4194k6698l8346O6581J33301P3864P738L4468
$$ 4728162 4745820 4736414 4756001 4838736 4902930 4876232 4837886 4904467 5037768 5111632 5119370 5153838
9853E153838N8779j2683p6409j1724Q9755P1309k3738l8405K8575M7963K320k873
$$ 5153838 5212617 5199934 5123525 5111801 5201556 5272865 5249127 5210722 5239297 5287260 5289580 5286707
9841E286707N1480P0645K8925N786K7428L0989L739R183N3255O4577L1207K2317
$$ 5286707 5338187 5408832 5437757 5443543 5470971 5501960 5505699 5514882 5568137 5632714 5663921 5686238
9829E686238M9924M3883o249j9148L0911O4910M1977K5739N6560P7749M7106J0099
$$ 5686238 5736162 5780045 5773796 5754648 5785559 5850469 5892446 5918185 5974745 6052494 6099600 6109699
9817F109699L164p437l1882j3451N5441Q5386L3293j4216J6315O4386N0746J2100
$$ 6109699 6112863 6105426 6073544 6060093 6115534 6200920 6234213 6219997 6236312 6300698 6351444 6363544
9805F363544J5310L0918R368p75N9575J24903R7052J8098N374N3254N4586l80
$$ 6363544 6378854 6409772 6419140 6418365 6477940 6602843 6699895 6717993 6723367 6776621 6831207 6830827
9793F830827j0785M2253N5916l439k9043L6896Q7124K4048o6974m5000O6533J23334
$$ 6830827 6820042 6862295 6918211 6914772 6885729 6922625 7009749 7033797 6966823 6921823 6988356 7111690
9781G111690P9651K7744K9249L9350K2289K3583P2555J06899O8507P194O115N0140
$$ 7111690 7191341 7219085 7248334 7287684 7309973 7333556 7406111 7513010 7581517 7588711 7594826 7644966
9769G644966N9440K8008K8239P6688R7890N2523Q559L0473P6067P4449M3611M6597
$$ 7644966 7704406 7732414 7760653 7837341 7935231 7987754 7996313 8026786 8102853 8177302 8220913 8267510
9757H267510P7235Q2505O9341R0611J36145J37198Q5275N1849P2167R9557J01946
$$ 8267510 8344745 8427250 8496591 8587202 8723347 8860545 8945820 8997669 9069836 9169393 9271339
9746I271339J15896J65013K03468J88648J45446J14958J00347J02466J42837K06990
$$ 9271339 9387235 9552248 9755716 9944364 10089810 10204768 10305115 10407581 10550418 10757408
9736A0757408K31457J96023J65017J88685K31629K49646K60418K77364K59242
$$ 10757408 10988865 11184888 11349905 11538590 11770219 12019865 12280283 12557647 12816889
9727A2816889K04496K06908L12532M01491L42861K08216J81077K83565L54215
$$ 12816889 13021385 13228293 13540825 13942316 14285177 14493393 14674470 14958035 15312250
9718A5312250L04622K38223K64587L33390L36968K82021K62922L12607L63516
$$ 15312250 15616872 15855095 16119682 16453072 16790040 17072061 17334983 17647590 18011106
9709A8011106L46636K77437K34939K70411L45017L75797L47191L30051L61702
$$ 18011106 18357742 18635179 18870118 19140529 19485546 19861343 20208534 20538585 20900287
9700B0900287L76316L23436K84709L58905M77991M82824L72020L16836L96751
$$ 20900287 21276603 21600039 21884748 22243653 22721644 23204468 23576488 23893324 24290075
9691B4290075M77124M24436L08204K80856L52693M06774L83781L39963L39241
$$ 24290075 24767199 25191635 25499839 25780695 26133388 26540162 26923943 27263906 27603147
9682B7603147L74734M01138L93157L66306L57937L78680L91434L75297L85392
$$ 27603147 27977881 28379019 28772176 29138482 29496419 29875099 30266533 30641830 31027222
9673C1027222M71572N57770N21230L99204L69332M78345N53276M75809L81652
$$ 31027222 31498794 32056564 32577794 32976998 33346330 33824675 34377951 34853760 35235412
9664C5235412M39579N71079N83597M89556M73218N79612O60158O38895O20909
$$ 35235412 35674991 36246070 36829667 37319223 37792441 38372053 39032211 39671106 40292015
9655D0292015O81844P38101P13993O80700P19862P71540P37568O48977O12780
$$ 40292015 40973859 41711960 42425953 43106653 43826515 44598055 45335623 45984600 46597380
9646D6597380O47690O77395O52552N92219N28724M83307M74981M94779M96543
$$ 46597380 47245070 47922465 48575017 49167236 49695960 50179267 50654248 51149027 51645570
9637E1645570M64057M50106M91426N29350M91784M19201M16124M90690N41767
$$ 51645570 52109627 52559733 53051159 53580509 54072293 54491494 54907618 55398308 55940075
9628E5940075N17073M85498N11740N46114N11258M41872M47239N47439O31969
$$ 55940075 56457148 56942646 57454386 58000500 58511758 58953630 59400869 59948308 60580277
9619F0580277O06016N17454M93907N84968P14356P81688P73437P65389Q37198
$$ 60580277 61186293 61703747 62197654 62782622 63496978 64278666 65052103 65817492 66654690
9610F6654690R90736J142527J203582J179123J169272J245495J355740J401101
$$ 66654690 67645426 68787953 69991535 71170658 72339930 73585425 74941165 76342266
9602G6342266J377676J361912J364903J310530J188462J111045J142409J174385
$$ 76342266 77719942 79081854 80446757 81757287 82945749 84056794 85199203 86373588
9594H6373588J082624R25307Q49444Q52611P98580O56361N51971N48661N38308
$$ 86373588 87456212 88381519 89230963 90083574 90882154 91538515 92090486 92639147 93177455
9585I3177455M26954K90366K39788K39483J81277O8535m758k0942n6374j35911
$$ 93177455 93604409 93894775 94134563 94374046 94555323 94623858 94619100 94598158 94541784 94405873
9575I4405873j84853j53377r9759j03788j54589j74090j24001m6141M42J3394
$$ 94405873 94221020 94067643 93967884 93864096 93709507 93535417 93411416 93365275 93365717 93379111
9565I3379111M2286J16411K01049K44289K49348K64138L06238L44752L60524L70899
$$ 93379111 93421397 93537808 93738857 93983146 94232494 94496632 94802870 95147622 95508146 95879045
9555I5879045L78363L51329K86484K35785K28222K11685J25854k034r2035j22794
$$ 95879045 96257408 96608737 96895221 97131006 97359228 97570913 97696767 97694733 97602698 97479904
9545I7479904j54750k47275l91727n27490o04302o33968o83642p96045r23536
$$ 97479904 97325154 97077879 96686152 96158662 95554360 94920392 94236750 93440705 92517169
9536I2517169r88459j004036j059962j174713j257803j260211j258388j315892
$$ 92517169 91528710 90524674 89464712 88289999 87032196 85771985 84513597 83197705
9528H3197705j362199j312142j218855j181161j168166j083281r55862r03184
$$ 83197705 81835506 80523364 79304509 78123348 76955182 75871901 74916039 74012855
9520G4012855r16645q60401p04556n89636o02445o41060n86666m80484m28754
$$ 74012855 73096210 72235809 71531253 70941617 70339172 69698112 69111446 68630962 68202208
9511F8202208m34293m32558m20213m38422m77299m94407m94396n07771n21918
$$ 68202208 67767915 67335357 66915144 66476722 65999423 65505016 65010620 64502849 63980931
9502F3980931n08927m92346n13111n54908n72183n66062n64567n56606n21995
$$ 63980931 63472004 62979658 62466547 61911639 61339456 60773394 60208827 59652221 59130226
9493E9130226n02182n53024o35876o48089n75085n25604n81733o85646p27297
$$ 59130226 58628044 58075020 57439144 56791055 56215970 55690366 55108633 54422987 53695690
9484E3695690o95757o79935p34880q07302q12952p52353p09522p37015p83693
$$ 53695690 52999933 52319998 51585118 50777816 49964864 49212511 48502989 47765974 46982281
9475D6982281p66525o85824o19232o11121o27245o26230o12542n96451n65472
$$ 46982281 46215756 45529932 44910700 44299579 43672334 43046104 42433562 41837111 41271639
9466D1271639n30939n39318n89197n99928n26506m47900m60097n27056n34675
$$ 41271639 40740700 40201382 39612185 39012257 38485751 38037851 37577754 37050698 36516023
9457C6516023m66706m20365m46944m81747m59427m09001l89524l99840m03292
$$ 36516023 36049317 35628952 35182008 34700261 34240834 33831833 33442309 33042469 32639177
9448C2639177l94380l92704m01842m12725m24834m35571m30633m08131l91191
$$ 32639177 32244797 31852093 31450251 31037526 30612692 30177121 29746488 29338357 28947166
9439B8947166l97512m17272m35885m54326m71176m69660m41902m07418l92261
$$ 28947166 28549654 28132382 27696497 27242171 26770995 26301335 25859433 25452015 25059754
9430B5059754m04329m34321m59681m46941l83727l15860l13010l78408m30587
$$ 25059754 24655425 24221104 23761423 23314482 22930755 22614895 22301885 21923477 21492890
9421B1492890m03033l29006k90820l09687l31099l11706k75448k70827l03422
$$ 21492890 21089857 20760851 20470031 20160344 19829245 19517539 19242091 18971264 18667842
9412A8667842l34680l36199l20905l14693l15144k98400k61919k34486k35861
$$ 18667842 18333162 17996963 17676058 17361365 17046221 16747821 16485902 16251416 16015555
9403A6015555k51364k61675k72694k92268l00618k75681k31940k02306j95155
$$ 16015555 15764191 15502516 15229822 14937554 14636936 14361255 14129315 13927009 13731854
9394A3731854j99559k14349k35463k34757j96942j60416j69593k01393j98189
$$ 13731854 13532295 13317946 13082483 12847726 12650784 12490368 12320775 12119382 11921193
9385A1921193j62287j48148j63867j60165j28723j26624j72604k00157j60883
$$ 11921193 11758906 11610758 11446891 11286726 11158003 11031379 10858775 10658618 10497735
9376A0497735j04134r6892j24068j32043j22247j31520j53074j46631j09684q0053
$$ 10497735 10393601 10296709 10172641 10040598 9918351 9786831 9633757 9487126 9377442 9297389
9366I297389p8286r4091j16404j35464j31591j01383p7026q3600j00573j01094
$$ 9297389 9219103 9125012 9008608 8873144 8741553 8640170 8563144 8479544 8378971 8277877
9356H277877r7480j04805r6224n0458j1610l6127j01470j34130j14356q7695q2964
$$ 8277877 8180397 8075592 7979368 7928910 7917300 7881173 7779703 7645573 7531217 7443522 7360558
9345G360558q4524q0067p2065m7593j570J8556l4982j17044j30948o9367k5823
$$ 7360558 7276034 7195967 7123902 7076309 7074739 7093295 7058313 6941269 6810321 6740954 6715131
9334F715131m6607o5371k6182J7854o132p1659r8787p4621n3276o0152o4384m0924
$$ 6715131 6668524 6603153 6576971 6594825 6588693 6517034 6418247 6343626 6290350 6230198 6165814 6124890
9322F124890q337p85l0804p6123q9599m3577K0699K3101m9908j09651p5591J2808
$$ 6124890 6116553 6115768 6084964 6008841 5919242 5875665 5896364 5919465 5869557 5759906 5684315 5697123
9310E697123M6198j2698q9865r7925l0676M1840M4699l1993j15432j17683l9535
$$ 5697123 5743321 5730623 5640758 5542833 5512157 5553997 5598696 5566703 5451271 5333588 5294053
9299E294053K1967k560o2811o8354k2179l472l6220n9007l3610l301j3361m1187
$$ 5294053 5316020 5313460 5250649 5182295 5160116 5156644 5120424 5061417 5027807 5024506 5011145 4969958
9287D969958m7624m2342m7356l9875P179N4857L5037m6745j04822q1651j5264
$$ 4969958 4922334 4879992 4832636 4792761 4799940 4854797 4889834 4843089 4738267 4656616 4641352
9276D641352K0492M294k9880m7740l9875j0699K3518L3085K818m0137n4929m2447
$$ 4641352 4661844 4666138 4636258 4588518 4548643 4537944 4561462 4594547 4597365 4557228 4502299 4459852
9264D459852l8677m9691l7544Q293L1838j2580p6604p1009P666O6212L9418l2330
$$ 4459852 4421175 4371484 4333940 4342233 4374071 4361491 4284887 4213878 4221544 4287756 4327174 4294844
9252D294844p2239o1639l1291k857J5939R437k3087m2572j7478J6795j210o1100
$$ 4294844 4222605 4160966 4129675 4126818 4142757 4152194 4129107 4086535 4069057 4085852 4084642 4023542
9240D023542q0397j8777N6874N5540k0054p8007n0352L1353P8819M4785l3403
$$ 4023542 3943145 3924368 3981242 4036782 4016728 3938721 3888369 3919722 3998541 4043326 4009923
9229D009923p9263n4377J0613N2476L4570k5483p4198o7038q430M7108M4981j1866
$$ 4009923 3930660 3876283 3886896 3939372 3973942 3948459 3874261 3807223 3798793 3845901 3890882 3879016
9217C879016o5276o5680j9796K9289M9349L5200q63l5163m3518k5347o695m815
$$ 3879016 3813740 3748060 3728264 3757553 3806902 3842102 3841239 3806076 3762558 3737211 3730516 3725701
9205C725701m885J1086L0333K8034N630j4824k2774k0606n466K1912M0229L0010
$$ 3725701 3720816 3731902 3762235 3790269 3795899 3781075 3758301 3737695 3732229 3754141 3794370 3824380
9193C824380O666J392J4129J5874m568k5465k3713K478L7949N5721L1537j8203
$$ 3824380 3831046 3832438 3846567 3862441 3857873 3832408 3808695 3811173 3849122 3904843 3936380 3918177
9181C918177l3393J3821O1409L2976m3573o5994q128M3407K7333l689J5880N0738
$$ 3918177 3884784 3898605 3960014 3992990 3949417 3883423 3875295 3918702 3946035 3942346 3958226 4008964
9169D008964K8894l1818m9799q841K4668J1747j0247m389P532n997k8574k4768
$$ 4008964 4037858 4006040 3956241 3947400 3972068 3983815 3973568 3969179 3976711 3970714 3942140 3917372
9157C917372K996K0372R527j2355j6408Q005M0203M2693J668m7980n7832k6512
$$ 3917372 3920368 3940740 3950267 3937912 3921504 3929509 3969712 4012405 4014073 3966093 3908261 3881749
9145C881749L18n003j8696j1886J564p503l0565l3407j3735p941l1924m8647j8729
$$ 3881749 3882067 3877064 3858368 3846482 3848046 3840543 3809978 3776571 3762836 3754895 3722971 3674324 3655595
9132C655595L4943M5332j2592q0250q0981j6462L2212R005m1109l3963L0020N5534
$$ 3655595 3690538 3735870 3723278 3643028 3562047 3545585 3577797 3586802 3545693 3511730 3541750 3597284
9120C597284j6054j13048j19748l0971M2540K4151l7967n6146k2084O751n43k6294
$$ 3597284 3581230 3468182 3348434 3317463 3360003 3384154 3346187 3290041 3267957 3274708 3274165 3247871
9108C247871n0498o1244l5270K9299P0073K1232p9037j17297n7999J0207J1143
$$ 3247871 3197373 3136129 3100859 3130158 3200231 3221463 3142426 3025129 2967130 2977337 2988480
9097B988480j8633j6196J610q528k3557k483K1629p294o0142o2492j8169N880
$$ 2988480 2969847 2953651 2955261 2946733 2923176 2920693 2942322 2935028 2874886 2812394 2794225 2800105
9085B800105o81O917J8788j9628q3146p7932j529L5539r154l7025J6700O2219
$$ 2800105 2799424 2806341 2825129 2805501 2722355 2644423 2642894 2678433 2669279 2632254 2648954 2711173
9073B711173O843q0130p5519J535L0385k0322o6668n2582q957K2862L3185J3486
$$ 2711173 2718016 2637886 2562367 2563902 2594287 2573965 2507297 2454715 2445758 2468620 2501805 2515291
9061B515291l5224o9244m9525r190k867j1271K0254O8227N3336k6837q3688o7068
$$ 2515291 2480067 2410823 2361298 2352108 2349241 2337970 2358224 2426451 2479787 2452950 2369262 2302194
9049B302194k1336L257J1392J3497n442l7896m1324m946K4231P735l5621o2603
$$ 2302194 2280858 2284115 2295507 2309004 2303562 2265666 2224342 2219396 2243627 2251362 2215741 2153138
9037B153138n0048n399L1385J3762m0659m4084L2479P8338p262j33731j26742
$$ 2153138 2103090 2097691 2129076 2142838 2102179 2058095 2090574 2168912 2161650 2027919 1901177
9026A901177N852P9550J6481n1995j7433M2283K2450l4122l8227j1437j8443l5260
$$ 1901177 1907029 1986579 2003060 1951065 1933632 1975915 1998365 1964243 1926016 1914579 1896136 1860876
$$ [...]
##END NTUPLES=NMR SPECTRUM
##END=
