##TITLE=1H ikalashn
EC-3336(1)
19.11.2024
##JCAMPDX= 6.0         $$ Bruker NMR JCAMP-DX V2.0
##DATA TYPE= NMR SPECTRUM
##DATA CLASS= NTUPLES
##ORIGIN= UXNMR, Bruker Analytische Messtechnik GmbH
##OWNER= root
$$ TOPSPIN		Version 1.3
$$ 2024-11-19 10:26:31.828 +0400  Irina@DPX200
$$ Compression mode = diff/dup
##.OBSERVE FREQUENCY= 200.131300845
##.OBSERVE NUCLEUS= ^1H
##.ACQUISITION MODE= SIMULTANEOUS
##.ACQUISITION SCHEME= undefined
##.AVERAGES= 32
##.DIGITISER RES= 18
##SPECTROMETER/DATA SYSTEM= spect
##.PULSE SEQUENCE= zg
##.SOLVENT NAME= CDCl3
##.SHIFT REFERENCE= INTERNAL, CDCl3, 1, 17.49637
##AUDIT TRAIL= $$ (NUMBER, WHEN, WHO, WHERE, WHAT)
$$ ##TITLE= Audit trail, TOPSPIN		Version 1.3
$$ ##JCAMPDX= 5.01
$$ ##ORIGIN= Bruker BioSpin GmbH
$$ ##OWNER= Irina
$$ $$ F:/spectra/data/iren/nmr/1H/4/pdata/1/auditp.txt
$$ ##AUDIT TRAIL=  $$ (NUMBER, WHEN, WHO, WHERE, VERSION, WHAT)
(   1,<2024-11-19 10:26:00.156 +0400>,<Irina>,<DPX200>,<TOPSPIN 1.3>,
      <created by zg
	started at 2024-11-19 10:23:47.703 +0400,
	POWCHK disabled, PULCHK disabled
       configuration hash MD5:
       BE 6D 3F 07 2A EA 11 49 91 17 2B D3 AF B3 58 0D
       data hash MD5: 16K
       5A BF D7 DF 40 36 92 38 04 55 91 73 9E A3 C5 27>)
(   2,<2024-11-19 10:26:05.609 +0400>,<Irina>,<DPX200>,<TOPSPIN 1.3>,
      <Start of raw data processing
       efp BC_mod = 2 LB = 0.02 FT_mod = 6 PKNL = 1 PHC0 = 322.7296 PHC1 = 2.325537 SI = 32K 
       data hash MD5: 32K
       52 2F 5D FB 3C AD 1B 47 E1 6A AB 81 09 55 53 62>)
(   3,<2024-11-19 10:26:08.203 +0400>,<Irina>,<DPX200>,<TOPSPIN 1.3>,
      <apk 
       data hash MD5: 32K
       D4 A6 4E 45 0D 7F 95 7F D0 78 66 60 5E 84 C8 06>)
(   4,<2024-11-19 10:26:21.015 +0400>,<Irina>,<DPX200>,<TOPSPIN 1.3>,
      <pk fgphup PHC0 = 3.511914 PHC1 = -6.4 
       data hash MD5: 32K
       80 22 62 4C 3B 18 B0 37 65 0E 23 E2 B7 3F A7 76>)
(   5,<2024-11-19 10:26:22.468 +0400>,<Irina>,<DPX200>,<TOPSPIN 1.3>,
      <abs n ABSG = 5 
       data hash MD5: 32K
       EE E4 FA C0 D7 D5 8E 20 74 86 1E 32 AA B4 FE 94>)
$$ ##END=
$$ 
$$ $$ hash MD5
$$ $$ 12 0D 76 64 72 17 3F 2B 09 E8 48 E2 FE 4E 98 D7
##$RELAX= 
##$RELAX= 
##$RELAX= 
##$RELAX= 
##$RELAX= 
##$RELAX= 
##$RELAX= 
##$RELAX= 
##$RELAX= 
$$ Bruker specific parameters
$$ --------------------------
##$DU= <F:/spectra>
##$EXPNO= 4
##$NAME= <1H>
##$PROCNO= 1
##$TYPE= <nmr>
##$USER= <iren>
##$AMP= (0..31)
100 100 100 100 100 100 100 100 100 100 100 100 100 100 100 100 100 100 
100 100 100 100 100 100 100 100 100 100 100 100 100 100 
##$ANAVPT= -1
##$AQSEQ= 0
##$AQ_mod= 1
##$AUNM= <au_zg>
##$AUTOPOS= <>
##$BF1= 200.13
##$BF2= 200.13
##$BF3= 200.13
##$BF4= 200.13
##$BF5= 200.13
##$BF6= 200.13
##$BF7= 200.13
##$BF8= 200.13
##$BYTORDA= 1
##$CFDGTYP= 0
##$CFRGTYP= 5
##$CHEMSTR= <none>
##$CNST= (0..63)
1 1 145 1 1 1 1 1 1 1 1 1 1 1 1 1 1 1 1 1 1 1 1 1 1 1 1 1 1 1 1 1 1 1 
1 1 1 1 1 1 1 1 1 1 1 1 1 1 1 1 1 1 1 1 1 1 1 1 1 1 1 1 1 1 
##$CPDPRG= <>
##$CPDPRG1= <>
##$CPDPRG2= <>
##$CPDPRG3= <>
$$ [...]
##$SW_h= 4401.40845070422
##$TD= 16384
##$TD0= 1
##$TE= 300
##$TE2= 300
##$TE3= 300
##$TEG= 300
##$TL= (0..7)
0 120 120 120 120 120 120 120 
##$TP= (0..7)
150 150 150 150 150 150 150 150 
##$TP07= 0
##$TPNAME0= <>
##$TPNAME1= <>
##$TPNAME2= <>
##$TPNAME3= <>
##$TPNAME4= <>
##$TPNAME5= <>
##$TPNAME6= <>
##$TPNAME7= <>
##$TPOAL= (0..7)
0.5 0.5 0.5 0.5 0.5 0.5 0.5 0.5 
##$TPOFFS= (0..7)
0 0 0 0 0 0 0 0 
##$TUNHIN= 0
##$TUNHOUT= 0
##$TUNXOUT= 0
##$USERA1= <user>
##$USERA2= <user>
##$USERA3= <user>
##$USERA4= <user>
##$USERA5= <user>
##$V9= 5
##$VALIST= <valist>
##$VCLIST= <CCCCCCCCCCCCCCC>
##$VD= 0
##$VDLIST= <DDDDDDDDDDDDDDD>
##$VPLIST= <PPPPPPPPPPPPPPP>
##$VTLIST= <TTTTTTTTTTTTTTT>
##$WBST= 1024
##$WBSW= 25
##$XGAIN= (0..3)
0 0 0 0 
##$XL= 0
##$YL= 0
##$YMAX_a= 447073
##$YMIN_a= -1046375
##$ZGOPTNS= <>
##$ZL1= 120
##$ZL2= 120
##$ZL3= 120
##$ZL4= 120
##$ABSF1= 17.49637
##$ABSF2= -4.496376
##$ABSG= 5
##$ABSL= 3
##$ALPHA= 0
##$AQORDER= 0
##$ASSFAC= 0
##$ASSFACI= 0
##$ASSFACX= 0
##$ASSWID= 0
##$AUNMP= <proc_1d>
##$AXLEFT= 0
##$AXRIGHT= 0
##$AXTYPE= 0
##$AXUNIT= <>
##$AZFE= 0.1
##$AZFW= 0.1
##$BCFW= 0
##$BC_mod= 2
##$BYTORDP= 0
##$COROFFS= 0
##$CY= 7568.61572265625
##$DATMOD= 1
##$DC= 0
##$DFILT= <>
##$DTYPP= 0
##$F1P= 17.9538593292236
##$F2P= -4.03888763876832
##$FCOR= 0.5
##$FTSIZE= 32768
##$FT_mod= 6
##$GAMMA= 0
##$GB= 0
##$INTBC= 0
##$INTSCL= 1.367314e-010
##$ISEN= 128
##$LB= 0.02
##$LEV0= 0
##$LPBIN= 0
##$MAXI= 945.577
##$MC2= 0
##$MEAN= 0
##$ME_mod= 0
##$MI= -402.1523
##$NCOEF= 0
##$NC_proc= -7
##$NLEV= 6
##$NOISF1= 8.587773
##$NOISF2= 6.764455
##$NSP= 0
##$NTH_PI= 0
##$NZP= 0
##$OFFSET= 17.49637
##$PC= 1
##$PHC0= 327.8841
##$PHC1= -6.278573
##$PH_mod= 1
##$PKNL= yes
##$PPARMOD= 0
##$PPDIAG= 0
##$PPIPTYP= 0
##$PPMPNUM= 100
##$PPRESOL= 1
##$PSCAL= 0
##$PSIGN= 0
##$REVERSE= no
##$SF= 200.13
##$SI= 32768
##$SIGF1= 16.12182
##$SIGF2= -4.496377
##$SINO= 3.521527
##$SIOLD= 32768
##$SREGLST= <1H.CDCl3>
##$SSB= 0
##$STSI= 32768
##$STSR= 0
##$SW_p= 4401.40845070422
##$SYMM= 0
##$S_DEV= 0
##$TDeff= 16384
##$TDoff= 0
##$TI= <>
##$TILT= no
##$TM1= 0
##$TM2= 0
##$TOPLEV= 0
##$USERP1= <user>
##$USERP2= <user>
##$USERP3= <user>
##$USERP4= <user>
##$USERP5= <user>
##$WDW= 1
##$XDIM= 32768
##$YMAX_p= 494162015
##$YMIN_p= -1464243
$$ End of Bruker specific parameters
$$ ---------------------------------
##NTUPLES= NMR SPECTRUM
##VAR_NAME=  FREQUENCY,     SPECTRUM/REAL,   SPECTRUM/IMAG
##SYMBOL=    X,             R,               I
##VAR_TYPE=  INDEPENDENT,   DEPENDENT,       DEPENDENT
##VAR_FORM=  AFFN,          ASDF,            ASDF
##VAR_DIM=   32768,         32768,           32768
##UNITS=     HZ,            ARBITRARY UNITS, ARBITRARY UNITS
##FACTOR=    0.134324425510551, 1,           1
##FIRST=     4401.40845070422, 122508,       -4685569
##LAST=      0,             -587261,         -4763419
##MIN=       0,             -1464243,        0
##MAX=       4401.40845070422, 494162015,    0
$$ Real data points
##PAGE= N=1
##DATA TABLE= (X++(R..R)), XYDATA
$$ [...]
11194D0298834J397697J632760J620604J644137J858578J947754J744960J700927
$$ 40298834 41696531 43329291 44949895 46594032 48452610 50400364 52145324 53846251
11186E3846251K202082K844368L027562K957289L327001M181133M881293N200010
$$ 53846251 56048333 58892701 61920263 64877552 68204553 72385686 77266979 82466989
11178H2466989N660796O597626P563862P990282P853335P302290O126906M120933
$$ 82466989 88127785 94725411 102289273 110279555 118132890 125435180 131562086 135683019
11170A35683019J675814n10075k176276l505113m480857m768034m355770l889620
$$ 135683019 137358833 136848758 134672482 131167369 126686512 121918478 117562708 113673088
11162A13673088m029081m659789n085218m976474m777111m988663n351524n145270
$$ 113673088 109644007 104984218 99899000 94922526 90145415 85156752 79805228 74659958
11154G4659958m236792l340708l052089l060092k712260k040657j671874j819722
$$ 74659958 70423166 67082458 64030369 60970277 58258017 56217360 54545486 52725764
11146E2725764j963462j652433j125033q65247r21610r89131r11247p71433o44136
$$ 52725764 50762302 49109869 47984836 47119589 46197979 45208848 44297601 43526168 42882032
11137D2882032n50096n49879o15376n11485j01123K94877J89369l66802p06641
$$ 42882032 42331936 41782057 41166681 40655196 40554073 40848950 41038319 40671517 39964876
11128C9964876l58191L14444N56417J75472k81349l07257l5691J10922O1037M7874
$$ 39964876 39606685 39921129 40477546 40653018 40371669 40064412 40028721 40139643 40200680 40248554
11118D0248554J12415Q4670J3006J37701L63832K71041j46578k84137J65613O19122
$$ 40248554 40360969 40445639 40458645 40596346 40960178 41231219 41084641 40800504 40966117 41585239
11108D1585239M53272J4434P9542O04750Q21326M63846O6711J3121J27882L37307
$$ 41585239 42038511 42052945 42132487 42737237 43558563 44022409 44089120 44102241 44230123 44567430
11098D4567430Q49732J417456J327061N62526J16070N72699J212516J219940R66826
$$ 44567430 45417162 46834618 48161679 48724205 48840275 49412974 50625490 51845430 52812256
11089E2812256J180540J564425J398460J006736J317351K179066K470436J952243
$$ 52812256 53992796 55557221 56955681 57962417 59279768 61458834 63929270 65881513
11081F5881513J698771K363514L223766L485891L486551L901382M625831N219641
$$ 65881513 67580284 69943798 73167564 76653455 80140006 84041388 88667219 93886860
11073I3886860N759150O407297O672825N978585M639558L470921K643128J668890
$$ 93886860 99646010 106053307 112726132 118704717 123344275 126815196 129458324 131127214
11065A31127214L63325r23901j973834k900042l656263l971480l879337l778194
$$ 131127214 131490539 130566638 128592804 125692762 122036499 118065019 114185682 110407488
11057A10407488l848405l884230l805771l847263m065330m110359l730381l149987
$$ 110407488 106559083 102674853 98869082 95021819 90956489 86846130 83115749 79965762
11049G9965762k703865k390891k050192j734691j610881j616501j491431j133657
$$ 79965762 77261897 74871006 72820814 71086123 69475242 67858741 66367310 65233653
11041F5233653p42148n69123o20797o59379m95546k21653p4020r8109j16265m7313
$$ 65233653 64491505 63922382 63301585 62642206 62146660 61925007 61850987 61752878 61636613 61589300
11031F1589300k3536r0072n8863J52322L11764K58200K08252L52236M43376K33311
$$ 61589300 61565764 61475692 61416829 61569151 61880915 62139115 62347367 62699603 63142979 63376290
11021F3376290L9681K94204P06306N83255k9426k80912K30230Q41410Q13764L41536
$$ 63376290 63415971 63710175 64416481 64999736 64970310 64689398 64919628 65761038 66574802 66916338
11011F6916338J21574L62937P17877R01354R17313Q43255P57327P62863Q46950
$$ 66916338 67037912 67400849 68118726 69020080 69937393 70780648 71537975 72300838 73147788
11002G3147788Q75394Q79841J070879J397213J471855J198169J062469J452897
$$ 73147788 74023182 74903023 75973902 77371115 78842970 80041139 81103608 82556505
10994H2556505K076894K462627K656584K956830L330939L635360M036884M573433
$$ 82556505 84633399 87096026 89752610 92709440 96040379 99675739 103712623 108286056
10986A08286056M641412L710980K337402J591202J549714J260481K73918p34840
$$ 108286056 112927468 116638448 118975850 120567052 122116766 123377247 123651165 122916325
10978A22916325j141435j269614j649185k124675k275228k157987k066924j996562
$$ 122916325 121774890 120505276 118856091 116731416 114456188 112298201 110231277 108234715
10970A08234715j860975j836744j990557j969627j573913j223653j288720j364949
$$ 108234715 106373740 104536996 102546439 100576812 99002899 97779246 96490526 95125577
10962I5125577r01717k11673n9224m28212n37105o7842M31080N01627L94348M73530
$$ 95125577 94223860 94012187 93952963 93524751 92987646 92919804 93350884 93852511 94246859 94720389
10952I4720389O35652O54333O10604O49060P02824P40581R05752J148038J117910
$$ 94720389 95356041 96010374 96620978 97270038 97972862 98713443 99619195 100767233 101885143
10943A01885143P31308M45509O09991R01188Q27223M93617L74968N19103N00623
$$ 101885143 102616451 103061960 103671951 104573139 105400362 105893979 106268947 106788050 107288673
10934A07288673J14669l52547n92554o32887o37630o55941o85423p61148q68119
$$ 107288673 107403342 107050795 106458241 105825354 105187724 104531783 103846360 103085212 102217093
10925A02217093r12839q52494p45487o56609o16629o54661p46252p60391n95353
$$ 102217093 101304254 100451760 99706273 99049664 98433035 97778374 97032122 96271731 95676378
10916I5676378l40482j73123j34141j35704j34115j50103j80422k34616l71272
$$ 95676378 95335896 95162773 95028632 94892928 94758813 94608710 94428288 94193672 93822400
10907I3822400n39019n17449k41195l1811j91421m84768m26167k9228K03031Q3692
$$ 93822400 93283381 92765932 92524737 92492926 92301505 91816737 91390570 91361342 91564373 91648065
10897I1648065J1506K45530M39871K64926M3214K54001P00301P62066L69240J30041
$$ 91648065 91659571 91905101 92344972 92609898 92653112 92907113 93607414 94369480 94738720 94868761
10887I4868761M23128Q83649R93240P70439N91659O12520O89845P25347P74891
$$ 94868761 95291889 96175538 97168778 97939217 98530876 99143396 99833241 100558588 101333479
10878A01333479Q46224Q35010P10181O02433O33425P45589P80190O93230O18053
$$ 101333479 102179703 103014713 103724894 104327327 104960752 105706341 106486531 107179761 107797814
10869A07797814O84037Q23115Q39207O74391N03832N07339O42429P43521P62962
$$ 107797814 108481851 109304966 110144173 110818564 111322396 111829735 112472164 113215685 113978647
10860A13978647P76307Q06141Q07881Q11301Q96281J007064R69010P50644N52102
$$ 113978647 114754954 115561095 116368976 117180277 118076558 119083622 120052632 120803276 121355378
10851A21355378N52940P09750Q87027J042215J162250J154559R75788P94910Q42611
$$ 121355378 121908318 122618068 123505095 124547310 125709560 126864119 127839907 128634817 129477428
10842A29477428J102448J306095J274111J146858J205717J520862J854892J933350
$$ 129477428 130579876 131885971 133160082 134306940 135512657 137033519 138888411 140821761
10834A40821761J773697J680252J877248K216184K361168K245436K181372K446034
$$ 140821761 142595458 144275710 146152958 148369142 150730310 152975746 155157118 157603152
10826A57603152K897743L147375L046117K851535K901211L234474L586493L701202
$$ 157603152 160500895 163648270 166694387 169545922 172447133 175681607 179268100 182969302
10818A82969302L590706L475372L500297L579040L556115L446270L399401L463903
$$ 182969302 186560008 190035380 193535677 197114717 200670832 204117102 207516503 210980406
10810B10980406L527808L496525L381482L201646K970850K808211K843703K944896
$$ 210980406 214508214 218004739 221386221 224587867 227558717 230366928 233210631 236155527
10802B36155527K791668K357297K039172K090450K200381J975661J609530J612759
$$ 236155527 238947195 241304492 243343664 245434114 247634495 249610156 251219686 252832445
10794B52832445J976992K126478J778621J367985J397328J758209J999882J996161
$$ 252832445 254809437 256935915 258714536 260082521 261479849 263238058 265237940 267234101
10786B67234101K003817K212723K556883K912879L228062L464956L613714L762229
$$ 267234101 269237918 271450641 274007524 276920403 280148465 283613421 287227135 290989364
10778B90989364M023875M420628M925372N522135O099223O418390O399073O339886
$$ 290989364 295013239 299433867 304359239 309881374 315980597 322398987 328798060 335137946
10770C35137946O607376P140474P524408P560374P472758P473210P422491P122587
$$ 335137946 341745322 348885796 356410204 363970578 371443336 378916546 386339037 393461624
10762C93461624O700284O399048O112017N469809M417261L376421K679975K100781
$$ 393461624 400161908 406560956 412672973 418142782 422560043 425936464 428616439 430717220
10754D30717220J207465L5777r29085j430466j762700k295419k968101l478380
$$ 430717220 431924685 431960462 431031377 429600911 427838211 425542792 422574691 419096311
10746D19096311l747735l905395l948836l755261l386839l062136k814019k479157
$$ 419096311 415348576 411443181 407494345 403739084 400352245 397290109 394476090 391996933
10738C91996933k041373j640697j194085m27674N57647J209241J317931J467142
$$ 391996933 389955560 388314863 387120778 386693104 387250751 388459992 389777923 391245065
10730C91245065K229498L247738L716256L606168L715205M442701N204194N353022
$$ 391245065 393474563 396722301 400438557 404044725 407759930 412202631 417406825 422759847
10722D22759847N103048N059276N229143N093215M497563L873469L501676L074274
$$ 422759847 427862895 432922171 438151314 443244529 447742092 451615561 455117237 458191511
10714D58191511K229192J140568K24406n22217j477820k745535l952610m801368
$$ 458191511 460420703 461561271 461785677 461263460 459785640 457040105 453087495 448286127
10706D48286127n458789o169196o779904p011796p023144p260502p765457q069592
$$ 448286127 442827338 436658142 429878238 422866442 415843298 408582796 400817339 392747747
10698C92747747p887643p514748p336732p293905p091696o658511o115247n538807
$$ 392747747 384860104 377345356 370008624 362714719 355623023 348964512 342849265 337310458
10690C37310458n036347m800223m781848m580361m011879l497040l437777l510756
$$ 337310458 332274111 327473888 322692040 318111679 314099800 310602760 307164983 303654227
10682C03654227l170087k615792k525730k912940l077188k791862k682414l119217
$$ 303654227 300484140 297868348 295342618 292429678 289352490 286560628 283878214 280758997
10674B80758997l549316l434467l160422l364894l893362m148365m108971m250431
$$ 280758997 277209681 273775214 270614792 267249898 263356536 259208171 255099200 250848769
10666B50848769m660243m964743n053527n195504n421613n424531n171360n050505
$$ 250848769 246188526 241223783 236170256 230974752 225553139 220128608 214957248 209906743
10658B09906743n244440n440119n356927n144203n040955n000934m886583m740182
$$ 209906743 204662303 199222184 193865257 188721054 183680099 178679165 173792582 169052400
10650A69052400m630554m462561m156439l843699l699949l705188l695773l547909
$$ 169052400 164421846 159959285 155802846 151959147 148259198 144554010 140858237 137310328
10642A37310328l244026k886829k684753k764513k957669k934210k585846k130348
$$ 137310328 134066302 131179473 128494720 125730207 122772538 119838328 117252482 115122134
10634A15122134j832225j779543j908235k049462j987000j690407j446532j508792
$$ 115122134 113289909 111510366 109602131 107552669 105565669 103875262 102428730 100919938
10626A00919938j686442j600929j283946j112427j158799j090665q14696p07809
$$ 100919938 99233496 97632567 96348621 95236194 94077395 92986730 92172034 91464225
10618I1464225r76681j252061j151520q70389q32038j028686j103062r10433o49316
$$ 91464225 90487544 89235483 88083963 87213574 86381536 85352850 84249788 83339355 82690039
10609H2690039n34683o07622p82866q98523q31648o82108o59494p13394n77659
$$ 82690039 82155356 81547734 80764868 79866345 79034697 78352589 77693095 76979701 76402042
10600G6402042k89186k47333n44189p07108m46262j75527l20460n67281m06629
$$ 76402042 76112856 75865523 75321334 74614226 74167964 73992437 73671977 73104696 72698067
10591G2698067l5867R455j56102K1043M62080M86843j9617l40008n1945L76590
$$ 72698067 72662200 72671655 72515553 72536596 72998676 73485519 73465902 73125894 73073949 73450539
10581G3450539M60370M25853O04982P56235N79393L96542O58173J116185J164113
$$ 73450539 73910909 74336762 74941744 75697979 76277372 76673914 77332087 78448272 79612385
10572G9612385Q10823O70676J038275J546779J787932J779641J716010J675196
$$ 79612385 80423208 81093884 82132159 83678938 85466870 87246511 88962521 90637717
10564I0637717J733703K031143K520117K883900K897265K724178K697658K903984
$$ 90637717 92371420 94402563 96922680 99806580 102703845 105428023 108125681 111029665
10556A11029665L137277L225790L251071L366916L463637L169691K286342J104003
$$ 111029665 114166942 117392732 120643803 124010719 127474356 130644047 132930389 134034392
10548A34034392Q7678o91147j529923k493232l200710l377551l269138l234932
$$ 134034392 134122070 133430923 131901000 129407768 126207058 122829507 119560369 116325437
10540A16325437l237795l102883l017679l279723l679048l682752l250461k917955
$$ 116325437 113087642 109984759 106967080 103687357 100008309 96325557 93075096 90157141
10532I0157141k929363k830973k232044j496537j215983j311022j203824p46823
$$ 90157141 87227778 84396805 82164761 80668224 79452241 78141219 76937395 76190572
10524G6190572m15390n37976q54787j019536j085800j202465j209310r54237p55394
$$ 76190572 75775182 75237206 74382419 73362883 72277083 71074618 69865308 68911071 68155677
10515F8155677j039942j616409j832995j511213j206103j356693j670653j674431
$$ 68155677 67115735 65499326 63666331 62155118 60949015 59592322 57921669 56247238
10507E6247238j446381j354040j381621j252738j031625j033569j212164j207176
$$ 56247238 54800857 53446817 52065196 50812458 49780833 48747264 47535100 46327924
10499D6327924j010224r95276j190081j130773o70134l40466n47446r11843q73881
$$ 46327924 45317700 44322424 43132343 42001570 41331436 40990970 40443524 39531681 38657800
10490C8657800n45812m41271o45057p90883o94167n10790l71021k95871l82691
$$ 38657800 38111988 37670717 37025660 36234777 35540610 35029820 34658799 34362928 33980237
10481C3980237o51427p99109n41340j24474m8338l24128m78798l02656j10545
$$ 33980237 33328810 32529701 31988361 31863887 31815549 31491421 31012623 30709967 30599422
10472C0599422j78816l68044m41205l81816k60632j09226k9971j28460k74629
$$ 30599422 30420606 30052562 29611357 29229541 28968909 28859683 28829712 28701252 28426623
10463B8426623k47296j35026k15961m21829l78119n4288J21944n5254k76690k98896
$$ 28426623 28179327 28044301 27828340 27406511 27028392 26974104 27096048 27040794 26764104 26465208
10453B6465208l00818m05466l78231j45030r2350m19432o70487m22659j6047j8238
$$ 26465208 26164390 25758924 25380693 25235663 25143313 24723881 24053394 23630735 23614688 23596450
10443B3596450l16794l89677k13462k04809m00897m02873j22438O2332l8677j90034
$$ 23596450 23279656 22889979 22676517 22471708 22070811 21667938 21545500 21607832 21569155 21379121
10433B1379121k30526k73228l09314j43621J39780J62986j23927k97922j32752
$$ 21379121 21148595 20875367 20566053 20422432 20562212 20725198 20601271 20303349 20170597
10424B0170597P1303M9030l2691j9501j16967m21629n51584k04890K61597L05165
$$ 20170597 20241900 20290930 20258239 20238738 20121771 19700142 19148558 18943668 19205265 19510430
10414A9510430p162j74222m9123N6519l1964j37619j18062n9768m6461n7913j10499
$$ 19510430 19503268 19329046 19279923 19336442 19304478 19166859 19048797 18989029 18942568 18884655 18774156
10403A8774156k05292j77468P0350K46034j664m36640m14562J71981O32972M25787
$$ 18774156 18568864 18391396 18461746 18707780 18706116 18269476 17854914 18026895 18659867 19085654
10393A9085654r2570k39543K8003K08083R3105k4848N4450J47209Q2983k0322
$$ 19085654 18993084 18753541 18781544 18989627 19082732 19057884 19112334 19259543 19342526 19322204
10383A9322204m4297r2595k24836k61491r5051N5979j3724j20826k233J67290
$$ 19322204 19277907 19185312 18960476 18698985 18603934 18659913 18646189 18525363 18523130 18690420
10373A8690420K770l93577m57977j6160L61750J59949k97205k98934K09898N48362
$$ 18690420 18693190 18299613 17841636 17825476 18187226 18347175 18049970 17751036 17960934 18509296
10363A8509296K76070k13315k74236J41446N15214M84667K22212Q5579J47033
$$ 18509296 18785366 18572051 18297815 18439261 18954475 19439142 19661354 19746933 19893966
10354A9893966K13319J83272J75306K73622L37926K18282L8497K8918J17944l092
$$ 19893966 20107285 20290557 20465863 20739485 21077411 21295693 21334190 21363108 21481052 21477960
10344B1477960l41099m80223k10230O5621q8103m21676l60798N8281K07354j40512
$$ 21477960 21136861 20656638 20446408 20512029 20423926 20002250 19641452 19699733 19907087 19766575
10334A9766575m50186k91642j2615j33155m87966n06201j22305J46309q075l03665
$$ 19766575 19316389 19024747 19012132 18878977 18391011 17884810 17762505 17908814 17900739 17597074
10324A7597074l71908k42830j48258j23789m2824R0504J04089q6512l15352l31248
$$ 17597074 17225166 16982336 16834078 16710289 16667465 16757969 16862058 16775546 16460194 16128946
10314A6128946j05872J06787Q8537m2930j5670J51296J42282j48331l93047k95215
$$ 16128946 16023074 16129861 16218398 16175468 16159798 16311094 16453376 16305045 15911998 15616783
10304A5616783j8267R9432L9183Q908L6206M569l2023N2073J26420j9259k16368
$$ 15616783 15598516 15697948 15737131 15746039 15782245 15786814 15754791 15806864 15933284 15914025 15697657
10293A5697657q5456L11208M66911K00709n5415L7719K02978P5856j41980k3404
$$ 15697657 15612201 15923409 16390320 16591029 16535614 16573333 16776311 16852167 16710187 16686783
10283A6686783L42971M60041J78400j21088j19659O5254J89705K33890K93638
$$ 16686783 17029754 17489795 17668195 17547107 17427448 17492702 17682407 17916297 18209935
10274A8209935L63909L94228M02268M01442L43828K50732K79722N21638Q04878
$$ 18209935 18573844 18968072 19370340 19771782 20115610 20366342 20646064 21167702 21972580
10265B1972580Q48940O05570L36303L17821N29431O73712M91217K9852l98156
$$ 21972580 22821520 23427090 23763393 24081214 24610645 25284357 25775574 25805426 25407270
10256B5407270n13129l17743o4867N154j16753k60663l31063m25846o26217p58501
$$ 25407270 24894141 24576398 24511531 24516685 24399932 24139269 23808206 23382360 22756143 21997642
10246B1997642n78760k10966j15493m52787p58300n63427j14157k3582l31545
$$ 21997642 21418882 21207916 21092423 20639636 19881336 19317909 19203752 19180170 18848625
10237A8848625m73974k24009l1420j90366k99631J645L06227P3596m04777m24977
$$ 18848625 18374651 18150642 18119222 17928856 17629225 17630870 17937097 18010693 17605916 17180939
10227A7180939l1156P3804k56172l62573N3108L66127O1005l99961l49355Q450
$$ 17180939 17149783 17223587 16967415 16604842 16657950 17024077 17085082 16685121 16335766 16344216
10217A6344216K7417k51990k28305J60696L00571n8280l83313k39622O3848Q9869
$$ 16344216 16371633 16119643 15891338 16052034 16352605 16294325 15911012 15671390 15735238 15825107
10207A5825107o747J23220L04918J19809l01036l90170l8350K10740J0939k62107
$$ 15825107 15818360 15941580 16246498 16366307 16065271 15675101 15636751 15847491 15858430 15596323
10197A5596323j44626J66669J51385j71812k44212J60233N43547L83037j19002
$$ 15596323 15451697 15618366 15769751 15597939 15353727 15513960 16057507 16440544 16321542
10188A6321542l24932m0673K70056J74376j53793k32010M5147K83414J48602j74494
$$ 16321542 15996610 15955937 16225993 16400369 16246576 16014566 16059713 16343127 16491729 16317235
10178A6317235k32271P3752L22810J25561l17665m42765q6696K73964K01683p7201
$$ 16317235 16084964 16158716 16481526 16607087 16289422 15846657 15759961 16033925 16235608 16158407
10168A6158407o6210J77933J29501k83838m36350K9861N25995L36674k42500k93715
$$ 16158407 16092197 16270130 16399631 16115793 15679443 15709304 16235299 16571973 16329473 16035758
10158A6035758L17135P10998L34294k22151j69237L16480M91895K22061M1863
$$ 16035758 16352893 17063891 17398185 17176034 17006797 17323277 17815172 18037233 18079096
10149A8079096J98998L49882K61044J68161K34629K01145j13836l93845k78082
$$ 18079096 18278094 18627976 18889020 19057181 19291810 19492955 19379119 18985274 18707192
10140A8707192O2624J79859j3150j99567j42521P5792K27951J46070j58751m29344
$$ 18707192 18769816 18949675 18936525 18736958 18594437 18670229 18898180 19044250 18885499 18456155
10130A8456155l63908k6757J64205L1080q8551P9590K52827Q3044j96465j55458
$$ 18456155 18092247 18065490 18229695 18260775 18172224 18251814 18504641 18587685 18391220 18235762
10120A8235762P3353O5775n9369J52844N25659L77385k58764m76988Q8486N99733
$$ 18235762 18309115 18374890 18315521 18468365 18994024 19371409 19112645 18635657 18724143 19323876
10110A9323876L25751k13290j77533K14603J93673j64430j28470L25526M40812
$$ 19323876 19649627 19436337 19258804 19473407 19667080 19502650 19374180 19699706 20140518
10101B0140518K118k94554k5853L16989K47931O6137K22335N19941M96555J70788
$$ 20140518 20142636 19848082 19822229 20139218 20387149 20453286 20675621 21195562 21692117 21862905
10091B1862905r5050j56166p7718J44064M46115N38996K73235m8883p7300Q6898
$$ 21862905 21767855 21611689 21533971 21678035 22124150 22663146 22936381 22887498 22810198 22897096
10081B2897096J37123P9474J30888K83056L43460K80237K00407J21450N4563J31304
$$ 22897096 23034219 23113693 23244581 23527637 23871097 24151334 24351741 24473191 24527754 24659058
10071B4659058L45521M02893J82173P1829L87115P18879M67102j40494k72087
$$ 24659058 25004579 25407472 25589645 25661474 26048589 26767468 27234570 27094076 26821989
10062B6821989K58621O97884M99990R2365J29579N26520P08421M68963J12451
$$ 26821989 27080610 27778494 28278484 28370849 28500428 29026948 29735369 30204332 30316783
10053C0316783m6122P5947M31031Q30594R48905O63873L09529K88151N09485N39923
$$ 30316783 30270661 30346608 30777639 31608233 32557138 33221011 33530540 33818691 34328176 34868099
10043C4868099K79294J32614M14312Q79636J047514Q18923N48764N54113P65383
$$ 34868099 35147393 35280007 35694319 36573955 37621469 38440392 38989156 39543269 40308652
10034D0308652R25805R63258R94848J048307J024564R70777J119137J501948J788142
$$ 40308652 41234457 42197715 43192563 44240870 45265434 46236211 47355348 48857296 50645438
10025E0645438J758500J708041K016466K521257K811266L021957L685517M719677
$$ 50645438 52403938 54111979 56128445 58649702 61460968 64482925 68168442 72888119
10017G2888119N320549N222169N341939O476972P809824P567880N086518J502654
$$ 72888119 78208668 83430837 88772776 95249748 103059572 110627452 115713970 117216624
10009A17216624j608888l574888m481212m495734l855071l078276k641821k597244
$$ 117216624 115607736 112032848 107551636 103055902 99200831 96122555 93480734 90883490
10001I0883490k825629l402710m306494n008204m910699m159241l501037l271525
$$ 90883490 88057861 84655151 80348657 75340453 70429754 66270513 62769476 59497951
9993E9497951l033641k415412j784281j672421j898974j819563j302005q81623
$$ 59497951 56464310 54048898 52264617 50592196 48693222 46873659 45571654 44690031
9985D4690031r10368j090890j045498q77038q52500r01673q16599o77235o64449
$$ 44690031 43779663 42688773 41643275 40766237 39913737 39012064 38195465 37518230 36853781
9976C6853781o60641m83407l43100n47822q55770p24756k24667m2416m06871o86018
$$ 36853781 36193140 35709733 35366633 34818811 33963041 33238285 33013618 32971202 32564331 31878313
9966C1878313m07265l9634k10965o58619o63972k19349L488k56195n28543m45237
$$ 31878313 31471048 31431414 31220449 30561830 29897858 29678509 29681997 29425802 28897259 28452022
9956B8452022k25708j53322j43056q4662j22350k94187l22747r9076J1852k61062
$$ 28452022 28226314 28072992 27929936 27845274 27722924 27428737 27105990 27006914 27018766 26757704
9946B6757704n58934l97739K8237R3242k94372n41078k80046Q7488M4776k41427
$$ 26757704 26198770 25801031 25829268 25922510 25628138 25087060 24807014 24894502 24939278 24697851
9936B4697851k09498J92486L88227L1993m41443m09692N3588K84240m3432n04429
$$ 24697851 24488353 24680839 25069066 25101059 24659616 24249924 24303512 24587752 24544320 24039891
9926B4039891n58673k47098j936j0422r3548r6076o6814o3955n1117j9863j9902
$$ 24039891 23481218 23234120 23232184 23221762 23128214 23032138 22965324 22901369 22850252 22830389 22810487
9915B2810487n3457r2293j62433k58603k65420j50694r8470k00877j96566J28031
$$ 22810487 22757030 22664737 22502304 22243701 21978281 21827587 21729117 21528240 21331674 21459705
9905B1459705M52217L17273j04914k29354j9514k9349l61833l82147J68485N54386
$$ 21459705 21911922 22229195 22124281 21894927 21875413 21846064 21484231 21102084 21270569 21824955
9895B1824955J50935m77893l99565K40555M91292Q4874k76520j24850J60313J45448
$$ 21824955 21975890 21497997 21098432 21338987 21830279 21915153 21638633 21513783 21674096 21819544
9885B1819544K009L5041J32171O9708m5123L408J66638K60787K35123J21003m6335
$$ 21819544 21821553 21856594 21988765 22058473 22013350 22016758 22183396 22444183 22679306 22800309 22753974
9874B2753974j28439J0820K06967J48961q0741n9925K39093L03242o1319k93411
$$ 22753974 22625535 22636355 22843322 22992283 22911542 22851617 23090710 23393952 23332633 23039222
9864B3039222N0740N01712L57001k20829m74363j92973J30505J92787K10018L03749
$$ 23039222 23089962 23591674 23948675 23727846 23253483 23060510 23191015 23383802 23593820 23897569
9854B3897569K38730m0735j95807o0772P2607O73l0975J75497L41737J65135j44201
$$ 23897569 24136299 24095564 23899757 23838985 23911592 23912265 23881290 24056787 24398524 24563659 24419458
9843B4419458j89599O780J26890Q0726J5688k5271o3795L8403L47506N35736K61002
$$ 24419458 24229859 24236639 24363529 24444255 24459943 24434672 24370877 24409280 24756786 25292522 25553524
9832B5553524k08645k68070J18192L36352P6276k00673k6478L43855L88296J32796
$$ 25553524 25344879 25076809 25195001 25531353 25607629 25406956 25380478 25724333 26112629 26245425
9822B6245425J4900J49978K35753J10024m8706q8156o6766k3932J02106K61069
$$ 26245425 26260325 26410303 26646056 26756080 26707374 26619218 26552452 26528520 26630626 26891695
9812B6891695K91122K03867J94688K99046L15177J53748j3720n7281n8248o0372
$$ 26891695 27182817 27386684 27581372 27880418 28195595 28349343 28335623 28278342 28220094 28159722
9802B8159722M5831K32241K42835J4241j17545Q9393L62144L24884Q8691K6524
$$ 28159722 28205553 28437794 28680629 28694870 28577325 28666718 29028862 29353746 29442437 29468961
9792B9468961J42211J28550l3633l2525J88347K80500O8973j35842k5807K36228
$$ 29468961 29611172 29739722 29706089 29673564 29861911 30142411 30211384 30075542 30049735 30285963
9782C0285963K98729J32651j1940k735P9127J52905K19674K54575J95684O4645
$$ 30285963 30584692 30717343 30705403 30702668 30781795 30934700 31154374 31408949 31604633 31669278
9772C1669278o074R3090L11145M49495L50786J01543k8863P9247K32858K18759
$$ 31669278 31663204 31756294 32067439 32516934 32867720 32969263 32940400 33019647 33252505 33471264
9762C3471264J24304J64050L08945L59395L00592K70090K34838P0744o4529J22417
$$ 33471264 33595568 33759618 34068563 34427958 34728550 34998640 35233478 35304222 35239693 35362110
9752C5362110M97268N64975K38009L6886K88017O17183N83351L61720L60310N36339
$$ 35362110 35859378 36424353 36662362 36699248 36987265 37604448 38187799 38549519 38909829 39446168
9742C9446168N86898N23496N43391N62312M00594K50900M19719P35225P63037
$$ 39446168 40033066 40556562 41099953 41662265 42062859 42313759 42733478 43468703 44231740
9733D4231740N26835M52961O35853P38891O53843O70810Q78622R54353P39360
$$ 44231740 44758575 45211536 45847389 46586280 47240123 47910933 48789555 49743908 50483268
9724E0483268N34494O02125Q00214R22722J004310J076428J006561Q04120P32575
$$ 50483268 51017762 51619887 52420101 53342823 54347133 55423561 56430122 57234242 57966817
9715E7966817R03758J093059J136463J155011J219475J194671J102994J199397
$$ 57966817 58870575 59963634 61100097 62255108 63474583 64669254 65772248 66971645
9707F6971645J461482J488116J185745J036685J318473J590980J434709J181595
$$ 66971645 68433127 69921243 71106988 72143673 73462146 75053126 76487835 77669430
9699G7669430J315878J603789J527437J236080J279420J609501J667872J385353
$$ 77669430 78985308 80589097 82116534 83352614 84632034 86241535 87909407 89294760
9691H9294760J276289J492444J577443J331116J179350J405747J663038J597432
$$ 89294760 90571049 92063493 93640936 94972052 96151402 97557149 99220187 100817619
9683A00817619J412867J435549J575713J609508J609534J708891J763478J630285
$$ 100817619 102230486 103666035 105241748 106851256 108460790 110169681 111933159 113563444
9675A13563444J510661J645061J882187J900563J691623J513398J501877J592763
$$ 113563444 115074105 116719166 118601353 120501916 122193539 123706937 125208814 126801577
9667A26801577J700272J751569J679520J559198J579453J729520J755867J600065
$$ 126801577 128501849 130253418 131932938 133492136 135071589 136801109 138556976 140157041
9659A40157041J566331J809593K004053J870046J702517J921068K347752K456389
$$ 140157041 141723372 143532965 145537018 147407064 149109581 151030649 153378401 155834790
9651A55834790K189736J984789K044116K122335K059553K003555K006233J892736
$$ 155834790 158024526 160009315 162053431 164175766 166235319 168238874 170245107 172137843
9643A72137843J689148J720971K071587K355012K282030K083601K087764K221074
$$ 172137843 173826991 175547962 177619549 179974561 182256591 184340192 186427956 188649030
9635A88649030K269345K327431K574974K820318K726264K387884K228967K329776
$$ 188649030 190918375 193245806 195820780 198641098 201367362 203755246 205984213 208313989
9627B08313989K310356J989019J731967J899486K259351K294697J937762J636443
$$ 208313989 210624345 212613364 214345331 216244817 218504168 220798865 222736627 224373070
9619B24373070J701649J917554J923900J739002J677819J864270K077888K105277
$$ 224373070 226074719 227992273 229916173 231655175 233332994 235197264 237275152 239380429
9611B39380429K034382K087934K292917K461819K457700K351491K308225K399154
$$ 239380429 241414811 243502745 245795662 248257481 250715181 253066672 255374897 257774051
9603B57774051K546458K611849K533475K391887K320554K350493K408538K480749
$$ 257774051 260320509 262932358 265465833 267857720 270178274 272528767 274937305 277418054
9595B77418054K658351K950826L184787L225761L199136L318196L566019L749488
$$ 277418054 280076405 283027231 286212018 289437779 292636915 295955111 299521130 303270618
9587C03270618L824228L927391M079538M112137L969677L838549L835290L780294
$$ 303270618 307094846 311022237 315101775 319213912 323183589 327022138 330857428 334637722
9579C34637722L478512L070419K874105K955076L066854K990359K740919K440122
$$ 334637722 338116234 341186653 344060758 347015834 350082688 353073047 355813966 358254088
9571C58254088K166480J973478J896605J865190J722617J421656J113949R46108
$$ 358254088 360420568 362394046 364290651 366155841 367878458 369300114 370414063 371360171
9563C71360171Q32039N67113J66163p9211R184J73657O170m58178p09711m59929
$$ 371360171 372192210 372759323 372925486 372846275 372855459 373029116 373035286 372577108 371867397 371407468
9553C71407468r7724j55660n10191n51593j24280K13568N4139k14535j1527N32628
$$ 371407468 371309744 371154084 370643893 370092300 369968020 370181588 370235727 370021192 370009665 370542293
9543C70542293P83797N53456K97771L61884N42042N54703M96538N63589O36099
$$ 370542293 371326090 371879546 372177317 372539201 373081243 373635946 374132484 374696073 375332172
9534C75332172M71594J21100j54738k79248m04260o24620q82474j125824j365703
$$ 375332172 375803766 375924866 375770128 375490880 375086620 374462000 373579526 372453702 371087999
9525C71087999j595349j812621k079105k401322k633623k699161k815952l222888
$$ 371087999 369492650 367680029 365600924 363199602 360565979 357866818 355050866 351827978
9517C51827978l724906l866359l621528l529308l934005m435102m442622m055073
$$ 351827978 348103072 344236713 340615185 337085877 333151872 328716770 324274148 320219075
9509C20219075l929445m306687m623131m276901l461086k928822l053456l425835
$$ 320219075 316289630 311982943 307359812 303082911 299621825 296693003 293639547 290213712
9501B90213712l427905k973906k506137k350605k329037k117000j781734j674651
$$ 290213712 286785807 283811901 281305764 278955159 276626122 274509122 272727388 271052737
9493B71052737j833518j867983j596087j426324j748746k214348k144415j573988
$$ 271052737 269219219 267351236 265755149 264328825 262580079 260365731 258221316 256647328
9485B56647328j286396j679667k188334k158805j786694j690750j936176k093689
$$ 256647328 255360932 253681265 251492931 249334126 247547432 245856682 243920506 241826817
9477B41826817k057341k133676k349251k332934k020241j872132k138726k429566
$$ 241826817 239769476 237635800 235286549 232953615 230933374 229061242 226922516 224492950
9469B24492950k355285k145596k212670k465970k544740k473528k564646k806463
$$ 224492950 222137665 219992069 217779399 215313429 212768689 210295161 207730515 204924052
9461B04924052k869769k697664k603401k715718k760495k533354k228690k117231
$$ 204924052 202054283 199356619 196753218 194037500 191277005 188743651 186514961 184397730
9453A84397730k178912k244556k277170k322469k348149k304666k225409k139629
$$ 184397730 182218818 179974262 177697092 175374623 173026474 170721808 168496399 166356770
9445A66356770k005720j838518j769831j855971j936443j823686j573093j447746
$$ 166356770 164351050 162512532 160742701 158886730 156950287 155126601 153553508 152105762
9437A52105762j620274j952547k080239j774061j262650j063698j353864j681422
$$ 152105762 150485488 148532941 146452702 144678641 143415991 142352293 140998429 139317007
9429A39317007j574648j260456j332922j772771j887070j381251q92569j082781
$$ 139317007 137742359 136481903 135148981 133376210 131489140 130107889 129215320 128132539
9421A28132539j688488j971602j751225j428194j243787j128451j146021j445471
$$ 128132539 126444051 124472449 122721224 121293030 120049243 118920792 117774771 116329300
9413A16329300j778452j678440j206567r47343j122997j282094j089108q57240
$$ 116329300 114550848 112872408 111665841 110718498 109595501 108313407 107224299 106367059
9405A06367059r51937j162799j113719r10444q87616r93490r38162p68819p80300
$$ 106367059 105415122 104252323 103138604 102228160 101340544 100347054 99408892 98640073 97859773
9396I7859773r40226r01451n94269l59289m18385n95317o63891o39058n98170
$$ 97859773 96919547 96018096 95423827 95064538 94646153 94050836 93386945 92747887 92149717
9387I2149717n06532l67901l10573l79622m34644l72277k75734k42324k30994
$$ 92149717 91643185 91275284 90964711 90585089 90150445 89778168 89502434 89260110 89029116
9378H9029116j72380p0457P1369K48975L36476J93303l9072j7744L03318N49144
$$ 89029116 88856736 88786279 88857648 89106623 89443099 89636402 89597330 89579586 89882904 90432048
9368I0432048M82112L71909N24574P36344O27846L26325L15327O54289Q70062
$$ 90432048 90914160 91286069 91810643 92546987 93174833 93501158 93816485 94470774 95340836
9359I5340836P22401N71641P37362R36852P63833M12211M06564P34256P99429
$$ 95340836 96063237 96634878 97372240 98309092 99072925 99485136 99891700 100625956 101425385
9350A01425385L30853j64478j25934K60227L80525Q9439j88098k05350k54945
$$ 101425385 101756238 101591760 101465826 101726053 102106578 102196017 102007919 101802569 101547624
9341A01547624o20149j060663j147134q70757o00360n69153p11188r20840j154006
$$ 101547624 100927475 99866812 98719678 97848921 97248561 96679408 95968220 95047380 93893374
9332I3893374j294972j236493j119804j202092j440291j509400j308236j120569
$$ 93893374 92598402 91361909 90242105 89040013 87599722 86090322 84782086 83661517
9324H3661517j145759j208815j136084j085581j220145j342487j206618r70008
$$ 83661517 82515758 81306943 80170859 79085278 77865133 76522646 75316028 74346020
9316G4346020r49803j090497j083801r14524q56759r60791r74538q10648o86460
$$ 74346020 73396217 72305720 71221919 70307395 69450636 68489845 67515307 66704659 66018199
9307F6018199p17632p48111o91701o85585p73925p81351o49743n66942n98853
$$ 66018199 65300567 64552456 63860755 63175170 62401245 61619894 60970151 60403209 59804356
9298E9804356n39496l25383k45779m79707p43435o97983m31492k35151j70654
$$ 59804356 59264860 58939477 58693698 58213991 57470556 56772573 56341081 56105930 55935276
9289E5935276j82884l60740o97938q43413n32550p6597L5740j43427k01365j15908
$$ 55935276 55752392 55391652 54693714 53850301 53317751 53241154 53276894 53133467 52932102 52816194
9279E2816194k29826n15713n23393j79718p710k92508n96125m67694j56281j56749
$$ 52816194 52586368 52070655 51547262 51367544 51359834 51067326 50471201 50003507 49847226 49690477
9269D9690477m04410m42879j90081j7218j16050k44964j75118l8830q8713l21135
$$ 49690477 49286067 48843188 48653107 48635889 48519839 48274875 48099757 48060927 47972214 47651079
9259D7651079m86861l93953j18223P4196Q546k05156l16040k42967j16746l4415
$$ 47651079 47164218 46770265 46652042 46726238 46734784 46529628 46213588 45970621 45853875 45819460
9249D5819460K4372J3815j76240m31445m17181o5714K10206N4549l09949m11799
$$ 45819460 45843832 45857647 45681407 45249962 44832781 44767067 44977273 45031822 44721873 44310074
9239D4310074j99905k0001l8796q8686o6773j03591k57382l54668k59381p6448
$$ 44310074 44110169 44090168 44051372 43962686 43895913 43792322 43534940 43180272 42920891 42844443
9229D2844443K0657m132q7185j59923j61564r0752n2951j23166j98714j57472
$$ 42844443 42865100 42860968 42773783 42613860 42452296 42361544 42308593 42185427 41986713 41829241
9219D1829241r7414j87729l33596k76934k7316J18315K9190j01630j28762j52081
$$ 41829241 41731827 41544098 41210502 40933568 40906252 41024567 41053757 40952127 40823365 40671284
9209D0671284k17989j64928L6005J06139j09700l09569j53748J83904K43578m9024
$$ 40671284 40453295 40288367 40324372 40430511 40320811 40011242 39857494 40041398 40284976 40235952
9199D0235952k96226k02952P0368J88468M8006j76486k49080q3088J71032K50482
$$ 40235952 39939726 39736774 39807142 39995610 40043616 39867130 39618050 39534962 39705994 39956476
9189C9956476Q3521q1526J7177K74796L33856P3920k19715k46097o6498M4116
$$ 39956476 40039997 39958471 39975648 40250444 40584300 40658220 40438505 40192408 40125910 40170026
9179D0170026K606j7799Q6616J61965M9359j14476o5547J52209J97039l0037j53790
$$ 40170026 40172632 40154833 40241449 40403414 40452773 40338297 40272750 40424959 40621998 40591961 40438171
9168D0438171J17622M60596L52978j26980l96042k27925O954M2988Q6757K56985
$$ 40438171 40555793 41016389 41369367 41242387 40846345 40618420 40625374 40668362 40755119 41012104
9158D1012104K36470j26407l85714j79081J06077l5170l08951r8732L96605L96161
$$ 41012104 41248574 41122167 40736453 40557372 40663449 40628279 40319328 40220596 40617201 41013362
9148D1013362j35354l49988R5824M57216J49221k72220o4460M32980L61901k16425
$$ 41013362 40878008 40528020 40623844 41081060 41230281 40958061 40893601 41326581 41688482 41472057
9138D1472057m09965O5606M64585K17795k31115k02412J94145L45092R4157j44906
$$ 41472057 41062092 41127698 41592283 41810078 41578963 41376551 41570696 41915788 42009945 41865039
9128D1865039j01498M1155Q0999J08940K22814K51008J0892l41230m80391l50869
$$ 41865039 41763541 41804696 41885695 41994635 42217449 42468457 42479349 42138119 41657728 41306859
9118D1306859j90152j42514r9973K6086J15588M1170j30676k74490l64627l52876
$$ 41306859 41116707 40974193 40874220 40900306 41015894 41057064 40926388 40651898 40287271 39934395
9108C9934395j03831L12322M69661Q1606m69704n18332k7837L23341R1457l32269
$$ 39934395 39830564 40142886 40612547 40694153 40224449 39706117 39678280 40001621 40093078 39760809
9098C9760809l37174M3656K71593J07492j42254j60481l2562q750j01066j13426
$$ 39760809 39423635 39467291 39738884 39846376 39704122 39543641 39511079 39502329 39401263 39287837
9088C9287837J7305J08235J5019j07777q178K34870K50369m7797k31425R195K90292
$$ 39287837 39305142 39413377 39428396 39320619 39312441 39547311 39797680 39749883 39518458 39527653 39817945
9077C9817945O7387m35460m63526Q8952M45347J24481l41098k97235L5087N8683
$$ 39817945 39885332 39449872 38986346 39075298 39520645 39645126 39304028 39006793 39041880 39100563
9067C9100563j82509k08948k2685m6527k83917l03078n6836J7104j78717j84528
$$ 39100563 38918054 38709106 38686421 38639894 38355977 38052899 37996063 38013167 37834450 37649922
9057C7649922J81966M25929J58158k66446l18561q5481l1220k47632l99360k75494
$$ 37649922 37831888 38257817 38415975 38149529 37830968 37745487 37714267 37466635 37067275 36791781
9047C6791781k2616J17285M4052j71164l15789j83641J59363L67963K10814j44842
$$ 36791781 36769165 36886450 36930502 36759338 36443549 36259908 36419271 36787234 36998048 36853206
9037C6853206l54498k73542k0168J90036J87587j6897j85524j18269K7307n5055
$$ 36853206 36498708 36225166 36204998 36395034 36582621 36565724 36380200 36261931 36289238 36234183
9027C6234183k87528k66237N9324K22365k1805k53161m6963L17836K81729j33758
$$ 36234183 35946655 35680418 35739742 35962107 35940302 35687141 35640178 35958014 36239743 36105985
9017C6105985l94734k46287L5369J32512K6056j48225k61571k19300p6547o2512
$$ 36105985 35711251 35464964 35500333 35632845 35658901 35510676 35249105 35029805 34953258 34890746
9007C4890746k59340l90252j99059J18407J83368j3799j75721j68354o7112J08610
$$ 34890746 34631406 34241154 34042095 34160502 34343870 34330071 34154350 33985996 33918884 34027494
8997C4027494L04495K47453j73294n00649k47645K67032K76462k47121m90038
$$ 34027494 34331989 34579442 34406148 33905499 33657854 33924886 34201348 33954227 33464189
8988C3464189m1363M84310M06622o1671k77689j18233M5158J5670o5056o4901
$$ 33464189 33422826 33907136 34313758 34252087 33974398 33856165 33901323 33916993 33851937 33787036
8978C3787036p451L9219L255j33323k08519m1788K05825J77916p9638j26321J06152
$$ 33787036 33779585 33818804 33822059 33688736 33480217 33438429 33644254 33822170 33742532 33616211 33722363
8967C3722363J21233k66691m85381j21789L04973J53029k58327j95518K08978
$$ 33722363 33843596 33576905 33091524 32969735 33274708 33427737 33169410 32973892 33182870
8958C3182870J71779l75355o19386j76193L46280L80779J86023J81136J99440
$$ 33182870 33354649 32979294 32359908 32183715 32529995 32910774 33096797 33277933 33477373
8949C3477373m0979k64897p7370K71514K08171k36904m29963p2516L78915L85860
$$ 33477373 33436394 33171497 33094127 33365641 33573812 33336908 32906945 32834429 33213344 33599204
8939C3599204L9001j60137k1501J33016l117k46939j84439J90137M02108J67134
$$ 33599204 33638205 33478068 33456567 33589583 33586466 33339527 33155088 33345225 33747333 33914467
8929C3914467j72846j53846J19053J87779P15m3319J92731L51462J97181k0865
$$ 33914467 33741621 33587775 33706828 33894607 33895322 33852003 34044734 34396196 34593377 34572512
8919C4572512n0958m2575j60093j85864R8038M29042L98847P9403j06453k4169
$$ 34572512 34521554 34478979 34318886 34133022 34231060 34660102 35058949 35138352 35031899 35007730
8909C5007730O7811N832o6225o189J08011J40719P2256l2101p6373L1483K56213
$$ 35007730 35075541 35081373 35015148 35008959 35116970 35257689 35329945 35297844 35221471 35252954 35509167
8898C5509167L91916K92158Q1655j4111L3083R2771J12000J21022R8499L3021
$$ 35509167 35901083 36193241 36274896 36260785 36293868 36386639 36498639 36619661 36718160 36751181
8888C6751181K4136J20036J72433P7029J2488J62646L51697K99727J12171J06550
$$ 36751181 36775317 36895353 37067786 37144815 37157303 37319949 37671646 37971373 38083544 38190094
8878C8190094K41905J98971Q970O1727L95561N42097K92979P1194K02431L33499
$$ 38190094 38431999 38630970 38639940 38701667 39097228 39639325 39932304 40003498 40205929 40539428
8868D0539428N7154l06545j65801L60767N85879L05358M7837J79394L78136K68754
$$ 40539428 40596582 40290037 40124236 40485003 41070882 41376240 41424077 41603471 41981607 42250361
8858D2250361O6558J75503M81131N17105J88059j17989j28067p608O557k3903
$$ 42250361 42316919 42492422 42973553 43490658 43678717 43560728 43432661 43425053 43431610 43407707
8848D3407707Q0075K78028L76029L25148K53157K37920K21027J49185O4304L2904
$$ 43407707 43487782 43765810 44141839 44466987 44720144 44958064 45179091 45328276 45392580 45425484
8838D5425484Q4840K19332L72000M04969K70428J59544K95698N64897N89776K61995
$$ 45425484 45510324 45729656 46101656 46506625 46777053 46936597 47232295 47797192 48386968 48648963
8828D8648963m1659N3477M17346O19620M89094K30557Q5896J21469K91230M80369
$$ 48648963 48607304 48660781 49078127 49697747 50186841 50417398 50503294 50624763 50915993 51396362
8818E1396362N17451L43132J37856J19511K83564M95071O93444Q00204O26507
$$ 51396362 51913813 52256945 52394801 52514312 52797876 53292947 53986391 54786595 55413102
8809E5413102J89041p4693J77613O06982O10046K18889R971J51788K26085R3430
$$ 55413102 55602143 55527450 55705063 56312045 56922091 57140980 57150951 57302739 57528824 57622254
8799E7622254J75848N87162P35947K82077j72599K5045N38558O06964K33805L3705
$$ 57622254 57798102 58385264 59121211 59403288 59230689 59255734 59794292 60401256 60635061 60668766
8789F0668766J77084K97430K95604M27315O27421N30193K17367J99245N30862
$$ 60668766 60845850 61143280 61438884 61866199 62493620 63023813 63241180 63440425 63971287
8780F3971287O73046M18971K42503M49648O66360N40206L39356M17287O09217
$$ 63971287 64644333 65063304 65305807 65755455 66421815 66962021 67301377 67718664 68327881
8771F8327881O29865O17016P90228R54830Q41640O19173N89189O61769O04345
$$ 68327881 68957746 69574762 70364990 71319820 72161460 72780633 73369822 74031591 74635936
8762G4635936N34072O65288Q14615O84002M41090M80514P53980Q77096P94874
$$ 74635936 75170008 75835296 76649911 77333913 77775003 78255517 79009497 79886593 80681467
8753H0681467P89621Q89110Q36926O59921O98108R82039J112494R09889P00256
$$ 80681467 81471088 82360198 83197124 83857045 84555153 85537192 86649686 87559575 88259831
8744H8259831P62477R25408R41992Q82711R04408R47206R19899R26920J062858
$$ 88259831 89022308 89947716 90889708 91772419 92676827 93624033 94543932 95470852 96533710
8735I6533710J189087J139382R87635R31908J046996J270410J484644J536863
$$ 96533710 97722797 98862179 99849814 100781722 101828718 103099128 104583772 106120635
8727A06120635J359515J129381J096725J225547J270392J230854J365246J667384
$$ 106120635 107480150 108609531 109706256 110931803 112202195 113433049 114798295 116465679
8719A16465679J759619J503152J289966J442670J719835J767944J690291J738765
$$ 116465679 118225298 119728450 121018416 122461086 124180921 125948865 127639156 129377921
8711A29377921J779176J586231J413026J667975K163186K312927K057979J956279
$$ 129377921 131157097 132743328 134156354 135824329 137987515 140300442 142358421 144314700
8703A44314700K258592K525999K403864K195511K288645K487702K408987K213022
$$ 144314700 146573292 149099291 151503155 153698666 155987311 158475013 160884000 163097022
8695A63097022K379702K888703L175250K953592K628822K711688L145933L454184
$$ 163097022 165476724 168365427 171540677 174494269 177123091 179834779 182980712 186434896
8687A86434896L371039L103408L031573L321310L816320M204644M295149M195643
$$ 186434896 189805935 192909343 195940916 199262226 203078546 207283190 211578339 215773982
8679B15773982M199439M453724M800857N020640N146008N389435N789954O128588
$$ 215773982 219973421 224427145 229228002 234248642 239394650 244784085 250574039 256702627
8671B56702627O252324O312469O567396P067503P649008Q128454Q385731Q392278
$$ 256702627 262954951 269267420 275834816 282902319 290551327 298679781 307065512 315457790
8663C15457790Q330858Q559052R219813R971447J0362742J0414004J0521420J0811960
$$ 315457790 323788648 332347700 341567513 351538960 361901702 372315706 382837126 393649086
8655C93649086J0970263J0787714J0500970J0384729J0312140R958756R210966
$$ 393649086 404619349 415407063 425908033 436292762 446604902 456563658 465774624
8648D65774624Q152045O863839N462355M105976K737852J065324r30601k719802
$$ 465774624 473926669 480790508 486252863 490358839 493096691 494162015 493231414 490511612
8640D90511612l804494m369649m976300n788215o530078p075545p585178q086578
$$ 490511612 486707118 482337469 477361169 471572954 465042876 457967331 450382153 442295575
8632D42295575q386665q450158q458343q442277q253408p953152p819844p872855
$$ 442295575 433908910 425458752 417000409 408558132 400304724 392351572 384531728 376658873
8624C76658873p788069p412597o994330o772684o695650o650908o599964o379912
$$ 376658873 368870804 361458207 354463877 347691193 340995543 334344635 327744671 321364759
8616C21364759n800219n074451m694054m698484m574612m104589l737740l774835
$$ 321364759 315564540 310490089 305796035 301097551 296522939 292418350 288680610 284905775
8608B84905775l788393l367402k886479k869472l030051k729451k100227j856764
$$ 284905775 281117382 277749980 274863501 271994029 268963978 266234527 264134300 262277536
8600B62277536k089303k112555j604934j098885j090937j343380j408996j295151
$$ 262277536 260188233 258075678 256470744 255371859 254280922 252937542 251528546 250233395
8592B50233395j220122j142599r33537p04351o05474n32042l29297q4738M3008
$$ 250233395 249013273 247870674 246937137 246232786 245627312 245095270 244765973 244681235 244724243
8583B44724243Q2975Q9479q5679n93111j290211j867287k167570k235372k196911
$$ 244724243 244807218 244896697 244811018 244217907 242927696 241060409 238892839 236657467 234460556
8574B34460556k238637k531946l025692l478903l808014m158170m497629m484521
$$ 234460556 232221919 229689973 226664281 223185378 219377364 215219194 210721565 206237044
8566B06237044m010324l549485l570472l842298l798809l434069l275724l468810
$$ 206237044 202226720 198677235 195106763 191264465 187465656 184031587 180755863 177287053
8558A77287053l477172k914544k191296j966781k260635k515862k391587k080320
$$ 177287053 173809881 170895337 168704041 166737260 164476625 161960763 159569176 157488856
8550A57488856j852533j680616j455738j276146j274255j332737j252841j122219
$$ 157488856 155636323 153955707 152499969 151223823 149949568 148616831 147363990 146241771
8542A46241771j201039j425307j369454q66438l62760l68685p55148r40228o68465
$$ 146241771 145040732 143615425 142245971 141379533 141016773 140648088 139892940 138952712 138284247
8533A38284247k39031J4195Q8112Q8776k641j91377l62953m65983n91265p63936
$$ 138284247 138045216 138059411 138147523 138236299 138233658 138042281 137679328 137213345 136622080 135858144
8523A35858144q78517r27469j042922j219936j281983j231290j316446j606068
$$ 135858144 134979627 134052158 133009236 131789300 130507317 129276027 127959581 126353513
8515A26353513j830292j819324j738701j691302j509174j215115j214512j622145
$$ 126353513 124523221 122703897 120965196 119273894 117764720 116549605 115335093 113712948
8507A13712948j867808j510283j019904j085182j489655j480488j039724q75099
$$ 113712948 111845140 110334857 109314953 108229771 106740116 105259628 104219904 103344805
8499A03344805j163284j257740q54237n36531p52091j042973q61836n05084n58284
$$ 103344805 102181521 100923781 100069544 99533013 98780922 97737949 96876113 96371029 95812745
8490I5812745q83706q93618n57490m12333o55591q76921p57893n09972m51290
$$ 95812745 94929039 94035421 93477931 93065598 92410007 91533086 90775193 90265221 89813931
8481H9813931n34849n18993l85162l69320o21551r48465r68924n76339j57773
$$ 89813931 89279082 88760089 88374927 88005607 87384056 86435591 85466667 84890328 84732555
8472H4732555j64028n10737p02930n65766m51145n90108o96145m95240k30768
$$ 84732555 84568527 84057790 83354860 82789094 82337949 81747841 81051696 80556456 80325688
8463H0325688k51701m50461n46933o08504p86165q29061m65164n5736j89769p11733
$$ 80325688 80073987 79623526 79076593 78468089 77681924 76852863 76387699 76331963 76142194 75430461
8453G5430461q62871m29497m1190j62789m69886n13458l96173m02907m63529m14737
$$ 75430461 74567590 74138093 74096903 73934114 73464228 72950770 72554597 72151690 71688161 71273424
8443G1273424l92528n29580o00462l99947j75186k36672m08107l43322j64324
$$ 71273424 70880896 70351316 69750854 69350907 69175721 68939049 68530942 68187620 68023296
8434F8023296k49030n26196n54553k78991j42014l48954n42859m07572j48491
$$ 68023296 67774266 67248070 66693517 66414526 66272512 65923558 65380699 64973127 64824636
8425F4824636r7842j97142k03899j59764k83924n27755n91904l79830j45449j30065
$$ 64824636 64726794 64529652 64325753 64165989 63882065 63354310 62762406 62382576 62237127 62107062
8415F2107062k72786l71230l53803k71058j51576k4349m381j72928l90541m17720
$$ 62107062 61834276 61463046 61109243 60838185 60686609 60662260 60657879 60484951 60094410 59676690
8405E9676690k51071j38562j86206j92392m5625k2061l55560p06832n38398K3169
$$ 59676690 59425619 59287057 59100851 58908459 58862834 58840773 58485213 57778381 57239983 57263152
8395E7263152K50188j28564n00237l14730P3990K9001l23766l55423k1616P7587
$$ 57263152 57513340 57384776 56884539 56569809 56643799 56672800 56349034 55993611 55971995 56049582
8385E6049582k66864n33072l65120j18526j54345k01481P0830L35763R6660m21337
$$ 56049582 55782718 55249646 54884526 54766000 54611655 54410174 54481004 54816767 54913427 54492090
8375E4492090n50563k12440J0596j59129l25518j79670j5803j67220m20043m03812
$$ 54492090 53941527 53729087 53739683 53580554 53255036 53075366 53059563 52892343 52472300 52068488
8365E2068488k09510j67272k53563j90515K183K3167j83289l52502l71030l99711
$$ 52068488 51858978 51691706 51438143 51247628 51249811 51272978 51089689 50737187 50366157 49966446
8355D9966446m54806l07812K8605J45661j46964m27223k67201O3436j2911m61991
$$ 49966446 49511640 49203828 49232433 49378094 49231130 48803907 48536706 48600142 48587231 48125240
8345D8125240o67262l73392l4343n7367k18268j43034N2661L5845j28175j31209
$$ 48125240 47457978 47084586 47050243 46992876 46774608 46631574 46684235 46720080 46591905 46460696
8335D6460696l0312j65252m93609n52423k03831Q9161k4454k47826j68431N5162
$$ 46460696 46430384 46265132 45771523 45219100 45015269 45104430 45079976 44832150 44663719 44718881
8325D4718881J0162k30097k38820J418N2537k22271m23709l06187j67597k66313
$$ 44718881 44729043 44498946 44260126 44261544 44314081 44091810 43668101 43361914 43194317 42928004
8315D2928004l42968j33075O5399j32821m64626l79360K9529J30599k13296m14274
$$ 42928004 42585036 42451961 42517360 42384539 41919913 41540553 41570082 41700681 41487385 41073111
8305D1073111j33545J66789j1741m27383n37710l17565j46720j54353j65415j28321
$$ 41073111 40939566 41106355 41094614 40667231 40129521 39811956 39665236 39510883 39345468 39217147
8295C9217147j39834j51343n7227J8372r5929k56459k14256o4740n9316j01052
$$ 39217147 39077313 38925970 38868743 38887115 38791186 38534727 38320471 38255731 38196415 38095363
8285C8095363N9545K28742q840m72742m87567M8328M07731J49648k06702q5770
$$ 38095363 38154908 38383650 38374810 37902068 37414501 37462829 37870560 38020208 37813506 37727736
8275C7727736K05773Q6977k48128j68854K88696M74453K04509K950J64096K91881
$$ 37727736 37933509 38020486 37772358 37603504 37892200 38366653 38571162 38574112 38738208 39030089
8265C9030089M1686k73926k10384J07171K45661J53087J32490K51028K22072o7503
$$ 39030089 39071775 38797849 38587465 38694636 38940297 39093384 39225874 39476902 39698974 39631471
8255C9631471k78412p9932L21185M11703R7209j29363J07268M90422M78755J47801
$$ 39631471 39353059 39273127 39594312 40006015 40103224 39973861 40081129 40571551 41050306 41198107
8245D1198107O5012L53096M78883J68045p9343K02588O48077O46286L25200K64156
$$ 41198107 41263119 41616215 42095098 42263143 42183800 42386388 43034465 43680751 44005951 44270107
8235D4270107M86305N03781K66674K65515O08966P63509M42419Q0588J02183K92755
$$ 44270107 44756412 45260193 45526867 45792382 46401348 47164857 47607276 47687864 47790047 48082802
8225D8082802K73762J12684N8582P1655J6593j074J39453K88305K79097K01238
$$ 48082802 48356564 48469248 48527830 48599485 48616078 48615004 48754457 49042762 49321859 49523097
8215D9523097J60849Q7313K2192K03343N58718N68355M0348m21514k37878K60115
$$ 49523097 49683946 49771259 49793451 49996794 50555512 51123867 51164215 50742701 50504823 50764938
8205E0764938L65508P7074m6620J17208J67790J4805M3445L61993N58036L88306
$$ 50764938 51130446 51207520 51160900 51278108 51445898 51460703 51504148 51866141 52424177 52812483
8195E2812483J49973J54006L04492M07244M72548N13623M35102L12039M08132
$$ 52812483 52962456 53116462 53420954 53828198 54300746 54814369 55249471 55561510 55969642
8186E5969642P26258Q99295P28181M90609N09325P31293R37974J060291J074888
$$ 55969642 56695900 57595195 58323376 58813985 59323310 60054603 60992577 62052868 63127756
8177F3127756R01231O35128N80639P88222Q50200M63194m8432j17919L08793P38271
$$ 63127756 64028987 64664115 65244754 66032976 66883176 67346370 67297938 67180019 67488812 68227083
8167F8227083P82380N61426M51578O22382Q65580Q30873M58621J35717K57523
$$ 68227083 69009463 69570889 70022467 70644849 71510429 72341302 72799923 72935640 73193163
8158G3193163O72857Q50851O32404M42153N97534Q08766O82717L99085M47779
$$ 73193163 73866020 74716871 75349275 75791428 76388962 77197728 77880445 78279530 78727309
8149G8727309Q60662J161659J071845Q67685R27127J204533J342015J174008R44065
$$ 78727309 79587971 80749630 81821475 82689160 83616287 84820820 86162835 87336843 88280908
8140H8280908R93999J317412J538283J388327J078418J020018J260709J453968
$$ 88280908 89274907 90592319 92130602 93518929 94597347 95617365 96878074 98332042
8132I8332042J376281J177507J062388J026594J018277J071019J136997J066184
$$ 98332042 99708323 100885830 101948218 102974812 103993089 105064108 106201105 107267289
8124A07267289R00784R04751J132058J263975J079663P98355P26299Q43804R82091
$$ 107267289 108168073 109072824 110204882 111468857 112548520 113346875 114073174 114916978 115899069
8115A15899069J127757J290845J344546J266085J270467J450206J584208J567759
$$ 115899069 117026826 118317671 119662217 120928302 122198769 123648975 125233183 126800942
8107A26800942J668339K024220K281723K149912J941012K074018K387703K484020
$$ 126800942 128469281 130493501 132775224 134925136 136866148 138940166 141327869 143811889
8099A43811889K433287K551333K767390K840617K927259L249729L469191L154842
$$ 143811889 146245176 148796509 151563899 154404516 157331775 160581504 164050695 167205537
8091A67205537K643582K567157K704450K297604J443239J047871J264820J151868
$$ 167205537 169849119 172416276 175120726 177418330 178861569 179909440 181174260 182326128
8083A82326128K57238n94140o86963n46601r08629j450256j478686j194105j254798
$$ 182326128 182583366 181989226 181302263 180755662 179847033 178396777 176918091 175723986 174469188
8074A74469188j557543j472911j019135q19051r88726r67546m97329K949J68385
$$ 174469188 172911645 171438734 170419599 169600548 168611822 167644276 167146947 167149896 167318281
8065A67318281J61019K58437M81256P71945J125529J428091J508378J420739J397990
$$ 167318281 167479300 167737737 168218993 168990938 170116467 171544558 173052936 174473675 175871665
8056A75871665J526381J719997J929963K105310K098711J928565J930843K262507
$$ 175871665 177398046 179118043 181048006 183153316 185252027 187180592 189111435 191373942
8048A91373942K484314K122156J439093J083838J122893J051134O81450L36387
$$ 191373942 193858256 195980412 197419505 198503343 199626236 200677370 201358820 201695207
8040B01695207J32335k21377p68070j117449j148667j297589j843483k430217
$$ 201695207 201827542 201606165 200838095 199720646 198571979 197274390 195430907 193000690
8032A93000690k627055k529374k485705k605265k812072l026004l055718k704857
$$ 193000690 190373635 187844261 185358556 182753291 179941219 176915215 173859497 171154640
8024A71154640k209677k117902k463194k569455k048131j461067j464851j760622
$$ 171154640 168944963 166827061 164363867 161794412 159746281 158285214 156820363 155059741
8016A55059741j579617r15474n02283o41961q06482n46831j53843j08420l44598
$$ 155059741 153480124 152564650 152062367 151420406 150613924 150067093 149913250 149804830 149460232
8007A49460232m55546l59613l53341n85375q26959q37327p23409p75355j051827
$$ 149460232 149004686 148645073 148291732 147706357 146879398 146042071 145318662 144543307 143491480
7998A43491480j324471j439264j530245j761133k029717k135055k128389k242659
$$ 143491480 142167009 140727745 139197500 137436367 135406650 133271595 131143206 128900547
7990A28900547k511167k716235k725974k634129k538070k424260k317673k304255
$$ 128900547 126389380 123673145 120947171 118313042 115774972 113350712 111033039 108728784
7982A08728784k352430k334451k248585k184952k086860j842565j597243j612439
$$ 108728784 106376354 104041903 101793318 99608366 97521506 95678941 94081698 92469259
7974I2469259j804401j828452j653247j585071j659575j557102j258642j169106
$$ 92469259 90664858 88836406 87183159 85598088 83938513 82381411 81122769 79953663
7966G9953663j347309j280227q00273n40600r31610j387440j202353p12726p12057
$$ 79953663 78606354 77326127 76525854 75985254 75053644 73666204 72463851 71751125 71039068
7957G1039068j105844j119644o64046m87053r05629j306655j163049p84212p01718
$$ 71039068 69933224 68813580 68149534 67662481 66756852 65450197 64287148 63502936 62801218
7948F2801218q97153j024018r76695q92148q61018q78606q92678q06354o33511
$$ 62801218 61904065 60880047 59903352 59011204 58150186 57271580 56378902 55572548 54939037
7939E4939037o15779q95905j165615j028648o26314m35863n21766n36877m37377
$$ 54939037 54323258 53427353 52261738 51233090 50606776 50170913 49649147 49112270 48674893
7930D8674893n61152r17574j048481p73829m75171m32506m64722m46356n68076
$$ 48674893 48113741 47196167 46147686 45373857 44898686 44466180 44001458 43555102 42987026
7921D2987026q08903p68232l66094j20314l43954o36353n85433m09026m36208
$$ 42987026 42178123 41409891 41043797 40923483 40579529 39943176 39357743 38948717 38512509
7912C8512509n07139m03167l38715m68227m36505m5053J62012k84986q46713p06847
$$ 38512509 38005370 37602203 37263488 36795261 36358756 36313703 36475715 36190729 35344016 34637169
7902C4637169q9719Q1265l50281o11799l07525K7334j27401n27494o51419l95416
$$ 34637169 34547450 34628715 34278434 33666635 33359110 33386444 33259043 32731549 32080130 31684714
7892C1684714l0907J42642l4285m32420o42015m59946k46795l79647n67068l09782
$$ 31684714 31653807 31796449 31762164 31329744 30687729 30227783 29980988 29601341 29034273 28724491
7882B8724491J43114O9992n28855q46981n07924p5818q5516l19430l85268l29237
$$ 28724491 28867605 28937597 28408742 27561761 27053837 26978019 26892503 26573073 26187805 25858568
7872B5858568k89225j51279N0449l6442m47689o49445l44389O850p5550l54411
$$ 25858568 25569343 25418064 25468513 25432071 24984382 24334937 23990548 23997398 23921848 23567437
7862B3567437l77053k18610j78823j82278n6792j4476k61937m82896l14860k3542
$$ 23567437 23190384 22971774 22792951 22610673 22553881 22539405 22277468 21794572 21479712 21456170
7852B1456170p7777l35609l09708k0320Q3529r9793k66232l05935l54356l55735
$$ 21456170 21378393 21042784 20733076 20712756 20796285 20696492 20430260 20124325 19769969 19414234
7842A9414234j69992J015j12559k93527j85496j2772k18397n49438l78701J25301
$$ 19414234 19244242 19245257 19132698 18839171 18653675 18640903 18422506 17873068 17494367 17619668
7832A7619668J41134l96338n87937p0737L36961J0952m56683l41120k0027k03682
$$ 17619668 17760802 17364464 16776527 16705790 17042751 17053703 16597020 16255900 16235873 16032191
7822A6032191o01462m21269J98432L51100j67894n70841l51120L2975L87l25876
$$ 16032191 15430729 15009460 15207892 15558992 15391098 14820257 14469137 14502112 14502499 14176623
7812A4176623m69759k85579K0148K09982J41449j52676l84413k82176L064P3657
$$ 14176623 13706864 13421285 13441433 13651415 13792864 13640188 13255775 12973599 12976663 13050320
7802A3050320j18389k37147j55024j14374j94572j31591J19160J56072k05899
$$ 13050320 12931931 12694784 12539760 12425386 12230814 12099223 12218383 12374455 12168556
7793A2168556n18644l69492n2868o3066k59475j55858J73051J73729k26538m39947
$$ 12168556 11649912 11280420 11227552 11164486 10905011 10749153 10922204 11095933 10869395 10429448
7783A0429448j53603J79578Q2772k28945k74176o0865L6904q7719k10918k11863
$$ 10429448 10275845 10455423 10538195 10309250 10035074 9974209 10011113 9923394 9712476 9500613
7773I500613j67436r7019J8781L3713j72850l50119j41000K96923L92323j1176
$$ 9500613 9333177 9236158 9254939 9288652 9115802 8765683 8624683 8921606 9313929 9302753
7763I302753l86000k89676K8123R8282o3280j31188p3605j10543k19645j52642
$$ 9302753 8916753 8627077 8655200 8753482 8690202 8559014 8485409 8374866 8155221 8002579
7753H002579R2132K27155J20374o9285k04611k74573k01178O8167K68648O6411
$$ 8002579 8094711 8321866 8442240 8372955 8168344 7893771 7692593 7760760 8029408 8095819
7743H095819l35697l42810J21057L88115L5279m29971l37746J27831K82064J8701
$$ 8095819 7760122 7417312 7538369 7926484 7961763 7531792 7194046 7321877 7603941 7622642
7733G622642j51683l2275L373k24934l39298o6226K60230K18204o0299j60415
$$ 7622642 7470959 7438684 7442057 7217123 6877825 6811599 7071829 7290033 7229734 7069319
7723G069319l3763K9600o9639j32837n4150J5924m9742j58656j69295r0808k1700
$$ 7069319 7035556 7065156 6995517 6862680 6808530 6824454 6774712 6616056 6446761 6355953 6334253
7712F334253O556M0363R9294J13621j6506k74587m55216l37221K0649K66600J46441
$$ 6334253 6340809 6381172 6480466 6594087 6577581 6302994 5847778 5510557 5531206 5797806 5944247
7701E944247j74512l16581j57417O6806J21504N0235K5360P4013Q1796k993j02039
$$ 5944247 5769735 5453154 5295737 5362543 5484047 5534282 5559642 5633655 5715451 5712458 5610419
7690E610419j36983j20131q2649N939J69992L08567K43841n8835l75325m18515
$$ 5610419 5473436 5353305 5270656 5276595 5446587 5755154 5998995 5940160 5564835 5146320
7680E146320j57540J33513J80173K23j59051j25871L1041J28435Q1043l9745j16052
$$ 5146320 4988780 5122293 5302466 5302689 5143638 5017767 5048808 5177243 5258286 5218541 5102489
7669E102489j10573p9315p0414m1530P5416K27860K42927L9207k19941k89909
$$ 5102489 4991916 4912601 4842187 4800657 4876073 5103933 5346860 5386067 5166126 4876217
7659D876217j47086r352k8394q9587r240J67860K18234O3752j12155j23707k9861
$$ 4876217 4729131 4719779 4691385 4601798 4592558 4760418 4978652 5042404 4930249 4806542 4776681
7648D776681j5953j07178j45114m7797M8666j6517j82556k28223n9170J74597
$$ 4776681 4760728 4653550 4508436 4460639 4509305 4492788 4310232 4082009 4022839 4197436
7638D197436K76527K25007J30258M6146n7218j56784j57024n4515M717p3677j74511
$$ 4197436 4473963 4698970 4829228 4875374 4818156 4661372 4504348 4449833 4454550 4380873 4206362
7627D206362j38178l65Q3600Q4620Q2547N5405p3072j88102q3066J42952J30073
$$ 4206362 4068184 4067819 4151419 4236039 4318586 4373991 4300919 4112817 4029751 4172703 4302776
7616D302776j60701k91328k8152K15604K6559k77766j41484K54489K35379k17552
$$ 4302776 4142075 3850747 3822595 4038199 4064758 3786992 3645508 3899997 4135376 3917824
7606C917824l76547J9084K93011l2400m03741j61662L28078K73807k18748l26136
$$ 3917824 3541277 3560361 3853372 3820972 3417231 3255569 3583647 3857454 3638706 3312570
7596C312570J41284M65912J90215k37915k52369L1670J59210J9883j62879k19597
$$ 3312570 3453854 3919766 4109981 3872066 3619697 3651367 3810577 3830460 3667581 3447984
7586C447984j31048L7219J18855j1407j87686j25317J04058J39962n0296q2424
$$ 3447984 3316936 3354155 3473010 3461603 3273917 3148600 3252658 3392620 3342324 3259900
7576C259900J57708K47873o1183l57689j96289J90640K81759N8781q7725k7362
$$ 3259900 3417608 3665481 3604298 3246609 3050320 3240960 3522719 3581500 3493775 3466413
7566C466413L0431o473l4870n8437j57988k17002n7887J85916J87954r5822l70499
$$ 3466413 3496844 3490371 3455501 3397064 3239076 3022074 2964187 3150103 3338057 3242235 2871736
7555B871736l94439j77080J34987L25456J99183j25544k03907J36973M23049J76469
$$ 2871736 2477297 2300217 2435204 2760660 2959843 2834299 2630392 2767365 3190414 3366883
7545C366883l05196l60207J1447J82213p1502k58794l5799K48418J42957k44128
$$ 3366883 3061687 2701480 2712927 2895140 2823638 2564844 2529045 2777463 2920420 2676292
7535B676292m69184l02613J46662N61523N68082R1728l89155l43478M8037J35911
$$ 2676292 2207108 1904495 2051157 2612680 3180762 3272490 2883335 2539857 2587894 2723805
7525B723805j70294k78441L6544K20614p3651l36696p5547L12788K16517j55869
$$ 2723805 2553511 2275070 2311614 2532228 2458577 2121881 2046334 2359122 2575639 2419770
7515B419770j73671J39767K14107q2322l11969k48394j14901n1573N0378J49398
$$ 2419770 2246099 2385866 2599973 2517651 2205682 1957288 1842387 1790814 1841192 1990590
7505A990590L9204j99677k18022N5690L01656K88393R2836j51580l45685l09230
$$ 1990590 2029794 1830117 1612095 1667785 1969441 2257834 2350670 2199090 1853405 1544175
7495A544175R285K66289J19183j81978j17696K40026L02338o3581l03271r0679
$$ 1544175 1553460 1819749 1938932 1756954 1639258 1879284 2181622 2118041 1814770 1724091
7485A724091J73405Q1153j36856q4781J34273J67293K542j06371r3012r4219j47884
$$ 1724091 1897496 1978649 1841793 1757012 1891285 2058578 2061120 1954749 1861737 1767518 1619634
7474A619634j53256n7779P3650J07155n3142k59877j40836L62690O40718J37441
$$ 1619634 1466378 1408599 1482249 1589404 1536262 1276385 1135549 1498239 2138957 2276398
7464B276398o53912o56035K21191Q11689L46693m56374n44090k6660K55371R4418
$$ 2276398 1622486 966451 1187642 1999331 2346024 1889650 1345560 1318900 1574271 1668689
7454A668689o0156p8317k08885l34496p7207L74063L92248n0665k69911L9668
$$ 1668689 1608533 1530216 1321331 986835 909628 1283691 1675939 1625274 1355363 1395031
7444A395031L41478J54173k48318l75312k13281k1593J16470J91171R5275j24518
$$ 1395031 1736509 1890682 1642364 1267052 1053771 1032178 1148648 1339819 1435094 1310576
7434A310576j82854l028R5604o9312j99965l6328J59885N3348j54875n8432K31699
$$ 1310576 1127722 1124694 1220298 1150986 951021 914693 1074578 1127926 973051 914619 1146318
7423A146318K32869j22664l70187k31189J4511L5525m8378O7821L36491L92752
$$ 1146318 1379187 1256523 886336 655147 669658 705183 656805 724626 1061117 1453869
7413A453869Q3223k84164l08258O619K57281J41410j86321l45227k06113K6025
$$ 1453869 1537092 1252928 944670 951289 1208570 1349980 1163659 818432 612319 638344
7403F38344J49122J63222J11657l4441k18422k35066r000K11464J53920p5179
$$ 638344 787466 950688 1062345 1027904 809482 574416 565416 776880 930800 855621
7393H55621j26703P4719K11804N7098j61575q9005J97999K59519n3701l33634
$$ 855621 728918 803637 1015441 1072539 910964 821959 1019958 1279477 1225776 892142
7383H92142k00985J07017R2618k07161k62886Q3128L30475J21792j78667j06015
$$ 892142 691157 798174 890792 683631 420745 503873 834348 956140 777473 671458
7373F71458J33859N6970k34637k22420J31072L16524J22908p9416k1094P4111
$$ 671458 805317 862287 627650 405230 536302 852826 975734 896318 875224 949335
7363I49335k2983j68482j86918j59694j51469n0817J14338J09529o3897q9165
$$ 949335 926352 757870 570952 411258 259789 208972 323310 432839 368942 279777
7353B79777J06422J87248K9032l1712J37036J32222k37234m59349j18671L44623
$$ 279777 386199 573447 602479 570767 707803 840025 602791 143442 24771 369394
7343C69394L19109J878l6202J26192L618k99255k37726J35953K03328j14638j89357
$$ 369394 688503 690381 654179 780371 783989 484734 247008 382961 586289 471651 282294
7332B82294J90990M01861M4747l46092j73834K47630K01411l30204o74615m17166
$$ 282294 473284 875145 919892 573800 399966 647596 849007 518803 -155812 -572978
7322e72978J50068M97724M26838J32032q6504j04747k7665R448J8615O1728R6316
$$ -572978 -422910 74814 501652 633684 547180 442433 414768 424216 442831 504559 600875
7311F00875P9039Q7254J30540K3484k70694l96768j10219K05017N7942k94458
$$ 600875 679914 767168 897708 921192 650498 253730 143511 348528 406470 112012
7301A12012j90574L14579M62444J6920l55255j99991M2507q7882k58919q768L75209
$$ 112012 -78562 236017 698461 715381 360126 160135 202642 114760 -144159 -152927 222282
7290B22282L26859o7315k77290j73678m1000K2158J24353J72720j578k23535j74333
$$ 222282 549141 481826 204536 30858 -10142 12016 136369 309089 307511 83976 -90357
7279i0357Q3303K14648J35642K0287p4803j85796j94138j6762J18815Q666j09259
$$ -90357 -7054 207594 343236 363523 288720 102924 -91214 -107976 10839 19505 -89754
7268h9754O6339L04290J63252k38842l64420r6763J45108J25474N1942O6114K4535
$$ -89754 -23415 280875 444127 205285 -159135 -255898 -110790 14684 66626 132740 157275
7257A57275j02542j09273L3581P9938n1400j35147m7506N8847P5957P3236M6949
$$ 157275 54733 -54540 -20959 58979 7579 -127568 -175074 -116227 -40270 32966 79915
7246G9915r0198k23346j31477R0332J18991m5887o8900J19921J91571Q13j73059
$$ 79915 -10283 -233629 -365106 -274774 -155783 -201670 -270570 -150649 40922 41735 -131324
7235a31324j23834p938K9945Q4103J66663R2617j24778j84190N584J50595Q0340
$$ -131324 -255158 -263096 -233151 -149048 17615 110232 -14546 -198736 -193152 -42557 37783
7224C7783M683O9749J01736J0424k652J22601J18156j04725k16296k0580K00344
$$ 37783 42466 112215 213951 224375 221723 344324 462480 357755 141459 120879 321223
7213C21223J86668R2785P8653j2857k36427k90478n0599J32259M4428r314J48794
$$ 321223 507891 600676 679329 666472 430045 139567 88968 221227 265655 256341 405135
7202D05135J42682k15613l88718O697L83328P5130m69137l60864K30266L48992
$$ 405135 547817 332204 -56514 -49817 333511 408641 -60496 -421360 -191094 157898
7192A57898j37050l53087O7696L92992O0712m09449l07119J70937L16035m4356
$$ 157898 20848 -332239 -264543 128449 189161 -220288 -527407 -356470 -40435 -84791
7182h4791m39614m53693j17459K63446M03585K45299J589r3303o7044q1627j09364
$$ -84791 -524405 -978098 -1095557 -832111 -428526 -183227 -181638 -274941 -341985 -423612 -532976
7171e32976q752J44960J29558n2218j79398j55017n4122Q0848J90708R9919j79571
$$ -532976 -541728 -396768 -267210 -319428 -498826 -653843 -707965 -627117 -436409 -336490 -516061
7160e16061k55562R2193M11905J91525k64684k61736J53114K83200m9361k89302
$$ -516061 -771623 -679430 -267525 -76000 -340684 -602420 -449306 -166106 -215467 -504769
7150e04769j64274l6796p6717L5553L20578K88922j36583l37240m1369J96605
$$ -504769 -669043 -705839 -782556 -747003 -426425 -137503 -274086 -611326 -652695 -456090
7140d56090K5490p2726K30562L71976j00877n76504l16428L00743M17364N8138
$$ -456090 -430600 -503326 -272764 99212 -1665 -578169 -894597 -593854 -176490 -118352
7130a18352j21383l0756p9172k07991j0436L39875K64019j72976l14103j7650
$$ -118352 -239735 -270491 -349663 -557654 -568090 -228215 35804 -137172 -451275 -468925
7120d68925J78805O0687J8282J80005J27146k55591m23820m3720M15379L73549
$$ -468925 -290120 -229433 -211151 -31146 96000 -159591 -583411 -627131 -211752 161797
7110A61797n3940l32558k39870Q352J25543J9532j56335j44777P5327J83759j1735
$$ 161797 107857 -224701 -464571 -456219 -330676 -311144 -467479 -612256 -536929 -353170 -364905
7099c64905k07006p3617J50110N6789j78369r6873J71908J10810j99584j61618
$$ -364905 -571911 -645528 -495418 -438629 -616998 -713871 -541963 -431153 -630737 -792355
7089g92355K33952L10635r6776k94964O7784L70313R3869l04163k21772R6346
$$ -792355 -558403 -247768 -344544 -639508 -571724 -201411 -107542 -411705 -633477 -537131
7079e37131J04746r2154p5847O5801o373j69802r2968R3769O0270n1518J01725
$$ -537131 -432385 -524539 -600386 -534585 -540958 -710760 -803728 -709959 -649689 -701207 -599482
7068e99482L42811K22372j59639k76550m5860R3778l2764j19740p028P3525k127
$$ -599482 -256671 -34299 -193938 -470488 -516348 -422570 -455334 -575074 -582102 -508577 -510704
7057e10704l2030P9424J27924M281j12215r4110m2965j6300O9529J62260O5205
$$ -510704 -542734 -463310 -335386 -331105 -443320 -537430 -580395 -596695 -527166 -364906 -299701
7046b99701j70264k10229M0004K27202P2686k02340k24988n765J46662R3068j2504
$$ -299701 -469965 -680194 -640190 -412988 -340302 -542642 -767630 -773395 -626733 -533665 -546169
7035e46169r14J09933J80144J00591j01756k53454j84741N6716K13090J03681
$$ -546169 -547083 -437150 -257006 -156415 -258171 -511625 -696366 -639650 -426560 -322879
7025c22879j57713l07113k41031q7432J5987Q9323J89585K31716R9618r2703q5241
$$ -322879 -480592 -787705 -1028736 -1116168 -1100181 -1010858 -821273 -589557 -489939 -582642 -667883
7014f67883J10052J46388j15450k90564k7585L67595L38054n0086k13405M621
$$ -667883 -557831 -411443 -526893 -817457 -845042 -477447 -139393 -189479 -402884 -398263
7004c98263J34148p0522k33442n4193J99975K19521J19804M5739j30425l45282
$$ -398263 -264115 -334637 -568079 -622272 -422297 -202776 -82972 -37233 -167658 -512940
6994e12940j86761L38367N16647q405n18015k84343K46874K23044j78788j35765
$$ -512940 -699701 -361334 155313 146908 -371107 -655450 -408576 -185532 -364320 -500085
6984e00085L26664L79114j47028m62198j30430L08613K91085k2112k26714k15420
$$ -500085 -173421 205693 58665 -403533 -533963 -225350 65735 43623 -183091 -398511
6974c98511j5259K96897L89718J4183m18142k99553J45446J43386l03772l86056
$$ -398511 -413770 -116873 272845 287028 -131114 -430667 -285221 -141835 -445607 -831663
6964h31663Q1380L13079k6248k11557J90583M76634N8089m39784k30818L09267
$$ -831663 -750283 -437204 -463452 -675009 -484426 -7792 50297 -389487 -620305 -311038
6954c11038L50982j5748j19398P7857Q5271j38095k08680q1985j8620j2308Q1090
$$ -311038 39944 24196 -95202 -17345 67926 -70169 -278849 -360834 -379454 -391762 -310672
6943c10672J15328l5137q3266J50279K61538m2871k90366l0535K76050M0905l29242
$$ -310672 -195344 -230481 -313747 -163468 98070 55199 -235167 -265702 10348 51253 -277989
6932b77989j27921L19686K04047k60198j79502L68750M15930j68267m16559O1116
$$ -277989 -405910 -86224 117823 -142375 -321877 46873 462803 294536 -122023 -60907
6922f0907M64662K28863j48491j60852p3467j43983p8803K01661K10264j57534
$$ -60907 403755 632618 484127 323275 249808 105825 27022 228683 438947 281413
6912B81413k58207J57492L89421O241l41789p7356K63536L5099l13943o7341M13795
$$ 281413 23206 180698 570119 576360 234571 157215 420751 455850 141907 74566 488361
6901D88361K98546k46810l50517Q2978K92297k4496l15049j61406J71485L09285
$$ 488361 786907 540097 189580 272558 564855 540359 225310 63904 235389 544674
6891E44674K32648O0467j04237q6333J41613K35943l7646k76125J1688N01541
$$ 544674 777322 837789 733552 647219 788832 1024775 987129 711004 722692 1224233
6881A224233M31130j79210m89387j32285K56960R7974k63098k03502J90832L50922
$$ 1224233 1655363 1476153 986766 854481 1111441 1209415 946317 742815 933647 1284569
6871A284569J23125j12886j10370m7641j01210j21288O7675K93862K60600M7042
$$ 1284569 1407694 1294808 1184438 1136797 1035587 914299 981974 1275836 1536436 1583478
6861A583478L4362K71845L15837n1124l46232r3618L36064K60508j57038j37817
$$ 1583478 1617840 1889685 2205522 2154398 1808166 1714548 2050612 2311120 2154082 2016265
6851B016265L52693M68646o1984l85552P0783O15897M44005q3278j77227P6048
$$ 2016265 2368958 2837604 2775620 2390068 2460851 3076748 3520753 3437475 3260248 3336296
6841C336296J26816P0799K93461M95402J90575k03830N3783O48554O44585J19628
$$ 3336296 3463112 3533911 3827372 4322774 4513349 4309519 4363302 5011856 5656441 5776069
6831E776069M0228N28032O46343J14182j56809L29442P96478N63105J36765K07299
$$ 5776069 5816297 6344329 6990672 7104854 6948045 7277487 8073965 8637070 8773835 8981134
6821H981134N11658M97865L26385M04992N69665M95257L91031N83325Q62099Q72790
$$ 8981134 9492792 9990657 10317042 10722034 11291699 11786956 12177987 12761312 13623411 14496201
6811A4496201P37007P27754P58346P02906P61668J015646J119358R33141R10682
$$ 14496201 15233208 15960962 16719308 17422214 18183882 19199528 20318886 21252027 22162709
6802B2162709J313434J619473J341642Q84595R01444J288670J520769J532458
$$ 22162709 23476143 25095616 26437258 27321853 28223297 29511967 31032736 32565194
6794C2565194J569860J599595J561943J773450K375821K848326K803406K773369
$$ 32565194 34135054 35734649 37296592 39070042 41445863 44294189 47097595 49870964
6786D9870964L407112M396456N079803N584263O373664P187226P574052P982814
$$ 49870964 53278076 57674532 62754335 68338598 74712262 81899488 89473540 97456354
6778I7456354Q928186R382191P591071L581687o05258l402104n022477n994954
$$ 97456354 106384540 115766731 123357802 126939489 126334231 122932127 117909650 111914696
6770A11914696n976611m814484l525998l217595l813179m615330n372345o061634
$$ 111914696 105938085 101123601 97597603 94380008 90566829 85951499 80579154 74517520
6762G4517520o336012n972262n336539m771167m067264l106601k384697k251971
$$ 74517520 68181508 62209246 56872707 52101540 48034276 44927675 42542978 40291007
6754D0291007k252586j904368j539476j629850j847120j623986j180941j124520
$$ 40291007 38038421 36134053 34594577 32964727 31117607 29493621 28312680 27188160
6746B7188160j379105j378914j062253q48041q15857o99945n59085o93984r78690
$$ 27188160 25809055 24430141 23367888 22519847 21703990 21004045 20444960 19750976 18772286
6737A8772286r72392o49624m02360l89981m58269n72245p45709p15221l12631
$$ 18772286 17799894 17150270 16747910 16357929 15899660 15327415 14581706 13866485 13553854
6728A3553854K9472j73069n99572n73130j79192p4642l03943k82538K8694j2803
$$ 13553854 13583326 13410257 12810685 12237555 12058363 11983721 11679778 11397240 11425934 11413131
6718A1413131m96376o43431j23237K97578j4072n29941m55373L0132J84833j33734
$$ 11413131 10916755 10273324 10150087 10447665 10433593 9903652 9448279 9478411 9663244 9529510
6708I529510m58722n31621m62596l10957r1761j6684k20661m22739l08931n3692
$$ 9529510 9070788 8539167 8076571 7765614 7673853 7657169 7436508 7013769 6704838 6651146
6698F651146k1832j71424k15398j64113k17135l01703k22899j04996j61133j91737
$$ 6651146 6629314 6457890 6242492 6078379 5861244 5559541 5336642 5231646 5070513 4878776
6688D878776R8186M12345J79928m51126o72217k14718K28712Q9313k45667j68955
$$ 4878776 4976962 5389307 5569235 5118109 4445892 4231174 4459886 4549199 4303532 4134577
6678D134577J34115O0840l53456m76000r9736K39776J06839k18522k47602j1593
$$ 4134577 4268692 4329532 3976076 3500076 3400340 3640116 3746955 3528433 3280831 3269238
6668C269238Q9825n5288j69053q1710L6796J6890l9276J5443J01918P7525M248
$$ 3269238 3359063 3303775 3134722 3053012 3089808 3106698 3067422 3082865 3184783 3262308 3266556
6657C266556J2686K1622j16424k60330j23663K03036K61479r6668m17518k93896
$$ 3266556 3279242 3300864 3184440 2924110 2800447 3003483 3264962 3168294 2750776 2456880
6647B456880K6642O1780j31367r6430K12358L14415j1146l34084k25722R4990
$$ 2456880 2483522 2545302 2413935 2317505 2529863 2844278 2833132 2499048 2273326 2368316
6637B368316J34299j13053j95907Q1738L75574K95746r4480m04382l76149j01391
$$ 2368316 2502615 2389562 2193655 2275393 2650967 2946713 2852233 2447851 2071702 1970311
6627A970311J35266J46881J2251l5061Q1471J51381k3307k81208k78252k707J67844
$$ 1970311 2105577 2252458 2264709 2229648 2311119 2462500 2439193 2157985 1879733 1877026 2044870
6616B044870J8832j84866j37270K3960j1263j68456j19329J10889J37847j19424
$$ 2044870 2063702 1878836 1741566 1765526 1754263 1585807 1466478 1577367 1715214 1595790
6606A595790k43264J4501K95060J84581j35387j96578K4230J32957k6512j86929
$$ 1595790 1352526 1367027 1662087 1846668 1711281 1514703 1538933 1671890 1645378 1458449
6596A458449j31751K8128J11584Q6671k8611k04671k89079j30733J38521K19831
$$ 1458449 1326698 1354826 1466410 1553081 1524470 1319799 1030720 899987 1038508 1258339
6586A258339P8317l9618m5830j06516k26559j49323J61751L41378J61614j10997
$$ 1258339 1336656 1297038 1251208 1144692 918133 768810 930561 1271939 1433553 1322556
6576A322556j72937j42078k22034k45255K0663L58031L52889J6068k74992l35983
$$ 1322556 1149619 1007541 785507 540252 560915 918946 1271835 1287903 1012911 676928
6566F76928k65659r9740J69054L07406P2221k89001k73028J01460K74884K0458
$$ 676928 411269 311529 480583 787989 860210 571209 298181 399641 674525 694983
6556F94983k11704n8846J74212P5607j68498j20104J45164J64583j28876k79706
$$ 694983 483279 424433 598645 674252 505754 385650 530814 695397 566521 286815
6546B86815k8052K86030K28694j18387l11125j58350P4052P4391j01892j54638
$$ 286815 258763 544793 773487 655100 343975 185625 259677 334068 232176 77538
6536G7538J1334J44918J9637k09881j98607J04035L71951L31827Q0298j08278
$$ 77538 88872 233790 253427 43546 -155061 -51026 320925 652752 733050 624772
6526F24772j23090m4937L8755R6514R1356r591j67116k82733k81487j67167k5054
$$ 624772 501682 456745 495500 592014 683370 673779 506663 223930 -57557 -224724 -249778
6515b49778L6683M847k298R7146J84284Q6429j29914k04674n7422Q9767M9555
$$ -249778 -213095 -208248 -210546 -113400 70884 157313 27399 -177275 -234697 -144930 -95375
6504i5375o7232o0061N7720J32821J24099R9701O4859k9824j48767j91095j30456
$$ -95375 -162607 -222668 -164948 -32127 91972 191673 256532 226708 77941 -113154 -243610
6493b43610k1503R6968J90092J61058n5681l25889l73266p7805L38133M95329
$$ -243610 -265113 -168145 21947 183005 127324 -198565 -571831 -649636 -311503 183826
6483A83826K47881j46665l05522j62981k0790j03312k31562j17946J59125K61539
$$ 183826 431707 285042 -20480 -183461 -204251 -307563 -539125 -657071 -497946 -236407
6473b36407J12002k6956j6251k4596j46361j92377m4815J01831P7117J2041L5146
$$ -236407 -124405 -151361 -167612 -192208 -338569 -530946 -575761 -473930 -396813 -384772 -349626
6462c49626K586j66284j98108R8641L79543K17418j88052k80596j4007J22519
$$ -349626 -347040 -513324 -711432 -612791 -233248 -15830 -203882 -484478 -498485 -375966
6452c75966o0407j86866j8992J33626k1257k40810j51995J44702K54243Q2485
$$ -375966 -436373 -623239 -642231 -508605 -529862 -770672 -922667 -777965 -523722 -441237
6442d41237r1899n7087R9434J86107J41664M6096j0654m2810j34066k59372k40300
$$ -441237 -533136 -590223 -490789 -304682 -163018 -116922 -127576 -170386 -304452 -563824 -804124
6431h04124q758K06529J81312O4392J28846K58061J13844k11691k49413M4755
$$ -804124 -812882 -606353 -425041 -360649 -231803 26258 140102 -71589 -321002 -276247
6421b76247J35774j95675m16483j16120K59198J40273j81374o1676L31255K54549
$$ -276247 -140473 -336148 -752631 -868751 -609553 -469280 -650654 -712330 -381075 -126526
6411a26526l01111m85513N1400N51842L14007k62516l69278P936K43325R8211
$$ -126526 -427637 -913150 -861750 -309908 4099 -258417 -627695 -619759 -376434 -278223
6401b78223r0856j11683j19706j68806p0286J58769J98647k9129j52558N3891
$$ -278223 -369079 -480762 -600468 -769274 -839560 -680791 -482144 -511273 -663831 -609940
6391f09940K42919K5408l56177l36388J20546M49914K96387m2430j38072k0102
$$ -609940 -367021 -341613 -697790 -1034178 -913632 -463718 -167331 -209761 -347833 -367935
6381c67935K7438k1970J2719J01385J5776k43710l69580j79437J32207K77648
$$ -367935 -340497 -362467 -349748 -248363 -232587 -476297 -845877 -1025314 -893107 -615459
6371f15459J97235P97j92103k34453n653L43465M13198M8250l68204l77086n7913
$$ -615459 -418224 -417427 -609530 -843983 -849636 -506171 -92973 -44723 -412927 -790013 -847926
6360h47926J30706L7180k8486J41086L00374J42546k14402l69409j48480K21282
$$ -847926 -717220 -680040 -708526 -567440 -267066 -124520 -338922 -708331 -856811 -635529
6350f35529M01361K69307j8566j92772j09948J12315K15348Q4648j27301j97298
$$ -635529 -234168 35139 16573 -176199 -286147 -173832 41516 126164 -1137 -198435
6340a98435r1232L4785N3699P510J8539J17689K08041J94055R7795Q860m3057
$$ -198435 -289667 -254882 -201183 -193673 -175134 -57445 150596 344651 442446 451306 408249
6329D08249r0559j22553q4677r38K7692j4362l2477j2500o3132j75703j55730
$$ 408249 317690 195137 110460 109522 137214 122852 90375 77875 14743 -160960 -316690
6318c16690L8049J14858j23343l80879k53749J20193K36993J2063j08800Q7707
$$ -316690 -278641 -163783 -287126 -668005 -921754 -801561 -564568 -552505 -661305 -573598
6308e73598K26239k457k90935k05070J12933J91019k1900j30529M2575K14814
$$ -573598 -347359 -349816 -640751 -845821 -732888 -541869 -563769 -694298 -651723 -436909
6298d36909J25891j00821k07627j48095l7615N6788J33447J68014J16949k7480
$$ -436909 -311018 -411839 -619466 -767561 -805176 -748388 -614941 -446927 -329978 -357458
6288c57458k07140k86260j29014K06325M19902K80288n7290k28898j37149k5871
$$ -357458 -564598 -850858 -979872 -773547 -353645 -73357 -130647 -359545 -496694 -522565
6278e22565n5826o5039J17609L31432K70835p6157l76258l45025o4626J35236
$$ -522565 -578391 -643430 -525821 -194389 76446 289 -375969 -720994 -785620 -650384
6268f50384N6308j56368j97567J5503K19398J39010j21904j87796P7455L55030
$$ -650384 -594076 -750444 -948011 -932508 -713110 -574100 -696004 -883800 -806345 -451315
6258d51315K84305m8338k27764p7474J10133L469k73402k90385O3985L61198J95242
$$ -451315 -167010 -215348 -443112 -520586 -410453 -406984 -680386 -970771 -906786 -545588 -350346
6247c50346k21424l26682j9250J91932k0257k66999n4075L74731L40711k05775
$$ -350346 -571770 -898452 -917702 -725770 -746027 -1013026 -1067101 -692370 -351659 -557434
6237e57434n22040j37142M51241M98489M0856k73357j60346K6738k0969j29691
$$ -557434 -1079474 -1216616 -765375 -266886 -226030 -499387 -659733 -632995 -653964 -783655
6227g83655n5337P0213L707j45401o6993K16886L11219J1027l56248l34972M7902
$$ -783655 -838992 -768779 -765072 -910473 -977466 -760580 -449361 -438334 -794582 -1129554 -1081652
6216a081652L08125J43322j72509j74381J47028L23157N6671l40422l37667J04399
$$ -1081652 -773527 -630205 -802714 -977095 -830067 -506910 -450239 -790661 -1128328 -1023929
6206a023929M65068L30826r4683k93321r6146J76293J98000J8205j18626j20972
$$ -1023929 -558861 -228035 -322718 -616039 -712185 -535892 -337892 -319687 -438313 -559285
6196e59285n1021O7160K07897K02492p4303l80646k96156J59793M23188J21197
$$ -559285 -610306 -543146 -335249 -132757 -207060 -587706 -883862 -724069 -300881 -179684
6186a79684l68599m21259k5811K64059J55512n4213l0062J34411J77714P7682
$$ -179684 -548283 -969542 -995353 -731294 -575782 -629995 -660057 -525646 -347932 -270250
6176b70250k0531n8214m7899J5135O8881o28j25070o8558J60276J95100j37685
$$ -270250 -290781 -348995 -396894 -381759 -312878 -313506 -438576 -507134 -346858 -151758 -289443
6165b89443m37947k57933K07586L82495J30673j44925j81763j49867j95733j65298
$$ -289443 -727390 -985323 -777737 -395242 -264569 -409494 -591257 -741124 -936857 -1102155
6155a102155L2362J79413J11697J0515P2496J63676R0270k8180R341P1802r5678
$$ -1102155 -1069793 -890380 -778683 -768168 -695672 -531996 -441726 -469906 -460565 -388763 -484441
6144d84441l53338k85961J33430M09661K07353j72594k41881m2J55062N6333n5297
$$ -484441 -837779 -1123740 -990310 -580649 -373296 -545890 -787771 -787813 -632751 -576418 -631715
6133f31715M901P0961m4972j91773j02958J64400K97529J82490J3897m9691n4449
$$ -631715 -626814 -555853 -600825 -792598 -895556 -731156 -433627 -251137 -237240 -286931 -341380
6122c41380l0593Q5185J98836O5975k62013l49087j8224K66646P1919k73459j77148
$$ -341380 -371973 -286788 -87952 -21977 -283990 -633077 -651301 -384655 -312736 -586195 -763343
6111g63343K10104J91654l14050n80116k08492K79624L27544J39056J17705J18592
$$ -763343 -553239 -361585 -675635 -1255751 -1464243 -1184619 -857075 -718019 -600314 -481722
6101d81722j26184l24586q3075K97212K41751j08615j27325J99438K56164q9792
$$ -481722 -607906 -932492 -1015567 -718355 -476604 -585219 -712544 -513106 -256942 -346734
6091c46734k38739O4492K52150o8168l92425j59442K94710K92828r8557k55576
$$ -346734 -585473 -520981 -268831 -336999 -729424 -888866 -594156 -301328 -399885 -655461
6081f55461k3128J48796J6685j44982r5919L2763P1018O2561N5948j9464j47096
$$ -655461 -678589 -529793 -513108 -658090 -754009 -721246 -650228 -587667 -531719 -551183 -698279
6070f98279j69836m0506J09198J98981K55971K22711q3k74983l08037r4982L0505
$$ -698279 -868115 -908621 -799423 -600442 -344471 -121760 -121843 -396826 -704863 -799845 -769340
6059g69340q2118j60880J8835K43520K14369L7031K4005J64975J52309j06530
$$ -769340 -851458 -1012338 -993503 -749983 -535614 -498583 -474578 -309603 -157294 -263824
6049b63824l25965k47905K5144J95281J19906q4159j98674j11168Q7808J99120
$$ -263824 -589789 -837694 -812550 -617269 -497363 -581522 -780196 -891364 -803556 -604436
6039f04436J35374J0844l5637l1829q1114j45512q3158R5251J79700N1373j09445
$$ -604436 -469062 -458218 -493855 -525684 -606798 -752310 -835468 -740217 -560517 -509144 -618589
6028f18589m5965J95871K77745J4569l25250l22646L1780K92758J52800j38462
$$ -618589 -664554 -468683 -190938 -176369 -501619 -824265 -792485 -499727 -346927 -485389
6018d85389j56331O4045J11183j24894k66453p0437J56889O0702j56560n1374
$$ -485389 -641720 -577675 -466492 -591386 -857839 -928276 -771387 -710685 -867245 -918619
6008i18619L07538L92339K9234l14064k13905J29213K55947R7517o3138q8171
$$ -918619 -611081 -218742 -189508 -503572 -717477 -588264 -332317 -234800 -297938 -386109
5998c86109q6946r9715k7124J01194R3835p4571j60525j5142J66025J36413l4631
$$ -386109 -473055 -572770 -599894 -498700 -404865 -479436 -639961 -655103 -489078 -352665 -387296
5987c87296j09673o3300m3499l1036J28876L30093K15116k42044n05613j60745
$$ -387296 -496969 -560269 -603768 -634804 -505928 -175835 39281 -202763 -708376 -869121
5977h69121M10943M76490k2209l87786j87845J59633R9260k05829k02593J28234
$$ -869121 -458178 18312 -3897 -391683 -579528 -419895 -320635 -526464 -729057 -600823
5967f00823K53293l7575k97913j40643J78792K10655L548n9761P2958Q2010j27372
$$ -600823 -347530 -385105 -683018 -823661 -644869 -434214 -430666 -490427 -417469 -335459 -462831
5956d62831k37952o3765J06448k6964k53955j59699K05132L71647J56937r1786
$$ -462831 -700783 -764548 -658100 -685064 -939019 -1098718 -893586 -521939 -365002 -456788
5946d56788o8856O0895K9220p5966l9619N3370N429p1762M3561J99009P8091j77166
$$ -456788 -525644 -464749 -435529 -511495 -551114 -497744 -492315 -564077 -520516 -321507 -243416 -420582
5934d20582j22483J88429K02613j78021l36400L6017L52844R2743k96022j62775
$$ -420582 -543065 -354636 -152023 -330044 -666444 -630427 -277583 -184840 -480862 -643637
5924f43637K05380R6863l29991k86038K44927M17531m3525l70402m7749L75994
$$ -643637 -438257 -341394 -671385 -957423 -712496 -294965 -338490 -708892 -756641 -380647
5914c80647K83638m1464q0151j313j77311l43195o2204L69658L29537p4397j88053
$$ -380647 -97009 -138473 -218624 -219937 -397248 -740443 -802647 -432989 -103452 -177849 -365902
5903c65902P6102J48472j61611l44030p8997K44492J88343j02753k48295j90441
$$ -365902 -289800 -141328 -302939 -646969 -725966 -481474 -293131 -395884 -644179 -834620
5893h34620r0494J5438J61893K70514K52737J48528K8142r1339j56307q9401M4440
$$ -834620 -925114 -909676 -747783 -477269 -224532 -76004 -47862 -139201 -295508 -384909 -340469
5882c40469P6605j0394n9991l784N7724N6608K9253j9667j07219j40051l0535
$$ -340469 -263864 -274258 -334249 -338033 -280309 -223701 -194448 -214115 -321334 -461385 -491920
5871d91920Q3619N932j60042j21599J35573L00487J81287q2727k60242k28901
$$ -491920 -408301 -402369 -562411 -684010 -548437 -247950 -66663 -149390 -409632 -638533
5861f38533M159K22469R3106l28039m31032J16121O50297L40215m67127o43676
$$ -638533 -634374 -411905 -318799 -646838 -1077870 -961749 -311452 28763 -438364 -1082040
$$ [...]
##END NTUPLES=NMR SPECTRUM
##END=
