##TITLE=1H ikalashn
EC-3335(1)Hex
15.11.2024
##JCAMPDX= 6.0         $$ Bruker NMR JCAMP-DX V2.0
##DATA TYPE= NMR SPECTRUM
##DATA CLASS= NTUPLES
##ORIGIN= UXNMR, Bruker Analytische Messtechnik GmbH
##OWNER= root
$$ TOPSPIN		Version 1.3
$$ 2024-11-15 09:30:56.875 +0400  Irina@DPX200
$$ Compression mode = diff/dup
##.OBSERVE FREQUENCY= 200.131300845
##.OBSERVE NUCLEUS= ^1H
##.ACQUISITION MODE= SIMULTANEOUS
##.ACQUISITION SCHEME= undefined
##.AVERAGES= 32
##.DIGITISER RES= 18
##SPECTROMETER/DATA SYSTEM= spect
##.PULSE SEQUENCE= zg
##.SOLVENT NAME= CDCl3
##.SHIFT REFERENCE= INTERNAL, CDCl3, 1, 17.49637
##AUDIT TRAIL= $$ (NUMBER, WHEN, WHO, WHERE, WHAT)
$$ ##TITLE= Audit trail, TOPSPIN		Version 1.3
$$ ##JCAMPDX= 5.01
$$ ##ORIGIN= Bruker BioSpin GmbH
$$ ##OWNER= Irina
$$ $$ F:/spectra/data/iren/nmr/1H/4/pdata/1/auditp.txt
$$ ##AUDIT TRAIL=  $$ (NUMBER, WHEN, WHO, WHERE, VERSION, WHAT)
(   1,<2024-11-15 09:30:36.531 +0400>,<Irina>,<DPX200>,<TOPSPIN 1.3>,
      <created by zg
	started at 2024-11-15 09:28:28.625 +0400,
	POWCHK disabled, PULCHK disabled
       configuration hash MD5:
       BE 6D 3F 07 2A EA 11 49 91 17 2B D3 AF B3 58 0D
       data hash MD5: 16K
       69 07 27 02 22 81 10 DE D4 57 B3 60 EE CE 10 05>)
(   2,<2024-11-15 09:30:38.687 +0400>,<Irina>,<DPX200>,<TOPSPIN 1.3>,
      <Start of raw data processing
       efp BC_mod = 2 LB = 0.02 FT_mod = 6 PKNL = 1 PHC0 = 118.1966 PHC1 = 8.07123 SI = 32K 
       data hash MD5: 32K
       7F 17 98 72 EF F0 79 EB F6 E5 52 E2 84 F0 5A 6F>)
(   3,<2024-11-15 09:30:40.656 +0400>,<Irina>,<DPX200>,<TOPSPIN 1.3>,
      <apk 
       data hash MD5: 32K
       61 AC 85 7B AB 57 46 A0 95 51 B1 EA 7E 2C BB D8>)
(   4,<2024-11-15 09:30:47.234 +0400>,<Irina>,<DPX200>,<TOPSPIN 1.3>,
      <abs n ABSG = 5 
       data hash MD5: 32K
       4D B9 71 C3 D1 24 62 F1 76 BE 31 3E 9E E2 85 2F>)
$$ ##END=
$$ 
$$ $$ hash MD5
$$ $$ 2D 5B 79 B7 A1 A1 A0 D6 F8 18 A4 7F AD 2A B7 30
##$RELAX= 
##$RELAX= 
##$RELAX= 
##$RELAX= 
##$RELAX= 
##$RELAX= 
##$RELAX= 
##$RELAX= 
##$RELAX= 
$$ Bruker specific parameters
$$ --------------------------
##$DU= <F:/spectra>
##$EXPNO= 4
##$NAME= <1H>
##$PROCNO= 1
##$TYPE= <nmr>
##$USER= <iren>
##$AMP= (0..31)
100 100 100 100 100 100 100 100 100 100 100 100 100 100 100 100 100 100 
100 100 100 100 100 100 100 100 100 100 100 100 100 100 
##$ANAVPT= -1
##$AQSEQ= 0
##$AQ_mod= 1
##$AUNM= <au_zg>
##$AUTOPOS= <>
##$BF1= 200.13
##$BF2= 200.13
##$BF3= 200.13
##$BF4= 200.13
##$BF5= 200.13
##$BF6= 200.13
##$BF7= 200.13
##$BF8= 200.13
##$BYTORDA= 1
##$CFDGTYP= 0
##$CFRGTYP= 5
##$CHEMSTR= <none>
##$CNST= (0..63)
1 1 145 1 1 1 1 1 1 1 1 1 1 1 1 1 1 1 1 1 1 1 1 1 1 1 1 1 1 1 1 1 1 1 
1 1 1 1 1 1 1 1 1 1 1 1 1 1 1 1 1 1 1 1 1 1 1 1 1 1 1 1 1 1 
##$CPDPRG= <>
##$CPDPRG1= <>
##$CPDPRG2= <>
##$CPDPRG3= <>
##$CPDPRG4= <mlev>
##$CPDPRG5= <mlev>
##$CPDPRG6= <mlev>
##$CPDPRG7= <mlev>
##$CPDPRG8= <mlev>
##$CPDPRGB= <>
##$CPDPRGT= <>
##$D= (0..63)
0 2 0 0 0 0 0 0 0 0.06 0 0.03 0 0 0 0 0.0002 0 0 0 0 0 0 0 0 0 0 0 0 0 
$$ [...]
##$SW_h= 4401.40845070422
##$TD= 16384
##$TD0= 1
##$TE= 300
##$TE2= 300
##$TE3= 300
##$TEG= 300
##$TL= (0..7)
0 120 120 120 120 120 120 120 
##$TP= (0..7)
150 150 150 150 150 150 150 150 
##$TP07= 0
##$TPNAME0= <>
##$TPNAME1= <>
##$TPNAME2= <>
##$TPNAME3= <>
##$TPNAME4= <>
##$TPNAME5= <>
##$TPNAME6= <>
##$TPNAME7= <>
##$TPOAL= (0..7)
0.5 0.5 0.5 0.5 0.5 0.5 0.5 0.5 
##$TPOFFS= (0..7)
0 0 0 0 0 0 0 0 
##$TUNHIN= 0
##$TUNHOUT= 0
##$TUNXOUT= 0
##$USERA1= <user>
##$USERA2= <user>
##$USERA3= <user>
##$USERA4= <user>
##$USERA5= <user>
##$V9= 5
##$VALIST= <valist>
##$VCLIST= <CCCCCCCCCCCCCCC>
##$VD= 0
##$VDLIST= <DDDDDDDDDDDDDDD>
##$VPLIST= <PPPPPPPPPPPPPPP>
##$VTLIST= <TTTTTTTTTTTTTTT>
##$WBST= 1024
##$WBSW= 25
##$XGAIN= (0..3)
0 0 0 0 
##$XL= 0
##$YL= 0
##$YMAX_a= 1864462
##$YMIN_a= -1788435
##$ZGOPTNS= <>
##$ZL1= 120
##$ZL2= 120
##$ZL3= 120
##$ZL4= 120
##$ABSF1= 17.49637
##$ABSF2= -4.496376
##$ABSG= 5
##$ABSL= 3
##$ALPHA= 0
##$AQORDER= 0
##$ASSFAC= 0
##$ASSFACI= 0
##$ASSFACX= 0
##$ASSWID= 0
##$AUNMP= <proc_1d>
##$AXLEFT= 0
##$AXRIGHT= 0
##$AXTYPE= 0
##$AXUNIT= <>
##$AZFE= 0.1
##$AZFW= 0.1
##$BCFW= 0
##$BC_mod= 2
##$BYTORDP= 0
##$COROFFS= 0
##$CY= 7568.61572265625
##$DATMOD= 1
##$DC= 0
##$DFILT= <>
##$DTYPP= 0
##$F1P= 17.9538593292236
##$F2P= -4.03888763876832
##$FCOR= 0.5
##$FTSIZE= 32768
##$FT_mod= 6
##$GAMMA= 0
##$GB= 0
##$INTBC= 0
##$INTSCL= 1.367314e-010
##$ISEN= 128
##$LB= 0.02
##$LEV0= 0
##$LPBIN= 0
##$MAXI= 945.577
##$MC2= 0
##$MEAN= 0
##$ME_mod= 0
##$MI= -402.1523
##$NCOEF= 0
##$NC_proc= -4
##$NLEV= 6
##$NOISF1= 8.587773
##$NOISF2= 6.764455
##$NSP= 0
##$NTH_PI= 0
##$NZP= 0
##$OFFSET= 17.49637
##$PC= 1
##$PHC0= 324.4483
##$PHC1= -0.247241
##$PH_mod= 1
##$PKNL= yes
##$PPARMOD= 0
##$PPDIAG= 0
##$PPIPTYP= 0
##$PPMPNUM= 100
##$PPRESOL= 1
##$PSCAL= 0
##$PSIGN= 0
##$REVERSE= no
##$SF= 200.13
##$SI= 32768
##$SIGF1= 16.12182
##$SIGF2= -4.496377
##$SINO= 3.521527
##$SIOLD= 32768
##$SREGLST= <1H.CDCl3>
##$SSB= 0
##$STSI= 32768
##$STSR= 0
##$SW_p= 4401.40845070422
##$SYMM= 0
##$S_DEV= 0
##$TDeff= 16384
##$TDoff= 0
##$TI= <>
##$TILT= no
##$TM1= 0
##$TM2= 0
##$TOPLEV= 0
##$USERP1= <user>
##$USERP2= <user>
##$USERP3= <user>
##$USERP4= <user>
##$USERP5= <user>
##$WDW= 1
##$XDIM= 32768
##$YMAX_p= 486334206
##$YMIN_p= -388640
$$ End of Bruker specific parameters
$$ ---------------------------------
##NTUPLES= NMR SPECTRUM
##VAR_NAME=  FREQUENCY,     SPECTRUM/REAL,   SPECTRUM/IMAG
##SYMBOL=    X,             R,               I
##VAR_TYPE=  INDEPENDENT,   DEPENDENT,       DEPENDENT
##VAR_FORM=  AFFN,          ASDF,            ASDF
##VAR_DIM=   32768,         32768,           32768
##UNITS=     HZ,            ARBITRARY UNITS, ARBITRARY UNITS
##FACTOR=    0.134324425510551, 1,           1
##FIRST=     4401.40845070422, 47483,        -262391
##LAST=      0,             -175022,         -354244
##MIN=       0,             -388640,         0
##MAX=       4401.40845070422, 486334206,    0
$$ Real data points
##PAGE= N=1
##DATA TABLE= (X++(R..R)), XYDATA
$$ [...]
13020C464795l4727m3334n8533l7997m004j1503n3170o5977k9558O059L50k5064
13008C107337l2181k1577j7841k9096m2885m5589l2887j3549p496k4889m6137
12997B793210m1721j3733L889q371l0862l5551k2362j1494j2862j7546j3555J74
12985B589216J3493J4582K718q264m915Q332J5194J0896Q447J7811K9525K7119
12973B724154J0266l210J938K1073L5618L4725K6904K6212L0015K1335k460j6496
12961B910074J076L2251L4935j66l1174j9960J2758J5663j7158l5830j0617K0508
12949B912360J0348k1883k0536J6030L2676R035q208J1132K5773k884l3363o505
12937B923975M8650M9520j0447m7447j3599L7399L9794P150p264P379K3651K8715
$$ y = [3464795, 3430068, 3386734, 3328201, 3290204, 3286200, 3274697, 3221527, 3155550, 3125992, 3132051, 3132401, 3107337, 3075156, 3053579, 3035738, 3006642, 2963757, 2918168, 2885281, 2871732, 2864236, 2839347, 2793210, 2751489, 2737756, 2741645, 2733274, 2702412, 2666861, 2644499, 2633005, 2620143, 2602597, 2589042, 2589216, 2602709, 2617291, 2620009, 2611745, 2606830, 2615162, 2630356, 2641252, 2649699, 2667510, 2697035, 2724154, 2734420, 2731210, 2733148, 2754221, 2789839, 2824564, 2851468, 2877680, 2907695, 2929030, 2926570, 2910074, 2911150, 2943401, 2978336, 2978170, 2946996, 2927036, 2939794, 2955457, 2938299, 2902469, 2891852, 2912360, 2922708, 2900825, 2880289, 2896319, 2928995, 2938030, 2929822, 2940954, 2966727, 2963843, 2930480, 2923975, 2972625, 3022145, 3011698, 2964251, 2950652, 2988051, 3027845, 3034995, 3027731, 3035110, 3058761, 3087476]
12925C087476K8631K2577J0502P841K0816K6919J0181o016N777L0326L4319J9631
12913C298980J3992K2465K6966K4775L0148M2960M9334M8293M7046L7960J3091
12902C656010p690j16K0002J5731j1250k2838p897K122r689j8380o044K763j6713
12889C596011m2337l4942J236K1631K490k7864k7809K675K2275M373k4084j7518
12877C476137K3226N0830M0078K0285K2748L4394L2901L0983M5156N3769L5962
12866C866469K3082N1688Q9123P5820K7284J5049M8466O1091K7174K675K0620
12855D308541L2827K714k4243m510J8724j1297o1873o2291k0002k541k6790m6491
12843D102768l9419l1784l6436l3936k0605j6972k2587j5261J042m37j5467j2062
$$ y = [3087476, 3116107, 3138684, 3149186, 3157027, 3177843, 3204762, 3214943, 3208927, 3214704, 3245030, 3279349, 3298980, 3312972, 3335437, 3362403, 3387178, 3417326, 3460286, 3509620, 3557913, 3604959, 3642919, 3656010, 3648320, 3648204, 3668206, 3683937, 3672687, 3649849, 3641952, 3644074, 3634385, 3616005, 3609961, 3612724, 3596011, 3553674, 3518732, 3519968, 3541599, 3544089, 3516225, 3488416, 3491091, 3513366, 3517739, 3493655, 3476137, 3499363, 3550193, 3590271, 3610556, 3633304, 3667698, 3700599, 3731582, 3776738, 3830507, 3866469, 3889551, 3941239, 4030362, 4106182, 4133466, 4148515, 4196981, 4258072, 4285246, 4287921, 4308541, 4341368, 4344082, 4319839, 4315329, 4334053, 4322756, 4260883, 4198592, 4178590, 4176049, 4149259, 4102768, 4063349, 4031565, 3995129, 3961193, 3940588, 3923616, 3901029, 3885768, 3886810, 3886373, 3870906, 3858844]
12831C858844Q858J2627k462K202L3278M8363L2205K6080N0013N9230K3117j0115
12819D142240J3563O2187O7305L4099K6201N3923N7657J3042k1455M512N1192
12808D504466M5040j6706o6998n9974j7411J3792J3729p564l0599l8507k7804
12797D311464j5429j9123k8598j9144K584o33l5932n8219l6997q444j7383l9383
12785D034763k0779K3946K8852j1639k8951M033K7318J986j7904J7841N9154L7394
12773D156014j2192n357M8722O3477K0681m839K4268N2141L3189L661P723K5304
12761D412792K2098J1443J6215J9414K818q411J0048L0158J5158j6072j8894O544
12749D503311K2525J3438n288k1926l2006k2468Q817L1746J9658p028r152J2608
$$ y = [3858844, 3867702, 3880329, 3877867, 3880069, 3913347, 3961710, 3993915, 4019995, 4070008, 4129238, 4152355, 4142240, 4155803, 4217990, 4285295, 4319394, 4345595, 4399518, 4457175, 4470217, 4448762, 4453274, 4504466, 4549506, 4532800, 4465802, 4405828, 4388417, 4402209, 4415938, 4408374, 4377775, 4339268, 4311464, 4296035, 4276912, 4248314, 4229170, 4231754, 4231121, 4195189, 4136970, 4099973, 4091529, 4074146, 4034763, 4013984, 4037930, 4066782, 4055143, 4026192, 4030225, 4057543, 4059529, 4041625, 4059466, 4118620, 4156014, 4143822, 4138465, 4187187, 4250664, 4271345, 4266506, 4290774, 4342915, 4376104, 4379765, 4387488, 4412792, 4434890, 4446333, 4462548, 4481962, 4484780, 4476369, 4486417, 4516575, 4531733, 4515661, 4496767, 4503311, 4525836, 4539274, 4533986, 4512060, 4480054, 4457586, 4466403, 4498149, 4517807, 4510779, 4501627, 4514235]
12737D514235K4821J5395L205K218J0895K8966N1313N4655K5215q441n238L1737
12725D748976O1030N8365L4513P161j0232o22L7572O9349N9099K3537J1088L2586
12713E132422N2732M9123L7590L4898L5968L5597L8216M0389L4897L2685M6901
12702E571418N8825M0319P989P332L9632N5784L3531R141J4641L2886L7850L4239
12690E943587L1729K2158Q039J2919L7620M7763L1299K3339M3075N4608L0168
12679F286304M533J7210M3243L8518J7705K3270M4690L8019R853J0332M5926O7614
12667F647217N2700L5218M0648M8471M1119L8843N8427P8750P6146O1464N5952
12656G234955N8271N9071O2986P3570P8743P1940O7008P3423P7939O9870O2990
$$ y = [4514235, 4539056, 4554451, 4557656, 4559874, 4570769, 4599735, 4651048, 4705703, 4730918, 4722477, 4717239, 4748976, 4810006, 4868371, 4902884, 4910045, 4899813, 4899191, 4936763, 5006112, 5065211, 5088748, 5099836, 5132422, 5185154, 5234277, 5271867, 5306765, 5342733, 5378330, 5416546, 5456935, 5491832, 5524517, 5571418, 5630243, 5670562, 5678551, 5685883, 5725515, 5781299, 5814830, 5823971, 5838612, 5871498, 5909348, 5943587, 5975316, 5997474, 6005513, 6018432, 6056052, 6103815, 6135114, 6158453, 6201528, 6256136, 6286304, 6290837, 6308047, 6351290, 6389808, 6407513, 6430783, 6475473, 6513492, 6523345, 6533677, 6579603, 6647217, 6699917, 6735135, 6775783, 6824254, 6865373, 6904216, 6962643, 7041393, 7117539, 7179003, 7234955, 7293226, 7352297, 7415283, 7488853, 7567596, 7639536, 7706544, 7779967, 7857906, 7927776, 7990766]
12645G990766P1369Q3358Q2054P4338P6720Q7349R4507R9037J05882J06621R4380
12634H966381Q4270R3717J12328J17357J10201J08899J11995J03681R2281J04939
12624A0006049J37535J50292J30245J18425J45713J77113J63470J24561J25168
12615A1278571J74074K06853J84321J51662J65214K06732K20753K06516K12041
12606A3006737K47822K69309K53572K36653K52975K85573L05750L21264L49115
12597A5528770L73674L72959L63055L74895M03641M21189M25278M34863M47337
12588A9145661M44845M38582M60598N08432N41851N43172N39599N54225N75526
12579B3752491N92105O18175O60865O95843P03526P04497P32617P92407Q64168
$$ y = [7990766, 8062135, 8145493, 8227547, 8301885, 8378605, 8465954, 8560461, 8659498, 8765380, 8872001, 8966381, 9050651, 9144368, 9256696, 9374053, 9484254, 9593153, 9705148, 9808829, 9901110, 10006049, 10143584, 10293876, 10424121, 10542546, 10688259, 10865372, 11028842, 11153403, 11278571, 11452645, 11659498, 11843819, 11995481, 12160695, 12367427, 12588180, 12794696, 13006737, 13254559, 13523868, 13777440, 14014093, 14267068, 14552641, 14858391, 15179655, 15528770, 15902444, 16275403, 16638458, 17013353, 17416994, 17838183, 18263461, 18698324, 19145661, 19590506, 20029088, 20489686, 20998118, 21539969, 22083141, 22622740, 23176965, 23752491, 24344596, 24962771, 25623636, 26319479, 27023005, 27727502, 28460119, 29252526, 30116694]
12570C0116694R30560R78318R98575J010394J059635J163473J275741J342026
12562C8875416J374588J434306J544292J660693J734058J765674J789302J821853
12554E2000182J850998J858979J839968J793583J713540J593806J446864J301779
12546F5399699J169563J021476Q27716O13718M42058L30282K27650R6746k1323
12537G0107585o2159k9918J3876L9199P6823J60060K80523M09813N32035O45774
12527G2173611P59255Q88931J041737J199364J341941J480524J638277J808577
12519H2332217J967745K122479K300444K493378K658354K785297K914227L067325
12511A02641466L209999L302577L345852L346221L278738L122012K893521K610741
$$ y = [30116694, 31047254, 32025572, 33024147, 34034541, 35094176, 36257649, 37533390, 38875416, 40250004, 41684310, 43228602, 44889295, 46623353, 48389027, 50178329, 52000182, 53851180, 55710159, 57550127, 59343710, 61057250, 62651056, 64097920, 65399699, 66569262, 67590738, 68418454, 69032172, 69474230, 69804512, 70032162, 70128908, 70107585, 70045426, 70015508, 70029384, 70068583, 70145406, 70305466, 70585989, 70995802, 71527837, 72173611, 72932866, 73821797, 74863534, 76062898, 77404839, 78885363, 80523640, 82332217, 84299962, 86422441, 88722885, 91216263, 93874617, 96659914, 99574141, 102641466, 105851465, 109154042, 112499894, 115846115, 119124853, 122246865, 125140386, 127751127]
12503A27751127K250398J791763J274845P67763K91823j80135o67390j163249
12495A32116945j653378k106595k464528k689989k812426k875509k857523k708127
12487A11948870k454442k193241j968314j733273j459685j202129j009899q43027
12479I9084860o38451m08808k07886l5172J53752L65397N69311P68834R97917
12470A00649754J245702J454623J609000J761227J943219K107717K194596K211863
12462A15177701K208072K194924K141826K031121J879022J707357J524915J333649
12454A30198587J128860Q95225O23002L26682L2550k46842n10159p47319r43223
12445A30757363j100159j239333j379866j530005j697084j889730k106354k330601
$$ y = [127751127, 130001525, 131793288, 133068133, 133835896, 134127719, 133947584, 133280194, 132116945, 130463567, 128356972, 125892444, 123202455, 120390029, 117514520, 114656997, 111948870, 109494428, 107301187, 105332873, 103599600, 102139915, 100937786, 99927887, 99084860, 98446409, 98037601, 97829715, 97794543, 97948295, 98313692, 98883003, 99651837, 100649754, 101895456, 103350079, 104959079, 106720306, 108663525, 110771242, 112965838, 115177701, 117385773, 119580697, 121722523, 123753644, 125632666, 127340023, 128864938, 130198587, 131327447, 132222672, 132845674, 133172356, 133204906, 132958064, 132447905, 131700586, 130757363, 129657204, 128417871, 127038005, 125508000, 123810916, 121921186, 119814832, 117484231]
12437A17484231k538033k700440k789092k786730k696734k535208k320179k074227
12429I7043588j823245j576808j320177j042700p62662n02076k47993L0870L32550
12420I0131347O20817Q82263J152743J471218J830604K191053K522252K812224
12412A03614521L045970L195137L227945L124227K890237K565207K202447J835376
12404A25701067J466853J087478O83859K25062l33261j011380j778901k568772
12396A23472005l301028l891618m271383m423736m393711m245736m022884l751161
12388I1170748l455608l152895k848170k555335k296931k066965j824738j552028
12380G1418078j286671j067501q76452o75494m71880k96372j39932K8419J93527
$$ y = [117484231, 114946198, 112245758, 109456666, 106669936, 103973202, 101437994, 99117815, 97043588, 95220343, 93643535, 92323358, 91280658, 90517996, 90015920, 89767927, 89798797, 90131347, 90752164, 91634427, 92787170, 94258388, 96088992, 98280045, 100802297, 103614521, 106660491, 109855628, 113083573, 116207800, 119098037, 121663244, 123865691, 125701067, 127167920, 128255398, 128939257, 129164319, 128831058, 127819678, 126040777, 123472005, 120170977, 116279359, 112007976, 107584240, 103190529, 98944793, 94921909, 91170748, 87715140, 84562245, 81714075, 79158740, 76861809, 74794844, 72970106, 71418078, 70131407, 69063906, 68187454, 67511960, 67040080, 66743708, 66603776, 66632195, 66825722]
12371F6825722L07559L69037M23580M78018M78186L91260K52549J07420l9248
12362F9594083j91215l35060m79807o70295r21479j184360j415968j636165j869749
12353F0889985k078437k205891k253249k253513k206188k100186j971390j867336
12345D3953795j775038j654249j524829j442308j394786j310414j175816j061730
12337C2614625j008226r66424q90369q10656p67386p36168o81208o28130o15987
12328B5510071o16279n72683m98377m61309m79258m95937m67750m16886l82967
12319B1118625l68950l56283l38367l16740k88634k57358k37187k33132k30291
12310A8491683k14459j90534j71311j59377j48127j32038j11765r6957j02470
$$ y = [66825722, 67133281, 67502318, 67925898, 68403916, 68882102, 69273362, 69525911, 69633331, 69594083, 69402868, 69067808, 68588001, 67917706, 66996227, 65811867, 64395899, 62759734, 60889985, 58811548, 56605657, 54352408, 52098895, 49892707, 47792521, 45821131, 43953795, 42178757, 40524508, 38999679, 37557371, 36162585, 34852171, 33676355, 32614625, 31606399, 30639975, 29749606, 28938950, 28171564, 27435396, 26754188, 26126058, 25510071, 24893792, 24321109, 23822732, 23361423, 22882165, 22386228, 21918478, 21501592, 21118625, 20749675, 20393392, 20055025, 19738285, 19449651, 19192293, 18955106, 18721974, 18491683, 18277224, 18086690, 17915379, 17756002, 17607875, 17475837, 17364072, 17267115, 17164645]
12301A7164645j28324j45560j22790p1432m1864o1507r6235r3793n2720k1875
12291A6328545l3082o1170o1981k9122P604K8662M2912N8986O6602N9589N4822
12280A6462367O7372Q3758Q4939Q1759R6391J18309J17452R9948J06980J48460
12270A7467735J82453J80744J71849J88589K12760K12702K03498K20756K56197
12261A9297283K71589K65003K70607K96247L13247L12432L20183L47324L68348
12252B2062263L68244L68150L83839L96697L90122L81905L93905M16125M26261
12243B5587511M22767M16611M12097M15983M41926M83908N08718M98581M79194
12234B9667296M81319M96744M98696M85136M74043M74031M85871N13572N48067
$$ y = [17164645, 17036321, 16890761, 16767971, 16696539, 16654675, 16593168, 16496933, 16403140, 16350420, 16328545, 16295463, 16234293, 16172312, 16143190, 16150794, 16179456, 16222368, 16281354, 16347956, 16407545, 16462367, 16529739, 16613497, 16698436, 16780195, 16876586, 16994895, 17112347, 17212295, 17319275, 17467735, 17650188, 17830932, 18002781, 18191370, 18404130, 18616832, 18820330, 19041086, 19297283, 19568872, 19833875, 20104482, 20400729, 20713976, 21026408, 21346591, 21693915, 22062263, 22430507, 22798657, 23182496, 23579193, 23969315, 24351220, 24745125, 25161250, 25587511, 26010278, 26426889, 26838986, 27254969, 27696895, 28180803, 28689521, 29188102, 29667296, 30148615, 30645359, 31144055, 31629191, 32103234, 32577265, 33063136, 33576708, 34124775]
12225C4124775N63544N60355N85378O71729P82771Q60961R11090R83091J088074
12216D1131768J190881J279897J380855J496170J594012J673446J779708J929057
12208E3455794K073717K174446K258841K368356K488807K575557K613182K607042
12200G2615742K546001K421137K259929K095163J913857J678916J388365J071063
12192H7990173P35434L68478j7992l84660p12098j012672j288634j511665j653294
12183H2513070j709901j691510j608594j474644j303960j106943q99611p03237
12175G2014670n14602k98674m1995K11211M18022O06117Q28145J070193J280122
12166G5573209J476256J736619K067495K378416K622221K862551L140751L364033
$$ y = [34124775, 34688319, 35248674, 35834052, 36505781, 37288552, 38149513, 39060603, 40043694, 41131768, 42322649, 43602546, 44983401, 46479571, 48073583, 49747029, 51526737, 53455794, 55529511, 57703957, 59962798, 62331154, 64819961, 67395518, 70008700, 72615742, 75161743, 77582880, 79842809, 81937972, 83851829, 85530745, 86919110, 87990173, 88725607, 89094085, 89076093, 88691433, 87979335, 86966663, 85678029, 84166364, 82513070, 80803169, 79111659, 77503065, 76028421, 74724461, 73617518, 72717907, 72014670, 71500068, 71201394, 71159399, 71370610, 71788632, 72394749, 73222894, 74293087, 75573209, 77049465, 78786084, 80853579, 83231995, 85854216, 88716767, 91857518, 95221551]
12158I5221551L414371L305942L139118K945487K684211K363616K048695J740031
12150A16863022J346612Q03845J38400o02008j393964k176619k828849l270288
12142A08880151l535803l702549l791012l785211l701288l574908l410712l199438
12134H0179230k962515k728890k487606k215280j937241j708958j539743j381429
12126F3217568j197275j004277q39076p10819n97551m72916l32959k04182j16754
12117E7741759o3722p661O0911J02392Q8008M8257K8732K6610Q393l7921j11204
12106E7884554k27991l92600n61808o97767q33575j019552j224058j368550j453211
12097E0105442j555163j690975j779016j772410j735253j730476j714267j617357
$$ y = [95221551, 98635922, 101941864, 105080982, 108026469, 110710680, 113074296, 115122991, 116863022, 118209634, 119013479, 119151879, 118549871, 117155907, 114979288, 112150439, 108880151, 105344348, 101641799, 97850787, 94065576, 90364288, 86789380, 83378668, 80179230, 77216715, 74487825, 72000219, 69784939, 67847698, 66138740, 64598997, 63217568, 62020293, 61016016, 60176940, 59466121, 58868570, 58395654, 58062695, 57858513, 57741759, 57678037, 57670376, 57731287, 57833679, 57921687, 57969944, 57998676, 58025286, 58033679, 57995758, 57884554, 57656563, 57263963, 56702155, 56004388, 55170813, 54151261, 52927203, 51558653, 50105442, 48550279, 46859304, 45080288, 43307878, 41572625, 39842149, 38127882, 36510525]
12089C6510525j469496j357995j300348j240578j151505j063557r98096r39327
12081B6989623q76327q20212p75342p35520p06938o96212o83501o48139o09714
12072B0437718n98941o00730n78442n43858n41048n62059n47001m81506m27206
12063A5556927m27163m40514m11294l54723l26283l35187l37987l06620k62891
12054A2354265k44060k57887k76097k64886k23535j89396j92860k15949k18706
12045A0270889j97419j81678j78407j63757j35428j23866j36624j40861j22301
12036H890548j11783j25537j30692j06732q9976j09761j28203j01487o0671o4538
12026G861168j02534j16860j00191r4458j03419q8511n5280o0768j14502j48706
$$ y = [36510525, 35041029, 33683034, 32382686, 31142108, 29990603, 28927046, 27928950, 26989623, 26113296, 25293084, 24517742, 23782222, 23075284, 22379072, 21695571, 21047432, 20437718, 19838777, 19238047, 18659605, 18115747, 17574699, 17012640, 16465639, 15984133, 15556927, 15129764, 14689250, 14277956, 13923233, 13596950, 13261763, 12923776, 12617156, 12354265, 12110205, 11852318, 11576221, 11311335, 11087800, 10898404, 10705544, 10489595, 10270889, 10073470, 9891792, 9713385, 9549628, 9414200, 9290334, 9153710, 9012849, 8890548, 8778765, 8653228, 8522536, 8415804, 8325828, 8216067, 8087864, 7986377, 7925706, 7861168, 7758634, 7641774, 7541583, 7447125, 7343706, 7255195, 7199915, 7139147, 7024645, 6875939]
12016F875939j20530p7450p8983j09203j15423r1013p0589p2674q9304j08154
12006E942616j11161p9134k9910j8590o2986j04883q9645m7314l9282n8324n1538
11995E249849k0859j9817n2947o1646k6873p129m0859q1207p5168m8654n4549
11984D760141q1660q1780n7644n4153p5809q1902o3620n9849q3844r6076p3905
11973C949899n2469o2173p4783n6328l2561m5451p2683n6236j642K0490j7388
11962C498675n5595m0131k588j849k9778l3683p310N279j0176j9021q143j2750
11950C282930m6853o4521l3040K662j4636n8739n8634j6596q484n7282q7326m3290
11938B796191J4445k496p2868r4633l5287K6338J9211k9314n2998m0722k6252
$$ y = [6875939, 6755409, 6677959, 6598976, 6489773, 6374350, 6283337, 6212748, 6140074, 6050770, 5942616, 5831455, 5752321, 5722411, 5703821, 5640835, 5535952, 5446307, 5398993, 5359711, 5301387, 5249849, 5228990, 5209173, 5156226, 5094580, 5067707, 5060578, 5019719, 4938512, 4863344, 4814690, 4760141, 4678481, 4596701, 4539057, 4484904, 4409095, 4327193, 4263573, 4203724, 4119880, 4023804, 3949899, 3897430, 3835257, 3760474, 3704146, 3671585, 3626134, 3553451, 3497215, 3495573, 3516063, 3498675, 3443080, 3402949, 3400361, 3398512, 3368734, 3335051, 3327741, 3333020, 3322844, 3303823, 3295680, 3282930, 3236077, 3171556, 3138516, 3141178, 3126542, 3067803, 3009169, 2992573, 2984089, 2926807, 2839481, 2796191, 2810636, 2808140, 2735272, 2640639, 2605352, 2631690, 2650901, 2621587, 2568589, 2527867, 2501615]
11927B501615k1723j2285J206J282r381r440K395L658j3889l2373l8583l8942
11915B333540l8268l1068k1622k5667m2081m9211m0218l3947l7396l0273q092
11904A975697n623m3119p8519n9187m067J7485j4716m5821l0123P718J9184M05
11892A739314j7856k1697k0725j8148o920R069J5419Q210l014j0353j0983j645
11880A660671J3791J7697j321k5617k5963j262J8854J3556n797j7125j5642j1728
11868A620114j3272j9506k5682k8024k8195l2475m0158l8128k0153n648j7852
11857A351021m4651m8994k4886j0673k8533m3949j8946K0111J5596k9923m9789
11846A086384j1914L0154J5751l2765m3953j550L5210J7421l0262m9569k3490
$$ y = [2501615, 2479892, 2467607, 2468813, 2470095, 2460714, 2451274, 2453669, 2457327, 2443438, 2411065, 2372482, 2333540, 2295272, 2264204, 2242582, 2216915, 2174834, 2125623, 2085405, 2051458, 2014062, 1983789, 1975697, 1970074, 1926955, 1848436, 1789249, 1785182, 1802667, 1787951, 1742130, 1712007, 1719725, 1738909, 1739314, 1721458, 1699761, 1679036, 1660888, 1653968, 1663037, 1678456, 1686666, 1683652, 1673299, 1662316, 1660671, 1674462, 1692159, 1690838, 1665221, 1639258, 1637996, 1656850, 1670406, 1664609, 1647484, 1631842, 1620114, 1606842, 1587336, 1561654, 1533630, 1505435, 1472960, 1432802, 1394674, 1374521, 1368873, 1351021, 1306370, 1257376, 1232490, 1221817, 1193284, 1149335, 1130389, 1150500, 1166096, 1136173, 1086384, 1074470, 1104624, 1120375, 1087610, 1043657, 1042107, 1077317, 1094738, 1064476, 1014907, 991417]
11835I91417J2493K1098L447j1727o626N537R84j8941k6780j0123N021q265l2999
11822I24536l2344r506l267k1818k7633m239R646j6135m7870m0380j0428m282
11810G16280j7234q642J5287M729m2373o3400k8436J0699M820j7384p300J8513
11798E85559J1416k3192l7279k1225j0480j6134j0072J3517J9047r032l3810k1581
11786D46734P323J2845o955k1818j4457O412K5219K9468J0923k2968m5681l6299
11774C90746l534K4941K9899J0700j8847l5017k0151J2268K3757j401l0205k4252
11762C58904N239J4581p291k4988j2576R445R805o213j0174L176J1675N117N32
11749C57232R390J4036l408k4877j7075J6009L2366J1924j2668n056K0314K3226
$$ y = [991417, 1003910, 1025008, 1028455, 1016728, 1010102, 1015639, 1016623, 997682, 970902, 960779, 965800, 957535, 924536, 892192, 882686, 879419, 857601, 829968, 825729, 835375, 819240, 771370, 730990, 720562, 716280, 699046, 690404, 705691, 710420, 668047, 604647, 576211, 586910, 591730, 574346, 567046, 585559, 596975, 573783, 536504, 515279, 504799, 488665, 478593, 492110, 511157, 502125, 468315, 446734, 454057, 466902, 459947, 438129, 423672, 430084, 455303, 484771, 495694, 472726, 427045, 390746, 387212, 412153, 442052, 452752, 433905, 398888, 378737, 391005, 414762, 413361, 383156, 358904, 364143, 378724, 371433, 346445, 333869, 343314, 353119, 346906, 336732, 339908, 351583, 356700, 357232, 366622, 380658, 377250, 352373, 335298, 351307, 383673, 395597, 382929, 377873, 398187, 421413]
11737D21413P13j2570j597J1144R687P114J0693K969k0031k7372j636K1444K045
11724D24016l6687l8054J685K6488L986l1874l7058j5360L434J0228J2803R195
11712C32802m405j4099m850J3065J8810J2949J0006Q229m084j6765n335K5849
11700C72172M0137K0166n302l422J7624K7352J8417Q119O299P413Q976J4594K1258
11687E53803K4105L0129M5751N5562L9986J1896M533K0126K5665R195P57J6509
11675H38017K1785j4933o2380o5309k4353R205Q969k947o638j2078k6583l4341
11663F28414k3605m651J0290J8756J4866n164k1289r441J3357O754k3675k7491
11651E77121N090J9709r644k9090M611M2245K0060k8134k2107K9955M3030l027
$$ y = [421413, 422126, 409556, 407959, 419103, 428790, 435904, 446597, 449566, 429535, 402163, 400527, 421971, 424016, 387329, 349275, 350960, 377448, 381434, 349560, 312502, 297142, 300576, 310804, 323607, 332802, 328397, 314298, 309448, 322513, 341323, 354272, 364278, 372507, 368423, 351658, 346323, 372172, 412309, 432475, 427173, 423751, 441375, 468727, 487144, 495263, 501562, 508975, 517951, 532545, 553803, 577908, 608037, 653788, 709350, 749336, 761232, 765765, 785891, 811556, 820751, 821508, 838017, 859802, 844869, 782489, 717180, 692827, 702032, 711001, 708054, 701416, 689338, 662755, 628414, 604809, 600158, 610448, 629204, 644070, 638906, 617617, 608176, 621533, 628287, 604612, 577121, 582211, 601920, 592276, 563186, 567797, 610042, 630102, 601968, 579861, 609816, 652846, 649819]
11639F49819k9843J0966O2936N9225K1062Q852K7109L6554K7784K5732L6930M1407
11627I78533L2124K3869K2998J8351M809p033r129r022j9591m1434n7304m7875
11615H89296j9492p004l0762n9904m8531n472J1526k0596n5458m7038j3836j097
11603E91632j1988j6306o116j024q206j4163j3077j3036j4441p352Q117J7420
11591E11460R429j1831l0686l0326r453R813P518j576J0986L3377K2961j9476
11579E02196l7064m325K7716J4361r820K943K5398N990l1752k6043J0903R597
11567D90100l5685n6491k7760l293j4033k0961j817J217l4126n5596k1843K3069
11555B42781K0334j3853k9867k6863l0646l1871j0818J1116O635l164R502J7460
$$ y = [649819, 619976, 630942, 693878, 753103, 774165, 783017, 810126, 846680, 874464, 900196, 937126, 978533, 1010657, 1034526, 1057524, 1075875, 1080684, 1073651, 1064522, 1055500, 1035909, 994475, 937171, 889296, 869804, 862800, 832038, 772134, 723603, 718131, 729657, 709061, 653603, 606565, 592729, 591632, 579644, 563338, 557222, 556198, 547992, 533829, 520752, 507716, 493275, 485923, 494040, 511460, 520889, 509058, 478372, 448046, 438593, 448406, 455924, 454348, 465334, 498711, 521672, 502196, 465132, 460807, 488523, 502884, 493064, 496007, 521405, 527395, 495643, 469600, 480503, 490100, 454415, 397924, 370164, 366871, 352838, 331877, 330060, 331277, 297151, 241555, 219712, 242781, 263115, 249262, 219395, 192532, 161886, 130015, 119197, 130313, 136948, 133784, 143286, 160746]
11543A60746j4291n1659l7086J1368K6324J867n390J8349K3097j0755l7949k8086
11531E6535q162k021N781K0008J3653j3643j8748J0406K4918k915k9277j5483
11519D1052N600n704k1441k115K1292j973m4588l7540J3978L5776L695k4251q015
11506b4234J7020R971j0983j0501N306J0234L199k579q161j6080j3149N765J8664
11493a5528Q295p635n276O912Q181M460J2908K2392Q164k1159l0691j3226K684
11480a9519L718J0777L2539L9111R169k6971k6509K640J5844k84j4054m886O150
11467B7725l369j9452j7817l984J45o306p700l050k945k575R185J6997n509m2098
11453f0753m0169R722M4947J7254k9935k2615L0010M7953L233l9089k3451J5378
$$ y = [160746, 146455, 94796, 57710, 69078, 95402, 97269, 91879, 110228, 133325, 122570, 84621, 56535, 48373, 46352, 52133, 72141, 85794, 72151, 53403, 63809, 88727, 85812, 56535, 41052, 46652, 40948, 19507, 17392, 38684, 36711, -7877, -45417, -31439, 4337, 8032, -16219, -24234, -7214, 2757, -8226, -18727, -13421, -3187, 12, -2567, -10728, -26808, -39957, -34192, -15528, -7233, -14868, -20144, -13232, -5051, -591, 12317, 34709, 42873, 21714, -8977, -22203, -19519, -15801, -5024, 27515, 66626, 75795, 48824, 22315, 24955, 40799, 40515, 26461, 21575, 27725, 24356, 4904, -12913, -16897, -16752, -23058, -30758, -33808, -36753, -39328, -30143, -13146, -18655, -60753, -100922, -91200, -46253, -28999, -58934, -81549, -51539, -3586, -353, -39442, -62893, -47515]
11441d7515J5549j5391k2639M895K4983J4804j641l230o38l311K86J1696Q921
11428a3231j4224k8094j1969J0729J0859j35L161J1375M54j6136m086K8045L2815
11415I563j224k7328j1154J9683K2894K227j1062r113n294j790N804O811q063
11402h046k1226j2202M930L579p325J295K2479K0132o459j6354L139J2571j0339
11389a3826k8006n793K6019K0223r852j4986Q012J6654j693j1812N273K2159J5377
11376B7749J509O99J677r736j8034m709J5298J5391m4n457L358O541l727j1623
11362A8892m566R474J6002J0431k363j3396j3706l032P009P078K941M288P622
11349D6674L383o368j1798j0575m600R648K8840L1352L938k7309k4196P029K1587
$$ y = [-47515, -31966, -47357, -69996, -65101, -40118, -25314, -26955, -30185, -30823, -34134, -33848, -22152, -13231, -27455, -55549, -67518, -56789, -45930, -46065, -42904, -31529, -31075, -47211, -51297, -23252, 9563, 8339, -18989, -30143, -10460, 12434, 14661, 3599, -5514, -10808, -12598, -6794, 17, -8046, -29272, -41474, -36544, -32965, -40290, -38995, -16516, 3616, -2843, -19197, -16058, -3487, -13826, -41832, -47625, -21606, -1383, -11235, -26221, -18209, -1555, -3248, -15060, -9787, 12372, 27749, 29258, 29957, 31634, 21898, 3864, -845, 14453, 29844, 29800, 24343, 27701, 34242, 30515, 18892, 14326, 23800, 39802, 50233, 47870, 34474, 20768, 17736, 24745, 31823, 34764, 39052, 46674, 50057, 43689, 31891, 21316, 16716, 26364, 55204, 86556, 90494, 63185, 38989, 46018, 67605]
11336F7605L068j4479m503J2044Q837m4R680K5010J7875m487j1811o42P635Q679
11322A24467J3903J4801n579k7289j0439L4708M7350N472l5282k3097J5039K2037
11310A76091j768j1122N901J6773N549n302K32P066J535n321k040K759L29O68
11296A91350J3764K7278K0554o162k9148k6113J071K6420K4305j250j7862m575
11284B19632J9263K1362L491l875R311J9308J1191M438J8375L5953K7079m338
11272C81190k2441p282J9702K4703M315j1681K38K4645K5128n893l2523k1603
11260C78498J2321K8852J7932P179J5514K8466K6367J2497K069J724R608J9992
11248E61019K1053M946j4086j0225J8373M3352M2908K6082J3493J3289K3098L5899
$$ y = [67605, 70673, 56194, 51691, 63735, 72572, 72528, 82208, 107218, 125093, 120606, 108795, 108153, 115788, 124467, 138370, 153171, 147592, 120303, 109864, 144572, 191922, 197394, 162112, 139015, 154054, 176091, 174323, 163201, 169102, 185875, 191424, 186122, 186354, 193420, 194955, 189634, 187594, 190353, 190682, 191350, 205114, 232392, 252946, 246784, 217636, 191523, 192594, 219014, 243319, 242069, 224207, 219632, 238895, 260257, 263748, 259873, 269184, 288492, 299683, 304121, 322496, 358449, 385528, 381190, 358749, 351467, 371169, 395872, 400187, 388506, 388744, 413389, 438517, 432624, 400101, 378498, 390819, 419671, 437603, 444782, 460296, 488762, 515129, 527626, 529695, 531419, 541027, 561019, 582072, 587018, 572932, 562707, 581080, 624432, 667340, 693422, 706915, 720204, 743302, 779201]
11236G79201L8472K5604J8539M1755P8113Q2777N0758K9645M7450P1060O4852
11225A328226M9775O5348J04397J27948J23202J07426R1491P5322O4565O1129
11215B198829N3225L8766L3398L1778p29o4401j00334p7897n7664j00250j57443
11204A797278j40531o6139l3343o6216q5748m9978j7201l6514o8788o4062m0393
11193A128365l3700l3268j8628o085j1298j5112q198j7589m8151n4092j3969K3357
11181H91632J6815j935M314Q617j7979l6058o131K8019R513k7207j5841K1009
11169H74768J5167j6711k594M3304L4810k7477m1992K1911O4235J7924m2667k9061
11157I11617K2678K8656k425k611L1263M3490K2663J0632J9496J8124J068J235
$$ y = [779201, 817673, 843277, 861816, 903571, 981684, 1064461, 1115219, 1144864, 1192314, 1263374, 1328226, 1378001, 1443349, 1547746, 1675694, 1798896, 1906322, 1997813, 2073135, 2137700, 2198829, 2252054, 2290820, 2324218, 2355996, 2355267, 2290866, 2190532, 2112635, 2054971, 1954721, 1797278, 1656747, 1590608, 1557265, 1491049, 1405301, 1355323, 1338122, 1301608, 1232820, 1168758, 1128365, 1094665, 1061397, 1042769, 1036684, 1025386, 1010274, 1002076, 984487, 936336, 882244, 868275, 891632, 908447, 906512, 910826, 919443, 901464, 865406, 859275, 887294, 896807, 869600, 853759, 874768, 889935, 873224, 870630, 913934, 948744, 921267, 879275, 901186, 965421, 983345, 940678, 911617, 934295, 962951, 960526, 957915, 989178, 1032668, 1055331, 1065963, 1085459, 1103583, 1104651, 1105886]
11145A105886K5484L8033K2772J0415K4043M1633L7313K4667K9414M3820M1080
11134A444560K3190K1570M7614P0828O1284L4435K8214M4171M5495K0233P932
11123A849526L7699P4084O7411L4282L3147O9229Q6582O2468M4950P0131J01230
11112B530739R2685O7836P9147J22092J46080J36406J30054J50656J76052J81365
11102C813112J77685J91516K28903K73985L09519L31220L52164L94596M64256
11093F536956N30840N49624N11721M63009M59329N01063N22513M57020L08998
11084A0841073J45900J8959q1954j83517k75209l34908l79132m34778m73884m37770
11074H404780l29764k22379j56333r2823P234J15916J90460K41585K99981L52952
$$ y = [1105886, 1131370, 1169403, 1192175, 1202590, 1226633, 1268266, 1305579, 1330246, 1359660, 1403480, 1444560, 1467750, 1489320, 1536934, 1607762, 1669046, 1703481, 1731695, 1775866, 1821361, 1841594, 1849526, 1887225, 1961309, 2028720, 2063002, 2096149, 2165378, 2251960, 2314428, 2359378, 2429509, 2530739, 2623424, 2691260, 2770407, 2892499, 3038579, 3174985, 3305039, 3455695, 3631747, 3813112, 3990797, 4182313, 4411216, 4685201, 4994720, 5325940, 5678104, 6072700, 6536956, 7067796, 7617420, 8129141, 8592150, 9051479, 9552542, 10075055, 10532075, 10841073, 10986973, 11005932, 10923978, 10740461, 10465252, 10130344, 9751212, 9316434, 8842550, 8404780, 8075016, 7852637, 7696304, 7603481, 7610715, 7726631, 7917091, 8158676, 8458657, 8811609]
11064H811609L66530L43642L12031K75550K21710J59494J09939P6244N5622N4613
11054A0786984N6535O010j28291l02883m55440n77739o81673p34136o99291o17972
11044F652104n62962n30207m59615l56683k97475l00581k91342k27277j70026
11035C455936j79856k13037j91479j22766q0301r3754j23688j31156j17176r5364
11025B107359p0175m9515m8398o9113r2609r6528p7238n3081m4941n1620n2271
11014A401870l8873k9573l5852l9646k7662k1279l5858l9368l316L0961M702n5185
11002A110921o5077j5556J3924j4131m0620j9098Q768k567k2398j1041J548k3054
10990I21619m8801k2709K7306L3394k727k0451j761J3958P801L270J0494J1049
$$ y = [8811609, 9178139, 9521781, 9833812, 10109362, 10331072, 10490566, 10600505, 10676749, 10732371, 10786984, 10843519, 10849529, 10721238, 10418355, 9962915, 9385176, 8703503, 7969367, 7270076, 6652104, 6089142, 5558935, 5099320, 4742637, 4445162, 4144581, 3853239, 3625962, 3455936, 3276080, 3063043, 2871564, 2748798, 2668497, 2574743, 2451055, 2319899, 2202723, 2107359, 2037184, 1987669, 1939271, 1870158, 1777549, 1681021, 1603783, 1550702, 1505761, 1454141, 1401870, 1362997, 1333424, 1297572, 1257926, 1230264, 1208985, 1173127, 1133759, 1130443, 1161404, 1166106, 1110921, 1045844, 1030288, 1044212, 1030081, 989461, 970363, 979131, 976564, 954166, 943125, 944673, 921619, 872818, 850109, 877415, 910809, 908082, 887631, 885870, 899828, 907629, 910899, 921393, 932442]
10978I32442K930P160K4105K9788J9363J2548J4265R891R36P535L2348N3722N6422
10965A203455M5409L3919L6191N6443O8985L9727j1123j4291M3665P6868K1086
10954A600334n7609n8800p278j1328q5254j31901j05745p3597q3240q5264l9970
10943H60348l515l3795q4913p6869j9518J2051o347k9898k6229j1218o934j2758
10931E60405k0467k5040k1214j0678n032o678l341N044j49j8349j7865J2113L0943
10918D79692L634l9733m4114q990J7650J3257J688J014l730k2557l2676j3402
10906C51733J3066N646l5113n8373k7965K3239L1134j2856m8562l1711P386J7898
10894B35522M113J992Q712n641l0728k5371O388J4179j3490k7450j283K5343J5839
$$ y = [932442, 935372, 942532, 966637, 996425, 1015788, 1028336, 1042601, 1052492, 1053428, 1060963, 1093311, 1147033, 1203455, 1248864, 1282783, 1318974, 1375417, 1444402, 1484129, 1473006, 1458715, 1502380, 1579248, 1600334, 1542725, 1483925, 1476647, 1465319, 1380065, 1248164, 1142419, 1068822, 985582, 900318, 860348, 856833, 823038, 738125, 661256, 641738, 653789, 647442, 617544, 591315, 580097, 573163, 560405, 539938, 514898, 493684, 483006, 477974, 471296, 467955, 472999, 472850, 454501, 436636, 448749, 479692, 483326, 443593, 399479, 390489, 408139, 421396, 423084, 424098, 420368, 397811, 365135, 351733, 364799, 370445, 335332, 276959, 248994, 272233, 303367, 290511, 241949, 210238, 217624, 235522, 239635, 241627, 250339, 244698, 213970, 188599, 194987, 209166, 195676, 168226, 166943, 192286, 208125]
10881B08125o659p116N223O188Q95J667k111j7739k5760j2909L750R918J4450
10868A77922J5904n338l7722l5197O023K6213l400k7988j665L1499J4585k2095
10856A38741j6078J8531K2083n035j4857n741j5954l7185k2153K3358L8352L799
10844A27861l0775k7975n114J3049K3748K0250o426l2779k3667Q471J8413J096
10832H6152p426Q99p23j1841l542J6612Q951k0307j8876J8590L2626k168l4019
10819F4928k1914K750J977m689J1248K7619J1376k0678k7710m655J9816K3772
10807H3840O362j7043k1665p20J3673o087k6997Q50M9845M0765k6789n7940p854
10794C0240M5416K5606k5661k7275J2729K7624N299j0030k167M272K83J73L170
$$ y = [208125, 201466, 194350, 199573, 205761, 206656, 208323, 206212, 188473, 162713, 149804, 153554, 163472, 177922, 193826, 188488, 150766, 115569, 121592, 147805, 144405, 116417, 114752, 146251, 160836, 138741, 122663, 141194, 163277, 158242, 143385, 137644, 121690, 84505, 62352, 85710, 124062, 127861, 97086, 69111, 63997, 77046, 100794, 121044, 114618, 81839, 58172, 66643, 85056, 86152, 78726, 79625, 78902, 67061, 63519, 80131, 89082, 68775, 49899, 68489, 101115, 98947, 64928, 43014, 45764, 47741, 43052, 54300, 81919, 93295, 72617, 44907, 40252, 60068, 83840, 90202, 73159, 51494, 50774, 64447, 58360, 31363, 32213, 82058, 122823, 96034, 38094, 30240, 75656, 101262, 75601, 48326, 61055, 88679, 93978, 83948, 81781, 86053, 86336, 86509, 89679]
10781H9679k070n860N929J7747P344j2262j2477M006J1498K541r415j3611m912
10768G8137J6930L3093J8995j2777k0507L57Q115q438n906K9926M5407J0252k2376
10755A71208n680J9309K837j8917O841M3323K4676k2056j9911K3525L1568p924
10743B48799k9773q626J0734N444M460J6086J1182q930p546J3130J0326j6628
10731B48658k0659M779J2863o325n622K7275M0003P958k0050m677K3306K2568
10719C30077J952j2186j5320m023K9638O0247M4255m579j8219K1984N1796K6017
10707E11639j3391j1030K1549M2885M4926L6669J3939j3962j3894J7374L4472
10696F71176J2315j4056j1831k158j3308l1483l6137l7800m4807l8636j5849o801
$$ y = [89679, 87609, 81749, 87678, 105425, 112769, 100507, 88030, 92036, 103534, 106075, 96660, 83049, 78137, 95067, 128160, 147155, 134378, 113871, 114228, 122343, 113905, 107999, 137925, 183332, 193584, 171208, 165528, 184837, 187674, 168757, 175598, 218921, 243597, 221541, 201630, 225155, 256723, 248799, 219026, 210400, 221134, 226578, 231038, 247124, 258306, 249376, 241830, 254960, 265286, 248658, 227999, 232778, 245641, 239316, 233694, 260969, 300972, 308930, 288880, 284203, 307509, 330077, 332029, 319843, 304523, 300500, 330138, 390385, 434640, 430061, 411842, 433826, 485622, 511639, 498248, 487218, 508767, 551652, 596578, 633247, 647186, 633224, 619330, 636704, 671176, 683491, 669435, 657604, 655446, 642138, 610655, 574518, 536718, 491911, 453275, 437426, 430625]
10684D30625k0968k5126o532o71k2888l4332j3947R27j1860j4089J4993K7237
10672C23369q664l9715j5100K4793K0275o652l246J6194Q345j0238R73K1685Q638
10659C40657j6916o442K2614J8200r369r970J0690P066j4343q941J5011R159k0932
10646C36484k2906O377J7670L5q018K296L01j4130r112J0311Q375q120k44K3571
10632C42890K0126j284P804L6824K6267j9713l0555P814K8905O107n606K0080
10620D39659L0522k479k4735J708K8690R657j9901j2067J1166Q723m348M832K1951
10607D93378J7051P25j732M228M389N607R435j672k1849j4681K1550L7216J2587
10594E66232o234R101J7021j3228l6216p284L5119L3162M849K944K1383J8330
$$ y = [430625, 409657, 384531, 377999, 377328, 354440, 320108, 306161, 307088, 295228, 281139, 296132, 323369, 314705, 274990, 259890, 284683, 304958, 298306, 295060, 311254, 319599, 309361, 310334, 332019, 340657, 323741, 317299, 339913, 358113, 348744, 338774, 349464, 356530, 342187, 333246, 348257, 357416, 336484, 313578, 319955, 337625, 337660, 329642, 331938, 332239, 318109, 308997, 319308, 327683, 319563, 319319, 342890, 363016, 361732, 369536, 406360, 432627, 412914, 382359, 390173, 419078, 425185, 419579, 439659, 470181, 467702, 442967, 444675, 473365, 483022, 463121, 451054, 462220, 470943, 466595, 471427, 493378, 510429, 511154, 509422, 513650, 518039, 523646, 533081, 531409, 509560, 494879, 516429, 553645, 566232, 559998, 569099, 586120, 572892, 536676, 529392, 564511, 597673, 602522, 605466, 626849, 645179]
10582F45179J24N759K8445K5510l359j3174J2441L8507L3488O464j3163o287K1842
10569G81776M1838K8965J425J624K9658L8137R833j1913K551K0743J1162j004
10557I54795J2866K8541J7401K814J4392L1357K5956J8115L1054L9094J9148O571
10545A202104L5219O9565O6410N5932Q2479J11154Q4947L8520N4093J23811J57660
10534B081894J24028Q6333R2178J14380J19447J17743J21472J13913Q3243M1544
10524C096175r35m0898o2872n7493n2236p9097j21305j37201j22847j04295q7227
10513B229769o5535n7394p6603r0980o7620l3474k9364l5489j3329J2850q56k5067
10501A746908j736M2564L2059k2261l1737K3166O3894M6199J8917K6567M6053
$$ y = [645179, 645303, 651062, 679507, 705017, 701658, 688484, 700925, 739432, 772920, 779384, 766221, 759934, 781776, 823614, 852579, 854004, 855628, 885286, 923423, 933256, 921343, 923894, 944637, 955799, 954795, 967661, 996202, 1013603, 1016417, 1030809, 1062166, 1088122, 1106237, 1137291, 1176385, 1195533, 1202104, 1237323, 1306888, 1373298, 1429230, 1511709, 1622863, 1707810, 1746330, 1800423, 1924234, 2081894, 2205922, 2292255, 2384433, 2498813, 2618260, 2736003, 2857475, 2971388, 3054631, 3096175, 3095240, 3054342, 2991470, 2933977, 2881741, 2802644, 2681339, 2544138, 2421291, 2316996, 2229769, 2164234, 2106840, 2030237, 1939257, 1871637, 1838163, 1808799, 1773310, 1759981, 1772831, 1771975, 1746908, 1745172, 1787736, 1819795, 1797534, 1765797, 1788963, 1852857, 1899056, 1917973, 1944540, 1990593]
10490A990593M8853M5162M1555K7305J6981L3891M8219J3606l7670l2335J2080
10479B208240M231o3215r4776n5431k5934n3481p2961l6548m334l1885p0283n7922
10467A645701k3198j6974k1547m011J1033l940j6750L738K4659R700j6331j9746
10455A572334j4432j5803l809K0707J4511k6023l9257k474K3356L563r155J8224
10443A541742L1133m539k8229K979K9323K079j9872J6774N0879J7369l0091k0371
10431A589176N395j3176k6347K7185P9128L7833l7519k6080M9170O6320J2970
10420A764055j1312K3905N0302M0620L7010M5822L1307O295J3374L3198K2088
10409B056664R883M4881Q3044N7738J2270K5642N9092L0158j4611K4320R8413
$$ y = [1990593, 2039446, 2084608, 2126163, 2153468, 2170449, 2204340, 2252559, 2266165, 2228495, 2196160, 2208240, 2212471, 2149256, 2054480, 1999049, 1973115, 1919634, 1846673, 1810125, 1805791, 1773906, 1703623, 1645701, 1622503, 1605529, 1583982, 1579971, 1591004, 1587064, 1570314, 1574052, 1598711, 1608411, 1592080, 1572334, 1557902, 1542099, 1538290, 1558997, 1573508, 1547485, 1508228, 1505754, 1529110, 1532673, 1523518, 1541742, 1572875, 1568336, 1540107, 1543086, 1572409, 1574488, 1554616, 1571390, 1622269, 1639638, 1609547, 1589176, 1594571, 1581395, 1555048, 1582233, 1661361, 1699194, 1661675, 1635595, 1684765, 1751085, 1764055, 1752743, 1776648, 1826950, 1867570, 1904580, 1950402, 1981709, 1988004, 2001378, 2034576, 2056664, 2066547, 2111428, 2194472, 2252210, 2264480, 2290122, 2349214, 2379372, 2364761, 2389081, 2487494]
10398B487494Q0839L416J1381R7007J05892J8653r966O9202J16874O5801L3929
10387C080522Q9723J25085P2076M0057J09013J74728J40048Q9405J24759J82877
10377D228293J70720J43886J90942K60796K63232K35296K54166K81177K43459
10368F271967J82856J75875J85726J36650N7687J2023l7959j49201k56330k64521
10358F314773k20074k33536k86889k75612k01585j64529j83923j80673j28826
10349D439126q9666r3670j05820j07989j14178j12385q3955o1736q0491j00896
10339C488340p4228m0266n9079r2157o6253j2353j5334n9695n8205j0894M02l3434
10327B966844l3523K2979O6613N6934L2134K4157K0428J9032L5099N0151L4578
$$ y = [2487494, 2568333, 2571749, 2583130, 2680137, 2786029, 2804682, 2794716, 2863918, 2980792, 3046593, 3080522, 3170245, 3295330, 3367406, 3407463, 3516476, 3691204, 3831252, 3920657, 4045416, 4228293, 4399013, 4542899, 4733841, 4994637, 5257869, 5493165, 5747331, 6028508, 6271967, 6454823, 6630698, 6816424, 6953074, 7010761, 7022784, 6984825, 6835624, 6579294, 6314773, 6094699, 5861163, 5574274, 5298662, 5097077, 4932548, 4748625, 4567952, 4439126, 4349460, 4255790, 4149970, 4041981, 3927803, 3815418, 3731463, 3669727, 3589236, 3488340, 3414112, 3373846, 3314767, 3222610, 3156357, 3144004, 3128670, 3068975, 3010770, 2999876, 3000278, 2966844, 2933321, 2956300, 3022913, 3079847, 3111981, 3136138, 3156566, 3175598, 3210697, 3260848, 3295426]
10316C295426J0685J5535K5110N17k4082K853M3254K7201j6943r332L4571L2697
10304C437492r664r503M0137O0415L0429J1275K2710K1217N951K3030N8130M6544
10292C738163l653j8218J1118K2159Q555K3469N7685M6809K742L116M6832N8862
10280C997639L9452N9032J00871P1621j5407l6966L0166O5629J3486l4096j3304
10269D278123J4628L839M133L6113L6945m325n684M9766O5547P259k7717J3375
10257D472002M8477K2622K793K9990L5347q674j3509N4870R1315L8700j600M4431
10245D816764Q8993N2957J1376L9727O9526L3153J903L7780N6979q123n7938J177
10233E144274P3297L5846m3405l4255K7086K4334k2661j4088L9073N5440M2904
$$ y = [3295426, 3306111, 3321646, 3346756, 3347273, 3323191, 3326044, 3369298, 3396499, 3379556, 3370224, 3404795, 3437492, 3427828, 3418325, 3458462, 3518877, 3549306, 3560581, 3583291, 3604508, 3610459, 3633489, 3691619, 3738163, 3734510, 3716292, 3727410, 3749569, 3758124, 3781593, 3839278, 3886087, 3888829, 3891945, 3938777, 3997639, 4037091, 4096123, 4196994, 4268615, 4253208, 4216242, 4246408, 4312037, 4325523, 4291427, 4278123, 4292751, 4296590, 4300723, 4336836, 4373781, 4369456, 4363772, 4413538, 4479085, 4486344, 4458627, 4472002, 4520479, 4543101, 4545894, 4575884, 4611231, 4602557, 4589048, 4643918, 4735233, 4773933, 4772333, 4816764, 4905757, 4958714, 4970090, 5009817, 5079343, 5112496, 5114399, 5152179, 5209158, 5201035, 5143097, 5144274, 5217571, 5253417, 5210012, 5175757, 5202843, 5227177, 5204516, 5190428, 5229501, 5284941, 5327845]
10222E327845N8673Q1317O7802N8507Q9940R7867M2341J6948Q9161J56479J19630
10211F206510O5692J03887J57457J15055N3366R2571J57103J12781K7084M9054
10201G140560J32994J33360Q1466J07574J70990J37045N3007P3026J64941J67171
10191H362134Q9853Q2107J39489J24710M8723M9072J11867R6716J7521J4374O7080
10180I203646L0436o3011m1510P4509R5422J6268K1532J26130J49573P4379Q2908
10169I770282J93174K11487J09614R1540K04750K44574J43076R3959J76748K15095
10159A1454299J37852J23908K44455L15771K61644K66073M00499M62230L67495
10150A4034226L38292M90989O03101N18930M29919N01721N71122M83128L93372
$$ y = [5327845, 5386518, 5467835, 5535637, 5594144, 5684084, 5781951, 5824292, 5841240, 5930401, 6086880, 6206510, 6272202, 6376089, 6533546, 6648601, 6701967, 6794538, 6951641, 7064422, 7091506, 7140560, 7273554, 7406914, 7488380, 7595954, 7766944, 7903989, 7956996, 8030022, 8194963, 8362134, 8451987, 8534094, 8673583, 8798293, 8847016, 8896088, 9007955, 9104671, 9122192, 9136566, 9203646, 9234082, 9171071, 9129561, 9204070, 9299492, 9315760, 9337292, 9463422, 9612995, 9687374, 9770282, 9963456, 10174943, 10284557, 10376097, 10580847, 10825421, 10968497, 11062456, 11239204, 11454299, 11592151, 11716059, 11960514, 12276285, 12537929, 12804002, 13204501, 13666731, 14034226, 14372518, 14863507, 15466608, 15985538, 16415457, 16917178, 17488300, 17971428, 18364800]
10141A8364800M50609N00179L97419L06316L86092M81483M28883L73133M69110
10132B2158024N64003M96511M20868N06207O01482N29706M25846M49953M64907
10123B6617507L40948K66095L96286N24062M69042M48561O55170Q35624P42102
10114C1295397O26194P83099R79573Q90445P42434R13836J227402J291301J233276
10105C9982957J404578J642299J569693J379988J531049J860206J828624J501892
10097E2701286J440445J707518J844690J780151J881513K111804K029526J682094
10089F7179027J618602J932179K155586K179878K373929K709336K731516K537987
10081H5418040K784797L520232M024767M060583M264288N012661N903126O626518
$$ y = [18364800, 18815409, 19315588, 19713007, 20019323, 20405415, 20886898, 21315781, 21688914, 22158024, 22722027, 23218538, 23639406, 24145613, 24747095, 25276801, 25702647, 26152600, 26617507, 26958455, 27224550, 27620836, 28144898, 28613940, 29062501, 29717671, 30553295, 31295397, 31921591, 32704690, 33684263, 34574708, 35317142, 36230978, 37458380, 38749681, 39982957, 41387535, 43029834, 44599527, 45979515, 47510564, 49370770, 51199394, 52701286, 54141731, 55849249, 57693939, 59474090, 61355603, 63467407, 65496933, 67179027, 68797629, 70729808, 72885394, 75065272, 77439201, 80148537, 82880053, 85418040, 88202837, 91723069, 95747836, 99808419, 104072707, 109085368, 114988494, 121615012]
10073A21615012P315686P815203P786468P780687Q890765J1047454J3110843J4919114
10065B00281232J7473662K0732514K3479030K6052920L0218246L4593857L3580221
10058C86411682K4474455J3572927J0499548J6313370K1020538J4041686n216523
10051D81117683k7676214m2813805m5859972l9711451l1718566k7402253k6202811
10044B39732611k4036517j9536538j5460518j3860496j3101212j1149250q954770
10037A33633310q244613q147761o777053m732435m176050n181608n712359m960653
10029H5700778m206740m240792m200916l449553k701134k610254k732302k546053
10021E9013034k299400k262547k173560j914427j822129j939454j831232j462086
$$ y = [121615012, 128930698, 136745901, 144532369, 152313056, 161203821, 172251275, 185362118, 200281232, 217754894, 238487408, 261966438, 288019358, 318237604, 352831461, 386411682, 410886137, 424459064, 434958612, 451271982, 472292520, 486334206, 481117683, 453441469, 410627664, 364767692, 325056241, 293337675, 265935422, 239732611, 215696094, 196159556, 180699038, 166838542, 153737330, 142588080, 133633310, 125388697, 117240936, 110463883, 105731448, 101555398, 96373790, 90661431, 85700778, 81494038, 77253246, 73052330, 69602777, 66901643, 64291389, 61559087, 59013034, 56713634, 54451087, 52277527, 50363100, 48540971, 46601517, 44770285, 43308199]
10013D3308199j369966j662764j744198j369858j078194j194619j284156j024917
10005C2579527p90515q82837r58225p28265n24372o42226p75531o28779m85914
9996B6162863o34188p87786o31671m21867m94193o47442n64317m13329m81819
9987B1086251o01893m90073l08663l49723m73278l88558k13334k34987l64338
9978A7661404l33093k14254k55086l86734l73161k73651l02696l91779l32264
9969A4798686k03376k25437l26594k79851j42701j42811k44034k37306j54677
9960A2841899j85308k78781k38137j20492j41488k57414k44792j29940j33798
9951A1111749k39824k26111r9413q9604k14577k47580j37392q0305j39119j55593
$$ y = [43308199, 41938233, 40275469, 38531271, 37161413, 36083219, 34888600, 33604444, 32579527, 31789012, 30906175, 29947950, 29219685, 28695313, 28053087, 27277556, 26648777, 26162863, 25528675, 24740889, 24109218, 23687351, 23193158, 22545716, 21981399, 21568070, 21086251, 20484358, 19994285, 19685622, 19335899, 18862621, 18474063, 18260729, 18025742, 17661404, 17328311, 17114057, 16858971, 16472237, 16099076, 15825425, 15522729, 15130950, 14798686, 14595310, 14369873, 14043279, 13763428, 13620727, 13477916, 13233882, 12996576, 12841899, 12656591, 12377810, 12139673, 12019181, 11877693, 11620279, 11375487, 11245547, 11111749, 10871925, 10645814, 10546401, 10456797, 10242220, 9994640, 9857248, 9776943, 9637824, 9482231]
9941I482231q8258q6514j72506j84611r8692q3207j72384k00393j25903j08934
9931H160829j91392k11139j18873p7380j49214j79796r8326n0780j15153j54997
9921F813779q3659k0441n2941q2647l7446j1254o3036r3438m7848l2593j03971
9910F184505j46353q5841k7495n6197r4249p7999q2413j47009j70528j04763o2760
9899E128898j07270j25051m5747J0390m9315j15229p8422k6228o4691j16448p6608
9888D334279j5931m2809r9722q2601l9865o8636j22615j04698n4220o6633j12698
9877C523851j05911p1505q6231j20860r8419m6377m4292p6374p0508l0401r098
9866B763875p879o702k6942o7277o1580L839L2061k4943o6996k0237K0867l6334
$$ y = [9482231, 9393973, 9307459, 9134953, 8950342, 8851650, 8768443, 8596059, 8395666, 8269763, 8160829, 7969437, 7758298, 7639425, 7562045, 7412831, 7233035, 7134709, 7083929, 6968776, 6813779, 6730120, 6709679, 6656738, 6574091, 6536645, 6525391, 6462355, 6368917, 6321069, 6288476, 6184505, 6038152, 5952311, 5924816, 5868619, 5774370, 5696371, 5613958, 5466949, 5296421, 5191658, 5128898, 5021628, 4896577, 4850830, 4861220, 4811905, 4696676, 4618254, 4592026, 4527335, 4410887, 4334279, 4318348, 4275539, 4175817, 4093216, 4053351, 3984715, 3862100, 3757402, 3703182, 3636549, 3523851, 3417940, 3346435, 3260204, 3139344, 3040925, 2994548, 2950256, 2873882, 2803374, 2772973, 2763875, 2755996, 2749294, 2722352, 2655075, 2593495, 2597334, 2629395, 2604452, 2537456, 2517219, 2538086, 2501752]
9854B501752j05088p5052j8852n6919j26421q9320J4893L5280l2670o2083k5355
9843A960165j0305l3426k6864M186j1808n9987n7565j1315m25k1649p196K7097
9831A750908J1045k7578m505N0848L6595k9941l7646J4566K0420l1329m1675M048
9819A715756J0141m2013n9653j8515l637l8792m4650k612O042l6281m4522L060
9807A444324K2014j2028j7214K7936L6961j3524l1953J0935K2055l0561m6331
9796A412614J6914N2095l492m9651m909N1000L3702M606L6996O9051K8353j9467
9784A627812J0170O0428L6934k1598k2306J2657J336l9471l3468P447Q833l0413
9772A618361m8694l6486l2065l3570j4758K869j4418l8331k4793L336J051j4416
$$ y = [2501752, 2396664, 2321612, 2302760, 2245841, 2119420, 2030100, 2044993, 2080273, 2047603, 1985520, 1960165, 1949860, 1916434, 1889570, 1893756, 1881948, 1821961, 1764396, 1753081, 1752656, 1731007, 1723811, 1750908, 1761953, 1734375, 1729870, 1780718, 1817313, 1787372, 1749726, 1764292, 1784712, 1753383, 1711708, 1715756, 1725897, 1683884, 1624231, 1605716, 1602079, 1563287, 1518637, 1516025, 1522067, 1485786, 1441264, 1444324, 1466338, 1454310, 1437096, 1465032, 1501993, 1488469, 1456516, 1467451, 1489506, 1458945, 1412614, 1429528, 1481623, 1478131, 1428480, 1423571, 1474571, 1508273, 1512879, 1549875, 1618926, 1647279, 1627812, 1637982, 1698410, 1735344, 1713746, 1691440, 1704097, 1705433, 1665962, 1632494, 1639941, 1648774, 1618361, 1569667, 1533181, 1501116, 1467546, 1452788, 1455657, 1441239, 1402908, 1378115, 1381451, 1382502, 1368086]
9760A368086m599J2016M505J137L2110N4164K1782j9608n293L5603L5231N147
9748A540281m70R122m620j6094J6107N1209K8088j6110n436L5660K7578j2603
9736A652712l09N3889N3121j2865m3915O37M0061J7428j1987J0645M9982M8003
9724A857402J8774J3258L9797O6062O8183N0510L8063N3299P9773P0311K4012
9713B379444J3373P8169J40894J11437L4773K9131J01030J40735J01311O0749
9703C191046Q1837J21911J24886J09590J14948J29908J27390J12770R9304Q0935
9693D294525N7347M4082M1003L2228K3253L1110L9607J9766r592m816K2932K0304
9681D611749j7333m0765l3928l0524m1128m1733l8292o1004r0554p7467m0191
$$ y = [1368086, 1363487, 1375503, 1380008, 1381145, 1413255, 1467419, 1489201, 1469593, 1464300, 1499903, 1535134, 1540281, 1539811, 1548933, 1544313, 1528219, 1544326, 1595535, 1623623, 1607513, 1602077, 1637737, 1665315, 1652712, 1652403, 1706292, 1759413, 1746548, 1702633, 1703270, 1743331, 1760759, 1748772, 1759417, 1809399, 1857402, 1876176, 1889434, 1929231, 1995293, 2063476, 2113986, 2152049, 2205348, 2285121, 2355432, 2379444, 2392817, 2470986, 2611880, 2723317, 2758090, 2787221, 2888251, 3028986, 3130297, 3191046, 3272883, 3394794, 3519680, 3629270, 3744218, 3874126, 4001516, 4114286, 4213590, 4294525, 4351872, 4395954, 4436957, 4469185, 4492438, 4523548, 4563155, 4582921, 4573329, 4568513, 4591445, 4611749, 4594416, 4553651, 4519723, 4489199, 4448071, 4406338, 4368046, 4307042, 4216488, 4139021, 4098830]
9670D098830m8629r9623j12600o9452m8909q7533j17274r0937o4155q9048j20981
9659C149689j03457o5556o1106p8756q2697q2461r6061r8912p1664m8029n8585
9648B302405p6720p1126n9477o1784n6582l2117k2877m6164o2029m5027l2032
9637A736470m8562n6610l1428j7857m6894o8565l8369jn445k1702q95K2406l744
9624A418804m4404l5566K778Q955q556o75J9072K682l1265k6187N944O120k1831
9611A295871k1488Q560J4468j1334k1300m106L207m560P458L8794M9126L3052
9599A387748K5835L4261L3676L0192N0808P6425O3854L2254M5048J02740J36690
9588B019531J18155R2912R4998J03614J01320J01557J01173P4166K8357L513J307
$$ y = [4098830, 4050201, 3950578, 3837978, 3768526, 3719617, 3632084, 3514810, 3423873, 3359718, 3270670, 3149689, 3046232, 2980676, 2919570, 2840814, 2758117, 2675656, 2579595, 2480683, 2409019, 2360990, 2302405, 2225685, 2154559, 2095082, 2033298, 1976716, 1944599, 1921722, 1875558, 1813529, 1768502, 1736470, 1687908, 1631298, 1599870, 1582013, 1535119, 1466554, 1428185, 1428184, 1422739, 1401037, 1400142, 1422548, 1418804, 1374400, 1338834, 1341612, 1350567, 1342011, 1341336, 1360408, 1363090, 1331825, 1305638, 1311582, 1317702, 1295871, 1274383, 1282943, 1297411, 1286077, 1264777, 1260671, 1263878, 1259318, 1266776, 1305570, 1354696, 1387748, 1413583, 1447844, 1481520, 1511712, 1562520, 1638945, 1702799, 1735053, 1780101, 1882841, 2019531, 2137686, 2230598, 2325596, 2429210, 2530530, 2632087, 2733260, 2807426, 2835783, 2839296, 2840603]
9577B840603j8145o1583r1579r7832j10155j32139j32811j13242j09439j20794
9567A852884j10343q3241q3649j03458q3209k2623K093l8869p8399o3307l1191
9556A156688l1439m7014m4778l5636l5437k6751l946J457k0113l0480j2792l686
9544H66073k0558k4281M457K0448p397l8603l2358j3393j5262j9100k738P396
9532G24684j1217k7531j3952L80j3874l0048j8742k769n711k591K2231K7440j2856
9519F35444m7332k5816J4896J4574j1818j3241N325N656q352j0807j2084k7489
9507E18956k7234J1752M4687K2985k0661k6262m427j605r409N728K1705J092k2870
9494E14437K567M3245K6279k8763l6335R704K9543k875k4616k299J8442O462o415
$$ y = [2840603, 2822458, 2760875, 2669296, 2571464, 2461309, 2329170, 2196359, 2083117, 1973678, 1852884, 1742541, 1659300, 1575651, 1472193, 1388984, 1366361, 1368454, 1329585, 1251186, 1187879, 1156688, 1125249, 1078235, 1033457, 997821, 962384, 935633, 931687, 933144, 913031, 882551, 869759, 866073, 845515, 821234, 825691, 846139, 838742, 800139, 767781, 754388, 739126, 720026, 717288, 724684, 713467, 685936, 671984, 672364, 658490, 628442, 609700, 606931, 601220, 598629, 620860, 648300, 635444, 588112, 562296, 577192, 591766, 579948, 566707, 572032, 577688, 569336, 558529, 546445, 518956, 491722, 503474, 548161, 571146, 550485, 524223, 519796, 518191, 508782, 514510, 536215, 537307, 514437, 517004, 560249, 586528, 557765, 521430, 531134, 560677, 557802, 533186, 530887, 549329, 555791, 549376]
9481E49376j28m151k8180l2750l335J6239p33j8159k348K2530J9355o098k4266
9468D87352k2158n314J1220P472j6498k7073l158K2736J4167n161M492K0356l084
9455D85349m1105l2187J2363K5702K206k422J6641Q454k1605r215M1714M6441
9443E32336j4277n1099j4282K6569P879k6511j6675J2489J3889L042R695J3514
9431D96569o674k2071r736K890k080L157K3774J6736j9764k0488K8791M5513j0653
9418E25964n6009k2282K5191P441k8647o048L5800J8779k4008j2827K5388J0759
9406D99501l0985j2152M7754M7708j5770m4090j0035Q824j7682k5965R434K6794
9394D83336l128k4209k685J6413K026r084P520J7791J820q888n14k993j8177n723
$$ y = [549376, 549248, 545097, 516917, 484167, 480832, 497071, 496338, 478179, 475831, 498361, 517716, 511618, 487352, 465194, 459880, 471100, 478572, 462074, 435001, 431843, 454579, 468746, 463585, 468077, 488433, 485349, 444244, 412057, 424420, 450122, 452328, 449906, 466547, 475001, 453396, 444181, 485895, 532336, 518059, 466960, 452678, 479247, 487126, 460615, 443940, 456429, 470318, 473360, 483055, 496569, 489895, 467824, 458088, 460978, 458898, 462055, 485829, 502565, 482801, 462313, 491104, 536617, 525964, 469955, 447673, 472864, 480305, 451658, 445610, 481410, 500189, 476181, 463354, 488742, 499501, 468516, 456364, 504118, 551826, 536056, 491966, 481931, 490755, 473073, 447108, 456542, 483336, 480208, 455999, 453314, 469727, 471753, 462669, 470189, 487980, 489800, 480912, 480398, 477405, 459228, 453505]
9380D53505L0425K9721j7919m2776j0473K4373K0761J3837K6612J5998l2269m8904
9368D62891N111N5810K9982k5080k5996R798J1176j4947n330L7087M5428L171
9356E89101l3217k6309J668K2685L3441K9510N877j4006m3L2484L8997J2981q357
9343F84812n597J533j315p12J1493J8923R730j096N975K6008L6002K4802Q344
9330H18902R850K4463J9252j5756l7266n434M4608M2003j0750l3292J1831O2225
9318I30636N3759J2194j700J4636K3795J8953J8146J8796J1535J2969L5387N0862
9306A199968L4353J3947K6651N2440M8664K5647K8223N9187P9548P4041O3631
9295A706300O2477O9279Q8362J15551J22180R7938Q3606J10653J39454J18629
$$ y = [453505, 483930, 513651, 495732, 452956, 442483, 466856, 487617, 501454, 528066, 544064, 511795, 462891, 468002, 523812, 553794, 528714, 502718, 512516, 523692, 508745, 503415, 540502, 585930, 589101, 555884, 529575, 531243, 553928, 587369, 616879, 622756, 608750, 608707, 641191, 680188, 693169, 684812, 679215, 680748, 679433, 678721, 690214, 709137, 718867, 717771, 723746, 749754, 785756, 810558, 818902, 828752, 853215, 872467, 856711, 819445, 814011, 858619, 900622, 889872, 856580, 868411, 930636, 984395, 996589, 994889, 1009525, 1033320, 1052273, 1070419, 1089215, 1100750, 1113719, 1149106, 1199968, 1234321, 1248268, 1274919, 1327359, 1376023, 1401670, 1429893, 1489080, 1568628, 1642669, 1706300, 1768777, 1838056, 1926418, 2041969, 2164149, 2262087, 2345693, 2456346, 2595800, 2714429]
9285B714429P4293O6793Q3986O1614l813n0494n7638o8531r9902j14402j00700
9274B505635r9673j26085j38510j14479q6811p8293o7412m6853m8569p8755r2731
9263A527464o8443m2813m1827l8759j8047j3903m2187n8828l4701r862k0944l5555
9251A101595j7116M067j0599l2857k1749l143j8697m0305j9448J5437K832l7098
9239I22919l0257K0282L3149j4382m8016k1071J3758M08k9649j9312J8158K8005
9227H73992L950j1075J752J5198N880j3881k1624j5310p457m130j687J002k150
9214H24460j2996k0076j1890L321O726j372k235N741K67k2160k8732p00K9216
9201G69570K3898o53o248L111k090j3988m10K6536J9674j9637l2986J303K9598
$$ y = [2714429, 2788722, 2855515, 2939501, 3001115, 2997302, 2946808, 2889170, 2820639, 2720737, 2606335, 2505635, 2405962, 2279877, 2141367, 2026888, 1940077, 1861784, 1794372, 1747519, 1698950, 1620195, 1527464, 1459021, 1416208, 1374381, 1335622, 1317575, 1303672, 1261485, 1202657, 1167956, 1158094, 1137150, 1101595, 1084479, 1088546, 1077947, 1045090, 1023341, 1020198, 1001501, 961196, 941748, 957185, 960017, 922919, 892662, 912944, 946093, 931711, 883695, 862624, 876382, 876790, 847141, 827829, 845987, 873992, 877942, 866867, 868619, 883817, 889697, 875816, 854192, 838882, 831425, 827295, 825608, 826610, 824460, 811464, 791388, 779498, 782819, 789545, 788173, 785938, 791679, 791946, 769786, 741054, 740354, 769570, 793468, 792815, 786567, 789678, 787588, 773600, 773190, 799726, 819400, 799763, 766777, 768080, 797678]
9188G97678J0014k0234r526K3715K5972m233k1947j1318j36l721m279Q348J6603
9175H06936P421o442r106k801K406J804n643j5212j2591Q160K5242J3442j2790
9162H00826j2997J6449L0569M293k4636j2334K1925K5431o430k6253r377J4401
9150H21867J4230J716O77O635K450q827j2253n820M314J7255K6630J5690j3880
9137H70684k8475n633K7806L2038J1255j472K10j762m132J1646L2191K3577p258
9124I60675j6347L609J0405j0891j8785R629L3732J8676m314M715K3764J1684
9112A026552j6426j7864J766M326q328r01K6615L7732K3521J1438J0577K545j0788
9099A090765m681J6664J8088n526j5769O601L0766K5982L482r777n949R120K5332
$$ y = [797678, 807692, 787458, 777932, 801647, 827619, 823386, 801439, 790121, 789985, 786264, 781985, 790333, 806936, 814357, 807915, 798809, 796008, 798414, 800218, 794575, 779363, 766772, 774932, 800174, 813616, 800826, 787829, 804278, 834847, 839140, 814504, 802170, 824095, 849526, 843096, 816843, 807466, 821867, 836097, 837813, 838490, 845125, 847575, 838748, 826495, 820675, 824989, 842244, 868874, 884564, 870684, 842209, 836576, 864382, 896420, 907675, 906203, 906413, 904651, 900519, 912165, 944356, 967933, 960675, 944328, 947937, 958342, 947451, 928666, 938295, 972027, 990703, 986389, 991104, 1014868, 1026552, 1010126, 992262, 994028, 998354, 990026, 989125, 1015740, 1053472, 1076993, 1088431, 1099008, 1101553, 1090765, 1086084, 1102748, 1120836, 1115310, 1099541, 1106142, 1136908, 1162890, 1166372, 1156595, 1150646, 1159766, 1185098]
9086A185098K3836m403l1140j9371J7686K9834O982p564Q402K3379J3825L279
9074A249843J1819J8321O572L66J5351K2636K087j3230O368K8236J0221k3343
9062A335247j9974J3286K5477Q481J640J5325J5629p832j9140J779K5134K2466
9050A417518J0278J5160K7930K3311M708j459J2002K2589J2631l993j258K0680
9038A560097L3782K3407J1462J9691K8795Q771k1132j1820L3179N1671J9114q979
9026A748038J1900M0599K3417q469R920O1023O5610J1245k6051q19L8921L6202
9014B011536P448L76J7943K8524K1890J5503K1178L4041M4403M3331K7575R113
9002B282861O134J9057L1966L8495M4004M2891K3821J067O543M0279O1463M3570
$$ y = [1185098, 1208934, 1204531, 1173391, 1154020, 1171706, 1201540, 1208522, 1200958, 1209360, 1232739, 1246564, 1249843, 1261662, 1279983, 1286555, 1286921, 1302272, 1324908, 1326995, 1313765, 1320133, 1348369, 1358590, 1335247, 1315273, 1328559, 1354036, 1362517, 1364157, 1379482, 1395111, 1387279, 1368139, 1369918, 1395052, 1417518, 1427796, 1442956, 1470886, 1494197, 1498905, 1497446, 1509448, 1532037, 1544668, 1540675, 1539417, 1560097, 1593879, 1617286, 1628748, 1648439, 1677234, 1686005, 1664873, 1653053, 1686232, 1737903, 1757017, 1748038, 1759938, 1800537, 1823954, 1815485, 1825405, 1886428, 1952038, 1963283, 1937232, 1936413, 1975334, 2011536, 2018984, 2019360, 2037303, 2065827, 2087717, 2103220, 2124398, 2158439, 2202842, 2246173, 2273748, 2282861, 2288995, 2308052, 2340018, 2378513, 2422517, 2465408, 2489229, 2490296, 2496839, 2537118, 2598581, 2642151]
8990B642151R482m201Q219K8151L9792L6127K0048J1106K8126N6541O0122L4279
8978B969943J6089K8758N0007N3188M5864M4993M4835L5530K7550L2558M2789
8967C392104N0440O2302P5537O9380M4293L5882O0575Q1727O5944L9722M5315
8956D023221O8653O4548L5518K8153N6067Q1203P7281O3125O0473O0789N2291
8945D671322M6621N7203P3707P7355O7644N9829O4323P6330Q0688O7114M6365
8934E388501M4290O9276R5482R3407O7730M8515N4524Q1674J14888J32625J16257
8923F307169P8720O5254R5925J28278J16542Q7417J02181J53496J67611J20314
8913G422907Q1573J11091J68413J77861J41116J24268J53985J88278J89805J74187
$$ y = [2642151, 2651633, 2647432, 2655651, 2683802, 2723594, 2759721, 2779769, 2790875, 2819001, 2875542, 2935664, 2969943, 2986032, 3014790, 3064797, 3117985, 3163849, 3208842, 3253677, 3289207, 3316757, 3349315, 3392104, 3442544, 3504846, 3580383, 3649763, 3694056, 3729938, 3790513, 3872240, 3938184, 3977906, 4023221, 4091874, 4156422, 4191940, 4220093, 4276160, 4357363, 4434644, 4497769, 4558242, 4619031, 4671322, 4717943, 4775146, 4848853, 4926208, 4993852, 5053681, 5118004, 5194334, 5275022, 5342136, 5388501, 5432791, 5502067, 5597549, 5690956, 5758686, 5807201, 5861725, 5943399, 6058287, 6190912, 6307169, 6385889, 6451143, 6547068, 6675346, 6791888, 6879305, 6981486, 7134982, 7302593, 7422907, 7504480, 7615571, 7783984, 7961845, 8102961, 8227229, 8381214, 8569492, 8759297, 8933484]
8903H933484J71415J81256J88973J95723K08520K19844K22195K29616K58137K91647
8893A1100810K96884K75509K71285L10285L59279L69122L42659L26886L43849
8884A3996568L65447L62785L46528L41000L43853L32897K97709K47469J98271
8875A6832527J62253J36082R6424K6962m9976r9713j33985j97060k82799l25957
8865A6164758l06333k95432l46249l99336l75115l08639k95902l37487l45108
8856A3155157k95326k61516k77132k81325k39459k11095k39342k66828k35817
8847A0847317j92062k03922k42134k33035j84895j65819j86020j95151j79707
8838I064572j74598j85561j83268j71801j82550k00329j78184j30476j23815j61445
$$ y = [8933484, 9104899, 9286155, 9475128, 9670851, 9879371, 10099215, 10321410, 10551026, 10809163, 11100810, 11397694, 11673203, 11944488, 12254773, 12614052, 12983174, 13325833, 13652719, 13996568, 14362015, 14724800, 15071328, 15412328, 15756181, 16089078, 16386787, 16634256, 16832527, 16994780, 17130862, 17227286, 17254248, 17204272, 17104559, 16970574, 16773514, 16490715, 16164758, 15858425, 15562993, 15216744, 14817408, 14442293, 14133654, 13837752, 13500265, 13155157, 12859831, 12598315, 12321183, 12039858, 11800399, 11589304, 11349962, 11083134, 10847317, 10655255, 10451333, 10209199, 9976164, 9791269, 9625450, 9439430, 9244279, 9064572, 8889974, 8704413, 8521145, 8349344, 8166794, 7966465, 7788281, 7657805, 7533990, 7372545]
8828G372545j69148j23984j00751j41464j71800j21630n1643o4830j43161j76743
8818F107391j31596q3388q3952r5601q3117p9237j10346j30669r5008m5251n1781
8807E117445r9748j10719o7149l7165o3305r9238r0783n9861n7807p8178p5956
8796D277536m9423l9980n7303o4966m7041l3709m4352n4853m4805l2960l7567
8785C770577m1511k9165k0881l3852m2439k0091Q397L697k2546k9519j5969j2848
8773C513850k0607j2814K682j1786n2915p1096m9600l0844m3099n7646m7261l3993
8761C084871m1982n0175l4816j8727l1398n3460n0246l2707l2855m1224k5498
8750B671783L168K355k7430m0443k2696j2493k8988l7116j1761J3016j468l2367
$$ y = [7372545, 7203397, 7079413, 6978662, 6837198, 6665398, 6543768, 6492125, 6427295, 6284134, 6107391, 5975795, 5892407, 5808455, 5712854, 5629737, 5550500, 5440154, 5309485, 5214477, 5169226, 5117445, 5017697, 4906978, 4839829, 4802664, 4739359, 4640121, 4549338, 4489477, 4431670, 4353492, 4277536, 4228113, 4188133, 4130830, 4065864, 4018823, 3985114, 3940762, 3885909, 3841104, 3808144, 3770577, 3729066, 3699901, 3679020, 3645168, 3602729, 3582638, 3591035, 3594732, 3572186, 3542667, 3526698, 3513850, 3493243, 3480429, 3483111, 3471325, 3418410, 3347314, 3297714, 3266870, 3223771, 3166125, 3118864, 3084871, 3042889, 2992714, 2957898, 2939171, 2907773, 2854313, 2804067, 2771360, 2738505, 2697281, 2671783, 2674951, 2677306, 2649876, 2609433, 2586737, 2574244, 2545256, 2508140, 2496379, 2509395, 2507927, 2475560]
8738B475560l0366K081J6078q176l6207l4482j3708l447j0484j9859k0106j1050
8726B305834K741J1939L811k2486m6038m2668j3167J6580K3777Q570j3736k9326
8714B205831l1135j7919K813J5000O311j7555l4682k6897m1J7303K334l1700m4098
8701B045565j6386J7773J3665j9718k8232P466L7962J5997l0713l8002J735L3488
8689B040600K3985K663N532K2691K7281K1744K2584K4189J3758N255J9929M1533
8677B271744L2348m207j8947R499L4484M935n6757q1177m7521r579j6907m9318
8665B068597n5612k9079p345j0416j9916k0845k4345l6488l8541j8503M575R142
8653A821224P41p327j7344k7706j8415J2989K9165N635k0511k407L8183M2030
$$ y = [2475560, 2445194, 2447275, 2463353, 2455177, 2418970, 2384488, 2370780, 2367333, 2356849, 2336990, 2316884, 2305834, 2308575, 2320514, 2324325, 2301839, 2255801, 2213133, 2199966, 2216546, 2240323, 2248893, 2235157, 2205831, 2174696, 2156777, 2159590, 2174590, 2180901, 2163346, 2128664, 2101767, 2101726, 2119029, 2121363, 2089663, 2045565, 2029179, 2046952, 2060617, 2040899, 2012667, 2020133, 2058095, 2074092, 2043379, 2005377, 2007112, 2040600, 2064585, 2067248, 2072780, 2095471, 2122752, 2144496, 2167080, 2191269, 2205027, 2210282, 2230211, 2271744, 2304092, 2299885, 2280938, 2290437, 2324921, 2329856, 2273099, 2191922, 2144401, 2134822, 2117915, 2068597, 2012985, 1983906, 1976561, 1966145, 1946229, 1925384, 1901039, 1864551, 1826010, 1807507, 1812082, 1821224, 1821965, 1814638, 1797294, 1769588, 1751173, 1764162, 1793327, 1798962, 1778451, 1776044, 1814227, 1856257]
8641A856257Q526n362J8966L6799K3629J3940L0740M1557K2168O444K7433N7816
8629B138913N8764M6085N4252O9729N7300K6622J4368J7833L136l0696n0332m7496
8617B358478n0067p1449r1424r1975p7300n6068l4373k5154l5899n0385m8531
8606A725853l5779k7242j8667m175k804k8032m9687l2260M358J2510p579j4778
8594A521718j516j384k2147l1303j5885m26M262J4885K7775J4775j7921k4662
8582A468171N974K8914J7518M064J6472L0047J8508L255J0732K3295J4240l783
8570A637407n367L227K214o584j3660k3480l6549l9871l6185m5803o0463m3167
8558A331719J339J2760l1605o9030m5234L33K198k8783l8476k2535j3897j0850
$$ y = [1856257, 1864783, 1859421, 1878387, 1915186, 1938815, 1952755, 1983495, 2025052, 2047220, 2053664, 2081097, 2138913, 2197677, 2243762, 2298014, 2367743, 2425043, 2451665, 2466033, 2483866, 2487002, 2456306, 2405974, 2358478, 2308411, 2236962, 2145538, 2053563, 1976263, 1920195, 1885822, 1860668, 1824769, 1774384, 1725853, 1690074, 1662832, 1644165, 1639990, 1637186, 1609154, 1559467, 1527207, 1531565, 1544075, 1536496, 1521718, 1520202, 1518818, 1496671, 1465368, 1449483, 1449057, 1453319, 1468204, 1495979, 1510754, 1492833, 1468171, 1474145, 1503059, 1520577, 1524641, 1541113, 1571160, 1589668, 1592923, 1603655, 1626950, 1641190, 1637407, 1632040, 1635267, 1637481, 1630897, 1617237, 1593757, 1557208, 1517337, 1481152, 1435349, 1374886, 1331719, 1333058, 1345818, 1314213, 1245183, 1199949, 1200282, 1202480, 1173697, 1135221, 1112686, 1098789, 1087939]
8546A087939P698K1197l091l8960l3576L587J6760l454j6582j1845j5703k4862
8534I89108q670K0791J7656j3636j9611P883J6330j3324l4622j9882k082n571
8522I34370o242Q416Q780j2964j5910J3979K7397n067l6370k0173J3356J4351
8510I23923n791r210k498j0814j7952M085L2826K4134j4290l3313j4348J5572
8498H92324K9672K2945N41k1311j9010M304J1651j1867k7830m079L0512L3398
8486I41250J4096L945l187k3409l0750J786L7434K3545j7130j9465J4555K2331
8474I65001p477j7660J1602K6737j110k1550Q533M9653M2517k238k9364k0570
8462A004074k279O261R959J3725J3863R925O864R107J7907K5152J4449j2369k0799
$$ y = [1087939, 1095637, 1116834, 1113743, 1074783, 1041207, 1044794, 1061554, 1058100, 1041518, 1029673, 1013970, 989108, 980438, 1001229, 1018885, 1005249, 985638, 993521, 1009851, 996527, 961905, 942023, 939941, 934370, 928128, 936544, 945324, 932360, 916450, 930429, 957826, 952759, 916389, 896216, 909572, 923923, 918132, 908922, 906424, 895610, 877658, 881743, 914569, 938703, 924413, 891100, 876752, 892324, 921996, 944941, 945482, 924171, 905161, 909465, 921116, 909249, 881419, 877340, 907852, 941250, 955346, 959291, 956104, 932695, 901945, 903731, 941165, 964710, 947580, 928115, 942670, 965001, 957524, 939864, 951466, 978203, 977093, 955543, 964076, 1013729, 1056246, 1054008, 1024644, 1004074, 1001795, 1008056, 1018015, 1031740, 1045603, 1055528, 1062392, 1071499, 1089406, 1114558, 1129007, 1116638, 1095839]
8449A095839J1659M7516L3098j4418k3412K0878M8994J6890k4412j2931K8243
8438A227944L6370P942r978L9J4202J9804K4874K5456J1388k639M951K1741J9662
8425A401756M397L465J4492J2104M60R370L7987N1376L7725K1488J3419k079j8752
8412A587208j921M7422P2984M0528q017j5728J0536K5600K0416K1208L2083L1076
8400A863395J9781K7783N8985P5103N0447J2014K868K5970M7125M3229K7075K5520
8388B279295M6402P0838P4154N2663K8331K4773M2094O1054O8041O6172O3444
8377B877261O1854O0397N9172N7792N7128O1985P2749P7797O8901O1317P7079
8366C593432J06577J13847Q9607O9020P7518Q9719P3594M8845N7285R0222R6833
$$ y = [1095839, 1107498, 1155014, 1188112, 1173694, 1150282, 1171160, 1220154, 1237044, 1212632, 1199701, 1227944, 1264314, 1272256, 1262278, 1262317, 1276519, 1296323, 1321197, 1346653, 1358041, 1355402, 1360353, 1382094, 1401756, 1406153, 1409618, 1424110, 1436214, 1436674, 1446044, 1484031, 1535407, 1573132, 1594620, 1608039, 1605960, 1587208, 1585287, 1632709, 1705693, 1746221, 1738204, 1722476, 1733012, 1758612, 1779028, 1800236, 1832319, 1863395, 1883176, 1910959, 1969944, 2045047, 2095494, 2107508, 2110376, 2136346, 2183471, 2226700, 2253775, 2279295, 2325697, 2396535, 2470689, 2523352, 2551683, 2576456, 2618550, 2679604, 2747645, 2813817, 2877261, 2939115, 2999512, 3058684, 3116476, 3173604, 3235589, 3308338, 3386135, 3455036, 3516353, 3593432, 3700009, 3813856, 3903463, 3972483, 4050001, 4139720, 4213314, 4262159, 4319444, 4409666, 4506499]
8355D506499O3958L5795M3055O1467O0983N1049M9225M5714L2932L3424N8899
8344E043000P4738N1261K1914L6964Q0056R0634N9452L8530N4035P2506O8350
8333E691440O5710Q6686J07987J02348Q4355Q1882R3394J04200J15758J28584
8323F662344J24832J00935R0706J18652J52855J45823J06796Q9629J14535J43880
8313G850987J39538J08506Q0885O8866O0614L8718m958o2604j13022j37128j33017
8302G897385j14118r7759r7565j15034j31856j23633r0476o0825n5175o0460n2074
8291F898410k7111l047M520o812k4591k6453m267J5871M241k2048j8488J1367
8279F801592J2886k7382m7545q674L2348Q411m8667n8957j9848J599j7253l3202
$$ y = [4506499, 4570457, 4606252, 4649307, 4710774, 4771757, 4822806, 4872031, 4917745, 4950677, 4984101, 5043000, 5117738, 5168999, 5190913, 5227877, 5307933, 5398567, 5458019, 5496549, 5550584, 5623090, 5691440, 5757150, 5843836, 5951823, 6054171, 6138526, 6220408, 6313802, 6418002, 6533760, 6662344, 6787176, 6888111, 6978817, 7097469, 7250324, 7396147, 7502943, 7592572, 7707107, 7850987, 7990525, 8099031, 8179916, 8248782, 8309396, 8348114, 8343156, 8280552, 8167530, 8030402, 7897385, 7783267, 7685508, 7587943, 7472909, 7341053, 7217420, 7126944, 7066119, 7010944, 6950484, 6898410, 6871299, 6868252, 6872772, 6865960, 6841369, 6814916, 6810649, 6826520, 6830761, 6808713, 6790225, 6801592, 6814478, 6787096, 6739551, 6730877, 6763225, 6771636, 6722969, 6664012, 6644164, 6645763, 6628510, 6595308]
8267F595308k6168k7124m7908n7966m6930m3397n5474n7009m7826o0754r1870
8256F032882r4452o4132n5622q6499j03012p9032o6581r6626j12675p1573l3080
8245E169598o3039j12698r5330l5238k8901q3713j10951p7038m9861p3924j00820
8234D338085q3763n7150o9697j01563j04318q0092o8009p9206r1211r1423q9777
8223C421876r4506r9295r2118o7995m0016l5508o3459r1245q2004n0815m5601
8212B659314p0531p5978l9602q037k6235o5610o5776k3877K710k3891p6236r9586
8200B086665p2515k3274K975j0629l8722m7357l5094k5964k7931k5035j3158j2672
8188A757289l3604n5854n9642n1076m1664k7992j0002m151j6903k8499k5005k2306
$$ y = [6595308, 6569140, 6542016, 6494108, 6436142, 6389212, 6345815, 6290341, 6233332, 6185506, 6124752, 6032882, 5938430, 5874298, 5818676, 5732177, 5629165, 5550133, 5483552, 5386926, 5274251, 5202678, 5169598, 5106559, 4993861, 4898531, 4863293, 4834392, 4750679, 4639728, 4562690, 4512829, 4438905, 4338085, 4254322, 4197172, 4127475, 4025912, 3921594, 3841502, 3773493, 3694287, 3603076, 3511653, 3421876, 3327370, 3228075, 3135957, 3067962, 3027946, 2992438, 2928979, 2837734, 2755730, 2704915, 2659314, 2588783, 2512805, 2473203, 2465166, 2438931, 2373321, 2307545, 2283668, 2286378, 2262487, 2186251, 2086665, 2014150, 1990876, 1993851, 1983222, 1944500, 1897143, 1862049, 1836085, 1808154, 1783119, 1769961, 1757289, 1723685, 1667831, 1608189, 1557113, 1515449, 1487457, 1477455, 1473304, 1456401, 1427902, 1402897, 1380591]
8176A380591l4256m3059l0685j4836j8788k8002j7158j611j4604m3939m3183o914
8164A083556J6119l488l5010l9577k3564j4684j6121j3585p075p713j4841j8216
8152I05801j5027r592m605l521j0639k0551k1837j7855k3710l4225k2680J2137
8140G33696K8938J631l4746l3029n136J954j5282j7881O41J941k3277l0761Q26
8127F09515K5318J581l7032l6361o601M154o541l366J1426K80l3602m1478j1492
8114D75801R318n009j9844q361J356j4411k4920k176K0888N264k2361j5025J0053
8101D10573J507l2986l6641J63K4470P367j8211j9558p172J320R459J5511L385
8088C59187k1115k6847p447N981k080q522R83O077n784j4337p403m493j5662j9847
$$ y = [1380591, 1346335, 1303276, 1272591, 1257755, 1238967, 1210965, 1193807, 1192196, 1177592, 1133653, 1090470, 1083556, 1099675, 1096187, 1061177, 1021600, 998036, 983352, 967231, 953646, 946571, 938858, 924017, 905801, 890774, 881182, 876577, 873056, 862417, 841866, 820029, 802174, 778464, 744239, 721559, 733696, 762634, 764265, 729519, 696490, 691354, 693308, 678026, 660145, 660786, 662727, 639450, 608689, 609515, 634833, 636414, 599382, 563021, 556420, 560574, 554033, 550667, 562093, 562373, 528771, 487293, 475801, 485119, 480110, 460266, 451905, 453261, 438850, 413930, 411754, 432642, 437906, 415545, 400520, 410573, 412080, 379094, 342453, 342616, 367086, 374453, 356242, 336684, 329512, 330832, 340291, 355802, 359187, 338072, 311225, 303778, 309759, 307679, 299157, 300140, 306217, 300433, 286096, 278693, 274200, 258538, 238691]
8074B38691r294r567k6662k3834J2520L4374N475l3448k7044P090J3903p578j3543
8061A61083L555P968j2895l1398k7442q320J4002K7227J3615k0876l3016j270
8049I2233K8349P837l1244k7405O464Q321k0724k0685J3080J8007j7797k5516
8037C0920K1631N0465O838n0103m1517Q875K3434n152j8351N197K5523J3203j3613
8024E7350k5624j4990P632K0559M971k6408l3782n793J8178Q961n607O002J7247
8011B8696r841m6342l2229K2846M5117P462l1616j9731J5356J7444j2233k3199
7999c8270O504L9015K8986j4826l9076j6042J7419J1625k1284k4909J0432K8266
7987a2160k053l1043r558K7099J6760k5136l2199K031J8833k926j7393J589J7771
$$ y = [238691, 229397, 219830, 193168, 169334, 181854, 216228, 221703, 188255, 161211, 168301, 182204, 174626, 161083, 164638, 172606, 159711, 128313, 100871, 92551, 106553, 133780, 147395, 126519, 93503, 92233, 120582, 128419, 97175, 69770, 76234, 84555, 63831, 43146, 56226, 74233, 56436, 30920, 52551, 103016, 109854, 59751, 18234, 27109, 50543, 45391, 27040, 32237, 57760, 70963, 57350, 31726, 16736, 24368, 44927, 49898, 23490, -10292, -16085, 2093, 11054, 5447, 11449, 28696, 18855, -27487, -59716, -36870, 8247, 15709, -15907, -35638, -20282, -2838, -15071, -38270, -31766, 7249, 36235, 21409, -17667, -33709, -16290, -4665, -25949, -50858, -40426, -12160, -14213, -45256, -54814, -27715, -10955, -36091, -68290, -66259, -47426, -50352, -67745, -66156, -48385]
7974d8385L259j2116J388J9143P458j7769k0158j76J5560J8159J4447K410j7660
7961c4440k5705p882J5155J5895J254l556J684j839j2338q854R343J7173K565
7948c1545j5793j7967q790l845n597n700j041M088P120Q544N315p385k4194k7730
7934a24520q810J5675J9816M583j991J2323K3682J1258o725l757P332m879l2254
7921h8267l3544p2K8767K5843J0192L975l388k2282l0255o821K4736K6805K347
7908f1964j3943q600k33k070m724P82P307N705j499o652p128n423n308q933j4126
7893a26809j5074p072R770K7623K9758M431l0469l4708J448L1459J3145k3011
7881a19509j5308K9149L9748m401l7276j1265K7983K0113j4468j9512R10J409
$$ y = [-48385, -45126, -57242, -55854, -36711, -29253, -47022, -67180, -67356, -51796, -33637, -19190, -16780, -34440, -60145, -68027, -52872, -36977, -35723, -39279, -37595, -39434, -51772, -60626, -51283, -34110, -31545, -47338, -65305, -74095, -77940, -83537, -89237, -90278, -86190, -79070, -70526, -65211, -72596, -96790, -124520, -133330, -117655, -97839, -93256, -95247, -82924, -59242, -47984, -54709, -58466, -51134, -56013, -88267, -121811, -121883, -93116, -67273, -57081, -53106, -56494, -78776, -109031, -115852, -91116, -64311, -61964, -75907, -84507, -84740, -86810, -91534, -90752, -83445, -77740, -79239, -85891, -93019, -98442, -103750, -112683, -126809, -141883, -148955, -139185, -111562, -81804, -77373, -107842, -142550, -141102, -109643, -96498, -119509, -134817, -105668, -65920, -70321, -107597, -118862, -90879, -70766, -85234, -104746, -103836, -102427]
7869a02427j7966j6133J1243K5677J3717P18k126q075j2729J587J7921M76l5911
7856a24028l4166J3202M3259J7476k1208j9275J0703K3823J1966k369r554j1114
7844a01285p42J7493J6938j0806k8239m105L0199K2055j9892l5915n767K2304
7832i7762P121k4905k3599R457K7094Q725j2434m719J2135J362k5865k2294J8069
7819a27615M1481J3817k5105k3085N005Q773j3043j8602OQ473l281q431r87l725
7805a46319j1236P710L8490K6200k4732l8548P393L3386j0579n0861j0468N3064
7793a26500L6399l6352n0192J5497O1387L0574j8916k6939j3399j0967n969Q936
7781a36441K054k8858k8006K4683N9355J9448m0955l7570J3291K8222p872k8664
$$ y = [-102427, -120393, -136526, -125283, -99606, -85889, -85171, -87297, -95372, -108101, -106514, -88593, -88117, -124028, -158194, -144992, -101733, -84257, -105465, -124740, -114037, -90214, -78248, -80617, -90171, -101285, -102027, -84534, -67596, -78402, -106641, -110746, -80547, -58492, -78384, -114299, -120066, -97762, -90641, -115546, -139145, -129688, -102594, -93869, -106303, -111022, -98887, -97525, -123390, -145684, -127615, -86134, -72317, -97422, -120507, -115502, -106729, -119772, -138374, -138368, -129895, -133176, -141607, -142594, -146319, -157555, -149845, -111355, -85155, -109887, -148435, -141042, -107656, -118235, -169096, -179564, -126500, -90101, -126453, -176645, -161148, -99761, -69187, -88103, -115042, -128441, -139408, -145377, -136441, -134387, -163245, -191251, -166568, -107213, -87765, -128720, -166290, -152999, -124777, -132649, -161313]
7769a61313k878K0782K516k4850j5036J7957K6015r3k2381j2674J1155J2989j1491
7756a59302k7142o282K8969L1668m124l1533j6405J6120K3936Q216l096q428k4438
7743a71841l7819j6913K7356M3218J3773j5989r593P878p69k0760j4769R589J2310
7730a74329r703j7346L431J7827K027j5739k498K3639K2015n447j8341j296J6035
7717a59725Q776q338j1348m118l157n989l80P835L689o210q0K0684K7059N448
7703a25854j9025j8476l069l539k2630k9709o157K6038L3064J2318r778j5959
7691a82776j4163j3729p192J0430K0782M164k3985k5701O030L2488K1117r665
7679a82200j7976L865K3119J3134j4766k8076r650K4482L9673J9640j1083j5862
$$ y = [-161313, -164191, -143409, -140893, -165743, -180779, -162822, -136807, -136900, -159281, -171955, -160800, -147811, -159302, -186444, -192726, -163757, -132089, -136213, -167746, -184151, -168031, -144095, -135879, -138975, -147403, -171841, -209660, -226573, -199217, -155999, -142226, -158215, -167808, -159930, -160699, -181459, -196228, -186639, -174329, -184032, -201378, -197947, -180120, -178093, -193832, -196330, -172691, -150676, -156123, -174464, -175760, -159725, -150949, -159287, -170635, -174753, -177910, -183899, -184279, -176444, -172755, -178965, -179045, -158361, -131302, -125854, -144879, -163355, -166424, -169963, -192593, -222302, -228459, -202421, -169357, -157039, -166817, -182776, -196939, -210668, -217860, -207430, -186648, -182484, -206469, -232170, -226140, -193652, -172535, -182200, -200176, -196311, -173192, -160058, -174824, -202900, -212550, -188068, -148395, -128755, -139838, -155700]
7667a55700J925J982k7630m3926j4479K5496K4420m643r304J2699J4519j1231
7655a85872j5983J6099L2283j620l9247k6542J2369J8627p591j7893Q77J4953
7643a99540P939J009O561R234M58p547r498j3589j4775K613K7854K6068r009l7640
7629b09862k7532L322J7606R481J524O645J5680J5859M918j0021j8166j3873m823
7616b09242m064j0645r072O091J7623Q350j2074j6799K605K2187J4701j2498k2388
7603b25225K073K8257J5408k2339k9288Q785L6152P607m0008l9854O535L6160
7591b15737J9838o062q311k595j0958j9485p793J2055J6296O526j07L2J73K57
7577b15871K139J927J608J1063K4779J8553j2376l4750k0796Q936J3960q907k5878
$$ y = [-155700, -153775, -151793, -179423, -223349, -237828, -212332, -187912, -192555, -201859, -189160, -174641, -185872, -201855, -185756, -153473, -155093, -194340, -220882, -208513, -189886, -197477, -215370, -214493, -199540, -191601, -190592, -184031, -174797, -174339, -181886, -191384, -204973, -219748, -217135, -189281, -163213, -172222, -209862, -237394, -234072, -216466, -206985, -205461, -198816, -183136, -167277, -162359, -172380, -190546, -204419, -209242, -213306, -223951, -233023, -226932, -209309, -200959, -213033, -229832, -227227, -205040, -190339, -202837, -225225, -223152, -194895, -179487, -201826, -231114, -222329, -186177, -178570, -218578, -258432, -251897, -215737, -195899, -201961, -210272, -212867, -223825, -243310, -251103, -239048, -222752, -216226, -216333, -216301, -216128, -215871, -213732, -211805, -210197, -199134, -174355, -155802, -168178, -202928, -223724, -214788, -200828, -209735, -235613]
7564b35613j6301N261J6035J1519J899k918j557j079o990j2007m495J0927J7644
7551b17675J3955J2941J1534q505l7378l4091R362M0419J9147j7780j4455J4414
7539b08112J2516j8873k2893J2831L2164M372k6308j7348N779L482q071N035K4266
7526b01160Q047l0115l6199k040K3626J6112Q007K2058K5719j0883n2924m5304
7514b75056L732L3850K0014j363N42O944n199j5947J917K7634J8849j8410l3273
7501b35766n763K5567K4606N395l038l265r887j2396M444K2584J3735j0347j2418
7488a96549Q925J5367q034k7744j5514R324J4642L710L78O493M800o745j2975
7475b03922j0088r800j3443o063J5769L0115J7315j0662k3907j2610L400L767
$$ y = [-235613, -251914, -246653, -230618, -219099, -217200, -220118, -221675, -222754, -229744, -241751, -246246, -235319, -217675, -203720, -190779, -179245, -187750, -225128, -259219, -249857, -209438, -190291, -208071, -222526, -208112, -195596, -214469, -237362, -224531, -192367, -187995, -214303, -231651, -225872, -222390, -230461, -225426, -201160, -193113, -223228, -259427, -261467, -237841, -221729, -213722, -191664, -165945, -176828, -229752, -275056, -271324, -237474, -217460, -218823, -218281, -211337, -216536, -232483, -230566, -202932, -184083, -202493, -235766, -241529, -215962, -191356, -185961, -188999, -192264, -202151, -214547, -210103, -187519, -173784, -184131, -196549, -187624, -172257, -180291, -208035, -223549, -214225, -199583, -195873, -195495, -189002, -184202, -190947, -203922, -214010, -223810, -237253, -243316, -227547, -197432, -180117, -190779, -214686, -227296, -223896, -220129]
7463b20129p383j1936l076R816J5447R235p138k2286j6394J6142M6716L7862n748
7450a58872l5252j8963J6794K6536N480j3805j0920K934R038J874j1392j5947
7438b02495p84K1083J8883j1088k8043k647L1689K3940j4942k8738n486Q493q421
7425a98556j7297R337L4518J5308k6586l7849j0932J5298J6587N360q07J79L812
7412a91628N137p89q961m745J1644J6891j282k0296j5201L247Q684J25n964q638
7398b11776j4973j2990J0824L4810K2973j7379l8145j7744J0739J2265k528l722
7386b27646R124J1720l844j8140j3388M705J8313J9235J2112K299q600j4327m314
7373b12751J7860K7681Q761j8984k2955n266K064j0357j6410k633Q573J578m072
$$ y = [-220129, -227512, -239448, -242524, -232708, -217261, -208026, -215164, -237450, -253844, -237702, -190986, -153124, -158872, -194124, -213087, -196293, -169757, -164277, -178082, -189002, -186068, -177030, -175156, -186548, -202495, -203279, -182196, -163313, -174401, -202444, -205091, -173402, -149462, -164404, -193142, -198628, -190135, -198556, -215853, -206516, -171998, -156690, -183276, -221125, -232057, -216759, -200172, -194812, -195619, -195440, -191628, -186491, -187280, -196241, -200986, -189342, -172451, -173733, -194029, -209230, -205983, -197299, -197174, -203138, -211776, -226749, -239739, -228915, -194105, -171132, -188511, -226656, -244400, -233661, -221396, -223924, -227646, -218522, -206802, -210646, -228786, -242174, -237469, -219156, -199921, -187809, -185510, -194110, -208437, -212751, -194891, -167210, -158449, -177433, -200388, -205654, -203590, -213947, -230357, -232990, -224417, -222839, -226911]
7360b26911P092J4609J159j0107M760K3790J5437m768k353J2917N240k0797k7382
7347b07314q907M574M604R682J5605r68k6586j9597J6272K8857L017j4268L048
7334a91981J6202n532k8117j2732J8151K2890O926j831o488j9292j9615J1009
7322b10410L8453J8751k6739l7869p276J3957J001j3411l099J0466L966n347N638
7309b11919K0695J0402j4129j2633K0187L8220Q591l4030l0742J4126L2950n602
7297a63884m3798j8960L8095M7268O59l1439j4915M565p999j8039P050L2209J4216
7284a54972k2755k8611o418O480N209R452J4932O691k216L587L153k0900l3387
7271b19755P66M2385K8451k3077l7644l778J5155p643k3443O54K8585K3338K857
$$ y = [-226911, -219819, -205210, -204051, -214158, -209398, -185608, -170171, -174939, -177292, -164375, -159135, -179932, -207314, -216221, -211647, -207043, -197361, -181756, -182724, -209310, -228907, -212635, -183778, -180761, -195029, -191981, -175779, -181311, -209428, -222160, -204009, -181119, -174193, -176024, -182512, -201804, -221419, -210410, -171957, -153206, -179945, -217814, -225090, -211133, -210132, -223543, -226642, -216176, -212210, -217557, -211919, -191224, -180822, -194951, -207584, -187397, -149177, -140586, -174616, -205358, -191232, -158282, -163884, -207682, -226642, -188547, -141279, -140620, -172059, -186974, -182409, -190408, -208447, -201397, -169188, -154972, -177727, -206338, -212756, -206276, -201067, -191615, -176683, -169992, -172208, -168621, -165468, -186368, -219755, -218989, -176604, -148153, -171230, -208874, -212652, -197497, -205140, -228583, -227929, -199344, -176006, -173149]
7258a73149n120q127j6137j3396N357J5106N657K933J8453K2859l11j9101n764
7245a70740J5555J0487j0728j6960o166K437K744m88o957j1842m146R739Q135
7232a78930p650j1116J736L866r393o998J7688K6504L369j3408J047J4812L122
7219a55351l672J5168J8646k2181n4793k3147L2348L4643o766k0067O441J7596
7207a61135l727j5064k49O514o251n838J6725K5481N142j3353j0898o866j1364
7194a80883o240J0526J5673R065J5423K7031Q064k9876k8140J8741L8570m844
7182a06890m7501k6726K0476K5368k629q867N505k922k9280k5377J0636K5594
7170a62613N46j8581R85K7690K1870k110o385Q335J0573p177j9125j0328K130
$$ y = [-173149, -178269, -186396, -202533, -215929, -210572, -195466, -189809, -186876, -168423, -145564, -145875, -164976, -170740, -155185, -144698, -155426, -172386, -178552, -176115, -173371, -173859, -180816, -192658, -196804, -187065, -178930, -186580, -197696, -195960, -192094, -201487, -208485, -190797, -164293, -160924, -174332, -173285, -158473, -155351, -159023, -143855, -125209, -147390, -202183, -225330, -192982, -158339, -165105, -185172, -178731, -161135, -164862, -179926, -180175, -173661, -179912, -185750, -169025, -143544, -138402, -151755, -162653, -169519, -180883, -187123, -176597, -160924, -151859, -136436, -109405, -101341, -131217, -159357, -140616, -102046, -106890, -154391, -181117, -160641, -135273, -137902, -146769, -141264, -144186, -173466, -198843, -188207, -162613, -162067, -180648, -179663, -151973, -130103, -132213, -138598, -130263, -119690, -126867, -145992, -156320, -154190]
7157a54190J746l1J1093J8891o94l0753k6322J5416L9303J1063k7440k1565J1300
7144a52183J4932j0333j2316J8627L1785N102j6871j398J7373L39l0143l0215
7132a65301k961J6430J5263M967o855j3335k214J8890J9499m768j4873R945L2224
7119i3089J5545j5488j9001k825J924Q59J5403L0523K0316J207K280P111j2849
7106d8084l1135m049M1684L8111j2328l6259p078J8240k22k5058j4118J3631K3728
7093d2937K1573K1808J1392j4855k4280M066L4580K3987j2096k4413k521J8926
7081A5230J5682P96j713J3307K8732K2101p423k8331j0970K7103L7552P768k1925
7068I7909j8229L650J5626J8218K2000J9000J750j3183q915L710O803N821J4800
$$ y = [-154190, -152444, -152475, -141382, -122491, -123185, -153938, -180260, -164844, -125541, -114478, -141918, -163483, -152183, -137251, -147584, -159900, -141273, -109488, -104386, -121257, -122655, -105282, -104943, -135086, -165301, -168262, -151832, -136569, -131602, -138457, -151792, -154006, -135116, -115617, -120385, -135258, -125313, -93089, -77544, -93032, -112033, -114858, -112934, -112075, -96672, -66149, -45833, -44626, -42346, -35235, -48084, -79219, -83268, -41584, -3473, -15801, -52060, -59138, -40898, -41120, -66178, -80296, -66665, -42937, -21364, 444, 11836, -3019, -27299, -23233, 11347, 35334, 23238, -1175, -3696, 15230, 30912, 31708, 29995, 43302, 72034, 94135, 86712, 58381, 47411, 74514, 112066, 119834, 97909, 79680, 83330, 98956, 117174, 139174, 158174, 159924, 146741, 137826, 141536, 148339, 154160, 168960]
7055A68960K7307K6282J1557j285k89J5828L6787M1012J6840j1346n140L2216
7043C58729N4009L5866Q677Q426K7688L9311L7212L0003K1252J6589K4570L6396
7031F98728L5547L5614O5457J06725J03114N2888K8033O7588J19088J31686J37595
7020A582063J78779K19071K07706J76182J85977K24050K38243K34154K38050K01013
7010C685288N6168j44411k67810k76195k53412k52116k35301j90090j73824k01821
7000A746476k03731j48896j09140j29730j40002p6515m548j6366p8513q9336m0740
6989G08959j2477l1673m4894k5699j4775l8877o5382n9721l3886j7579j9009k7608
6977C17379k9811j8477m058o900k3663k5214o730l261k7111l4992m23K8792L533
$$ y = [168960, 196267, 222549, 234106, 232821, 232532, 248360, 285147, 326159, 342999, 331653, 326513, 358729, 412738, 448604, 457281, 465707, 493395, 532706, 569918, 599921, 621173, 637762, 662332, 698728, 734275, 769889, 835346, 942071, 1045185, 1098073, 1126106, 1193694, 1312782, 1444468, 1582063, 1760842, 1979913, 2187619, 2363801, 2549778, 2773828, 3012071, 3246225, 3484275, 3685288, 3741456, 3597045, 3329235, 3053040, 2799628, 2547512, 2312211, 2122121, 1948297, 1746476, 1542745, 1393849, 1284709, 1154979, 1014977, 938462, 933914, 917548, 839035, 749699, 708959, 696482, 664809, 619915, 594216, 579441, 540564, 475182, 415461, 381575, 363996, 344987, 317379, 287568, 269091, 265033, 258133, 234470, 209256, 202526, 199265, 172154, 137162, 136739, 165531, 169064]
6964A69064l9142l2341J0829K3015n157k2881j5871j7933k8644r073L1050L0231
6952I3147j9811m9812k3096R101L47j7767l618J8593Q133j8026j8725J013P676
6939a2845q29k056N578O736J266k037o558j4612j3682o33M563o914j2948J82J0038
6924d4751k290j6944j0909K352J350n930n311n460j1216l348J9828K0921j4740
6911g6448l8752j2069K5214J7710j1803n767K4234K1173r962j0112K2867K4912
6899b8803j9815m5338j3197K5472J6849j5433k2793p561J440L379R172P982p966
6886i6612j6857k749J2785P960k447m11m15j5418k1639J266K5301J4082j7376
6873a12530k7333j0712N698J2138J5737Q815j6623l5515j6913K3407M0237K2089
$$ y = [169064, 129922, 97581, 108410, 131425, 126268, 103387, 87516, 69583, 40939, 31866, 62916, 93147, 73336, 23524, 428, 9529, 9876, -7891, -11509, 7084, 15217, -2809, -21534, -20521, -12845, -13674, -15730, -10152, -3416, -2150, -4187, -10745, -25357, -39039, -39672, -35109, -42023, -54971, -54789, -44751, -47041, -63985, -74894, -72542, -71192, -77122, -82433, -87893, -99109, -102457, -82629, -61708, -76448, -115200, -127269, -102055, -84345, -96148, -101915, -77681, -56508, -66470, -76582, -53715, -28803, -48618, -93956, -107153, -81681, -64832, -80265, -103058, -110619, -109179, -105800, -96628, -88646, -96612, -113469, -116218, -103433, -95473, -97920, -98331, -98746, -114164, -135803, -134537, -109236, -95154, -112530, -139863, -150575, -144877, -132739, -117002, -108187, -124810, -160325, -177238, -153831, -113594, -91505]
6861i1505l257j7657k4054j7115J0148L2924J6788k2486k9316J0987M6564L1139
6849e6840j6213m3755l0666J352J9300P862j8170k6297m977J7276J1905n953n939
6836a51115L121o636k1156k402L5974L7300m593k9792j0767M962j5801l0835j89
6823a91929L7783K9445n423j4001J283L244m945L286J2255j0079l9375k4974J8593
6810a84837K8457k353j8254k085K200j7463j3094K7903M3749J436l7023j1596
6798a82960L6552L3454r508k4067J32J0329j2062k5567n809J6070R515j0095j3131
6785a77147K285J8079K1206R338q596j3277L530J9638Q478j8744k6114o819R633
$$ y = [-91505, -94762, -112419, -136473, -153588, -143440, -110516, -93728, -116214, -145530, -134543, -87979, -56840, -73053, -116808, -147474, -146122, -126822, -118960, -137130, -163427, -168404, -151128, -139223, -145176, -151115, -147994, -154630, -175786, -178188, -142214, -104914, -109507, -139299, -150066, -145104, -160905, -191740, -191929, -154146, -124701, -130124, -144125, -142842, -139598, -144543, -141257, -129002, -139081, -178456, -203430, -184837, -156380, -158733, -176987, -179072, -176872, -194335, -207429, -179526, -135777, -134341, -171364, -182960, -146408, -112954, -122462, -146529, -146397, -136068, -148130, -173697, -179506, -163436, -153921, -164016, -177147, -174862, -156783, -135577, -126239, -134835, -148112, -144582, -124944, -116466, -135210, -161324, -168143, -158510]
$$ [...]
##END NTUPLES=NMR SPECTRUM
##END=
