##TITLE=1H ikalashn
EC-3335(1)
14.11.2024
##JCAMPDX= 6.0         $$ Bruker NMR JCAMP-DX V2.0
##DATA TYPE= NMR SPECTRUM
##DATA CLASS= NTUPLES
##ORIGIN= UXNMR, Bruker Analytische Messtechnik GmbH
##OWNER= root
$$ TOPSPIN		Version 1.3
$$ 2024-11-14 14:05:56.171 +0400  Irina@DPX200
$$ Compression mode = diff/dup
##.OBSERVE FREQUENCY= 200.131300845
##.OBSERVE NUCLEUS= ^1H
##.ACQUISITION MODE= SIMULTANEOUS
##.ACQUISITION SCHEME= undefined
##.AVERAGES= 16
##.DIGITISER RES= 18
##SPECTROMETER/DATA SYSTEM= spect
##.PULSE SEQUENCE= zg
##.SOLVENT NAME= CDCl3
##.SHIFT REFERENCE= INTERNAL, CDCl3, 1, 17.49637
##AUDIT TRAIL= $$ (NUMBER, WHEN, WHO, WHERE, WHAT)
$$ ##TITLE= Audit trail, TOPSPIN		Version 1.3
$$ ##JCAMPDX= 5.01
$$ ##ORIGIN= Bruker BioSpin GmbH
$$ ##OWNER= Irina
$$ $$ F:/spectra/data/iren/nmr/1H/4/pdata/1/auditp.txt
$$ ##AUDIT TRAIL=  $$ (NUMBER, WHEN, WHO, WHERE, VERSION, WHAT)
(   1,<2024-11-14 14:04:58.062 +0400>,<Irina>,<DPX200>,<TOPSPIN 1.3>,
      <created by zg
	started at 2024-11-14 14:03:50.343 +0400,
	POWCHK disabled, PULCHK disabled
       terminated by command 'halt'
       configuration hash MD5:
       BE 6D 3F 07 2A EA 11 49 91 17 2B D3 AF B3 58 0D
       data hash MD5: 16K
       3F 99 A3 A2 96 C0 6C B9 24 D5 12 38 2D 2C 98 8F>)
(   2,<2024-11-14 14:05:33.609 +0400>,<Irina>,<DPX200>,<TOPSPIN 1.3>,
      <Start of raw data processing
       fp BC_mod = 2 FT_mod = 6 PKNL = 1 PHC0 = 119.5545 PHC1 = 4.959261 SI = 32K 
       data hash MD5: 32K
       B2 76 38 90 78 96 41 45 4F 88 F1 BA 6E 2F 6E 78>)
(   3,<2024-11-14 14:05:48.359 +0400>,<Irina>,<DPX200>,<TOPSPIN 1.3>,
      <abs n ABSG = 5 
       data hash MD5: 32K
       EC 55 34 45 1E 30 E9 4F 09 1B E1 A7 9C F8 80 68>)
$$ ##END=
$$ 
$$ $$ hash MD5
$$ $$ 88 A5 89 6A DE 44 96 D3 74 5D 43 E7 DF 8F BC 11
##$RELAX= 
##$RELAX= 
##$RELAX= 
##$RELAX= 
##$RELAX= 
##$RELAX= 
##$RELAX= 
##$RELAX= 
##$RELAX= 
$$ Bruker specific parameters
$$ --------------------------
##$DU= <F:/spectra>
##$EXPNO= 4
##$NAME= <1H>
##$PROCNO= 1
##$TYPE= <nmr>
##$USER= <iren>
##$AMP= (0..31)
100 100 100 100 100 100 100 100 100 100 100 100 100 100 100 100 100 100 
100 100 100 100 100 100 100 100 100 100 100 100 100 100 
##$ANAVPT= -1
##$AQSEQ= 0
##$AQ_mod= 1
##$AUNM= <au_zg>
##$AUTOPOS= <>
##$BF1= 200.13
##$BF2= 200.13
##$BF3= 200.13
##$BF4= 200.13
##$BF5= 200.13
##$BF6= 200.13
##$BF7= 200.13
##$BF8= 200.13
##$BYTORDA= 1
##$CFDGTYP= 0
##$CFRGTYP= 5
##$CHEMSTR= <none>
##$CNST= (0..63)
1 1 145 1 1 1 1 1 1 1 1 1 1 1 1 1 1 1 1 1 1 1 1 1 1 1 1 1 1 1 1 1 1 1 
1 1 1 1 1 1 1 1 1 1 1 1 1 1 1 1 1 1 1 1 1 1 1 1 1 1 1 1 1 1 
##$CPDPRG= <>
##$CPDPRG1= <>
##$CPDPRG2= <>
##$CPDPRG3= <>
##$CPDPRG4= <mlev>
##$CPDPRG5= <mlev>
##$CPDPRG6= <mlev>
##$CPDPRG7= <mlev>
##$CPDPRG8= <mlev>
##$CPDPRGB= <>
##$CPDPRGT= <>
##$D= (0..63)
0 2 0 0 0 0 0 0 0 0.06 0 0.03 0 0 0 0 0.0002 0 0 0 0 0 0 0 0 0 0 0 0 0 
0 0 0 0 0 0 0 0 0 0 0 0 0 0 0 0 0 0 0 0 0 0 0 0 0 0 0 0 0 0 0 0 0 0 
##$DATE= 1731578695
##$DBL= (0..7)
120 120 120 120 120 120 120 120 
$$ [...]
##$SW_h= 4401.40845070422
##$TD= 16384
##$TD0= 1
##$TE= 300
##$TE2= 300
##$TE3= 300
##$TEG= 300
##$TL= (0..7)
0 120 120 120 120 120 120 120 
##$TP= (0..7)
150 150 150 150 150 150 150 150 
##$TP07= 0
##$TPNAME0= <>
##$TPNAME1= <>
##$TPNAME2= <>
##$TPNAME3= <>
##$TPNAME4= <>
##$TPNAME5= <>
##$TPNAME6= <>
##$TPNAME7= <>
##$TPOAL= (0..7)
0.5 0.5 0.5 0.5 0.5 0.5 0.5 0.5 
##$TPOFFS= (0..7)
0 0 0 0 0 0 0 0 
##$TUNHIN= 0
##$TUNHOUT= 0
##$TUNXOUT= 0
##$USERA1= <user>
##$USERA2= <user>
##$USERA3= <user>
##$USERA4= <user>
##$USERA5= <user>
##$V9= 5
##$VALIST= <valist>
##$VCLIST= <CCCCCCCCCCCCCCC>
##$VD= 0
##$VDLIST= <DDDDDDDDDDDDDDD>
##$VPLIST= <PPPPPPPPPPPPPPP>
##$VTLIST= <TTTTTTTTTTTTTTT>
##$WBST= 1024
##$WBSW= 25
##$XGAIN= (0..3)
0 0 0 0 
##$XL= 0
##$YL= 0
##$YMAX_a= 1432299
##$YMIN_a= -971066
##$ZGOPTNS= <>
##$ZL1= 120
##$ZL2= 120
##$ZL3= 120
##$ZL4= 120
##$ABSF1= 17.49637
##$ABSF2= -4.496376
##$ABSG= 5
##$ABSL= 3
##$ALPHA= 0
##$AQORDER= 0
##$ASSFAC= 0
##$ASSFACI= 0
##$ASSFACX= 0
##$ASSWID= 0
##$AUNMP= <proc_1d>
##$AXLEFT= 0
##$AXRIGHT= 0
##$AXTYPE= 0
##$AXUNIT= <>
##$AZFE= 0.1
##$AZFW= 0.1
##$BCFW= 0
##$BC_mod= 2
##$BYTORDP= 0
##$COROFFS= 0
##$CY= 7568.61572265625
##$DATMOD= 1
##$DC= 0
##$DFILT= <>
##$DTYPP= 0
##$F1P= 17.9538593292236
##$F2P= -4.03888763876832
##$FCOR= 0.5
##$FTSIZE= 32768
##$FT_mod= 6
##$GAMMA= 0
##$GB= 0
##$INTBC= 0
##$INTSCL= 1.367314e-010
##$ISEN= 128
##$LB= 0
##$LEV0= 0
##$LPBIN= 0
##$MAXI= 945.577
##$MC2= 0
##$MEAN= 0
##$ME_mod= 0
##$MI= -402.1523
##$NCOEF= 0
##$NC_proc= -5
##$NLEV= 6
##$NOISF1= 8.587773
##$NOISF2= 6.764455
##$NSP= 0
##$NTH_PI= 0
##$NZP= 0
##$OFFSET= 17.49637
##$PC= 1
##$PHC0= 119.5545
##$PHC1= 4.959261
##$PH_mod= 1
##$PKNL= yes
##$PPARMOD= 0
##$PPDIAG= 0
##$PPIPTYP= 0
##$PPMPNUM= 100
##$PPRESOL= 1
##$PSCAL= 0
##$PSIGN= 0
##$REVERSE= no
##$SF= 200.13
##$SI= 32768
##$SIGF1= 16.12182
##$SIGF2= -4.496377
##$SINO= 3.521527
##$SIOLD= 32768
##$SREGLST= <1H.CDCl3>
##$SSB= 0
##$STSI= 32768
##$STSR= 0
##$SW_p= 4401.40845070422
##$SYMM= 0
##$S_DEV= 0
##$TDeff= 16384
##$TDoff= 0
##$TI= <>
##$TILT= no
##$TM1= 0
##$TM2= 0
##$TOPLEV= 0
##$USERP1= <user>
##$USERP2= <user>
##$USERP3= <user>
##$USERP4= <user>
##$USERP5= <user>
##$WDW= 0
##$XDIM= 32768
##$YMAX_p= 301268874
##$YMIN_p= -633982
$$ End of Bruker specific parameters
$$ ---------------------------------
##NTUPLES= NMR SPECTRUM
##VAR_NAME=  FREQUENCY,     SPECTRUM/REAL,   SPECTRUM/IMAG
##SYMBOL=    X,             R,               I
##VAR_TYPE=  INDEPENDENT,   DEPENDENT,       DEPENDENT
##VAR_FORM=  AFFN,          ASDF,            ASDF
##VAR_DIM=   32768,         32768,           32768
##UNITS=     HZ,            ARBITRARY UNITS, ARBITRARY UNITS
##FACTOR=    0.134324425510551, 1,           1
##FIRST=     4401.40845070422, 121128,       -523914
##LAST=      0,             -57212,          -710087
##MIN=       0,             -633982,         0
##MAX=       4401.40845070422, 301268874,    0
$$ Real data points
##PAGE= N=1
##DATA TABLE= (X++(R..R)), XYDATA
$$ [...]
20862a15442R366L4815P9796Q1772K0522n5822q2459m3348K1081N7122L5477l2927
20850I953r2274p7246O832O5355K9991l6214k4483N4291Q9035M3241o543j6453
20838D5485l1049o0877l7574M9922R7665L8444n6835r8251q8000m7782L8172J27856
20826b2824J05112l9666j42324q9442J8307M2674R291J591k269l6303l4488K6964
20814a63377K8779p2096r7092O2537J94256P7892j22266j07616N7179P6094n0677
20803a16387n4854Q6487J13818j8747o4481L0345K4930j16501j04933J14646J78612
20792G2935o1096k09308J0826K33018M7317k71283j94516J78687K88582J6715
20782A11877j95559j08953J9022j5181m5458N7913J14525r737j28817n5546Q6657
$$ y = [-115442, -106076, -71261, 8535, 90307, 110829, 55007, -27452, -70800, -49719, 7403, 42880, 9953, -82321, -159567, -152735, -87380, -57389, -93603, -118086, -63795, 25240, 68481, 61938, 45485, 14436, -46441, -84015, -34093, 63572, 102016, 45181, -53070, -141070, -188852, -150680, -22824, 82288, 42622, -99702, -189144, -170837, -128163, -118872, -117281, -119550, -155853, -190341, -163377, -134598, -206694, -303786, -241249, -46993, 30899, -91367, -198983, -141804, -65710, -116387, -171241, -84754, 29064, 10317, -54164, -23819, 1111, -115390, -220323, -105677, 72935, 11839, -197469, -186643, 46375, 93692, -177591, -372107, -193420, 95162, 111877, -83682, -192635, -173613, -188794, -234252, -176339, -61814, -71551, -200368, -255914, -169257]
20771a69257R7817J6582j4827q953m4545o9170P061J19977J25178L228j29294
20760f6203j63051p7389N7840J19415M9369m7443k8841O6592P3639k8031q2341
20749a26444k3255L2271J3602P353N5790N3789m3698j07246m7440L8482N4156
20738i2640N2917P6177M0752p1511j14735k8819K1119o4749j13488J6622J47469
20727a30886P0019p7979m3783R3156O7133r0395j02566O0521J33376J9832o8436
20716g0008q053N1698Q467j4788M8458M7975q9914j75249n6776J14544J28087
20705a5559K7672j9176J811O385k523M932k2657q5032m3701J31384J98567j7679
20693A64424k74907k10878R8274K27491L6505j47289n8758J27777J22228m2710
$$ y = [-169257, -71440, -54858, -69685, -78638, -123183, -192353, -185292, -65315, 59863, 63091, -66203, -229254, -306643, -248803, -129388, -80019, -127462, -156303, -89711, -16072, -44103, -126444, -149699, -117428, -103826, -96473, -40683, 13106, -30592, -137838, -185278, -146796, -92640, -39723, 36454, 77206, 5695, -109040, -137859, -116740, -181489, -294977, -278355, -130886, -60867, -138846, -182629, -89473, -22340, -112735, -215301, -154780, -21404, -1572, -70008, -78061, -26363, -17896, -32684, 15774, 63749, -26165, -201414, -258190, -143646, -15559, 12113, -7063, -5252, 1133, -1390, 3542, -19115, -104147, -147848, -16464, 182103, 164424, -110483, -321361, -223087, 4404, 40909, -106380, -165138, -37361, 84867, 42157]
20683D2157j23279m9298L3880K7689j4106j9113J2287M7233N1640n776r9529j25220
20671b21435j8269J28298J54948L5153r8760j26343n7432K3716N6498L0149k3125
20660a16602m0738J1285P7758O8458j3822o5373k7430L2332L1637j934Q274N3036
20648A6881N5144M7m6224m9142m1571l2971J5772Q6201P4718n0345j49613q0939
20636b02042Q5189J44162L5250q8168q5518k899L5212O646j7753K017M4599Q0780
20624C7475Q3526J8270r9788j63754p9191Q9812J65520P2366o7446r8413k7888
20613f9511J3614k8031o5860k2662M2911K9920l9099m7188K8904P3604J8429l7295
20601a02264J5058J02038P2808n0915r3961k091P2575J5819p6865o9751N260L6631
$$ y = [42157, -81122, -130420, -96540, -68851, -82957, -102070, -89783, -42550, 9090, 3314, -96215, -221435, -239704, -111406, 43542, 78695, -20065, -146408, -203840, -180124, -123626, -93477, -116602, -157340, -146055, -68297, 161, -13661, -79034, -106464, -74132, -42495, -44429, -36155, 16881, 72025, 72072, 25848, -23294, -64865, -97836, -82064, 4137, 78855, 28510, -121103, -202042, -116853, 27309, 62559, -25609, -111127, -114026, -78814, -72168, -89921, -87904, -43305, 37475, 121001, 139271, 39483, -124271, -203462, -113650, 51870, 124236, 56790, -41623, -69511, -55897, -83928, -149788, -172450, -129539, -99619, -138718, -185906, -157002, -83398, -64969, -102264, -87206, 14832, 87640, 36725, -57236, -59327, 13248, 29067, -47798, -117549, -112289, -75658]
20589g5658K4247L6850N3863P952n8463m0617M0843N7894j3107n4730j3192J4241
20577a9877m3006j01964o4929K3339N7742L4965L1965O8847Q4355L1362o3435
20566C9364j26172r7457N479Q3030O2493Q369L3595R8878M0583j50517k42945
20555b45300q0748J54262J76247l02j02074r488R8829N2676o4134p7647J4693
20544h2986P5533L6928m0160p7608o1507k5530q514k0022k5986O897N0221M7760
20532a24974J0182Q65J9941K162m3805j7382R0395J27237L239j31420q3219R0348
20520e6431J57864M6376q5262j03846n2312j0617K1178L9082o231q3172o1236
20509a94607P5688J42903J9920j30442q8495P6596J09243k8116r9464K1762J49832
$$ y = [-75658, -51411, -14561, 39302, 47254, -11209, -51826, -10983, 46911, 33804, -20926, -34118, -19877, -62883, -164847, -229776, -206437, -148695, -113730, -81765, -12918, 71437, 102799, 39364, -86808, -184265, -178786, -95756, -33263, -24894, 8701, 107579, 148162, -2355, -245300, -326048, -171786, 4461, 4159, -97915, -107403, -8574, 44102, -20032, -97679, -82986, -7453, 29475, -10685, -88293, -149800, -175330, -183844, -203866, -229852, -222955, -172734, -124974, -114792, -113927, -93986, -91824, -135629, -153011, -62616, 64621, 67860, -63560, -146779, -56431, 101433, 147809, 62547, -41299, -93611, -104228, -83050, -43968, -50199, -133371, -194607, -118919, 23984, 43904, -86538, -175033, -98437, 10806, -17310, -116774, -95012, 54820]
20498E4820P9023j04493j62233m1928Q9764R9674K3816l8343m4796j2057K1870
20487c4883K1088j0390k3090K068Q840m0360p3426o524J01012J07225m282r8778
20475e1500q6002j8431L3142P0444Q2766R260j25651j65873l3873J16435J00914
20464f8369k3174n6038K7497N8352k9185q7088o115J01116Q2906k0161o1824j7280
20452i9363J8212O179K693L5494O2709N7732L7848M886m9974p9561k2621O9331
20440D3565N9407p3068j66715r3691N1066Q7732J4669r567O6801R8901k0262j68769
20428a09931j56158L84J01666N2831k0427J4421R4464P4886l4146p9600k061P0382
20416F711J0655j18523j42392o61J73494J99600M0234j56876k00411n2937J20966
$$ y = [54820, 133843, 29350, -132883, -174811, -85047, 14627, 38443, 100, -44696, -56753, -34883, -13795, -24185, -47275, -45207, -36367, -76727, -150153, -156677, -55665, 51560, 47278, -51500, -137502, -155933, -122791, -52347, 30419, 39679, -85972, -251845, -285718, -169283, -68369, -91543, -147581, -120084, -61732, -90917, -178005, -184120, -83004, -98, -20259, -82083, -99363, -81151, -74972, -72279, -36785, 25924, 83656, 121504, 126390, 76416, -3145, -25766, 43565, 102972, 29904, -136811, -230502, -179436, -91704, -77035, -86602, -19801, 79100, 58838, -109931, -266089, -265705, -164039, -111208, -131635, -117214, -22750, 52136, 17990, -61610, -63671, 6711, 17366, -101157, -243549, -244210, -70716, 128884, 169118, 12242, -188169, -241106, -120140]
20405a20140J39875K3364m8872L221N5290j0086j06515p9637M0063P8137j5275
20394d0575r9682o7330J8109N9985P1969R8502R9281J9690r0134j28644p7447
20383a36276j072N2536P4836N3061j4465p5893p1212j4315K6379J9894l514q988
20371i9029N271J6646o34l8829l4025N7533J45011P0136j51918k78251j36065
20360d44154J27317K34843J36457P968l9270m5706l0879M3690J18681N9764j07260
20349F1451j81494q0307M0425M4739N628K6587N7716K5044j9206j6819k0936n4508
20337a11680j9250R6862J08293o9335j96620m6847J94111J76259p4115k06126
20327a48448q8421N3178N4292J9308M1673L9291k4153l8331K0909K4907l6982
$$ y = [-120140, 19735, 43099, -5773, -2552, 52738, 42652, -63863, -143500, -103437, -25300, -40575, -140257, -207587, -189478, -129493, -57524, 40978, 140259, 159949, 69815, -58829, -136276, -137348, -84812, -9976, 43085, 28620, -47273, -118485, -132800, -106421, -86527, -90041, -99029, -93758, -77112, -77746, -116575, -150600, -93067, 51944, 122080, -29838, -308089, -444154, -316837, -81994, 54463, 62431, 23161, -22545, -53424, -9734, 108947, 168711, 61451, -120043, -200350, -159925, -115186, -109558, -82971, -25255, -211, -19417, -36236, -57172, -111680, -130930, -34068, 74225, 4890, -191730, -238577, -44466, 131793, 57678, -148448, -236869, -183691, -129399, -110091, -68418, -29127, -53280, -91611, -70702, -45795, -82777]
20316h2777l034J27012J17067q3814j75578Q791J78007M3824j84817j44067P9850
20305a19536J20224m2645q6432P0055J46018N562j30111q7337L026o95j1411O1880
20293g1402J12309M0848n0247m3590k090j6132k7028L2963P8586J6133p9992r0898
20281a00540l7260Q03K9332O7186M9214m8767j03778k1259Q7378O4214m9780r1522
20269a54779k0825O6653J01406P1145l2356j53578j49183J9620J63361J06227
20259A7691m3060n9938M5961Q2050J1606j9152K4156Q745r4415j34713m5248L9022
20247a67295J3379l9265j6571M5604P4863P3312M9413j8271q5808o3281J5952
20236a17968J5921n7362l6298J01743J41931j7024j52154n2260J38088J49590
$$ y = [-82777, -85811, 41201, 158268, 74454, -101124, -92333, 85674, 129498, -55319, -199386, -119536, 688, -41957, -128389, -58334, 87684, 93246, -36865, -124202, -121176, -121871, -133282, -71402, 40907, 81755, 31508, -12082, -14172, -30304, -57332, -24369, 54217, 70350, -9642, -100540, -137800, -136997, -107665, -40479, 8735, -40032, -143810, -165069, -77691, -13477, -63257, -154779, -175604, -108951, -7545, 63600, 31244, -122334, -271517, -251897, -88536, 17691, -25369, -85307, -39346, 42704, 54310, 35158, 59314, 68059, -26356, -161069, -206317, -167295, -153916, -193181, -209752, -164148, -89285, -15973, 33440, 15169, -70639, -133920, -117968, -102047, -159409, -195707, -93964, 47967, 30943, -121211, -173471, -35383, 114207]
20226A14207K829p4486l0912r342m4407k5423M9524M8118m2271p5054j735N5217
20214c3735M0420N1472J07892O1545j34651k69871j58189P1631J54397N2368m7748
20203a04469l6748J0847J7935J4085K9282J9733l6571o8433j0256Q4896J02455
20192B2756J4445q5066r2441n991Q4462R6905L0939m5810o6042j9472M0956M7944
20180B3585p989n9197m1717J2570J6962l2938m1736L0789Q8225M6330k3703j5858
20168d677J8899l9684j37341q6239J19770K31804Q8372j36465j73971k6938Q0065
20157f6405M3131k0304j563M9298M8542J2508p251k2812o1112q2461l3723M9960
20145i2192P5991K1601l5076k5465K0835L2093L877j894L7378O1026J6082n6846
$$ y = [114207, 117036, 42550, 11638, 2296, -42111, -67534, -18010, 30108, -12163, -87217, -88952, -33735, 6685, 58157, 166049, 227594, 92943, -176928, -335117, -263486, -109089, -56721, -104469, -141217, -130370, -112435, -98350, -69068, -49335, -85906, -154339, -164595, -79699, 22756, 37201, -47865, -140306, -146297, -61835, 35070, 66009, 20199, -45843, -65315, -24359, 23585, 15596, -43601, -85318, -72748, -55786, -88724, -130460, -99671, -11446, 34884, 11181, -4677, 14222, -25462, -162803, -249042, -129272, 102532, 190904, 54439, -119532, -146470, -66405, -23274, -43578, -45141, 4157, 52699, 65207, 57956, 35144, -25968, -108429, -142152, -92192, -16201, 5400, -29676, -55141, -34306, -2213, 1664, -230, 37148, 98174, 114256, 57410]
20133E7410p9748m6009j1315Q65J1985J9981J434k0332j160K6043j2478q2257
20121a35581o0440N3281R8311Q408n7055K8894J27516N2036j05716j11610J8233
20110h3723M2489q8229j34201L2232K00870J50217k1883q4961k4103J0606j5579
20099a6265j3734K2606J3698l0458k0346L2116J9564o1226q4015l163O4387K5446
20087e1390n0009m8926K2325O9772M3369j9463m3749R736Q5614P0911m5587j05537
20075f2934O645J39395N3933j82352k30955J6060K32149J22922j35017j73176
20065b13330J8039J27175L2127o0094m389O4902J2583o0795j7276P8442Q9339
20054F6723L2829P025J522m7837r8243o2779K1819M8439J8823J7630M2544J7748
$$ y = [57410, -22338, -68347, -79662, -78797, -66812, -46831, -45397, -65729, -66889, -40846, -53324, -135581, -196021, -142740, -44429, -36021, -93076, -64182, 63334, 115370, 9654, -101956, -83723, -41234, -129463, -263664, -231432, -30562, 119655, 97772, 12811, -11292, -686, -16265, -29999, -7393, 6305, -24153, -44499, -12383, 7181, -54045, -138060, -141223, -76836, -51390, -101399, -150325, -128000, -58228, -14859, -34322, -78071, -68335, 17279, 88190, 42603, -62934, -56289, 83106, 137039, -45313, -276268, -260208, -28059, 94863, -40154, -213330, -195291, -68116, -35989, -96083, -100472, -35570, -22987, -83782, -101058, -22616, 66723, 99552, 106577, 108099, 60262, -37981, -100760, -78941, -30502, -11679, 5951, 48495, 66243]
20042F6243m3491n0625n610n25l9892l2852J8557N878o6603m5229J04737J89019
20030I9607P5089q2780q1799J4575J0549q2770q5374K5660P9829J0122n0135j5268
20018h2695K5455O105O938P2511R3203K827p2927k6200K5761o1180j74909r9646
20006b84757J13746J87880L4176j18454p5841N7237Q0332n435n0956j045O3308
19995A91O7611J1170p2368j30144r9632J7040J18916J14302L0117m1868n8528
19984d3193k6895M0796R6526N4430p9835j48994m1321J12469R7247o6283j42543
19973a47596k8560J11814J13967L0510j0141n103j5794l0711j7841j2503l0679
19962d2637Q74R4741R9589p6307k39484j37675J38102K35381M0170j65540j28109
$$ y = [66243, 22752, -27873, -33483, -34008, -73900, -106752, -88195, -82317, -148920, -194149, -89412, 99607, 174696, 91916, 10117, 24692, 35241, -47529, -132903, -107243, -27414, -17292, -67427, -82695, -57240, -51135, -44197, 28314, 121517, 124344, 51417, 25217, 50978, -10202, -185111, -284757, -171011, 16869, 51045, -67409, -143250, -86013, -5681, -11116, -62072, -63117, 191, 67802, 78972, 6604, -123540, -223172, -206132, -87216, 27086, 57203, 15335, -43193, -70088, -29292, 67234, 121664, 41829, -107165, -148486, -36017, 61230, -5053, -147596, -176156, -64342, 49625, 80135, 69994, 64891, 49097, 18386, 545, -11958, -42637, -41763, 52978, 152567, 76260, -163224, -300899, -162797, 72584, 112754, -52786, -180895]
19951a80895L9778R2390J9377j8970J2665J5972k2035j4648L4289J7199p5762
19940h0640j06983J29J30942J31586O557j03886r3024J3711R8213O6543m7398
19929A5750j05105l1741P3792P3479o212k7704K0923P512r6045j31402j3758R6906
19917a23605L6561q6843n4187J12962J83247P3190n0048n2698r747k1078m1716
19906c3962r904J2375l5165p1037q237P3125N4502o074K3581R3539L8142j15565
19894A5320j45706R110J27029M5596q4521n4257O8355P2477l9231p1808K6685
19883c0951R2205K8478n3288m5421r308l0259n5999j593Q9156J08264M1071m1412
19871I0943r0274r2724l8359M3186P0178J9279j6049L2060Q0485K7059o4210n7325
$$ y = [-180895, -141117, -48727, -29350, -48320, -35655, -19683, -41718, -56366, -22077, -4878, -80640, -187623, -187494, -56552, 75034, 81591, -22295, -115319, -101608, -3395, 63148, 15750, -89355, -121096, -47304, 26175, 19963, -7741, 13182, 20694, -75351, -206753, -220511, -123605, -87044, -173887, -228074, -115112, 68135, 141325, 91277, 38579, 28832, 7754, -33962, -43866, -31491, -66656, -137693, -145930, -72805, -18303, -24377, -796, 92743, 130885, 15320, -130386, -121276, 5753, 51349, -33172, -87429, -19074, 53403, 14172, -57636, -30951, 61254, 89732, 36444, -8977, -18285, -48544, -104543, -106136, -16980, 91284, 132355, 90943, 669, -92055, -130414, -87228, -17050, 2229, -13820, 18240, 98725, 125784, 61574, 4249]
19859D249K3631K6816p1574j18506k4673J02880J29106O1440j5681o2043o5198
19848i553o820P5636Q4421k545p4371m3259K6457L1322j1335j7561J6243K8675
19836I7310Q169q655j5189k1298m685L5562L0582n1465j08396l8142P9630Q2745
19824H6168k2169p1562n965N5431L2755K074K4604K5117n0377r7068j4701R4123
19812E8430N5417r8250j52486j6409J51151J69728O7209n436n806k4722r7185
19801A01641j18976j5292J00398N9578r7586j43070J2567J69063J24444k0808
19791A71959l0287Q4674Q9355p2110j63378l5187J21404P1250r6362j15643M4434
19780G0109J51926O8271p9011j11292k1917P2321Q6761K0835o5246q7488j3745
$$ y = [4249, 27880, 54696, -16878, -135384, -160057, -57177, 71929, 133369, 117688, 55645, -9553, -16373, 59263, 143684, 141139, 66768, 23509, 49966, 81288, 69953, 52392, 68635, 97310, 105479, 96824, 81635, 60337, 55652, 91214, 121796, 70331, -38065, -76207, 3423, 86168, 63999, -7563, -13528, 41903, 74658, 76732, 101336, 126453, 76076, -20992, -35693, 58430, 113847, 15597, -136889, -153298, -2147, 167581, 234790, 229354, 223548, 198826, 101641, -17335, -32627, 67771, 127349, 29763, -113307, -100740, 68323, 192767, 171959, 141672, 226346, 315701, 243591, 80213, 45026, 166430, 237680, 141318, 25675, 70109, 222035, 290306, 211295, 100003, 78086, 150407, 237168, 258003, 192757, 105269, 91524]
19769I1524P9597Q5685M585o4571o6096m3097m2369m3644p717O1553J19386J08101
19757B82937O61j37164j69916n1624Q4646R1453R814j5253K9498L7037k087J0493
19745A70495O5445L4200p9512j00555J6463P5813l3564j26672k8872J11292O5226
19734A69759q1550p3957P5123J14234j2744q8707j0415O0949K0446p094N3351
19723B19395N3663q6177j64761j6543J63338R8823j07490j18921R7929K21196
19713C60452Q2364r8222r1863N558k187p5628n4471L4607L2234n6711o3429M3700
19701A16404Q3208m4885j75171j12068P6577J53515M2549q7322p4129K9716O1619
19690G0013k0114r6689o2504L8819Q4706L8319j5762l545L3553J5428l8714l6615
$$ y = [91524, 171121, 256806, 261391, 196820, 130724, 87627, 45258, 1614, -6103, 55450, 174836, 282937, 283598, 146434, -23482, -75106, 9540, 100993, 110807, 95554, 125052, 162089, 160002, 170495, 235940, 270140, 190628, 90073, 106536, 182349, 148785, 22113, -6759, 104533, 169759, 88209, 14252, 89375, 203609, 190865, 102158, 91743, 152692, 173138, 166044, 219395, 273058, 186881, 22120, 5577, 168915, 267738, 160248, 41327, 139256, 360452, 442816, 344594, 252731, 258289, 256102, 180474, 126003, 160610, 192844, 136133, 72704, 116404, 199612, 154727, -20444, -132512, -55935, 97580, 140129, 52807, -21322, 8394, 70013, 49899, -46790, -109294, -70475, 14231, 52550, 36788, 33243, 66796, 82224, 43510, 6895]
19678F895K7191M4664k9295q0533q930Q9247N1572q3827j11853K8354J51036R9835
19666A84356l1738o7186n223L1450J0274r366k5351p1826q4896K4919J68694J44921
19654B69028m8837j64113m8910J28850J32636j4501j12130q5116k4937Q319M0796
19643H1085O0512J2331o5377n3173N9097J28053O1022m9704o9711o793L2515N909
19631A95766l3806l8863k1965j6605k8259k8333J4548Q2100R4192o55j22411j24808
19619b9099P290J10554N4624p5351r9723M501Q9441O0496p822j5460R203k0400
19607H8254q5330p2330M9343J52940J08781l7185j16138n7012L3168L9776J101
19596A05368J7339O7638M4492n0117q6678j3480N9257M2162m37O032O39p8302
$$ y = [6895, 34086, 78750, 49455, -31078, -40008, 49239, 100811, 16984, -94869, -66515, 84521, 184356, 152618, 85432, 80209, 111659, 121933, 112567, 87216, 15390, -69506, -44587, 124107, 269028, 220191, 56078, 7168, 136018, 268654, 254153, 142023, 56907, 31970, 40289, 81085, 141597, 153928, 88551, 35378, 94475, 222528, 283550, 233846, 164135, 157342, 189857, 195766, 161960, 123097, 101132, 84527, 56268, 27935, 42483, 124583, 218775, 218120, 95709, -29099, -21809, 88745, 143369, 68018, -31705, -27204, 62237, 122733, 114911, 99451, 108654, 88254, 2924, -69406, -20063, 132877, 241658, 204473, 88335, 31323, 64491, 104267, 105368, 122707, 190345, 234837, 184720, 98042, 84562, 143819, 185981, 185544, 191576, 192215, 113913]
19584A13913j24131j1116J54862J47571l0960j35603n0750M7240k87p3922L309
19573D0126J45073J25348n5213j59354o9287N6861M3773n6108p8699O593Q9017
19562H8130R4463N7233K8897R713j2576k2697r437L044q062j9772L389M1752L7056
19549B91133j3395l7498L52L0291j0630n3368K174R1362M6422j22201j83182j6632
19537B4828J75325J46190l4723j02636N23Q0479L2817j5499L6478Q8881L5673
19526D68336m6546m3325M180r15k8396N623O4063M6836k8564n5083j2582K2293
19514C95920J9377J6581J7657j620l304O0191J18261N8997o6561q6116K2385Q2962
19502F34730R026m7936M5669J66145J20012m1357r5315Q595P9733j4781j52391
$$ y = [113913, -10218, -21334, 133528, 281099, 250139, 114536, 63786, 111026, 110739, 36817, 40126, 185199, 310547, 255334, 95980, 26693, 83554, 127327, 71219, -7480, -887, 88130, 182593, 239826, 268723, 278436, 265860, 243163, 233726, 236770, 228708, 208936, 212325, 254077, 291133, 277738, 240240, 240592, 270883, 260253, 206885, 209059, 300421, 346843, 224642, 41460, 24828, 200153, 346343, 311620, 208984, 209507, 289986, 322803, 307304, 343782, 432663, 468336, 421790, 378465, 382645, 381730, 353334, 358957, 423020, 469856, 441292, 386209, 373627, 395920, 415297, 431878, 449535, 447915, 444611, 504802, 623063, 682060, 615499, 529383, 551768, 634730, 643756, 595820, 641489, 807634, 927646, 886289, 790974, 799569, 879302, 864521, 712130]
19491G12130j36022L6225J79439J52858K708j17036j12543k4951L7516J7972m6464
19480G01832q5613p0159j9643K9353M2462M297n6264p9326l7884L1412P8620Q8965
19468F28052O1216j1052r3913j03008q733Q8322P3671j2306k3304P3441J37898
19457H10284N6625r6643j66103j05495J1112J09334J55103J19182R042p6683l6508
19446G89250P6283R4153k5724j14741k7281J33404J51023P419r3932k4177R7909
19435A063586R2577l4282j25890q8398K3804J00588P8587k1307j01243p0044K8919
19424I46897L8830q9783j87250r3428Q3591J09221k4899j01054l1494K2726m0470
19413F32887p6227M0009J61151R3280p1303q7759N0621J07645j6258j38085q6539
$$ y = [712130, 576108, 612333, 791772, 944630, 947338, 830302, 717759, 692808, 730324, 748296, 701832, 616219, 546060, 526417, 555770, 598232, 602529, 546265, 466939, 429055, 460467, 539087, 628052, 689268, 678216, 584303, 481295, 472562, 560884, 634555, 622249, 598945, 672386, 810284, 866909, 770266, 604163, 498668, 509780, 619114, 774217, 893399, 902441, 825758, 789250, 865533, 959686, 933962, 819221, 791940, 925344, 1076367, 1083786, 989854, 965677, 1063586, 1156163, 1121881, 995991, 907593, 931397, 1031985, 1110572, 1089265, 988022, 917978, 946897, 985727, 895944, 708694, 615266, 698857, 808078, 783179, 682125, 650631, 673357, 632887, 556660, 596669, 757820, 851100, 779797, 692038, 742659, 850304, 834046, 695961, 609422]
19402F09422N1712Q6288n963q3137m7463M7754Q8886M1560j8875j1700L7387L7999
19390H33870j5465l0598J4339J6085n7217o1572Q5410K01958Q6153j42288j96299
19379G34376n1715O0522O0232Q8812J50891N2849j87013k36186L8389K88125J89223
19368A188505n8767p5674R6147J27132j8465o8143N1082J14590L4324m16J00385
19357A490700J62679Q3624J7109P6474J36779R9445Q5472J73063J96725L8178
19347B560248j09110l5294J12634N6876j46585k02792p0742j4052j42530k36275
19337A772378j28120K3399P407j09974j30050n0833l4496j12733j35409k5264
19327A076305Q5964M4580j07766j91208j14439L5599J20793R8281J9000o0752
$$ y = [609422, 661134, 747422, 741459, 658322, 610859, 658613, 747499, 789059, 770184, 758484, 795871, 833870, 818405, 787807, 802146, 818231, 761014, 699442, 784852, 986810, 1072963, 930675, 734376, 682661, 743183, 803415, 892227, 1043118, 1095967, 908954, 672768, 711157, 999282, 1188505, 1129738, 1054064, 1150211, 1277343, 1258878, 1190735, 1241817, 1356407, 1390731, 1390315, 1490700, 1653379, 1737003, 1754112, 1830586, 1967365, 2066810, 2152282, 2325345, 2522070, 2560248, 2451138, 2415844, 2528478, 2585354, 2438769, 2235977, 2165235, 2151183, 2008653, 1772378, 1644258, 1667657, 1675064, 1565090, 1435040, 1384207, 1349711, 1236978, 1101569, 1076305, 1162269, 1206849, 1099083, 907875, 793436, 829035, 949828, 1048109, 1067109, 1006357]
19317A006357j11145j03303k7733N4958N4745k4543o8963j1025O2386L6899m5887
19306H22746m4363N5116R6776j0035j29546p8410R6871J58443K398j83746j65190
19295F21060K8338J57514J05831P189N624L8261k6099j37728j26716J9110J17031
19284H09415O1426l0546k1637L7929K1984n4708p2070n235M8507L2071j375L350
19272H29111K0289J361m3870o3073k6334M1439Q2294O4295K2842J5773L5011J8277
19260I97415l6451m8162J3757O2025K6552k9958k2649J2298j315l0302j23M6659
19248I89746J4415o1644o0872J3406M3309J1024J8223P4176O3301k8754o0746
19237A015584J3397M3948n0141j16558k7628P8509J7947j20309j12063L6171J10384
$$ y = [1006357, 895212, 791909, 764176, 819134, 873879, 849336, 780373, 769348, 831734, 868633, 822746, 778383, 833499, 930275, 920240, 790694, 712284, 809155, 967598, 969996, 786250, 621060, 649398, 806912, 912743, 919932, 925556, 963817, 937718, 799990, 673274, 692384, 809415, 870841, 840295, 818658, 856587, 878571, 823863, 751793, 746558, 795065, 827136, 825761, 829111, 849400, 850761, 806891, 743818, 717484, 758923, 841217, 905512, 928354, 944127, 979138, 997415, 960964, 912802, 926559, 988584, 1015136, 985178, 962529, 974827, 973512, 943210, 943087, 989746, 1004161, 942517, 881645, 895051, 938360, 949384, 967607, 1041783, 1105084, 1076330, 1015584, 1028981, 1072929, 1022788, 906230, 878602, 957111, 975058, 854749, 742686, 778857, 889241]
19226H89241M2619r967M0887P8382J3039n0075N394J03718R4098j7835q7182l9755
19214A062564M4126N4789j2349o9171m9417J4826M1946J6855J2303O7489J06137
19203A290098M6616n4883p4820j1916J7151k3284l1014M5528R5955J7576j05933
19192A211074j14751k160Q8583P1640O860k3000j7601r234P471M2319O0747K7330
19180A349278l0710n7193m7395l9528l2681J7313R8467J13840J5220r0729o6784
19169A229098M9487Q4550j3476q9972j9581J00674J05253O987n4223m4195m9478
19158A305124q3096m8863P5905J73440J49506M4161n9433j18444r3363L2527J51306
19147A528770J02433q2494j67424m2100J02686O7337n2308m2707P5195J03293
$$ y = [889241, 931860, 921893, 962780, 1041162, 1054201, 1004126, 1009520, 1113238, 1207336, 1189501, 1102319, 1062564, 1106690, 1161479, 1149130, 1079959, 1030542, 1045368, 1087314, 1104169, 1116472, 1183961, 1290098, 1336714, 1281831, 1207011, 1195095, 1212246, 1188962, 1157948, 1203476, 1299431, 1317007, 1211074, 1096323, 1094163, 1182746, 1254386, 1261246, 1238246, 1220645, 1211411, 1218882, 1261201, 1321948, 1349278, 1318568, 1261375, 1213980, 1174452, 1141771, 1159084, 1257551, 1371391, 1386611, 1295882, 1229098, 1278585, 1363135, 1349659, 1259687, 1240106, 1340780, 1446033, 1453020, 1398797, 1354602, 1305124, 1222028, 1173165, 1249070, 1422510, 1572016, 1616177, 1556744, 1438300, 1344937, 1377464, 1528770, 1631203, 1548709, 1381285, 1339185, 1441871, 1509208, 1456900, 1414193, 1489388, 1592681]
19137A592681M766n5560M660Q1348Q3855M4743j043o8345j16891o4938N1548R7265
19125A654089N0122K2143L8133k24p7701l4235J27983J61756l5870j97847p8480
19114A629869J46755J58679m45l7717P9155R5795n9506j51598m9729P2135O2243
19103A945636J8548M1458L6139n3007o1727J13465K63869J55612r0460j74683
19093B194850n8530M6089M8242N3359R6762Q1269J607j9285L6679L9858m1231
19082B479669o9270J2140O7854Q841n3407j0571N7508M0409p785J7371P8598P3508
19070B694865J7840P377N5813R2151P3039P574p1068r1700N709J39058J29939
19059C060597k8528j06820K4573J67538R9461n9738m4330J13276J47004J4027
$$ y = [1592681, 1597447, 1541887, 1546547, 1627895, 1711750, 1756493, 1755450, 1687105, 1570214, 1505276, 1556824, 1654089, 1704211, 1726354, 1764487, 1764263, 1686562, 1652327, 1780310, 1942066, 1906196, 1708349, 1629869, 1776624, 1935303, 1934858, 1897141, 1976296, 2072091, 2012585, 1860987, 1811258, 1883393, 1945636, 1964184, 2005642, 2041781, 1988774, 1927047, 2040512, 2304381, 2459993, 2369533, 2194850, 2136320, 2182409, 2230651, 2284010, 2380772, 2462041, 2463648, 2444363, 2481042, 2520900, 2479669, 2410399, 2422539, 2490393, 2499234, 2445827, 2435256, 2492764, 2533173, 2525388, 2542759, 2621357, 2694865, 2712705, 2720082, 2775895, 2868046, 2941085, 2948659, 2877591, 2785891, 2791600, 2930658, 3060597, 3032069, 2925249, 2949822, 3117360, 3216821, 3157083, 3112753, 3226029, 3373033, 3387060]
19049C387060m5895O8591J64500J06589K6889M7201O0941k8309p9456N6116K44794
19038D009021K41133M5034j17438j04613K4040J48169J88733J15339j2447n5108
19028D481863M0231J44497J29805O2421P6747J46698J50912R5474Q5287J18459
19018E532394J01631M7772O4201J43684J59090Q6574M9392J02482J49932J27800
19008F564952J01277J18011J25178J03771J29161K14356K44823J68419J05416
18999G875364J52691K13060J58947N3037M7970J44642K09938J88219J46072J31934
18989I321874J28087J33393J71364K14750K09613J76422J86038K32826K36477
18980A1010844J83260J59217K10539K68737K65350K38118K56496L04236L16049
$$ y = [3387060, 3341165, 3409756, 3574256, 3680845, 3707734, 3754935, 3815876, 3787567, 3708111, 3764227, 4009021, 4250154, 4295188, 4177750, 4073137, 4097177, 4245346, 4434079, 4549418, 4536971, 4481863, 4522094, 4666591, 4796396, 4858817, 4935564, 5082262, 5233174, 5328648, 5413935, 5532394, 5634025, 5681797, 5745998, 5889682, 6048772, 6135346, 6184738, 6287220, 6437152, 6564952, 6666229, 6784240, 6909418, 7013189, 7142350, 7356706, 7601529, 7769948, 7875364, 8028055, 8241115, 8400062, 8453099, 8501069, 8645711, 8855649, 9043868, 9189940, 9321874, 9449961, 9583354, 9754718, 9969468, 10179081, 10355503, 10541541, 10774367, 11010844, 11194104, 11353321, 11563860, 11832597, 12097947, 12336065, 12592561, 12896797, 13212846]
18971A3212846K96298L14290L80635M08241L34386K27777K13256L11425M20781
18962A6119935M62587M67352M83068M76741M05499L31703L61921M86092N80083
18953B0174981N74184N21549M84239M55288M29850M53521N41947O30817O62883
18944B4929259O58566O53942O42154O26277O52908P33890Q05649Q24773Q34758
18935C1362176Q83256R46849R91336J028561J067176J100317J181457J384246
18927C9945374J633006J740490J710305J810867K193035K624958K829912K930484
18919E7418431L280832L949497M642234N071594N130126M781195M134728L623438
18911I2032075L704468M257350M581409M123351K957896J491495O0258j019342
$$ y = [13212846, 13509144, 13823434, 14204069, 14612310, 14946696, 15174473, 15387729, 15699154, 16119935, 16582522, 17049874, 17532942, 18009683, 18415182, 18746885, 19108806, 19594898, 20174981, 20749165, 21270714, 21754953, 22210241, 22640091, 23093612, 23635559, 24266376, 24929259, 25587825, 26241767, 26883921, 27510198, 28163106, 28896996, 29702645, 30527418, 31362176, 32245432, 33192281, 34183617, 35212178, 36279354, 37379671, 38561128, 39945374, 41578380, 43318870, 45029175, 46840042, 49033077, 51658035, 54487947, 57418431, 60699263, 64648760, 69290994, 74362588, 79492714, 84273909, 88408637, 92032075, 95736543, 99993893, 104575302, 108698653, 111656549, 113148044, 113208302, 112188960]
18903A12188960j423404j218895j055418j576091k710409l797991m302619m181824
18895I1922309l715372l268831l122537l227530l179262k690553k013993j620226
18887F9084005j550593j430488j080886p31705n83652n30375m36646l69579l88203
18878F1981878l64369j89308M2822K04059L04871L83691M19366M63425O51935
18869F3898370R72427J240576J423250J724663K202252K592636K743571K933641
18861G9731386L469235M201334M753995M999744M960106M504716L657030L029537
18853A13307083L309924M227199M581626L525338J427395o83102k097061k654877
18845A24943525k529013k232205k500213l618897m959168n595959n339362m800693
$$ y = [112188960, 110765556, 109546661, 108491243, 106915152, 104204743, 100406752, 96104133, 91922309, 88206937, 84938106, 81815569, 78588039, 75408777, 72718224, 70704231, 69084005, 67533412, 66102924, 65022038, 64290333, 63706681, 63176306, 62739660, 62370081, 61981878, 61617509, 61428201, 61471023, 61675082, 61979953, 62363644, 62783010, 63246435, 63898370, 64870797, 66111373, 67534623, 69259286, 71461538, 74054174, 76797745, 79731386, 83200621, 87401955, 92155950, 97155694, 102115800, 106620516, 110277546, 113307083, 116617007, 120844206, 125425832, 128951170, 130378565, 129695463, 127598402, 124943525, 122414512, 120182307, 117682094, 114063197, 109104029, 103508070, 98168708, 93368015]
18837I3368015m515540m428555m272062m008982l709371l314675k785325k297357
18829F4036148k055335k005950j921741j706487j465569j318698j279927j302940
18821E0979501j329482j294809j176467j044349r92233j012608r99898q91905
18813D2237750p57066p10050p63995q01584p05154n00141l36431l16083l79967
18804C6967279m04076l69550l65243m34898n10469n22075m97939n06929n55693
18795C2800407n99590o23950o57689p14594p65133p73597p39689o94205o62521
18786B6569439o40956o12056n73147n30158m70503l81024k95881k69665k84422
18777B2511627k55626j67896j16574j50369j74044j06866l0799m1173n8200K0687
$$ y = [93368015, 88852475, 84423920, 80151858, 76142876, 72433505, 69118830, 66333505, 64036148, 61980813, 59974863, 58053122, 56346635, 54881066, 53562368, 52282441, 50979501, 49650019, 48355210, 47178743, 46134394, 45142161, 44129553, 43129655, 42237750, 41480684, 40770634, 40006639, 39205055, 38499901, 37999760, 37663329, 37347246, 36967279, 36563203, 36193653, 35828410, 35393512, 34883043, 34360968, 33863029, 33356100, 32800407, 32200817, 31576867, 30919178, 30204584, 29439451, 28665854, 27926165, 27231960, 26569439, 25928483, 25316427, 24743280, 24213122, 23742619, 23361595, 23065714, 22796049, 22511627, 22256001, 22088105, 21971531, 21821162, 21647118, 21540252, 21509453, 21468280, 21410080, 21430767]
18767B1430767P8883m9112k22654j37702J52572K28205o0274l15778j90310P9331
18757B0993928O6175j81281k78943j46644n8085j10435r5554N6903J27320J7279
18747B0390663n4463O5141K03298J83542J30652K23271L69275L76406K73381K16545
18737B2377711K11158J61340Q9516P5056N8008o8841k31193k58658j67699j50163
18727B2096235k84209m42707n00519m72260m27011m02463m19902m74673n11408
18718A8161083m96568m79410m88162m41880k99092k07378l19582n20248n48955
18709A4359808l74692k27039k46719l28569l50167l35830l23071k70750j91810
18700A1711161j91390k72269k80816j59700p5611j52517k45108j62327J0778K8129
$$ y = [21430767, 21509650, 21460538, 21237884, 21100182, 21252754, 21480959, 21420685, 21104907, 20914597, 20993928, 21060103, 20878822, 20599879, 20453235, 20395150, 20284715, 20189161, 20246064, 20373384, 20390663, 20336200, 20401341, 20604639, 20788181, 20918833, 21142104, 21511379, 21887785, 22161166, 22377711, 22588869, 22750209, 22839725, 22914781, 22972789, 22903948, 22672755, 22414097, 22246398, 22096235, 21812026, 21369319, 20868800, 20396540, 19969529, 19567066, 19147164, 18672491, 18161083, 17664515, 17185105, 16696943, 16255063, 15955971, 15748593, 15429011, 14908763, 14359808, 13985116, 13758077, 13511358, 13182789, 12832622, 12496792, 12173721, 11902971, 11711161, 11519771, 11247502, 10966686, 10806986, 10731375, 10578858, 10333750, 10171423, 10182201, 10210330]
18690A0210330j44050k79141k17410o7841l4114j54945k85161k84485j72489r3822
18680H476872j41506k43358k60502j72689r0970r0580j23195j16136p2099l8666
18670G127171m9060j09651j78460j69096o7580q460r8963k12146j50528J2240
18660F095467J3135j57294k07892l8767O3967q4372k26103r6406J03976M7077
18650E512788j49385j30776O5354P5394j47182k49203q3908O9255J0292q7812
18640D884817o2709m0645j14263j09836O4456J69258K6314j41420q9674Q272j09483
18629D485087k65075j07188K37541K89615k5052k42588q2743J55738J17290q1450
18619D481175j22431O3N2135k8140r4893q0788n6866m8582j5855M871n8829j40766
$$ y = [10210330, 10066280, 9787139, 9569729, 9501888, 9467774, 9312829, 9027668, 8743183, 8570694, 8476872, 8335366, 8092008, 7831506, 7658817, 7567847, 7477267, 7354072, 7237936, 7165837, 7127171, 7078111, 6968460, 6790000, 6620904, 6553324, 6544864, 6445901, 6233755, 6083227, 6095467, 6108602, 5951308, 5743416, 5704649, 5768616, 5684244, 5458141, 5361735, 5465711, 5512788, 5363403, 5232627, 5297981, 5373375, 5226193, 4976990, 4893082, 4962337, 4972629, 4884817, 4822108, 4781463, 4667200, 4557364, 4621820, 4791078, 4817392, 4675972, 4586298, 4594570, 4485087, 4220012, 4112824, 4350365, 4639980, 4614928, 4372340, 4289597, 4445335, 4562625, 4481175, 4358744, 4358807, 4410942, 4382802, 4287909, 4207121, 4150255, 4101673, 4085818, 4090689, 4031860, 3891094]
18607C891094r9717K8335M0465j18251k38723j44985N0190J20462M0082l4907
18597C534045k8952j5834l7944k7614M2375O8347l1261j60489j54032m842J19415
18586C303214R0459l4484j10518q5693k8819n778J858L2264N2069r42r2377r7168
18574C024085K2802J26197O8051q6786j48718p5331o566j6400o061Q4237J32117
18563C117627L2771j00286j00726j0424R465m7587m9814K3936N9760K6672J7010
18552B978404N2165M3793j6555k2199M2827N3925k8322p1899m509N2821O78n9377
18540C021752k631J01943J06575J2360o0265m9675J4226Q0998R5147K9133l4015
18529C315548K5174J45638J17915p5806j69263r616J79031J43284j680L150J17011
$$ y = [3891094, 3791377, 3819712, 3860177, 3741926, 3503203, 3358218, 3408408, 3528870, 3568952, 3534045, 3505093, 3489259, 3451315, 3423701, 3466076, 3534423, 3503162, 3342673, 3188641, 3183799, 3303214, 3393673, 3359189, 3248671, 3162978, 3134159, 3128381, 3130239, 3162503, 3214572, 3213630, 3121253, 3024085, 3046887, 3173084, 3241135, 3154349, 3005631, 2930300, 2923734, 2907334, 2901273, 2985510, 3117627, 3150398, 3050112, 2949386, 2938962, 2948427, 2900840, 2851026, 2874962, 2934722, 2961394, 2978404, 3030569, 3074362, 3057807, 3035608, 3078435, 3132360, 3104038, 3032139, 3027630, 3080451, 3081129, 3021752, 3019121, 3121064, 3227639, 3239999, 3179734, 3130059, 3144285, 3225283, 3320430, 3349563, 3315548, 3340722, 3486360, 3604275, 3528469, 3359206, 3349590, 3528621, 3671905, 3670225, 3673375, 3790386]
18518C790386J09293o491n379J34224K01301J37574J14204J87668K03901J13484
18508D980165P2240J32267J28570m451q3629O307J02296M0889p9254r8672o5606
18497E131122j07471j90613j98765j34359q1997p0910r3051j45839j66412o8598
18487C873107P2681O1777r5616j41140K5854J46484J7577j50887p6669J17689
18477C850857J14439o6652j24105J1480R8821K0860n4155m472N8276K5981l3473
18466C897857l5848m700L9280J19606J76667R9149n8356r6270K2818J02085L3611
18455D295899k6515O7897K06370K11694J18344Q6040J44411J87149J53040Q0987
18445E525316K8855K5702N7539N3311l8536j35535j06538j455k4404k10510l31369
$$ y = [3790386, 3899679, 3893188, 3887809, 4022033, 4223334, 4360908, 4475112, 4662780, 4866681, 4980165, 5052405, 5184672, 5313242, 5308791, 5225162, 5231469, 5333765, 5374654, 5295400, 5196728, 5131122, 5023651, 4833038, 4634273, 4499914, 4417917, 4347007, 4253956, 4108117, 3941705, 3873107, 3945788, 4007565, 3911949, 3770809, 3796663, 3943147, 3960724, 3809837, 3733168, 3850857, 3965296, 3898644, 3774539, 3786019, 3884840, 3905700, 3851545, 3847073, 3905349, 3931330, 3897857, 3862009, 3857309, 3896589, 4016195, 4192862, 4292011, 4233655, 4137385, 4160203, 4262288, 4295899, 4269384, 4337281, 4543651, 4755345, 4873689, 4959729, 5104140, 5291289, 5444329, 5525316, 5554171, 5579873, 5637412, 5690723, 5652187, 5516652, 5410114, 5408659, 5384255, 5173745, 4842376]
18434D842376k44537j27065j75377k68248j84585j1241k0812k04744k59682o9745
18424C276340J08229M9511j12503j31794j9665L4314j6810m8460j503M3581K8127
18413C209367m048j3399k8431o2042o4842j6857J1998m0055j19242j19191k9575
18402B723683M6597L1681k4343j5571O6639J02105m138j62640j71802J6483J87040
18391B795734J17927j07220j97362o2026P2096K3412p3993k3656R1545O3895o4549
18380B635803p5737K8715K7863j07537j41842K883Q8611k2432j18502j9304R8062
18369B396583K7290q5820j6927J14153O6089o4703j7191J37755J16452m1685k6654
18358B605342J68475K10823K0723q1759N0447J39377n080j55280r4512J7198j3397
$$ y = [4842376, 4597839, 4470774, 4295397, 4027149, 3842564, 3831323, 3810511, 3605767, 3346085, 3276340, 3384569, 3434080, 3321577, 3189783, 3170118, 3204432, 3187622, 3139162, 3137659, 3181240, 3209367, 3205319, 3191920, 3163489, 3101447, 3036605, 3019748, 3031746, 2991691, 2872449, 2753258, 2723683, 2770280, 2801961, 2777618, 2762047, 2828686, 2930791, 2926653, 2764013, 2592211, 2608694, 2795734, 2913661, 2806441, 2609079, 2547053, 2619149, 2642561, 2568568, 2544912, 2636457, 2700352, 2635803, 2560066, 2588781, 2616644, 2509107, 2367265, 2370148, 2458759, 2436327, 2317825, 2298521, 2396583, 2423873, 2338053, 2321126, 2435279, 2501368, 2436665, 2419474, 2557229, 2673681, 2631996, 2605342, 2773817, 2984640, 3005363, 2923604, 2974051, 3113428, 3108348, 2953068, 2858556, 2875754, 2862357]
18347B862357n8921L0853J00149q811j11549p73J43672M9698j52755j38219O9589
18336B785290J67401Q1485J1672L1612K3619j8474K3389J09247P3797n7074q8287
18325C143677L917M7060r897m0118l341J0897L208N4593J09235M6246n5894k2887
18313C286696Q1005M8520p3476n0066R2023R1372m6617k3846J89593K38280j2148
18302C821336k08520q2088J34005J39154L3931L3877N6095m9607j39748k4027
18292C714408J46569J06006q3484j59009q4466k6044k6510j1795q881o7861q2820
18281C416113L0058J06813j8623j80205j13975R4268J43215P881o4228M745M7662
18270C473724L379n810M0955K8009k6714J7938J22393R1152o1945r5562N3722
$$ y = [2862357, 2803436, 2834289, 2934438, 2925627, 2814078, 2813305, 2956977, 3006675, 2853920, 2715701, 2785290, 2952691, 3034176, 3045848, 3077460, 3101079, 3082605, 3105994, 3215241, 3289038, 3231964, 3143677, 3147594, 3194654, 3184757, 3144639, 3141298, 3152195, 3155403, 3209996, 3319231, 3365477, 3309583, 3286696, 3367701, 3416221, 3342745, 3292679, 3384702, 3476074, 3429457, 3405611, 3595204, 3833484, 3821336, 3612816, 3530728, 3664733, 3803887, 3837818, 3871695, 3927790, 3878183, 3738435, 3714408, 3860977, 3966983, 3883499, 3724490, 3640024, 3613980, 3587470, 3575675, 3566794, 3498933, 3416113, 3446171, 3552984, 3534361, 3354156, 3240181, 3334449, 3477664, 3485545, 3421317, 3426062, 3473724, 3477103, 3471293, 3512248, 3540257, 3513543, 3531481, 3653874, 3745026, 3683081, 3587519, 3641241]
18259C641241J66315J17703M6891M9105J6061q5597q2122Q9000K01532Q1655j01977
18248D139807r8916N8509J58762J32069P0482L4750J3909M984O518l154o583M3968
18236D555105J12186R8866J8561l179M4066K2314r3863j37300l3169N3969n188
18225D632368r3751p4936k7799o7130j12605n2505K1315k6736j12310o8282N6037
18214D073666P7672r376m8606l296J1900l1754l2333L2444N0339k7476r8667p2792
18202C921721O427N0231L6410o753n0061o7399m4372J422L7372M3057J1205l4930
18190C904330k6822O3039J25110L7541j03043o7181J36226K11226K3205j57558
18180D146073o8929J23145J03663q0693j34437j8188L4357l8149m1994P6896J14326
$$ y = [3641241, 3807556, 3925259, 3972150, 4021255, 4037316, 3951719, 3869597, 3958597, 4160129, 4241784, 4139807, 4040891, 4099400, 4258162, 4390231, 4460713, 4495463, 4509372, 4514356, 4520874, 4517720, 4511137, 4555105, 4667291, 4766157, 4784718, 4781539, 4825605, 4847919, 4754056, 4616756, 4583587, 4637556, 4632368, 4538617, 4463681, 4435882, 4368752, 4256147, 4203642, 4224957, 4198221, 4085911, 4017629, 4073666, 4151338, 4141962, 4093356, 4090060, 4101960, 4070206, 4037873, 4070317, 4120656, 4093180, 3994513, 3921721, 3928148, 3978379, 4014789, 4008036, 3957975, 3890576, 3846204, 3847626, 3884998, 3928055, 3939260, 3904330, 3877508, 3940547, 4065657, 4103198, 4000155, 3932974, 4069200, 4280426, 4303631, 4146073, 4077144, 4200289, 4303952, 4223259, 4088822, 4070634, 4104991, 4066842, 4024848, 4101744, 4216070]
18169D216070k0557j30905o3971N0689M7418j7691j5983L3714N1663N0723O1766
18158D262936M0200k7287n0435J4197O6120K5594l0986j4124K5619J0189j6867
18147D305156J4915N8465L1391l6828o1013l6918j6021p354K884j676k0246n461
18135D227294M8885P5083N1554N0149Q9735O9982m5301j09295M600J86627K30524
18124D879837J10927k6213q3057p2139j5278O9434J12451N7784l9557q5444p3761
18113D834984m6302J779O1674M4738p7281j53670n3771R3000O8491p6348q5757
18102D611537Q1685J70846L7350j20406p6792Q1265J17000P872n6308K3331J36731
18091E014111J48947O5849j4307l0231j728J9321J8876L7133R9580J48554J02745
$$ y = [4216070, 4195513, 4064608, 4000637, 4051326, 4098744, 4081053, 4065070, 4098784, 4150447, 4201170, 4262936, 4303136, 4275849, 4225414, 4239611, 4305731, 4331325, 4300339, 4286215, 4311834, 4322023, 4305156, 4320071, 4378536, 4409927, 4373099, 4312086, 4275168, 4259147, 4251793, 4254677, 4253001, 4232755, 4227294, 4276179, 4351262, 4402816, 4452965, 4542700, 4612682, 4567381, 4458086, 4462686, 4649313, 4879837, 4990764, 4964551, 4881494, 4809355, 4794077, 4863511, 4975962, 5033746, 4994189, 4908745, 4834984, 4788682, 4790461, 4852135, 4896873, 4819592, 4665922, 4612151, 4705151, 4773642, 4697294, 4611537, 4693222, 4864068, 4901418, 4781012, 4704220, 4785485, 4902485, 4910357, 4854049, 4877380, 5014111, 5163058, 5228907, 5214600, 5184369, 5182641, 5201962, 5220838, 5257971, 5357551, 5506105, 5608850]
18080E608850r848n7591J9339J13711R2202k4461r4913l9242Q1093J53915J30893
18069E973948N1051j0492j0003L1512O3109O9561P7104R3736Q9104N1935K1007
18058F501572K8390N3467O7387P9544R6510Q0516J2025m0207P560J18317J57007
18047G162088P1561k3717M340J28396J96279J28775J4797p116Q4189J77924J65487
18036H103003N8431k9716n691J05025J84489J52473N9938K6981R0515J59803J46804
18025I052055R0342R2571J62142K01221J54816R3993J11349J91428K41026K16606
18015A0607549J62980J34246J31288J33725J52672K10746K76734K69168J62029
18006A2241137N8647R1917K42540L35074K58604J15520P6622J55680K32888K53441
$$ y = [5608850, 5599002, 5541411, 5560750, 5674461, 5766663, 5742202, 5647289, 5608047, 5689140, 5843055, 5973948, 6024999, 6014507, 6004504, 6036016, 6099125, 6168686, 6245790, 6339526, 6428630, 6480565, 6501572, 6529962, 6583429, 6650816, 6730360, 6826870, 6907386, 6919411, 6879204, 6886764, 7005081, 7162088, 7233649, 7209932, 7214272, 7342668, 7538947, 7667722, 7682519, 7675403, 7759592, 7937516, 8103003, 8161434, 8131718, 8126027, 8231052, 8415541, 8568014, 8627952, 8654933, 8745448, 8905251, 9052055, 9142397, 9234968, 9397110, 9598331, 9753147, 9847140, 9958489, 10149917, 10390943, 10607549, 10770529, 10904775, 11036063, 11169788, 11322460, 11533206, 11809940, 12079108, 12241137, 12299784, 12391701, 12634241, 12969315, 13227919, 13343439, 13420061, 13575741, 13808629, 14062070]
17996A4062070K69135K95947K73732J94540J44548J73335K28069K59951K90291
17987A6191618L25615L16826K60810K39141K91601L45929L35302K94139K81487
17978A8882468L02823L53986M36478M91160M46461L69968M10514N42562N72084
17969B2808504M74325M77804O72550Q05958O90993N58269O94949R44461R39391
17960B9067204O97211N75670O85477P58435O33227M92639N19261O31658O80684
17951C4741466O52011N80444M95168N07328P03139R10240Q56834O14734N61901
17942D0623265Q20113J077607J097922J037121J066362J049119Q61643P08502
17934D8341654P97760R62149R35127P88085P57550Q22992Q04695P36915P94094
$$ y = [14062070, 14331205, 14627152, 14900884, 15095424, 15239972, 15413307, 15641376, 15901327, 16191618, 16517233, 16834059, 17094869, 17334010, 17625611, 17971540, 18306842, 18600981, 18882468, 19185291, 19539277, 19975755, 20466915, 20913376, 21283344, 21693858, 22236420, 22808504, 23282829, 23760633, 24433183, 25239141, 25930134, 26488403, 27183352, 28127813, 29067204, 29764415, 30340085, 31025562, 31783997, 32417224, 32909863, 33429124, 34060782, 34741466, 35393477, 35973921, 36469089, 36976417, 37679556, 38589796, 39446630, 40061364, 40623265, 41443378, 42520985, 43618907, 44656028, 45722390, 46771509, 47633152, 48341654, 49139414, 50101563, 51036690, 51824775, 52582325, 53405317, 54210012, 54946927, 55741021]
17925E5741021R48444J033498J069794J210643J430887J579986J688728J909919
17917F6612920K185843K278290K123450J889506J703265J578074J565955J691893
17909H1629196J768712J575204J203531R45380Q70304Q26639Q09511R56490J190063
17900I1775030J269504J235066J385305J742869J981472K000611K108554K446527
17892A05944938K703311K678009K679187L006167L429620L609471L690496M007421
17884A31748620M479338M838694N266161O182584P435390Q267818Q200005P478349
17876A83896959O566026N698889N141600N354002O450432P733866Q168139P255728
17868B36265641N268471K839395O46014p12577j062400j004917j534509l035190
$$ y = [55741021, 56689465, 57722963, 58792757, 60003400, 61434287, 63014273, 64703001, 66612920, 68798763, 71077053, 73200503, 75090009, 76793274, 78371348, 79937303, 81629196, 83397908, 84973112, 86176643, 87122023, 87992327, 88818966, 89628477, 90584967, 91775030, 93044534, 94279600, 95664905, 97407774, 99389246, 101389857, 103498411, 105944938, 108648249, 111326258, 114005445, 117011612, 120441232, 124050703, 127741199, 131748620, 136227958, 141066652, 146332813, 152515397, 159950787, 168218605, 176418610, 183896959, 190462985, 196161874, 201303474, 206657476, 213107908, 220841774, 229009913, 236265641, 241534112, 244373507, 245019521, 244306944, 243244544, 242239627, 240705118, 237669928]
17860B37669928m819031n846905n761102n020542m196800l468173k759445j976833
17852B03821097r40139O01801K601434M549096O012896P263618R000665J1370670
17844B44281138J3493933J4069923J2364719Q736186M539419J489052N40866R71657
17836C00486893P81981j571481n792583j0170321j3177576j4461145j4578452
17829B41517316j4293385j4139665j4188423j3995192j3009545j1231350r315042
17822A51344714p900469p008164o240162n399201m663748m210837l926481l581689
17814A08413963l145444k779927k566200k374631k058993j682371j441992j408293
17806I0956112j461515j480670j452765j370130j190295r78294r15436j032674
$$ y = [237669928, 232850897, 227003992, 221242890, 216222348, 212025548, 208557375, 205797930, 203821097, 202880958, 203482759, 206084193, 210633289, 216646185, 223909803, 232910468, 244281138, 257775071, 271844994, 284209713, 292945899, 297485318, 298974370, 299515236, 300486893, 301268874, 299697393, 293904810, 283734489, 270556913, 256095768, 241517316, 227223931, 213084266, 198895843, 184900651, 171891106, 160659756, 151344714, 143444245, 136436081, 130195919, 124796718, 120132970, 115922133, 111995652, 108413963, 105268519, 102488592, 99922392, 97547761, 95488768, 93806397, 92364405, 90956112, 89494597, 88013927, 86561162, 85191032, 84000737, 83022443, 82107007, 81074333]
17798H1074333j096289r40044p64891q63592j143499j219313r68655o92464o53697
17789G2731889p40125p31163o62661p12400q71792r66014r44297r42010j043417
17780F5118010j143888j100219r17452p30895o59046p13268q11120q44847p71627
17771E7425648o76574p22045r81366j324863j526053j495871j354497j248706
17763D8095673j183023j096768j012943r82557r43359p96907o01948n14546n37274
17754D0426348n23352m48868m52410n43694n27357l38841k03543k83651m01042
17745C6703590l34643j81812j60038k29874k12975j42944j77618k61513k06170
17736C4796003m7117O680n2046k8032J11190J89744J55573J43619J80885J42022
$$ y = [81074333, 79978044, 79038000, 78273109, 77409517, 76266018, 75046705, 74078050, 73385586, 72731889, 71991764, 71260601, 70597940, 69885540, 69013748, 68047734, 67103437, 66161427, 65118010, 63974122, 62873903, 61956451, 61225556, 60566510, 59853242, 59042122, 58197275, 57425648, 56749074, 56027029, 55045663, 53720800, 52194747, 50698876, 49344379, 48095673, 46912650, 45815882, 44802939, 43820382, 42877023, 42080116, 41478168, 40963622, 40426348, 39902996, 39454128, 39001718, 38458024, 37930667, 37591826, 37388283, 37104632, 36703590, 36368947, 36187135, 36027097, 35797223, 35584248, 35441304, 35263686, 35002173, 34796003, 34748886, 34755566, 34703520, 34675488, 34786678, 34976422, 35131995, 35275614, 35456499, 35598521]
17726C5598521L9840M5242J61568J94319J13344J23110K85860M01633L69788L40448
17716C7673673L84022L54235K34346K63838N13820O75716N22279K69343K02631
17707D1093903K33015J35718k1142l6262K8090l5964j95302k41183j59288j30455
17697D0671130k07978k58691k01989r0909K2085J27256K03611K57720L49098M71225
17687D1342558N24835N15958O12082Q59800J034866R51233P34980N95310N10634
17678D7682256L63592K10830J74071K06588J96123J66690J79414J90058J93491
17669D9563113L17049N71425P34126P00786O95134Q77962J040299R96346R74143
17660E6470383J231648J571676J678631J680163J889497K214996K353260K384787
$$ y = [35598521, 35638361, 35683603, 35845171, 36039490, 36152834, 36275944, 36561804, 36963437, 37333225, 37673673, 38057695, 38411930, 38646276, 38910114, 39423934, 40099650, 40621929, 40891272, 41093903, 41326918, 41462636, 41441494, 41405232, 41433322, 41397358, 41202056, 40960873, 40801585, 40671130, 40463152, 40204461, 40002472, 39911563, 39933648, 40060904, 40264515, 40522235, 40871333, 41342558, 41867393, 42383351, 42995433, 43855233, 44890099, 45841332, 46576312, 47171622, 47682256, 48045848, 48256678, 48430749, 48637337, 48833460, 49000150, 49179564, 49369622, 49563113, 49880162, 50451587, 51185713, 51886499, 52581633, 53459595, 54499894, 55496240, 56470383, 57702031, 59273707, 60952338, 62632501, 64521998, 66736994, 69090254, 71475041]
17652G1475041K616825K976353L153824L256432L674547M281420M382583L579931
17644I9396956K195013P70336l66354j016946j146922j114176j364779j783510
17636I5569618j802314j229303m93288J618K61336L75466L49615L77469P44317
17627I4154534J318122J644019J662626J804265K253233K683869K866832K945366
17619A11332866K929703K521054J688160Q93412N21582N39988Q09149J176278
17611A22412192J222075N90449l46442q49617q70711r57197j136131r05119l77949
17602A18781550k37608l64061J55537J323922K013696J941150K245456L384692
17594A29244334M209174M150674M496569O103040P675542Q054739Q364581R698982
$$ y = [71475041, 74091866, 77068219, 80222043, 83478475, 87153022, 91434442, 95817025, 99396956, 101591969, 102362305, 101995951, 100979005, 99832083, 98717907, 97353128, 95569618, 93767304, 92538001, 92044713, 92046331, 92307667, 92683133, 93032748, 93410217, 94154534, 95472656, 97116675, 98779301, 100583566, 102836799, 105520668, 108387500, 111332866, 114262569, 116783623, 118471783, 119365195, 119886777, 120426765, 121235914, 122412192, 123634267, 124224716, 123878274, 123028657, 122157946, 121200749, 120064618, 119159499, 118781550, 118543942, 118179881, 118335418, 119659340, 121673036, 123614186, 125859642, 129244334, 133453508, 137604182, 142100751, 148203791, 155879333, 163934072, 172298653, 181997635]
17586A81997635J0488088R058767P423978Q964641J2772925J3864498R398885
17579B53969417J648030n613751j0545392j2510660j1474994r606036j0280149
17572A95586465j3489167j4950953j1930349p317214n353051n749452n259816
17565A31536463l225865j831475j747794j282701R2060O85305l07083j372675
17557A22546235j253121p27856q98971j566580k238174l120445m161786m513957
17549A04065345l881317l231087l334337l661073l467077k955037k609443k312292
17541G8613682j854196j502706j405299j191969p31559m94027o45135o26237j66366
17532F9996188J81183J00956J84474Q29750J349858R88359O4998o97230j267134
$$ y = [181997635, 192485723, 201544490, 208968468, 217933109, 230706034, 244570532, 253969417, 255617447, 250003696, 239458304, 226947644, 215472650, 205866614, 195586465, 182097298, 167146345, 155215996, 147898782, 142545731, 136796279, 131536463, 128310598, 126479123, 124731329, 123448628, 123540688, 124225993, 123918910, 122546235, 121293114, 120565258, 119666287, 118099707, 115861533, 112741088, 108579302, 104065345, 100184028, 96952941, 93618604, 89957531, 86490454, 83535417, 80925974, 78613682, 76759486, 75256780, 73851481, 72659512, 71927953, 71433926, 70788791, 70162554, 69996188, 70177371, 70278327, 70462801, 71292551, 72642409, 73630768, 73695766, 72998536, 71731402]
17523G1731402j891519k281494k141092j941333k231070k636636k448963j799420
17515E4359875j364836j266304j145724j016157j137316j297106j101873p86998
17507D5243561q80443j227199j211092q21579o24839p36917p05301m27985l27011
17498C8281195n05142n41949k91840j32014k20958k25059j7016L5306k36294m44118
17488C5702111l13372j46730k59590m44285l87134k08714j89412k80459k71730
17479C3200685j97401k15213k60957j51975O7613J57261K0256j71533j92479j0876
17469C2245381J81700J82663K7852n2718K9261R8363M4529M1044K13483L37110
17459C3348668J86730k6629L9049K86918L53812K20456J75506K58843K43129J32198
$$ y = [71731402, 69839883, 67558389, 65417297, 63475964, 61244894, 58608258, 56159295, 54359875, 52995039, 51728735, 50583011, 49566854, 48429538, 47132432, 46030559, 45243561, 44363118, 43135919, 41924827, 41103248, 40478409, 39741492, 39036191, 38608206, 38281195, 37776053, 37234104, 36942264, 36810250, 36589292, 36364233, 36347217, 36382523, 36146229, 35702111, 35388739, 35242009, 34982419, 34538134, 34151000, 33942286, 33752874, 33472415, 33200685, 33003284, 32788071, 32527114, 32375139, 32442752, 32600013, 32620269, 32448736, 32256257, 32245381, 32427081, 32609744, 32637596, 32584878, 32614139, 32712502, 32757031, 32798075, 33011558, 33348668, 33535398, 33508769, 33547818, 33834736, 34188548, 34409004, 34584510, 34843353, 35086482, 35218680]
17449C5218680J65498L21649L27137J89303K08299M08762M80557L54675L07307
17440C7981867M07643M14771L22790M16286O49956O12354L03944K74910P02517
17431D2087038J018004Q37255N93178P56561J054762J048573R36226J125942J457498
17422E0915037J541323J521883J806933K304562K615404K781130L167034L738533
17414G0391839M097430M131610M005374L605650K669140J448263N95989L17214
17406I1262509K18594P4830J52680O31065J242505J679941J896523J839182J344698
17397A00342527M88896l81388j140302j990597k912424l470743l435706l176575
17389H4323688l116329l141417k900266k404510j957823j669726j390720j036947
$$ y = [35218680, 35384178, 35705827, 36032964, 36222267, 36430566, 36839328, 37319885, 37674560, 37981867, 38389510, 38804281, 39127071, 39543357, 40193313, 40805667, 41109611, 41384521, 42087038, 43105042, 43942297, 44535475, 45292036, 46346798, 47395371, 48331597, 49457539, 50915037, 52456360, 53978243, 55785176, 58089738, 60705142, 63486272, 66653306, 70391839, 74489269, 78620879, 82626253, 86231903, 88901043, 90349306, 90945295, 91262509, 91481103, 91555933, 91708613, 92339678, 93582183, 95262124, 97158647, 98997829, 100342527, 100831423, 100450035, 99309733, 97319136, 94406712, 90935969, 87500263, 84323688, 81207359, 78065942, 75165676, 72761166, 70803343, 69133617, 67742897, 66705950]
17381F6705950o94989m46055k85746j80361p4543Q7488K55700K93900J90032J21789
17371F5973165K28236M49036O70115Q85521J133831J419245J771447K237256K754659
17362G7522511L204540L642205M268738N066079N637487N527720M594128L059791
17354A12523199J406114K13904j99784j03140m8988j50666M8142Q49303J879816
17345A16417900K502701K431155J688544L10282j514627l234279m319931m808103
17337A09473642n130087n474406n641702n469391n046894m495030l846243l202654
17329G1167235k747613k511791k321740k047394j742830j502567j329684j184574
17321E5779042j041194q77910p14191o32262o51708o40675m93846l27296l14869
$$ y = [66705950, 66010961, 65564906, 65279160, 65098799, 65024256, 65111744, 65367444, 65661344, 65851376, 65973165, 66201401, 66650437, 67320552, 68206073, 69339904, 70759149, 72530596, 74767852, 77522511, 80727051, 84369256, 88637994, 93704073, 99341560, 104869280, 109463408, 112523199, 113929313, 114143217, 113943433, 113840293, 113791305, 113640639, 113688781, 114538084, 116417900, 118920601, 121351756, 123040300, 123350582, 121835955, 118601676, 114281745, 109473642, 104343555, 98869149, 93227447, 87758056, 82711162, 78216132, 74369889, 71167235, 68419622, 65907831, 63586091, 61538697, 59795867, 58293300, 56963616, 55779042, 54737848, 53859938, 53145747, 52513485, 51861777, 51221102, 50727256, 50399960, 50085091]
17312E0085091l94090l54259j81520o7514o5563j477K05475L85292M09675M29514
17302E0450624O42487R72300J184243J248434J380108J695662J986233J926634
17294F1486725J446271Q04275L12004P0457J948K4076Q7209J28279J55352L36771
17284F4853367P94529J292923J371382Q78811J66513l54273o23449p75420q41651
17275F6762732q34212q97198j095970j221273j074270p90995o10256m95542l05502
17266E9437514j54339k06516k61455n960M00848M97034K61409J62962M04290O52043
17256F1187830O64471O56055Q13606R54730R59441J074813J449994J801010J915869
17247G1477819K076425K549414L066261L322012L613431M344272N153723N239691
$$ y = [50085091, 49691001, 49336742, 49155222, 49087708, 49022145, 49020668, 49226143, 49611435, 50021110, 50450624, 51093111, 52065411, 53249654, 54498088, 55878196, 57573858, 59560091, 61486725, 62932996, 63737271, 64049275, 64119732, 64121680, 64145756, 64232965, 64361244, 64516596, 64853367, 65647896, 66940819, 68312201, 69191012, 69357525, 69003252, 68379803, 67604383, 66762732, 65928520, 65031322, 63935352, 62714079, 61639809, 60848814, 60238558, 59743016, 59437514, 59283175, 59076659, 58815204, 58809244, 59210092, 59707126, 59968535, 60131497, 60535787, 61187830, 61852301, 62508356, 63321962, 64276692, 65236133, 66310946, 67760940, 69561950, 71477819, 73554244, 76103658, 79169919, 82491931, 86105362, 90449634, 95603357, 100843048]
17239A00843048M450292L392494K495415J641981P67744J10974l12008q05752
17231A12584188j292136j155742k07274P54348Q64997K67428k75250m92771p36165
17222A10311623j230971j850495k548263l383304m073389m120444l549047l013726
17214H6541984k941389l002353k703987k111137j625930j368012j182790j056200
17206G0550186j090944j168554j042827p56292o02514o48087o34244m21488j99499
17197F3985737j28348p4254J18453L51217M81477N98464Q58560J216943J557083
17188F8965332J927694K393545K806995L046077L354903M031760M769662M738199
17180I6034167L503131J580984r1756j009131j283020j276997j306424j492722
$$ y = [100843048, 105293340, 108685834, 111181249, 112823230, 113590974, 113701948, 113389940, 112584188, 111292052, 110136310, 109929036, 110683384, 111548381, 111815809, 111540559, 111047788, 110311623, 109080652, 107230157, 104681894, 101298590, 97225201, 93104757, 89555710, 86541984, 83600595, 80598242, 77894255, 75783118, 74157188, 72789176, 71606386, 70550186, 69459242, 68290688, 67247861, 66491569, 65889055, 65240968, 64606724, 64185236, 63985737, 63857389, 63783135, 63901588, 64252805, 64734282, 65332746, 66191306, 67408249, 68965332, 70893026, 73286571, 76093566, 79139643, 82494546, 86526306, 91295968, 96034167, 99537298, 101118282, 101026526, 100017395, 98734375, 97457378, 96150954, 94658232]
17172I4658232j623256j267514k92799Q02563J291950R01179q4648j250497k300449
17163I0834761k975468l122917k950745k913566l179753l408107l199204k597629
17155F6487372j988026j631616j483672j382622j235692j033815q24186o91770
17147E6215973o90206p73829q33644p93936o58812m99213m09929m26805m65414
17138E0664185m03505k45163j23242j07676j10729m0337N9615J15155J70385L00590
17128E0279278M45407M82312M41418M88155O74161Q54668R10656R24591J043449
17119E6544095J261771J458789J605671J813774K166686K593785K950688L188550
17111G3583809L425615L861322M572437N311851N542260M841441L381369J903433
$$ y = [94658232, 93034976, 91767462, 91474663, 92277226, 93569176, 94470355, 94385707, 93135210, 90834761, 87859293, 84736376, 81785631, 78872065, 75692312, 72284205, 69085001, 66487372, 64499346, 62867730, 61384058, 60001436, 58765744, 57731929, 56907743, 56215973, 55525767, 54751938, 53918294, 53124358, 52465546, 51966333, 51556404, 51129599, 50664185, 50260680, 50015517, 49892275, 49784599, 49673870, 49633533, 49693148, 49808303, 49978688, 50279278, 50724685, 51206997, 51648415, 52136570, 52810731, 53665399, 54576055, 55500646, 56544095, 57805866, 59264655, 60870326, 62684100, 64850786, 67444571, 70395259, 73583809, 77009424, 80870746, 85443183, 90755034, 96297294, 101138735, 104520104, 106423537]
17103A06423537J069487Q72256Q21345O55687O23286R64059J350758J106433n1887
17094A13834961j676607l021246l682987l809966l823827m015381m325910m442304
17086H5036733m128553l483602k837168k406597k140137j894357j634161j394324
17078F5117834j160624r07162o92567n96995n76783m86998k64618o986J62763
17069F0587864K43506L24453M52749N98837P44945R37223J211950J518929J789139
17060F8409595K059834K435135K900942L303081L607823M072699M950119N996629
17052I7735857O469266N765184M036674K099389P53549K25841J99222K61026K65733
17043A17811741K85348K72356j12024j207194k871888m421647n184772n128505
$$ y = [106423537, 107493024, 108365280, 109186625, 109842312, 110465598, 111429657, 112780415, 113886848, 113834961, 112158354, 109137108, 105454121, 101644155, 97820328, 93804947, 89479037, 85036733, 80908180, 77424578, 74587410, 72180813, 70040676, 68146319, 66512158, 65117834, 63957210, 63050048, 62357481, 61760486, 61183703, 60696705, 60432087, 60425101, 60587864, 60831370, 61155823, 61608572, 62207409, 62952354, 63889577, 65101527, 66620456, 68409595, 70469429, 72904564, 75805506, 79108587, 82716410, 86789109, 91739228, 97735857, 104205123, 109970307, 114006981, 116106370, 116859919, 117085760, 117284982, 117546008, 117811741, 118097089, 118369445, 118257421, 117050227, 114178339, 109756692, 104571920, 99443415]
17035I9443415m853496m937139n334872n482481m963648l984294l128068k711902
17027F4047515k525102k221991j793305j499218j440153j411266j199914q51281
17019E1105285n64832m44983m36376m30957l65121k47725j32953m8205L8461J39522
17009D8612116J88014J44772J09432J93527L30286L78220L79194N06797P71453
17000E1613811J025436J276424J682716K133807K174152J572571P06182J17203
16992F2302302r4640j66787j92402j11226l7486j92592n43247q58888j114809
16983E8990225j484488j919575k121818k026493j951906k103653k241811k055280
16975D3085201j622676j264320j107618j027060r02164p29924n41973l65401k29541
$$ y = [99443415, 94589919, 89652780, 84317908, 78835427, 73871779, 69887485, 66759417, 64047515, 61522413, 59300422, 57507117, 56007899, 54567746, 53156480, 51956566, 51105285, 50540453, 50095470, 49659094, 49228137, 48863016, 48615291, 48482338, 48434133, 48472594, 48612116, 48800130, 48944902, 49054334, 49247861, 49578147, 49956367, 50335561, 50842358, 51613811, 52639247, 53915671, 55598387, 57732194, 59906346, 61478917, 62185099, 62302302, 62207662, 62040875, 61848473, 61737247, 61699761, 61507169, 60963922, 60105034, 58990225, 57505737, 55586162, 53464344, 51437851, 49485945, 47382292, 45140481, 43085201, 41462525, 40198205, 39090587, 38063527, 37161363, 36431439, 35889466, 35524065, 35294524]
16966C5294524j19346K0607J77870K57726K22835J28471k2213k96743o40832q54645
16956C4168254q69925q65777r71816j044368r17312p03721o23878o59127o17526
16947B6894804m64771l49025l30782l11285k30946j46973r5520l6526M3108J00329
16937B5072413J16901J00248K4184j14104k13766j84603j11874j58719l24220
16928B4206460m53153m75083m68379m78697m44572l43330k58922k44785k40893
16919B0798646j85917j13870r1229j40062k52523l98657n01536m93694m16928
16910A8204230l80968m12819m36483m07525l68620l56947l50322l23022k76685
16901A4890839k14659j59463j68901k43542k65866j55383l1127n7668j73013j72619
$$ y = [35294524, 35175178, 35195785, 35373655, 35631381, 35854216, 35982687, 35960474, 35663731, 35022899, 34168254, 33298329, 32432552, 31460736, 30416368, 29499056, 28795335, 28171457, 27512330, 26894804, 26430033, 26081008, 25750226, 25438941, 25207995, 25061022, 24965502, 24928976, 24972084, 25072413, 25189314, 25289562, 25313746, 25199642, 24985876, 24801273, 24689399, 24530680, 24206460, 23753307, 23278224, 22809845, 22331148, 21886576, 21543246, 21284324, 21039539, 20798646, 20612729, 20498859, 20407630, 20267568, 20015045, 19616388, 19114852, 18621158, 18204230, 17823262, 17410443, 16973960, 16566435, 16197815, 15840868, 15490546, 15167524, 14890839, 14676180, 14516717, 14347816, 14104274, 13838408, 13683025, 13651898, 13594230, 13421217, 13248598]
16891A3248598m9752j4825j38302k21341j18640L4060N0667l5771q6569q2000
16881A2586125p2507l6433N3082J23027J06705N9907M5316J2162p6002j17083
16871A2684299l1538O8885M9714j4289L0097J42729J64405R9241R6344J81950
16861A3471837K36293K30899K63738L38002L25917K00636R8952Q5942M8856q9760
16851A5211312k30229k68608k55560k73740k96467k82755k83339l27327l21195
16842A2672092j99057p3286q4816j79174j87359p9669J3820P522n8585j25059
16832A1706429j60791j14959L1684J60887J17540n1432j17211R619J39448R1837
16822A1813051k8355p756J32481J83457R6953N1965J34637J82460P1878l0850
$$ y = [13248598, 13198846, 13184021, 13045719, 12824378, 12705738, 12739798, 12790465, 12754694, 12668125, 12586125, 12513618, 12477185, 12530267, 12653294, 12759999, 12819906, 12865222, 12877384, 12801382, 12684299, 12652761, 12721646, 12771360, 12757071, 12787168, 12929897, 13094302, 13193543, 13289887, 13471837, 13708130, 13939029, 14202767, 14540769, 14866686, 15067322, 15166274, 15252216, 15301072, 15211312, 14981083, 14712475, 14456915, 14183175, 13886708, 13603953, 13320614, 12993287, 12672092, 12473035, 12399749, 12314933, 12135759, 11948400, 11868731, 11882551, 11890073, 11831488, 11706429, 11545638, 11430679, 11462363, 11623250, 11740790, 11689358, 11572147, 11581766, 11721214, 11813051, 11784696, 11776940, 11909421, 12092878, 12189831, 12241796, 12376433, 12558893, 12630771, 12599921]
16812A2599921R2558L38873L91575J83832J1167J10752L34643L86755K42986J43344
16802A4836406K21905L44281L47723K81232L03169M27995N03613M31674K98668
16793A7996666K39295K47440K12576J10447M1829O0065P7096J2880o3502n1823
16783A8882969J567j3178o2985j9405J06244J63584J18279J11275K07836K84224
16773A9780410K55660K25006K79485L22751K67425K25812L19409M45308M45094
16764B2566360L80645M08692M87350M65232L82453M03493N00171M98718M24690
16755B6517804M83574O73065P45401O32015N74596P05288Q19984P53844O80000
16746C2585571P92886R54854R44006Q46785Q90736J038365J077653J024634J101535
$$ y = [12599921, 12692479, 13031352, 13422927, 13606759, 13617926, 13728678, 14063321, 14450076, 14693062, 14836406, 15058311, 15402592, 15750315, 16031547, 16334716, 16762711, 17266324, 17697998, 17996666, 18235961, 18483401, 18695977, 18806424, 18848253, 18908318, 18985414, 18998294, 18934792, 18882969, 18884536, 18871358, 18808373, 18788968, 18895212, 19058796, 19177075, 19288350, 19496186, 19780410, 20036070, 20261076, 20540561, 20863312, 21130737, 21356549, 21675958, 22121266, 22566360, 22947005, 23355697, 23843047, 24308279, 24690732, 25094225, 25594396, 26093114, 26517804, 27001378, 27674443, 28419844, 29051859, 29626455, 30331743, 31151727, 31905571, 32585571, 33378457, 34333311, 35277317, 36124102, 37014838, 38053203, 39130856, 40155490, 41257025]
16737D1257025J341636J530515J565633J593950J733782J908182K040091K202215
16729E5173029K470975K798528L125119L480774L894790M329403M773027N275989
16721H5321634N820038O257384O436231O285067N748897M802635L606039K493980
16713A26771905J693959J152400P21516L78599J31225j67615p26703j583563k595629
16704A25776094l607381m495730n124712n438719n575565n702398n738648n438830
16696H4654111m787663m100157l627838l262336k790059k270076j925186j756995
16688F0133801j547000j233622j006299r47598q51759n65408k82072k53377l59819
16679E3086847k62767P9828L58122L92075L71635N16555P58196R22673J026461
$$ y = [41257025, 42598661, 44129176, 45694809, 47288759, 49022541, 50930723, 52970814, 55173029, 57644004, 60442532, 63567651, 67048425, 70943215, 75272618, 80045645, 85321634, 91141672, 97399056, 103835287, 110120354, 115869251, 120671886, 124277925, 126771905, 128465864, 129618264, 130339780, 130718379, 130849604, 130681989, 129955286, 128371723, 125776094, 122168713, 117672983, 112548271, 107109552, 101533987, 95831589, 90092941, 84654111, 79866448, 75766291, 72138453, 68876117, 66086058, 63815982, 61890796, 60133801, 58586801, 57353179, 56346880, 55399282, 54547523, 53982115, 53700043, 53446666, 53086847, 52824080, 52903908, 53262030, 53654105, 54025740, 54542295, 55300491, 56223164, 57249625]
16670E7249625J196059J439917J696270K001647K421884K892609L302918L668271
16662G5869200M050389M375137M507782M441668M222635L761190K958100J983871
16654A06169972J176841O45878K13352k24149n52407p42476j028579j616878k404222
16645A01637332l148782l768016m308938m755461n037397n148413n116468m926370
16637F5427487m579735m154459l714338l253089k806313k489030k318112k138947
16629C9973464j858648j608555j520179j485700j335131j126312j035240j051007
16621B8952692j017587r17355q69229q77143q23787p08095o52631o65908o31062
16612B1789895n48695n46487o11448n73172m21882l71943m96670n71433m44026
$$ y = [57249625, 58445684, 59885601, 61581871, 63583518, 66005402, 68898011, 72200929, 75869200, 79919589, 84294726, 88802508, 93244176, 97466811, 101228001, 104186101, 106169972, 107346813, 107992691, 108206043, 107981894, 107429487, 106687011, 105658432, 104041554, 101637332, 98488550, 94720534, 90411596, 85656135, 80618738, 75470325, 70353857, 65427487, 60847752, 56693293, 52978955, 49725866, 46919553, 44430523, 42112411, 39973464, 38114816, 36506261, 34986082, 33500382, 32165251, 31038939, 30003699, 28952692, 27935105, 27017750, 26148521, 25271378, 24447591, 23739496, 23086865, 22420957, 21789895, 21241200, 20694713, 20083265, 19510093, 19088211, 18716268, 18219598, 17648165, 17204139]
16603A7204139l02747l55280m68950m09636k64394k96151m70385m81654k58772
16594A3896170j03731k25005m19932l95729j93521p6745j29414j97624j82219
16585A1972250j67705k29294k90862k58844j77139j48115j75594j90441j85033
16576A0149223k10484k56034k44435j62648r4051q8475r8456q8066r9784j47761
16566H659029j55117r2293o7357j49224k07165j02601M2890k100j95433k51344
16556G479285q6900L8080o2068k07387j67778m4761p4961k04309j71164L6949
16546F534986J28086m0586k31401j81609J6398P3637p5932k13159j64928k4611
16536E820881J2704p6009j36018p4217Q325k0264j07132q7211M3594Q6626o1169
$$ y = [17204139, 16901392, 16546112, 16077162, 15667526, 15403132, 15106981, 14636596, 14154942, 13896170, 13792439, 13567434, 13147502, 12751773, 12558252, 12481507, 12352093, 12154469, 11972250, 11804545, 11575251, 11284389, 11025545, 10848406, 10700291, 10524697, 10334256, 10149223, 9938739, 9682705, 9438270, 9275622, 9181571, 9093096, 8994640, 8906574, 8806790, 8659029, 8503912, 8411619, 8344262, 8195038, 7987873, 7885272, 7928162, 7926062, 7730629, 7479285, 7392385, 7430465, 7368397, 7161010, 6993232, 6948471, 6873510, 6669201, 6498037, 6534986, 6663072, 6622486, 6391085, 6209476, 6225874, 6299511, 6223579, 6010420, 5845492, 5820881, 5833585, 5757576, 5621558, 5547341, 5555666, 5535402, 5428270, 5341059, 5384653, 5471279, 5410110]
16525E410110k18490j70401K841M2793r0315j63864m6415Q6013K9297j35936j76713
16514D568920n1538O0044L9737k8995l2137J655k2597r9226j29120p2625r939
16503D224179k4910q5901r4636l0488J8703j6198q5545r0847j8451M9677M3697
16492C889280k4028r1418j07772o4136J498K8902q184p4750j17808j14798o6388
16481C250398J1479O1047J5977q6938j09636q470O1911l2587j66240j16250P9856
16470B960547J54828J5954j22437r1475j4192n0114j06158j9587J23237J08508
16460B959111m2782r7547J5469J03816L0605q3891p5152K3921P6024N2233K3175
16449B984982J2589j7890o7411p6418j1958Q0809J19283O0375n0649j08933n9398
$$ y = [5410110, 5191620, 5021219, 5024060, 5066853, 4976538, 4812674, 4766259, 4852272, 4881569, 4745633, 4568920, 4517382, 4577426, 4617163, 4588168, 4556031, 4557686, 4535089, 4435863, 4306743, 4234118, 4224179, 4199269, 4113368, 4018732, 3988244, 4006947, 3990749, 3905204, 3814357, 3795906, 3845583, 3889280, 3865252, 3773834, 3666062, 3601926, 3603424, 3632326, 3624142, 3549392, 3431584, 3316786, 3250398, 3261877, 3322924, 3338901, 3251963, 3142327, 3133857, 3195768, 3163181, 2996941, 2880691, 2960547, 3115375, 3131329, 3008892, 2917417, 2903225, 2853111, 2746953, 2727366, 2850603, 2959111, 2916329, 2818782, 2834251, 2938067, 2968672, 2884781, 2809629, 2833550, 2909574, 2961807, 2984982, 2997571, 2979681, 2912270, 2835852, 2823894, 2904703, 3023986, 3084361, 3033712, 2924779, 2865381]
16438B865381K7431L5933m3250j05612q1434j9323r56m1523j02765j41669j19908
16427B272305l0687N5941M5266n1161j10610o4581R901J5948k6399l7780m899
16416B073244K8874M2845L3743j8186j02377j44082r2666j329M8793N1268L2532
16405A952659j9772r3946r6635J9526J33361R9547l3586j00399o6191k6796n1
16394A767717P0461J16012R16j79302j42246J21879K28674m5660l47607k06645
16384A384199K51385M37844J19156k80746k93274J571J86689Q8203r6620j47024
16374A651383o8004Q424J6981L9J3189L4113j2634j23620j62772l1050J44158
16363A470207J34699o2167j94661j12692L0833M7705j232L0847Q4911J0446j21227
$$ y = [2865381, 2892812, 2928745, 2885495, 2779883, 2698449, 2679126, 2678170, 2636647, 2533882, 2392213, 2272305, 2241618, 2297559, 2342825, 2291664, 2181054, 2116473, 2126374, 2142322, 2115923, 2078143, 2073244, 2102118, 2144963, 2178706, 2160520, 2058143, 1914061, 1821395, 1820066, 1868859, 1920127, 1952659, 1932887, 1838941, 1742306, 1761832, 1895193, 1994740, 1961154, 1860755, 1794564, 1767768, 1767717, 1838178, 1954190, 1955106, 1775804, 1633558, 1755437, 1984111, 1938451, 1590844, 1384199, 1635584, 2073428, 2192584, 1911838, 1618564, 1620135, 1806824, 1895027, 1798407, 1651383, 1583379, 1591803, 1608784, 1608823, 1622012, 1656125, 1643491, 1519871, 1357099, 1326049, 1470207, 1604906, 1542739, 1348078, 1235386, 1266219, 1313924, 1312692, 1343539, 1428450, 1438896, 1317669]
16352A317669r5729P1779J26754j3916j18011k0705J03141L5100j22801j21802
16342A161479K8012R4789J2160m3058K0487N9166l5706j34161p9901N0071P2140
16331A205478j5988n8058m221L2232r110l5188K6073R0490N1640m6021p7365k4046
16319A135916J7660n566l9518k2849K8328N9656M8829J5590m875P237K5775m691
16307A261492q4771j26768o8049J8589J9635m0958l8843M1619Q2010M0553K3310
16296A127819P4400O6909p2689j88270j16720L5133M5584o9935r6589J9042R1455
16285I16139J1580q6881n5809N7216J20873R4008N247j04257j47509m6190J11642
16274H76059J27885j4217r7131p671Q0567J4124o8820N930J13362L4381j38619
$$ y = [1317669, 1221940, 1293719, 1420473, 1406557, 1288546, 1267841, 1370982, 1406082, 1283281, 1161479, 1189491, 1284280, 1296440, 1253382, 1273869, 1333035, 1297329, 1163168, 1083267, 1133338, 1205478, 1189490, 1131432, 1127211, 1159443, 1150333, 1115145, 1141218, 1231708, 1283348, 1237327, 1159962, 1135916, 1153576, 1148010, 1108492, 1085643, 1113971, 1173627, 1222456, 1238046, 1233171, 1240408, 1266183, 1261492, 1176721, 1049953, 981904, 1000493, 1020128, 979170, 940327, 981946, 1063956, 1104509, 1127819, 1202219, 1269128, 1196439, 1008169, 891449, 926582, 972166, 902231, 805642, 824684, 916139, 927719, 840838, 785029, 842245, 963118, 1057126, 1062373, 958116, 810607, 764417, 876059, 1003944, 989727, 892596, 884925, 965492, 979616, 910796, 916726, 1030088, 1064469, 925850]
16263I25850j26948O5803J48533J5187j05815m8029M9329K3275m5703j6362O3787
16252I48907O8874O171m2552o8528q4805m5320N2475J01924N3346J9109P5377
16241A084978J02460n272j14002n4595O5592J8616j44934j46777O8563K29439
16231A104068J52722o924m6130j2348m2341r3390m5873N4058P1553K4784L5598
16220A195777Q1608K2403j19887j35671M1791J86239R5645r8454j23657K8832
16210A174626J10515N382j12574p3414L7409N1800r604j5319K5684m168q7466
16199A102871p8048L1007O2571m8648j20848j1863J38460J25407k094m7365O172
16188A157622O834o7308o6169N5311J41916Q5915k0276o2477o4175o8883k3693
$$ y = [925850, 798902, 864705, 1013238, 1028425, 922610, 874581, 923910, 947185, 901482, 885120, 948907, 1017781, 1023952, 981400, 912872, 828067, 782747, 835222, 937146, 990492, 1009601, 1084978, 1187438, 1182166, 1068164, 1013569, 1079161, 1097777, 952843, 806066, 874629, 1104068, 1256790, 1249866, 1203736, 1191388, 1149047, 1055657, 1009784, 1063842, 1135395, 1160179, 1195777, 1277385, 1299788, 1179901, 1044230, 1086021, 1272260, 1367905, 1269451, 1145794, 1174626, 1285141, 1290523, 1177949, 1104535, 1141944, 1193744, 1184140, 1168821, 1194505, 1190337, 1102871, 1024823, 1055830, 1118401, 1069753, 948905, 937042, 1075502, 1200909, 1198815, 1151450, 1157622, 1164456, 1097148, 1030979, 1086290, 1228206, 1314121, 1293845, 1231368, 1167193, 1098310, 1074617]
16177A074617R5119J75454J26862L4484J5802K5657l8819j24510r3771L8258J17489
16166A446642Q4925K8955P867j1988k6937K5581J19462J29080K3976o7897n3492
16155A706174Q292M9063R9047J62108J37248q364j24042q0797K6506M1954j024
16144B016165K0231O9978L1668l8823R031J23955J08772k2396l8607J02577J56145
16133B538696J0012j09518k9678P7124L5450Q258J74041L16136J42020j62138
16123C000403j61384J24410K41798M2892j07666J4932J39388K8583r1330L2422
16113C264448J92309P7455j65294j70005L8312J23126J5509l3481N7786R1250
16103C491415k105m1096M1880P6559k688k4676Q3572J46569P3335L7374J47550
$$ y = [1074617, 1169736, 1345190, 1472052, 1506536, 1522338, 1547995, 1509176, 1384666, 1290895, 1329153, 1446642, 1531567, 1560522, 1568389, 1556401, 1529464, 1555045, 1674507, 1803587, 1827563, 1759666, 1706174, 1714466, 1763529, 1862576, 2024684, 2161932, 2153568, 2029526, 1948729, 1975235, 2017189, 2016165, 2036396, 2106374, 2138042, 2099219, 2108250, 2232205, 2340977, 2318581, 2279974, 2382551, 2538696, 2548708, 2439190, 2409512, 2486636, 2522086, 2530344, 2704385, 3020521, 3162541, 3000403, 2839019, 2963429, 3205227, 3248119, 3140453, 3155385, 3294773, 3323356, 3232026, 3264448, 3456757, 3534212, 3368918, 3198913, 3237225, 3360351, 3375860, 3342379, 3400165, 3491415, 3489310, 3448214, 3490094, 3566653, 3563965, 3539289, 3622861, 3769430, 3842765, 3880139, 4027689]
16092D027689K29028J45779P3258J94870L58132L24872J83777J98544L65382M43124
16082F544455L63798L00791L31505L21630J93082N7681L752m2706j45049k15366
16072G713573j64425o7377n4681j10769r7700M2150J95393K11436Q8314j7474
16062G738440J6182J13303R8453n5990j92954k08744j93344k52169l20094k85542
16052F457541j97362j85436k39022k35309j58893j23213j70070k01501j40291
16043D806444l4591L2517M2897K7041K3192O4122J43628K03894K06828J81319
16033E697291J47613O7837n1401j02967l7107K6098j8009o8112J2049J35661J25285
16022E934238K3443J8407J05330R5168m3306j26644o9057J4751N7587J20767J78264
$$ y = [4027689, 4256717, 4402496, 4475754, 4670624, 5028756, 5353628, 5537405, 5735949, 6101331, 6544455, 6908253, 7209044, 7540549, 7862179, 8055261, 8112942, 8116694, 8073988, 7928939, 7713573, 7549148, 7481771, 7427090, 7316321, 7218621, 7260771, 7456164, 7667600, 7755914, 7738440, 7754622, 7867925, 7966378, 7910388, 7717434, 7508690, 7315346, 7063177, 6743083, 6457541, 6260179, 6074743, 5835721, 5600412, 5441519, 5318306, 5148236, 4946735, 4806444, 4771853, 4804370, 4847267, 4874308, 4897500, 4961622, 5105250, 5309144, 5515972, 5697291, 5844904, 5912741, 5861340, 5758373, 5721266, 5747364, 5729355, 5661243, 5673292, 5808953, 5934238, 5957681, 5976088, 6081418, 6176586, 6133280, 6006636, 5937579, 5952330, 6009917, 6130684, 6308948]
16011F308948J04991m8800o8155M9886M5049j59623k99459k28751j85434l51042
16001E167610m88990l46185j21497j50181l46246l72395k07064j16247j57196
15992B861609j39638m6500p2173k15362k29578n5713N6353l0509j23103m5841
15982A959545P5694M7701r7554k02628k06229j29381N957J28925J27531O69j17084
15971A593146j40270j11369o8495j132L6000l8701j43021r5259P8492J40134J6379
15960A265904q3082l4557n491j22248k08541q8977Q0774O2577o7178o5265O3494
15949G97410J04845J4384m1455k760L494p4941j16525m6558L9773M5154O067q449
15937G20439j1275m1454q0449q3409m5849n998j217k1415m790P5292J25359L4226
$$ y = [6308948, 6413939, 6365139, 6296984, 6346870, 6391919, 6232296, 5932837, 5704086, 5518652, 5167610, 4678620, 4332435, 4210938, 4060757, 3714511, 3342116, 3135052, 3018805, 2861609, 2721971, 2675471, 2603298, 2387936, 2158358, 2102645, 2158998, 2128489, 2005386, 1959545, 2035239, 2082940, 1985386, 1782758, 1576529, 1447148, 1453105, 1582030, 1709561, 1710230, 1593146, 1452876, 1341507, 1273012, 1271880, 1307880, 1269179, 1126158, 1030899, 1109391, 1249525, 1265904, 1182822, 1148265, 1142774, 1020526, 811985, 723008, 803782, 866359, 799181, 733916, 797410, 902255, 916639, 875184, 872424, 875918, 800977, 684452, 637894, 677667, 722821, 728888, 720439, 709164, 667710, 587261, 503852, 458003, 452005, 450788, 429373, 424583, 499875, 625234, 659460]
15925F59460j25105j44931P594J07661R482j22182q3055M7523P2518J2322J4877
15914D56164N1122q646r4987l0634J15627R5150r1911j69262m0759O1760p943
15903C35681p8263l824O3875k8814j30679l9761J28772J16803n6602j34462k7098
15892A45628Q3168M7717n3520p0779J1849Q9007O8688l4817j06467n0256P1887
15881B02105R3056k3401j09584l6346Q8529R1251n279n0778k1508k1520o9517
15870A37008p3405j7556K699l5962l0508O1293J20968M4831q1869q9894M2172
15859G9777J51312Q7439j01779k11664j12239Q3776J41019r05j38291p2936J18474
15848B3983J96667Q1872p7151j35395j02478m2730K8562Q8977P0206l7760j25836
$$ y = [659460, 534355, 389424, 397018, 504679, 514161, 391979, 308924, 356447, 428965, 441287, 456164, 507286, 498640, 403653, 373019, 488646, 583796, 491885, 322623, 281864, 343624, 335681, 257418, 253594, 317469, 288655, 157976, 118215, 246987, 363790, 307188, 172726, 145628, 228796, 276513, 222993, 152214, 164063, 253070, 321758, 286941, 180474, 130218, 202105, 295161, 271760, 162176, 125830, 214359, 305610, 300331, 249553, 228045, 206525, 137008, 63603, 46047, 48746, 12784, -17724, 43569, 164537, 209368, 127499, 37605, 79777, 231089, 318528, 216749, 5085, -107154, -23378, 117641, 116736, -21555, -94491, 23983, 220650, 302522, 225371, 89976, -12502, -55232, -26670, 62307, 132513, 94753, -31083]
15837c1083r5011J1807Q3638R3307Q9329P8033J9002o8422r9060n1482j3161m1069
15825b4172n7340K4444J25732R0202o0591j18414J306J01124o476j80375j39087
15814b43647R5396K02720M0368j49234j19827K7139N5565k5435l0449O2917R3453
15803H966J943q5688p4426j5657K3355M9774O6091L3052m2460q4475m9846K2073
15791a47298P1496O2849j1443r4014p5446N5536J36760L8853j19992j32068j1931
15780b26698N3309K1210J8705O0065J5902r4558o9958J15523K04000N3728j16550
15769C4678p7205N6235N0995o0448r0901l5302j8215k1091N2633J23219L9465
15758E4063j10716r6357N9922R1886o2718j36581L2866K22149J52852j03187k53427
$$ y = [-31083, -126094, -114287, -30649, 62658, 151987, 230020, 249022, 180600, 81540, 30058, 16897, -24172, -81512, -57068, 68664, 158866, 98275, -20139, -18833, 82291, 75815, -104560, -243647, -148251, 54469, 94837, -54397, -174224, -147085, -91520, -116955, -147404, -84487, 8966, 10909, -74779, -149205, -164862, -141507, -91733, -25642, 7410, -35050, -119525, -169371, -147298, -75802, -12953, -24396, -118410, -193856, -138320, -1560, 37293, -82699, -214767, -226698, -173389, -152179, -133474, -73409, -57507, -152065, -222023, -106500, 97500, 151228, 34678, -42527, 13708, 64703, 4255, -86646, -121948, -140163, -161254, -108621, 14598, 54063, -56653, -153010, -93088, -1202, -63920, -200501, -167635, 54514, 207366, 104179, -149248]
15747a49248j85146l7907M6917O3292M8094N416m9534o6312j9268M9048O9874
15736b24774K5326k5193j0555N3014O7799n167o6573j5549Q1588P2286n0755j29768
15724b28321p1287L2778O1098K6229J1384L2481M4778L0622Q565j0955k6826l0350
15712a19804k0738j1757n525Q474K1562J2246j4793l7399n2547n7702k4882M1987
15700b60878O5808K709n7095j3788O3763L9928m2395j6553J07367J26109j9743
15689d768j28236n8973N1171L8366l0380k5748N606k5385m4444L3347R1881J403
15677i6160j12552o1730N3714K68j54639j17726J24369K43056Q5604r5757o9401
15666b00954M1859M2221n542L1379O6212l6642j68074j31070K1270P7806K4892
$$ y = [-149248, -334394, -372301, -325384, -262092, -213998, -208582, -258116, -324428, -343696, -294648, -224774, -199448, -224641, -235196, -182182, -114383, -119550, -186123, -201672, -120084, -47798, -98553, -228321, -299608, -266830, -205732, -179503, -168119, -135638, -90860, -60238, -51673, -62628, -89454, -119804, -140542, -152299, -157824, -149350, -127788, -115542, -130335, -167734, -220281, -277983, -302865, -260878, -195070, -192361, -249456, -263244, -199481, -159553, -201948, -218501, -111134, 14975, -4768, -133004, -191977, -140806, -102440, -132820, -158568, -152962, -178347, -222791, -189444, -97563, -96160, -208712, -270442, -216728, -216460, -371099, -488825, -364456, -121400, -35796, -131553, -200954, -159095, -116874, -122416, -91037, -24825, -61467, -229541, -360611, -339341, -261535, -236643]
15655b36643L3873J23415J12612n3514j77987j00024P4908J36601L5707j01226
15645a52278j35859l5925J05001J39184K4594r3706n8793O3482O9838o1395j23502
15634b59359q954J11538N7666p9970r6305R932O8178K2776r917L6800P7834L0750
15622c9031o2534j14039r1757j3359P4073R2042M461r2482o3162O3593J09611
15611a32584Q817q6480m1382N5654M6765m4713p4574k1376J456m3736o1851J368
15599c92636P1564P4952L8779J3026q539l6230m0402j3090L340l067J5427O4559
15587b12317O6385j1467p1115k0923P2082P3217k0975q7153n9873k548J4257Q508
15575b51922K6396N4504M0471k5134q2451o3558K2828Q4022M9401l0738m9968
$$ y = [-236643, -202770, -79355, 33257, -20257, -198244, -298268, -223360, -86759, -51052, -152278, -288137, -324062, -219061, -79877, -55283, -148989, -207782, -144300, -74462, -135857, -259359, -268313, -156775, -99109, -179079, -275384, -265452, -197274, -174498, -184415, -147615, -69781, -39031, -101565, -215604, -307361, -320720, -246647, -154605, -150144, -242626, -305788, -242195, -132584, -123767, -210247, -251629, -195975, -149210, -193923, -268497, -289873, -288417, -332153, -394004, -392636, -321072, -246120, -207341, -194315, -202854, -239084, -279486, -292576, -289236, -292303, -276876, -212317, -145932, -157399, -228514, -249437, -177355, -104138, -125113, -212266, -272139, -274687, -260430, -251922, -225526, -171022, -130551, -155685, -238136, -301694, -278866, -194844, -145443, -176181, -226149]
15564b26149l698P513m7560o7642P828P9295M3156l4869l2581K6108L2370r112
15552b25341j2563L415m7637j16350n7544J04964J63670L9476q9473o4751K8765
15541b73369M0505m049O462N5596M1205l7815q3774n2172J0807N0650M1012j7232
15529b22174o5841k2952Q8254J30303M3358n8485p0746n3335q2103q0599L2470
15518c61850J42478Q8554o3895j14350l8859J2602k85L0443J07789Q7713n0508
15507a60168j21823k0627J08168R8375l495n7029m0444j6661L66K2674J9563k2639
15495a93740m7610j9161J5687K0925L0477M5697m930j14085j31774K4524K03410
15484a70580J99556K0070j53831j95352j03747O6431K11817J93268q527k05950
$$ y = [-226149, -229847, -222334, -269894, -337536, -329708, -250413, -207257, -242126, -274707, -248599, -216229, -225341, -237904, -234489, -282126, -398476, -456020, -351056, -187386, -147910, -237383, -302134, -273369, -232864, -236913, -230451, -174855, -133650, -171465, -255239, -307411, -296604, -245954, -204942, -222174, -288015, -310967, -222713, -92410, -49052, -107537, -178283, -231618, -313721, -394320, -361850, -219372, -130818, -194713, -309063, -347922, -335320, -335605, -305162, -197373, -109660, -160168, -281991, -302618, -194450, -96075, -99570, -156599, -197043, -213704, -213338, -190664, -171101, -193740, -241350, -260511, -244824, -223899, -193422, -147725, -152655, -266740, -398514, -373990, -170580, 28976, 49046, -104785, -300137, -403884, -337453, -125636, 67632, 59105, -146845]
15474a46845k10188o6438M8936Q5241J04213Q8009k4678j42984r5514Q2395J52043
15463a25810J8926j24096q8985M9727J05543M7078j8072l1042k5617l4653m8742
15452b75743m2770N008Q2148J13073L4676q1800q8143K4465Q7025j794j13837
15441b57692p9561O1490J27847N3957m9155o8325j2471L9488L4086k2494p7176
15430b50006p8120l3620J968J2098L0985N5693L1602l3820m4579K8304P1489N425
15418b02581o9831l2073N4467M7323k8407k8718M9972O1762k9963q4822k6109
15407b88980L5501P66n8261m2740O551Q861m254L0169O2994J4664o0546m0871
15395c36146O0639J02578K5790o8493p5043j4523L1468L4578K1866J4123L318
$$ y = [-146845, -357033, -423471, -374535, -289294, -185081, -97072, -121750, -264734, -360248, -277853, -125810, -106884, -230980, -319965, -270238, -164695, -117617, -135689, -166731, -192348, -227001, -275743, -318513, -313505, -231357, -118284, -83608, -165408, -253551, -229086, -142061, -143855, -257692, -337253, -275763, -147916, -93959, -143114, -211439, -223910, -184422, -150336, -172830, -250006, -328126, -361746, -359778, -347680, -316695, -261002, -229400, -263220, -307799, -279495, -208006, -202581, -272412, -304485, -250018, -202695, -231102, -259820, -209848, -148086, -178049, -262871, -288980, -253479, -252713, -310974, -353714, -347163, -338302, -342556, -312387, -249393, -234729, -295275, -336146, -275507, -172929, -147139, -215632, -290675, -305198, -273730, -239152, -217286, -203163, -199845]
15384a99845k6847o9634p7192l223J07206J24437q5j25925q6918O8097J30461
15373a59468K8880p8256n0687M2705O5121J3499l2863n5745o3071r460J00248
15362a99097J19876m1684k03473j18995J26856J90869j9544j93112r2016R1942
15352c38378P1722p2351n9040J06332J49851l225j14192l6942O3548J7596p8915
15341b93994o4604J7853L8586J5730M1158Q3343N6226K265J6767N0262j8698j47005
15329b02111j61533l2981P0418L5814n0696o3995m546N5489P5651M2392l9306
15318b75404j05300p8490J1070N2778K5609J9752N8172M5462m2881p7931J3805
15307c53358J04186N8737m6853o0086K635J8340j4279j781L9047R078n8210k6252
$$ y = [-199845, -226692, -296326, -373518, -376741, -269535, -145098, -145183, -271108, -358026, -289929, -159468, -130588, -208844, -259531, -216826, -151705, -138206, -171069, -226814, -289885, -299345, -199097, -79221, -120905, -324378, -443373, -316517, -125648, -145192, -338304, -430320, -338378, -266656, -339007, -398047, -291715, -141864, -145089, -259281, -296223, -232675, -215079, -293994, -358598, -340745, -302159, -286429, -245271, -161928, -105702, -103437, -86670, -36408, -55106, -202111, -363644, -396625, -326207, -290393, -341089, -405084, -409630, -354141, -278490, -236098, -275404, -380704, -459194, -448124, -395346, -369737, -349985, -291813, -246351, -289232, -367163, -353358, -249172, -190435, -237288, -297374, -294739, -276399, -290678, -292459, -253412, -244334, -302544, -328796]
15295c28796Q1704P5378p8959j52715l195J70141J08609j07758j76921k2794J17592
15284c17714O7762n4527o3663J5895L9413o964j2084M8370O9254J738n6318j7427
15272b86265N1422L3708n2158q4299l1509K731m4372q5582k1609R1203J13902
15261c12828K7139n2283n3167l0635l3196q199P9595J31802M2317j10840j40024
15250d60319j1341J05095Q1960l001k3048M351m121k3691K1625Q3114M1334p2282
15238b60324q7846L1591J09432L0255p2977m1401M2046m548j38795j36714M8451
15227d80830J85673R2563j05934j57827j7809J23467J02396l1067j02936l3690
15217d25994P4357P7484j3175m8569K8086P8101j7820j47920j25173J7711Q2748
$$ y = [-328796, -247092, -171714, -250673, -403388, -406583, -236442, -127833, -235591, -412512, -435306, -317714, -249952, -304479, -368142, -352247, -312834, -319798, -331882, -283512, -214258, -212520, -268838, -286265, -234843, -201135, -253293, -337592, -369101, -366370, -410742, -496324, -517933, -426730, -312828, -285689, -337972, -391139, -421774, -454970, -463169, -383574, -251772, -209455, -320295, -460319, -471660, -366565, -284605, -287606, -310654, -306303, -310424, -334115, -312490, -229376, -188042, -260324, -348170, -316579, -207147, -176892, -249869, -291270, -249224, -253772, -392567, -529281, -480830, -295157, -202594, -308528, -466355, -484164, -360697, -258301, -289368, -392304, -425994, -351637, -274153, -287328, -335897, -307811, -229710, -247530, -395450, -520623, -502912, -420164]
15206d20164K4727m989N5688Q5144K5808j2181J2052k6318j44854j38147P4089
15195d69145K26739Q9706j43613j52332J422J5901j11120r1540J25667K42426
15185b65889R7056j00213j35588p5564l9600J6557J18142J33256P376q9589l6515
15174c70571L4416m693l8311N4267J36610N0084p6309l9585O9374K7671j07648
15163b64695r3515N6576Q2646o7197j43959k4682R4295N0569k6968J9768R7160
15152b20002M2133q7539j14915k7633L4944J9509J0366N7984R6042N2108m6431
15141a83434j07972q0194l223L2846r504o2534l2232P6683J55057J11514k8874
15130a31867j44808j25021J6044J22403O2578p7167q1906O8430J34560j2315j51857
$$ y = [-420164, -395437, -400426, -344738, -259594, -233786, -245967, -233915, -260233, -405087, -543234, -469145, -242406, -152700, -296313, -448645, -447223, -431322, -542442, -633982, -508315, -265889, -168833, -269046, -404634, -480198, -519798, -503241, -385099, -251843, -244467, -334056, -370571, -336155, -340848, -379159, -324892, -188282, -138198, -214507, -254092, -184718, -157047, -264695, -358210, -301634, -218988, -286185, -430144, -454826, -360531, -309962, -336930, -317162, -220002, -177869, -265408, -380323, -407956, -373012, -353503, -343137, -285153, -189111, -137003, -183434, -291406, -371600, -374823, -341977, -351481, -414015, -446247, -369564, -214507, -102993, -131867, -276675, -401696, -385652, -263249, -200671, -277838, -359744, -291314, -156754, -169069, -320926]
15119c20926m9347J46542J28418o8493j36876j8023L2903o9030q9255P5996J82723
15108a85368O0743r1339o6201P664m6735j04604P829J47347Q7906o6017o2095
15097c10870N0056K8742j04881j12853J4595N3754k4434j4309J04126R8146p8078
15086b96006j56670j0434J15428J5665j37338r6289O9793J32108O1888l427j5040
15075c20322k0186j9011O401J0661k5070k6190L0685M0221l6796o2223L9762J06094
15063b75974l778j37174q1706P1442P9842l4418l6420R3876J17289m3566j53075
15052d03662m3741J14917Q9250p1357j38522l1910J19999J72648R0327o8865j88715
15041c59631j58074J2602J67772J67626M1938p0187r2846o2694l7362k4830l691
$$ y = [-320926, -370273, -223731, -95313, -163806, -300682, -318705, -285802, -354832, -444087, -368091, -185368, -124625, -215964, -282165, -274501, -321236, -425840, -418011, -270664, -182758, -248775, -310870, -260814, -232072, -336953, -449806, -435211, -381457, -405891, -420200, -316074, -217928, -296006, -452676, -463110, -347682, -332017, -469355, -565644, -495851, -363743, -301855, -305282, -320322, -340508, -359519, -353118, -342457, -367527, -393717, -363032, -322811, -359607, -421830, -382068, -275974, -279752, -416926, -498632, -427190, -347348, -381766, -418186, -324310, -207021, -250587, -403662, -447403, -332486, -243236, -314593, -453115, -485025, -365026, -192378, -102051, -170916, -359631, -517705, -505103, -337331, -169705, -127767, -197954, -290800, -353494, -390856, -415686, -419377]
$$ [...]
##END NTUPLES=NMR SPECTRUM
##END=
