##TITLE=1H ikalashn
EC-3334(III-24)
13.11.2024
##JCAMPDX= 6.0         $$ Bruker NMR JCAMP-DX V2.0
##DATA TYPE= NMR SPECTRUM
##DATA CLASS= NTUPLES
##ORIGIN= UXNMR, Bruker Analytische Messtechnik GmbH
##OWNER= root
$$ TOPSPIN		Version 1.3
$$ 2024-11-13 10:16:57.031 +0400  Irina@DPX200
$$ Compression mode = diff/dup
##.OBSERVE FREQUENCY= 200.131300845
##.OBSERVE NUCLEUS= ^1H
##.ACQUISITION MODE= SIMULTANEOUS
##.ACQUISITION SCHEME= undefined
##.AVERAGES= 64
##.DIGITISER RES= 18
##SPECTROMETER/DATA SYSTEM= spect
##.PULSE SEQUENCE= zg
##.SOLVENT NAME= CDCl3
##.SHIFT REFERENCE= INTERNAL, CDCl3, 1, 17.49637
##AUDIT TRAIL= $$ (NUMBER, WHEN, WHO, WHERE, WHAT)
$$ ##TITLE= Audit trail, TOPSPIN		Version 1.3
$$ ##JCAMPDX= 5.01
$$ ##ORIGIN= Bruker BioSpin GmbH
$$ ##OWNER= Irina
$$ $$ F:/spectra/data/iren/nmr/1H/4/pdata/1/auditp.txt
$$ ##AUDIT TRAIL=  $$ (NUMBER, WHEN, WHO, WHERE, VERSION, WHAT)
(   1,<2024-11-13 10:16:36.156 +0400>,<Irina>,<DPX200>,<TOPSPIN 1.3>,
      <created by zg
	started at 2024-11-13 10:12:23.265 +0400,
	POWCHK disabled, PULCHK disabled
       configuration hash MD5:
       BE 6D 3F 07 2A EA 11 49 91 17 2B D3 AF B3 58 0D
       data hash MD5: 16K
       FE 51 E3 87 A6 C7 0F 22 94 6D D4 18 35 BB E5 23>)
(   2,<2024-11-13 10:16:39.328 +0400>,<Irina>,<DPX200>,<TOPSPIN 1.3>,
      <Start of raw data processing
       fp BC_mod = 2 FT_mod = 6 PKNL = 1 PHC0 = 115.5571 PHC1 = 5.665494 SI = 32K 
       data hash MD5: 32K
       FF 66 6E 80 C2 07 8F 98 AE A0 B6 7D 7A F1 BA 48>)
(   3,<2024-11-13 10:16:41.578 +0400>,<Irina>,<DPX200>,<TOPSPIN 1.3>,
      <apk 
       data hash MD5: 32K
       0C D7 4C B8 36 A5 65 48 D1 9C C8 4B 0E A8 F5 B7>)
(   4,<2024-11-13 10:16:45.750 +0400>,<Irina>,<DPX200>,<TOPSPIN 1.3>,
      <abs n ABSG = 5 
       data hash MD5: 32K
       C3 F3 FC 4B 37 22 8E FD 61 3A 4E 65 23 77 33 88>)
$$ ##END=
$$ 
$$ $$ hash MD5
$$ $$ 01 F3 17 03 BD EF 55 D2 6F 33 9A 8F 37 6C 78 96
##$RELAX= 
##$RELAX= 
##$RELAX= 
##$RELAX= 
##$RELAX= 
##$RELAX= 
##$RELAX= 
##$RELAX= 
##$RELAX= 
$$ Bruker specific parameters
$$ --------------------------
##$DU= <F:/spectra>
##$EXPNO= 4
##$NAME= <1H>
##$PROCNO= 1
##$TYPE= <nmr>
##$USER= <iren>
##$AMP= (0..31)
100 100 100 100 100 100 100 100 100 100 100 100 100 100 100 100 100 100 
100 100 100 100 100 100 100 100 100 100 100 100 100 100 
##$ANAVPT= -1
##$AQSEQ= 0
##$AQ_mod= 1
##$AUNM= <au_zg>
##$AUTOPOS= <>
##$BF1= 200.13
##$BF2= 200.13
##$BF3= 200.13
##$BF4= 200.13
##$BF5= 200.13
##$BF6= 200.13
##$BF7= 200.13
##$BF8= 200.13
##$BYTORDA= 1
##$CFDGTYP= 0
##$CFRGTYP= 5
##$CHEMSTR= <none>
##$CNST= (0..63)
1 1 145 1 1 1 1 1 1 1 1 1 1 1 1 1 1 1 1 1 1 1 1 1 1 1 1 1 1 1 1 1 1 1 
1 1 1 1 1 1 1 1 1 1 1 1 1 1 1 1 1 1 1 1 1 1 1 1 1 1 1 1 1 1 
##$CPDPRG= <>
##$CPDPRG1= <>
##$CPDPRG2= <>
##$CPDPRG3= <>
##$CPDPRG4= <mlev>
##$CPDPRG5= <mlev>
##$CPDPRG6= <mlev>
##$CPDPRG7= <mlev>
##$CPDPRG8= <mlev>
##$CPDPRGB= <>
##$CPDPRGT= <>
##$D= (0..63)
0 2 0 0 0 0 0 0 0 0.06 0 0.03 0 0 0 0 0.0002 0 0 0 0 0 0 0 0 0 0 0 0 0 
$$ [...]
##$SW_h= 4401.40845070422
##$TD= 16384
##$TD0= 1
##$TE= 300
##$TE2= 300
##$TE3= 300
##$TEG= 300
##$TL= (0..7)
0 120 120 120 120 120 120 120 
##$TP= (0..7)
150 150 150 150 150 150 150 150 
##$TP07= 0
##$TPNAME0= <>
##$TPNAME1= <>
##$TPNAME2= <>
##$TPNAME3= <>
##$TPNAME4= <>
##$TPNAME5= <>
##$TPNAME6= <>
##$TPNAME7= <>
##$TPOAL= (0..7)
0.5 0.5 0.5 0.5 0.5 0.5 0.5 0.5 
##$TPOFFS= (0..7)
0 0 0 0 0 0 0 0 
##$TUNHIN= 0
##$TUNHOUT= 0
##$TUNXOUT= 0
##$USERA1= <user>
##$USERA2= <user>
##$USERA3= <user>
##$USERA4= <user>
##$USERA5= <user>
##$V9= 5
##$VALIST= <valist>
##$VCLIST= <CCCCCCCCCCCCCCC>
##$VD= 0
##$VDLIST= <DDDDDDDDDDDDDDD>
##$VPLIST= <PPPPPPPPPPPPPPP>
##$VTLIST= <TTTTTTTTTTTTTTT>
##$WBST= 1024
##$WBSW= 25
##$XGAIN= (0..3)
0 0 0 0 
##$XL= 0
##$YL= 0
##$YMAX_a= 2870818
##$YMIN_a= -6114481
##$ZGOPTNS= <>
##$ZL1= 120
##$ZL2= 120
##$ZL3= 120
##$ZL4= 120
##$ABSF1= 17.49637
##$ABSF2= -4.496376
##$ABSG= 5
##$ABSL= 3
##$ALPHA= 0
##$AQORDER= 0
##$ASSFAC= 0
##$ASSFACI= 0
##$ASSFACX= 0
##$ASSWID= 0
##$AUNMP= <proc_1d>
##$AXLEFT= 0
##$AXRIGHT= 0
##$AXTYPE= 0
##$AXUNIT= <>
##$AZFE= 0.1
##$AZFW= 0.1
##$BCFW= 0
##$BC_mod= 2
##$BYTORDP= 0
##$COROFFS= 0
##$CY= 7568.61572265625
##$DATMOD= 1
##$DC= 0
##$DFILT= <>
##$DTYPP= 0
##$F1P= 17.9538593292236
##$F2P= -4.03888763876832
##$FCOR= 0.5
##$FTSIZE= 32768
##$FT_mod= 6
##$GAMMA= 0
##$GB= 0
##$INTBC= 0
##$INTSCL= 1.367314e-010
##$ISEN= 128
##$LB= 0
##$LEV0= 0
##$LPBIN= 0
##$MAXI= 945.577
##$MC2= 0
##$MEAN= 0
##$ME_mod= 0
##$MI= -402.1523
##$NCOEF= 0
##$NC_proc= -4
##$NLEV= 6
##$NOISF1= 8.587773
##$NOISF2= 6.764455
##$NSP= 0
##$NTH_PI= 0
##$NZP= 0
##$OFFSET= 17.49637
##$PC= 1
##$PHC0= 314.9476
##$PHC1= 14.40931
##$PH_mod= 1
##$PKNL= yes
##$PPARMOD= 0
##$PPDIAG= 0
##$PPIPTYP= 0
##$PPMPNUM= 100
##$PPRESOL= 1
##$PSCAL= 0
##$PSIGN= 0
##$REVERSE= no
##$SF= 200.13
##$SI= 32768
##$SIGF1= 16.12182
##$SIGF2= -4.496377
##$SINO= 3.521527
##$SIOLD= 32768
##$SREGLST= <1H.CDCl3>
##$SSB= 0
##$STSI= 32768
##$STSR= 0
##$SW_p= 4401.40845070422
##$SYMM= 0
##$S_DEV= 0
##$TDeff= 16384
##$TDoff= 0
##$TI= <>
##$TILT= no
##$TM1= 0
##$TM2= 0
##$TOPLEV= 0
##$USERP1= <user>
##$USERP2= <user>
##$USERP3= <user>
##$USERP4= <user>
##$USERP5= <user>
##$WDW= 0
##$XDIM= 32768
##$YMAX_p= 361537421
##$YMIN_p= -193287
$$ End of Bruker specific parameters
$$ ---------------------------------
##NTUPLES= NMR SPECTRUM
##VAR_NAME=  FREQUENCY,     SPECTRUM/REAL,   SPECTRUM/IMAG
##SYMBOL=    X,             R,               I
##VAR_TYPE=  INDEPENDENT,   DEPENDENT,       DEPENDENT
##VAR_FORM=  AFFN,          ASDF,            ASDF
##VAR_DIM=   32768,         32768,           32768
##UNITS=     HZ,            ARBITRARY UNITS, ARBITRARY UNITS
##FACTOR=    0.134324425510551, 1,           1
##FIRST=     4401.40845070422, -96296,       -2430547
##LAST=      0,             40290,           -3141861
##MIN=       0,             -193287,         0
##MAX=       4401.40845070422, 361537421,    0
$$ Real data points
##PAGE= N=1
##DATA TABLE= (X++(R..R)), XYDATA
$$ [...]
11417A1262475O8884M5874K9851M4609N2843L4347K7057N1905O9168N7863O5900
$$ 11262475 11331359 11377233 11407084 11451693 11504536 11538883 11565940 11617845 11687013 11744876 11810776
11406A1810776J18282J46777R5853L9048Q3107J90909K18637J25994L2785M1626
$$ 11810776 11929058 12075835 12171688 12210736 12293843 12484752 12703389 12829383 12862168 12903794
11396A2903794J10149J46531J41421J38462J41972J31688J27067J59780K03260
$$ 12903794 13013943 13160474 13301895 13440357 13582329 13714017 13841084 14000864 14204124
11387A4204124K00736J56999J36730J64881J89643J67224J32332J44224J93603
$$ 14204124 14404860 14561859 14698589 14863470 15053113 15220337 15352669 15496893 15690496
11378A5690496K11902J67778J10284J00501J31479J45936J20136R3714J07662
$$ 15690496 15902398 16070176 16180460 16280961 16412440 16558376 16678512 16772226 16879888
11369A6879888J43069J47983J12119Q3162J02876J51417J73502J48940J14968
$$ 16879888 17022957 17170940 17283059 17366221 17469097 17620514 17794016 17942956 18057924
11360A8057924J15464J47244J72844J75791J77368J95207K14223K17863K23669
$$ 18057924 18173388 18320632 18493476 18669267 18846635 19041842 19256065 19473928 19697597
11351A9697597K55154K93083K96003K68265K64665L15700L86437M29067M44626
$$ 19697597 19952751 20245834 20541837 20810102 21074767 21390467 21776904 22205971 22650597
11342B2650597M69216N22089N87543O30541O21940N74282N55225O23575P44351
$$ 22650597 23119813 23641902 24229445 24859986 25481926 26056208 26611433 27235008 27979359
11333B7979359Q23873Q46989R04370J037527J134788J060674Q28791N51351K66434
$$ 27979359 28803232 29650221 30554591 31592118 32726906 33787580 34616371 35167722 35434156
11324C5434156o4408m09832o58779p78319q56203r39899r47690q11904o15562
$$ 35434156 35369748 34959916 34301137 33522818 32666615 31726716 30779026 29967122 29351560
11315B9351560m93017m56260m13586l22811k35513k02543k10422k13436j79027
$$ 29351560 28858543 28402283 27988697 27665886 27430373 27227830 27017408 26803972 26624945
11306B6624945j05017k7086P175L730L0972J23440K15914K28521J79311J42476
$$ 26624945 26519928 26492842 26500017 26503747 26534719 26658159 26874073 27102594 27281905 27424381
11296B7424381J25817P4769j5258q1585r6299j01768j25471j36548j14805r3267
$$ 27424381 27550198 27624967 27609709 27528124 27431825 27330057 27204586 27068038 26953233 26859966
11286B6859966r9482j17229j38449j88008k58850k90586k63266k47277k96319
$$ 26859966 26760484 26643255 26504806 26316798 26057948 25767362 25504096 25256819 24960500
11277B4960500l50625l26168k51881k23378k48604k43770j79390j25937j32001
$$ 24960500 24609875 24283707 24031826 23808448 23559844 23316074 23136684 23010747 22878746
11268B2878746j51193j31176r5295q3363p8685n4639l7294n3502o3079j9959L3259
$$ 22878746 22727553 22596377 22501082 22417719 22339034 22284395 22247101 22193599 22130520 22110561 22143820
11257B2143820J8283m8853p2975k6569J3694J98r935L7823R4935R1134N7500P9487
$$ 22143820 22162103 22113250 22040275 22013706 22027400 22027598 22017663 22055486 22150421 22241555 22299055 22378542
11245B2378542J57318K04002J78182J34075J21628J10872N3735l0927q1455p7281
$$ 22378542 22535860 22739862 22918044 23052119 23173747 23284619 23338354 23307427 23225972 23148691
11235B3148691n9356p4611j24590j68577j68493j32087j06741j20641j44263j33816
$$ 23148691 23089335 23014724 22890134 22721557 22553064 22420977 22314236 22193595 22049332 21915516
11225B1915516r7132p7798q3062p7705n2447m2555o1196o9307m2192j7013l3988
$$ 21915516 21818384 21740586 21657524 21579819 21527372 21484817 21423621 21354314 21312122 21295109 21261121
11214B1261121p0522p9565o2868n8312p5005q6786p8201n8282l7364k0917j5601
$$ 21261121 21190599 21111034 21048166 20989854 20914849 20828063 20749862 20691580 20654216 20633299 20617698
11203B0617698j6996q344P955O148j1799k153M6693P4318L7505o585J9633Q7416
$$ 20617698 20600702 20592358 20600313 20606461 20594662 20592509 20639202 20713520 20751025 20744440 20764073 20851489
11191B0851489J04523O3990M8542Q6309J09565Q3344P2697J30077K00556K06103
$$ 20851489 20956012 21020002 21068544 21154853 21264418 21347762 21420459 21550536 21751092 21957195
11181B1957195J63367J49223J90884K51801K95968L13049L05080K93655L15561
$$ 21957195 22120562 22269785 22460669 22712470 23008438 23321487 23626567 23920222 24235783
11172B4235783L73773M23318M40505M63517N19868N62808N43243N02395N13928
$$ 24235783 24609556 25032874 25473379 25936896 26456764 27019572 27562815 28065210 28579138
11163B8579138N60787N56865M82370M08691L78887L49007K76989J96219J58794
$$ 28579138 29139925 29696790 30179160 30587851 30966738 31315745 31592734 31788953 31947747
11154C1947747J62594J79602K10047K59572K98227K94362K67779K59725K61599
$$ 31947747 32110341 32289943 32499990 32759562 33057789 33352151 33619930 33879655 34141254
11145C4141254K19770J09755l4274j66986k72061l46737l82756l83608l74799
$$ 34141254 34361024 34470779 34436505 34269519 33997458 33650721 33267965 32884357 32509558
11136C2509558l71144l51019k91889k20631j92335k14998k30694j89509j13001
$$ 32509558 32138414 31787395 31495506 31274875 31082540 30867542 30636848 30447339 30334338
11127C0334338n6784l2415l123N3228J16673J62625J92906K22543K63317L24280
$$ 30334338 30277554 30245139 30242016 30295244 30411917 30574542 30767448 30989991 31253308 31577588
11117C1577588M01104M65559M99207N33819O11829P05560P36963O93151O51143
$$ 31577588 31978692 32444251 32943458 33477277 34089106 34794666 35531629 36224780 36875923
11108C6875923O50893O17019M69970K54456P6720m1063j50403k49431k75259k27744
$$ 36875923 37526816 38143835 38613805 38868261 38944981 38903918 38753515 38504084 38228825 38001081
11098C8001081j95679k24325k41063j63154j7762J00017J47820J64134K00856
$$ 38001081 37805402 37581077 37340014 37176860 37159098 37259115 37406935 37571069 37771925
11089C7771925K69519L43069L86063L92167L98504M42611N07051N43527N52882
$$ 37771925 38041444 38384513 38770576 39162743 39561247 40003858 40510909 41054436 41607318
11080D1607318N89025O68764P35899P47229P40778P72116Q24693Q38598Q02716
$$ 41607318 42196343 42865107 43601006 44348235 45089013 45861129 46685822 47524420 48327136
11071D8327136P63863P55223P63013P64037P61083P75062Q18152Q72602Q93650
$$ 48327136 49090999 49846222 50609235 51373272 52134355 52909417 53727569 54600171 55493821
11062E5493821Q54812P95073P84446Q27336Q44738P81162O82759O27761O23351
$$ 55493821 56348633 57143706 57928152 58755488 59600226 60381388 61064147 61691908 62315259
11053F2315259O25903O25717O44701O73297O80732O79153P10523P71077Q13176
$$ 62315259 62941162 63566879 64211580 64884877 65565609 66244762 66955285 67726362 68539538
11044F8539538Q26158Q51742R09155R67414J007959J053024J109121J144110J153686
$$ 68539538 69365696 70217438 71126593 72094007 73101966 74154990 75264111 76408221 77561907
11035G7561907J192691J294642J407444J462840J475765J516885J605523J687731
$$ 77561907 78754598 80049240 81456684 82919524 84395289 85912174 87517697 89205428
11027H9205428J718357J715403J722768J755165J795027J821580J829600J830891
$$ 89205428 90923785 92639188 94361956 96117121 97912148 99733728 101563328 103394219
11019A03394219J842974J867615J880123J850638J777883J693928J633995J605905
$$ 103394219 105237193 107104808 108984931 110835569 112613452 114307380 115941375 117547280
11011A17547280J588778J560090J526389J524178J580104J671737J744959J774908
$$ 117547280 119136058 120696148 122222537 123746715 125326819 126998556 128743515 130518423
11003A30518423J790500J827848J879300J907834J898225J870719J849496J838679
$$ 130518423 132308923 134136771 136016071 137923905 139822130 141692849 143542345 145381024
10995A45381024J828815J808936J770231J712176J647126J586725J524139J444213
$$ 145381024 147209839 149018775 150789006 152501182 154148308 155735033 157259172 158703385
10987A58703385J351977J273045J219781J175902J127543J092547J096790J129783
$$ 158703385 160055362 161328407 162548188 163724090 164851633 165944180 167040970 168170753
10979A68170753J150300J138371J115673J102745J079167J006695Q74971O98385
$$ 168170753 169321053 170459424 171575097 172677842 173757009 174763704 175638675 176337060
10971A76337060M79088K06205j08160m25762p26005j025348j337578j637787j884152
$$ 176337060 176816148 177022353 176914193 176488431 175762426 174737078 173399500 171761713 169877561
10962A69877561k056818k157049k186878k153254k079959j990834j884930j744132
$$ 169877561 167820743 165663694 163476816 161323562 159243603 157252769 155367839 153623707
10954A53623707j560191j343027j111386q85015o74785m75216k86706j50656j30788
$$ 153623707 152063516 150720489 149609103 148724088 148049303 147574087 147287381 147136725 147005937
10945A47005937k43119m37385o68536r46759j284750j637912j943895k186192
$$ 147005937 146762818 146325433 145656897 144710138 143425388 141787476 139843581 137657389
10937A37657389k366595k450617k406850k275163k124132j958567j743183j499530
$$ 137657389 135290794 132840177 130433327 128158164 126034032 124075465 122332282 120832752
10929A20832752j290864j118218r30178p40926o28803n92474n24645l80928k64702
$$ 120832752 119541888 118423670 117493492 116752566 116123763 115531289 115006644 114625716 114361014
10920A14361014k68107l25568l20632k59766k30971k46379k43032k09499j98234
$$ 114361014 114092907 113767339 113446707 113186941 112955970 112709591 112466559 112257060 112058826
10911A12058826k20123k26999k02430j83746j87875j91962j91938k07137k24581
$$ 112058826 111838703 111611704 111409274 111225528 111037653 110845691 110653753 110446616 110222035
10902A10222035k11996j86331j90124j98435j39644k2151N6704N8812O5252J37308
$$ 110222035 110010039 109823708 109633584 109435149 109295505 109273354 109330058 109388870 109454122 109591430
10892A09591430K06925J78040O8187l3255j01131j84626l07343m36309n43329
$$ 109591430 109798355 109976395 110044582 110011327 109910196 109725570 109418227 108981918 108438589
10883A08438589o30967o95655p20175p10306o95384o85567o65611o35175o15883
$$ 108438589 107807622 107111967 106391792 105681486 104986102 104300535 103634924 102999749 102383866
10874A02383866o07298n73261m94359m08051l68764l80484l96838l86640l69754
$$ 102383866 101776568 101203307 100708948 100300897 99932133 99551649 99154811 98768171 98398417
10865I8398417l72789l74714l32312k52368j91953j71567j34618k9599J07172
$$ 98398417 98025628 97650914 97318602 97066234 96874281 96702714 96568096 96538497 96645669
10856I6645669K04405K64321L52076M87721O22477P31774Q57524J027592J197695
$$ 96645669 96850074 97114395 97466471 97954192 98576669 99308443 100165967 101193559 102391254
10847A02391254J319458J418551J551753J714458J842025J892879J890564J881627
$$ 102391254 103710712 105129263 106681016 108395474 110237499 112130378 114020942 115902569
10839A15902569J874481J826729J693825J492393J293735J129270R32575O29685
$$ 115902569 117777050 119603779 121297604 122789997 124083732 125213002 126145577 126775262
10831A26775262K62454o0071l27632o43345j048416j441701j728846j946809k159140
$$ 126775262 127037716 126977645 126650013 126006668 124958252 123516551 121787705 119840896 117681756
10822A17681756k325133k384404k395623k457589k536762k514574k390208k293398
$$ 117681756 115356623 112972219 110576596 108119007 105582245 103067671 100677463 98384065
10814I8384065k282665k268405k177568k070019k023429k002673j928505j807509
$$ 98384065 96101400 93832995 91655427 89585408 87561979 85559306 83630801 81823292
10806H1823292j707795j647536j586506j506257j430357j371281j311263j238861
$$ 81823292 80115497 78467961 76881455 75375198 73944841 72573560 71262297 70023436
10798G0023436j165250j098279j028899r52729q86440q47939q23708p72608o78149
$$ 70023436 68858186 67759907 66731008 65778279 64891839 64043900 63220192 62447584 61769435
10789F1769435n86105n54725n65848n38141m50121l82979l90217l96355l12419
$$ 61769435 61183330 60628605 60062757 59524616 59074495 58691516 58301299 57904944 57592525
10780E7592525j92182j52986j75282j26094J5439J10485P8950J4846P028j7549
$$ 57592525 57400343 57247357 57072075 56945981 56961420 57071905 57150855 57165701 57172729 57155180
10770E7155180j59648l64428n03436n67860o46863p57381q25390q19012p84800
$$ 57155180 56995532 56631104 56127668 55559808 54912945 54155564 53330174 52511162 51726362
10761E1726362p53794p09559o51584o04615n62947n01769m40616m21591m31563
$$ 51726362 50972568 50263009 49611425 49006810 48443863 47942094 47501478 47079887 46648324
10752D6648324m21504l92716l83151l79617l34623k66274k43471k65715k58333
$$ 46648324 46226820 45834104 45450953 45071336 44736713 44470439 44226968 43961253 43702920
10743D3702920k03323j71052j91780j97694j38598o3647l3944l4050k6526k0781
$$ 43702920 43499597 43328545 43136765 42939071 42800473 42736826 42702882 42668832 42642306 42621525
10733D2621525k9216k1572J8529N2465N5334O1299Q6879Q2727K8356j80N9096
$$ 42621525 42592309 42570737 42589266 42641731 42697065 42758364 42845243 42927970 42956326 42956146 43015242
10722D3015242J41285J46987R4155P6777J14203J48016J59323J79905K03759J96911
$$ 43015242 43156527 43303514 43397669 43474446 43588649 43736665 43895988 44075893 44279652 44476563
10712D4476563J88230K40453L28110L55950L13576K99109L60148M23219M27847
$$ 44476563 44664793 44905246 45233356 45589306 45902882 46201991 46562139 46985358 47413205
10703D7413205M24810M75406N43935N68703N68571N97283O47569O81861P14356
$$ 47413205 47838015 48313421 48857356 49426059 49994630 50591913 51239482 51921343 52635699
10694E2635699P81146Q60526R02555R17605R60858J040163J108576J144314J174415
$$ 52635699 53416845 54277371 55179926 56097531 57058389 58098552 59207128 60351442 61525857
10685F1525857J215983J249353J256640J242752J214254J174151J134141J095866
$$ 61525857 62741840 63991193 65247833 66490585 67704839 68878990 70013131 71108997
10677G1108997J031308R24770Q22207P87815Q17316Q46811Q46242Q50670Q95727
$$ 71108997 72140305 73065075 73887282 74675097 75492413 76339224 77185466 78036136 78931863
10668G8931863R75797J075022J189294J305950J407137J502441J615174J734444
$$ 78931863 79907660 80982682 82171976 83477926 84885063 86387504 88002678 89737122
10660H9737122J829225J904677J979428K008323J912755J708332J513947J394116
$$ 89737122 91566347 93471024 95450452 97458775 99371530 101079862 102593809 103987925
10652A03987925J278182J092057Q87374P62442P21874P03701O96162P32035P97091
$$ 103987925 105266107 106358164 107245538 108007980 108729854 109433555 110129717 110861752 111658843
10643A11658843Q36729Q40185Q38944Q34183Q00038P45131O98024O48093N76157
$$ 111658843 112495572 113335757 114174701 115008884 115808922 116554053 117252077 117900170 118476327
10634A18476327N23225N44832O17099O81335P61188R25084J144847J320349J449181
$$ 118476327 118999552 119544384 120161483 120842818 121604006 122529090 123673937 124994286 126443467
10625A26443467J629025J864974K029146K068425K094379K175616K191670K019782
$$ 126443467 128072492 129937466 131966612 134035037 136129416 138305032 140496702 142516484
10617A42516484J736713J481919J227289Q60924M24846P2319j78908m52481p67854
$$ 142516484 144253197 145735116 146962405 147823329 148248175 148320494 148141586 147689105 146921251
10608A46921251r82012j021063r96069j011500j005799q84256o97765n72303n27073
$$ 146921251 145939239 144918176 143922107 142910607 141904808 141020552 140322787 139750484 139223411
10599A39223411m69591l40596j80812o2427n799L7927J38142L02552M50650N11320
$$ 139223411 138753820 138413224 138232412 138169985 138164186 138202113 138340255 138642807 139093457 139604777
10589A39604777N31671O18016P77702R14896R91088J076263J207092J313634J346526
$$ 139604777 140136448 140754464 141532166 142447062 143438150 144514413 145721505 147035139 148381665
10580A48381665J361897J398515J378322J232256J033390Q87456P65043N69889
$$ 148381665 149743562 151142077 152520399 153752655 154786045 155673501 156438544 157008433
10572A57008433L18275J16677n989j13875k29638l07061l31213l31163k94792
$$ 157008433 157326708 157443385 157437396 157323521 157093883 156786822 156455609 156124446 155829654
10563A55829654j81822k2620J07189K16711L92434O49418R04164J115919J338046
$$ 155829654 155647832 155625212 155732401 155949112 156341546 156990964 157895128 159011047 160349093
10554A60349093J596549J834903K028026K240496K510192K774434K981767L185818
$$ 160349093 161945642 163780545 165808571 168049067 170559259 173333693 176315460 179501278
10546A79501278L448331L728142L956902M167294M455526M850864N298459N749020
$$ 179501278 182949609 186677751 190634653 194801947 199257473 204108337 209406796 215155816
10538B15155816O205347O697006P250383P864795Q498584R112703R724378J0333232
$$ 215155816 221361163 228058169 235308552 243173347 251671931 260784634 270509012 280842244
10530B80842244J0767918J0707491R923923Q439859O417853M020206J464351r16215
$$ 280842244 291610162 302317653 312241576 320681435 327099288 331119494 332583845 331667630
10522C31667630k828423m188334n022064n286847m959539m252846l545010l070771
$$ 331667630 328839207 324650873 319628809 314341962 309382423 305129577 301584567 298513796
10514B98513796k824882k766184k928887l279026l637647l854213l942291l953294
$$ 298513796 295688914 292922730 289993843 286714817 283077170 279222957 275280666 271327372
10506B71327372l826596l474445k934147k325697j715785j126463o34475l57950
$$ 271327372 267500776 264026331 261092184 258766487 257050702 255924239 255289764 254931814
10498B54931814l59177o31867j154205j875397k673362l409799m024750m517815
$$ 254931814 254572637 253940770 252786565 250911168 248237806 244828007 240803257 236285442
10490B36285442m858582m996425m956857m849338m760419m695472m639006m612716
$$ 236285442 231426860 226430435 221473578 216624240 211863821 207168349 202529343 197916627
10482A97916627m642735m709123m763101m781501m787226m820684m891309m952620
$$ 197916627 193273892 188564769 183801668 179020167 174232941 169412257 164520948 159568328
10474A59568328m940582m850409m750881m695730m646071m520898m306314m066136
$$ 159568328 154627746 149777337 145026456 140330726 135684655 131163757 126857443 122791307
10466A22791307l851288l650541l438565l226286l042294k892660k758755k621779
$$ 122791307 118940019 115289478 111850913 108624627 105582333 102689673 99930918 97309139
10458I7309139k481433k357374k266585k192514k097773j982897j898611j867149
$$ 97309139 94827706 92470332 90203747 88011233 85913460 83930563 82031952 80164803
10450H0164803j831072j734610j620539j569332j563196j506489j384069j292304
$$ 80164803 78333731 76599121 74978582 73409250 71846054 70339565 68955496 67663192
10442F7663192j279592j263377j171676j071565j059914j096695j065283r60494
$$ 67663192 66383600 65120223 63948547 62876982 61817068 60720373 59655090 58694596
10434E8694596q88324q83626q60192p74762p15661p54632q09417p58428o32626
$$ 58694596 57806272 56922646 56062454 55287692 54572031 53817399 53007982 52249554 51616928
10425E1616928n75446o30296o84771o45463n63819n35575n56606n56188n23418
$$ 51616928 51041482 50411186 49726415 49080952 48517133 47981558 47424952 46868764 46345346
10416D6345346n11025n29564n25750m80081m49905m78382n18501m98484m25735
$$ 46345346 45834321 45304757 44779007 44298926 43849021 43370639 42852138 42353654 41927919
10407D1927919l70386l64817l74486l64313l42004l24817l06713k80155k60394
$$ 41927919 41557533 41192716 40818230 40453917 40111913 39787096 39480383 39200228 38939834
10398C8939834k62700k72369k60386k22972j89942j93050k31253k68142k67892
$$ 38939834 38677134 38404765 38144379 37921407 37731465 37538415 37307162 37039020 36771128
10389C6771128k36574k16079k27876k42051k24764j96521k04093k42967k55693
$$ 36771128 36534554 36318475 36090599 35848548 35623784 35427263 35223170 34980203 34724510
10380C4724510k15480j66679j63935k07835k59393k83192k59124j92454j34256
$$ 34724510 34509030 34342351 34178416 33970581 33711188 33427996 33168872 32976418 32842162
10371C2842162j44831k05244k16975j35464n0647o7123j48977j73813j18961q9701
$$ 32842162 32697331 32492087 32275112 32139648 32089001 32021878 31872901 31699088 31580127 31490426
10361C1490426j52233k40006k66602k47605k50460k83892l04165k94126k74783
$$ 31490426 31338193 31098187 30831585 30583980 30333520 30049628 29745463 29451337 29176554
10352B9176554k60559k53527k63274k88054k95401k64815k29874k32413k54209
$$ 29176554 28915995 28662468 28399194 28111140 27815739 27550924 27321050 27088637 26834428
10343B6834428k45110k04414j78548j84070j89681j76540j61236j50590j27620
$$ 26834428 26589318 26384904 26206356 26022286 25832605 25656065 25494829 25344239 25216619
10334B5216619r7884r8199j35659j62893j42882j01828q7761j06091j25343j23818
$$ 25216619 25118735 25020536 24884877 24721984 24579102 24477274 24389513 24283422 24158079 24034261
10324B4034261j05331q7362r1798j27263j67768j74889j53096j49876j85644k21850
$$ 24034261 23928930 23841568 23749770 23622507 23454739 23279850 23126754 22976878 22791234 22569384
10314B2569384k20558j95412j75826j61878j48473j52629j76632j84544j60113
$$ 22569384 22348826 22153414 21977588 21815710 21667237 21514608 21337976 21153432 20993319
10305B0993319j46020j74237k02196j81583j45824j49995j63211j18618m5262
$$ 20993319 20847299 20673062 20470866 20289283 20143459 19993464 19830253 19711635 19666373
10296A9666373l7004r3194j10204n1121k443j9363l3969J4590O7408N3788K0067
$$ 19666373 19629369 19536175 19425971 19374850 19372407 19353044 19319075 19333665 19401073 19454861 19474928
10285A9474928M2366Q0902M2851n3563j04015q9203r7239j67315k25490k08612
$$ 19474928 19517294 19598196 19641047 19587484 19483469 19394266 19297027 19129712 18904222 18695610
10275A8695610j58318j45316j69355j82188j62191j25987r7812r2457j01789q9697
$$ 18695610 18537292 18391976 18222621 18040433 17878242 17752255 17654443 17561986 17460197 17370500
10265A7370500l4369K5148L1319l404r326L2189O0690L6996J581k369N73k8014
$$ 17370500 17336131 17361279 17392598 17389194 17379868 17412057 17472747 17509743 17511324 17508955 17509528 17481514
10253A7481514p0493r1005r9873j24914j53028j55520j43696j44557j44447j13832
$$ 17481514 17411021 17320016 17220143 17095229 16942201 16786681 16642985 16498428 16353981 16240149
10243A6240149p2170o8515j01358j14093p9121l8637m2021p6263q5156m4686L817
$$ 16240149 16167979 16099464 15998106 15884013 15804892 15766255 15724234 15647971 15562815 15518129 15521946
10232A5521946L074m6207q1290n8502j2450j464j8728j4681N952j1064n9689o1188
$$ 15521946 15525020 15478813 15397523 15339021 15326571 15325107 15306379 15291698 15297650 15286586 15226897 15165709
10220A5165709K594L8388j3492p2610m4053K6237L0305k5971m8956k1978j2375
$$ 15165709 15168303 15206691 15193199 15120589 15076536 15102773 15133078 15107107 15058151 15036173 15023798
10209A5023798l0566j8037K0199Q584n0597n8049J1776N4887J3380k4422J7015
$$ 15023798 14993232 14975195 14995394 15003978 14953381 14895332 14907108 14961995 14975375 14950953 14967968
10198A4967968O4345K7979l3643j3530N7449O5847Q325j5925J7946L4725J0943
$$ 14967968 15032313 15060292 15026649 15013119 15070568 15136415 15144740 15128815 15146761 15181486 15192429
10187A5192429J3899O4217Q7127M6594J5968N3367J01914Q8273M4031M4875Q3907
$$ 15192429 15206328 15270545 15357672 15404266 15420234 15473601 15575515 15663788 15707819 15752694 15836601
10176A5836601R4848P0125O7273J03772J25155R5063N6354P0461J32322J81005
$$ 15836601 15931449 16001574 16068847 16172619 16297774 16392837 16449191 16519652 16651974 16832979
10166A6832979J80632J59982J67276K05591K31872K18381J93181K03398K52858
$$ 16832979 17013611 17173593 17340869 17546460 17778332 17996713 18189894 18393292 18646150
10157A8646150L01815L23448L30815L43693L59125L69372L85148M20084M64085
$$ 18646150 18947965 19271413 19602228 19945921 20305046 20674418 21059566 21479650 21943735
10148B1943735M88481M72915M21025L57347L09693K81510K42178J62914O2393
$$ 21943735 22432216 22905131 23326156 23683503 23993196 24274706 24516884 24679798 24742191
10139B4742191p468k5516k4572m1610p2966r4083r6528q4261n6551j9861J079
$$ 24742191 24734723 24709207 24684635 24643025 24570059 24475976 24379448 24295187 24238636 24218775 24219854
10128B4219854r424l1255l2059p548K2339M5225N9887N8121L1919k380j3744K381
$$ 24219854 24210430 24179175 24147116 24139568 24161907 24207132 24267019 24325140 24357059 24354679 24340935 24343316
10116B4343316J0644k4950r4203j41418j19613m7984l506l5427r6735r5824j8580
$$ 24343316 24353960 24329010 24234807 24093389 23973776 23925792 23922286 23886859 23790124 23694300 23675720
10105B3675720M7619L1366l2006o6969o8859q7960j33829j69047j86735k17080
$$ 23675720 23723339 23754705 23722699 23655730 23586871 23498911 23365082 23196035 23009300 22792220
10095B2792220k50929k34675j64286j11263j17616j31755r8765n2810n2622p3043
$$ 22792220 22541291 22306616 22142330 22031067 21913451 21781696 21682931 21630121 21577499 21504456
10085B1504456m3167L2164P4544N3487K5717L8844O7180P1020N9418N8471O5414
$$ 21504456 21461289 21493453 21567997 21621484 21647201 21686045 21753225 21824245 21883663 21942134 22007548
10074B2007548P1142Q6845J11408J13032Q5244Q0698J36113J97955J88768J26599
$$ 22007548 22078690 22165535 22276943 22389975 22475219 22555917 22692030 22889985 23078753 23205352
10064B3205352J03513J48546J91492J81518J64302J97238K49888K52263K06092
$$ 23205352 23308865 23457411 23648903 23830421 23994723 24191961 24441849 24694112 24900204
10055B4900204J80027K04944K35547K24658J87812J73342J97711K31894K39110
$$ 24900204 25080231 25285175 25520722 25745380 25933192 26106534 26304245 26536139 26775249
10046B6775249K13563J86936J97433K46416K93150L03546K91461K92987L13309
$$ 26775249 26988812 27175748 27373181 27619597 27912747 28216293 28507754 28800741 29114050
10037B9114050L27326L25315L25387L41186L68328M03400M42855M61929M36276
$$ 29114050 29441376 29766691 30092078 30433264 30801592 31204992 31647847 32109776 32546052
10028C2546052L94285M01591M71081N32579N25451M81222M70130M99822N23964
$$ 32546052 32940337 33341928 33813009 34345588 34871039 35352261 35822391 36322213 36846177
10019C6846177N30087N51694N93440O11362N88721N75072O13984O73362O91921
$$ 36846177 37376264 37927958 38521398 39132760 39721481 40296553 40910537 41583899 42275820
10010D2275820O69378O62316O98230P39583P43965P25302P31266P75318Q17513
$$ 42275820 42945198 43607514 44305744 45045327 45789292 46514594 47245860 48021178 48838691
10001D8838691Q17519P91006P96750Q65346R55508R98282R81958R71627J032976
$$ 48838691 49656210 50447216 51243966 52109312 53064820 54063102 55045060 56016687 57049663
9992E7049663J152682J255333J295028J306878J358491J467254J585341J663361
$$ 57049663 58202345 59457678 60752706 62059584 63418075 64885329 66470670 68134031
9984F8134031J707744J764298J859529J979034K100918K225291K359369K494958
$$ 68134031 69841775 71606073 73465602 75444636 77545554 79770845 82130214 84625172
9976H4625172K623854K763941K941249L146919L341420L509096L677775L864972
$$ 84625172 87249026 90012967 92954216 96101135 99442555 102951651 106629426 110494398
9968A10494398M033579M136396M187747M243209M303524M285863M113860L794483
$$ 110494398 114527977 118664373 122852120 127095329 131398853 135684716 139798576 143593059
9960A43593059L365565K803186K050534J136925J96097o62070j436236k144518
$$ 143593059 146958624 149761810 151812344 152949269 153145366 152483296 151047060 148902542
9952A48902542k711772l030647l112280l082834l019477k877617k614355k297048
$$ 148902542 146190770 143160123 140047843 136965009 133945532 131067915 128453560 126156512
9944A26156512k020641j779733j510471j224581j004668q71261p50481n97673
$$ 126156512 124135871 122356138 120845667 119621086 118616418 117745157 116994676 116397003
9936A16397003m68400m19573m07779l52237k57539j99946k04843k08187j53302
$$ 116397003 115928603 115509030 115101251 114749014 114491475 114291529 114086686 113878499 113725197
9927A13725197p1426l5399o6463j24537j79033k53196l89472n93854q31325j063593
$$ 113725197 113653771 113618372 113551909 113427372 113248339 112995143 112605671 112011817 111180492 110116899
9917A10116899j270601j440208j562685j641976j690586j705169j671954j606518
$$ 110116899 108846298 107406090 105843405 104201429 102510843 100805674 99133720 97527202
9909I7527202j553553j523110j464955j346360j220093j157290j138903j087882
$$ 97527202 95973649 94450539 92985584 91639224 90419131 89261841 88122938 87035056
9901H7035056r98525r46078r54656r48736q77738q04386q03642q40475q28623
$$ 87035056 86036531 85090453 84135797 83187061 82309323 81504937 80701295 79860820 79032197
9892G9032197p65139p19494p14074p02769o62969o28092o18199o06865n75991
$$ 79032197 78267058 77547564 76833490 76130721 75467752 74839660 74221461 73614596 73038605
9883G3038605n48086n42630n44501n35037n19074n07356n01906n03862n06074
$$ 73038605 72490519 71947889 71403388 70868351 70349277 69841921 69340015 68836153 68330079
9874F8330079m83504m29758l92419m19035m74112m75143m15726l78826m07098
$$ 68330079 67846575 67416817 67024398 66605363 66131251 65656108 65240382 64861556 64454458
9865F4454458m36575l99835l27768k94264l11027l34619l38989l25684k93144
$$ 64454458 64017883 63618048 63290280 62996016 62684989 62350370 62011381 61685697 61392553
9856F1392553k47970k21186k26692k29522j98862j62037j58805j73973j67117
$$ 61392553 61144583 60923397 60696705 60467183 60268321 60106284 59947479 59773506 59606389
9847E9606389j37904j06936o5818r120J9860q989l7152O422P9140Q1697L0650
$$ 59606389 59468485 59361549 59295731 59286611 59306471 59297482 59260330 59266752 59345892 59427589 59458239
9836E9458239M7926J58174K31115J85260J25516J82197L09566L64779L26903L07784
$$ 59458239 59506165 59664339 59895454 60080714 60206230 60388427 60697993 61062772 61389675 61697459
9826F1697459L67118M40805M65047M67100M98339N54939O05284O41015O66733
$$ 61697459 62064577 62505382 62970429 63437529 63935868 64490807 65096091 65737106 66403839
9817F6403839O83422P09646P75568Q67389R21564R10762Q97811R58754J076559
$$ 66403839 67087261 67796907 68572475 69439864 70361428 71272190 72170001 73128755 74205314
9808G4205314J160320J162980J135551J156186J238572J329406J379782J396476
$$ 74205314 75365634 76528614 77664165 78820351 80058923 81388329 82768111 84164587
9800H4164587J420938J473667J536036J584676J620723J652360J671849J677159
$$ 84164587 85585525 87059192 88595228 90179904 91800627 93452987 95124836 96801995
9792I6801995J697734J757761J821941J829557J790722J791281J872879J962181
$$ 96801995 98499729 100257490 102079431 103908988 105699710 107490991 109363870 111326051
9784A11326051J970225J921477J915477J978356K030594K013709J975247J987459
$$ 111326051 113296276 115217753 117133230 119111586 121142180 123155889 125131136 127118595
9776A27118595K035565K045889J999101J951994J944800J943033J896876J819400
$$ 127118595 129154160 131200049 133199150 135151144 137095944 139038977 140935853 142755253
9768A42755253J764965J744849J708304J616660J502502J430025J413726J404863
$$ 142755253 144520218 146265067 147973371 149590031 151092533 152522558 153936284 155341147
9760A55341147J354276J262410J164596J091052J049212J023314R80149Q95342
$$ 155341147 156695423 157957833 159122429 160213481 161262693 162286007 163266156 164161498
9752A64161498P86016O96326O37186N66494M49061L06546J77245N5970q2181k22305
$$ 164161498 164947514 165643840 166281026 166847520 167296581 167603127 167780372 167836342 167754161 167531856
9742A67531856l30933m24145n48596o93255p92062q31995q83342r86339j082015
$$ 167531856 167200923 166776778 166228182 165534927 164742865 163910870 163027528 162041189 160959174
9733A60959174j113194j127327j199717j305426j363942j381630j441047j551644
$$ 160959174 159845980 158718653 157518936 156213510 154849568 153467938 152026891 150475247
9725A50475247j625264j627527j644977j745242j864514j914271j925867j988721
$$ 150475247 148849983 147222456 145577479 143832237 141967723 140053452 138127585 136138864
9717A36138864k090913k133775k093462k057964k084473k118216k096807k053270
$$ 136138864 134047951 131914176 129820714 127762750 125678277 123560061 121463254 119409984
9709A19409984k049818k066699k035327j954268j893774j886618j884083j838511
$$ 119409984 117360166 115293467 113258140 111303872 109410098 107523480 105639397 103800886
9701A03800886j771345j725196j691121j629579j541514j470375j436462j411673
$$ 103800886 102029541 100304345 98613224 96983645 95442131 93971756 92535294 91123621
9693I1123621j368744j319728j287757j271059j262578j284242j366079j495819
$$ 91123621 89754877 88435149 87147392 85876333 84613755 83329513 81963434 80467615
9685H0467615j619673j696827j730729j745243j754426j760554j756400j720338
$$ 80467615 78847942 77151115 75420386 73675143 71920717 70160163 68403763 66683425
9677F6683425j634442j520857j434742j400699j378342j317161j227724j164305
$$ 66683425 65048983 63528126 62093384 60692685 59314343 57997182 56769458 55605153
9669E5605153j143817j120654j053168r65039r15875r22329r34760q99080q23962
$$ 55605153 54461336 53340682 52287514 51322475 50406600 49484271 48549511 47650431 46826469
9660D6826469p66884p57588p62084p35382o83560o44172o24066n98753n65622
$$ 46826469 46059585 45301997 44539913 43804531 43120971 42476799 41852733 41253980 40688358
9651D0688358n47534n39514n07571m56648m39722m68729m78746m27979l72402
$$ 40688358 40140824 39601310 39093739 38637091 38197369 37728640 37249894 36821915 36449513
9642C6449513l75039l96239l61714k98889k98422l55848l69164l08114k69223
$$ 36449513 36074474 35678235 35316521 35017632 34719210 34363362 33994198 33686084 33416861
9633C3416861l18340l82684l67714k99278k68095k90811l10076k96851k75029
$$ 33416861 33098521 32715837 32348123 32048845 31780750 31489939 31179863 30883012 30607983
9624C0607983k64037k61512k68895k81921k73546k33479k00919k09953k31400
$$ 30607983 30343946 30082434 29813539 29531618 29258072 29024593 28823674 28613721 28382321
9615B8382321k22147j99752k05363k24052k15251j96175k12688k46020k39587
$$ 28382321 28160174 27960422 27755059 27531007 27315756 27119581 26906893 26660873 26421286
9606B6421286k09100k25211k81394k87249k18760j66921j90534k22999j91802
$$ 26421286 26212186 25986975 25705581 25418332 25199572 25032651 24842117 24619118 24427316
9597B4427316j39153j38862j66853j52626j08401j03476j37772j41987r7868o6697
$$ 24427316 24288163 24149301 23982448 23829822 23721421 23617945 23480173 23338186 23240318 23173621
9587B3173621q7175j21291j22042r5305p3196p1453q8709j10585j07660o6483
$$ 23173621 23086446 22965155 22843113 22747808 22674612 22603159 22514450 22403865 22296205 22229722
9577B2229722k3560k7963p1203r8116q5376o0555m5475l6364m1503p5001j05350
$$ 22229722 22206162 22178199 22106996 22008880 21923504 21862949 21817474 21781110 21739607 21664606 21559256
9566B1559256q1225k5766k5949r4770j28880o1370K2955R149p2449r6940l8103
$$ 21559256 21478031 21452265 21426316 21331546 21202666 21141296 21164251 21173400 21100951 21004011 20965908
9555B0965908L817l0916p6266n6425J010K1805n124l1966k9415q790J1781K2187
$$ 20965908 20969725 20938809 20862543 20806118 20807128 20828933 20823809 20791843 20762428 20753638 20765419 20787606
9543B0787606J4307q544k6425k5909j3306O962L9813O9710O0289J2173j5459J9516
$$ 20787606 20801913 20793369 20766944 20741035 20727729 20734691 20774504 20844214 20904503 20916676 20901217 20920733
9531B0920733P6631R0065O4839N9560R0071J13942J09078J04742J22585J42745
$$ 20920733 20997364 21087429 21152268 21211828 21301899 21415841 21524919 21629661 21752246 21894991
9521B1894991J47491J50510J62493J71491J76740J97549K29053K37926K25910
$$ 21894991 22042482 22192992 22355485 22526976 22703716 22901265 23130318 23368244 23594154
9512B3594154K43572L07785L62036L63464L52926L80311M13650L97847L60829
$$ 23594154 23837726 24145511 24507547 24871011 25223937 25604248 26017898 26415745 26776574
9503B6776574L70846M12637M03897L30269K66350K50933K36905J90964J49998
$$ 26776574 27147420 27560057 27963954 28294223 28560573 28811506 29048411 29239375 29389373
9494B9389373J36717J06622L6492j0795J9452P5367P1497J5477j5952M732L7903
$$ 29389373 29526090 29632712 29669204 29658409 29677861 29753228 29824725 29840202 29824250 29828982 29866885
9483B9866885N5331O3061N9130L6760K0413L4379M5851N518o5171j00236r6773
$$ 29866885 29922216 29985277 30044407 30081167 30101580 30135959 30181810 30187328 30122157 30021921 29925148
9472B9925148j15208j67840j96319j81547j84867k37973k76692k45354j95138
$$ 29925148 29809940 29642100 29445781 29264234 29079367 28841394 28564702 28319348 28124210
9463B8124210k01717k38590k20332j42398q8064j00840j30973j22789q7559o2675
$$ 28124210 27922493 27683903 27463571 27321173 27233109 27132269 27001296 26878507 26790948 26728273
9453B6728273n0602l2796r944N535J7050L5415N5067O2897O4964Q2162J17114
$$ 26728273 26677671 26644875 26634931 26640466 26657516 26692931 26747998 26810895 26875859 26958021 27075135
9442B7075135J43225J38154J19388J28678J77422K26893K39502K32171K47219
$$ 27075135 27218360 27356514 27475902 27604580 27782002 28008895 28248397 28480568 28727787
9433B8727787K79972K82813K50471K46814L12071L90349M04127L69257L67939
$$ 28727787 29007759 29290572 29541043 29787857 30099928 30490277 30894404 31263661 31631600
9424C1631600M20816M62755M55868M48942M88535N38112N42656N24764N46101
$$ 31631600 32052416 32515171 32971039 33419981 33908516 34446628 34989284 35514048 36060149
9415C6060149O02177O33681O34621O66095P45205Q00460P81689P47043P75264
$$ 36060149 36662326 37296007 37930628 38596723 39341928 40142388 40924077 41671120 42446384
9406D2446384Q39866Q52999Q09500P92953Q33257Q54308Q00992P33143P28180
$$ 42446384 43286250 44139249 44948749 45741702 46574959 47429267 48230259 48963402 49691582
9397D9691582P55387P31175O59648O23429O46930O64469O37898O16678O44528
$$ 49691582 50446969 51178144 51837792 52461221 53108151 53772620 54410518 55027196 55671724
9388E5671724O82234O76942O50379O54118O76171O62502O15179O00464O50724
$$ 55671724 56353958 57030900 57681279 58335397 59011568 59674070 60289249 60889713 61540437
9379F1540437P10997P07134O37802N72825N68098O01556O04542N52111M96576
$$ 61540437 62251434 62958568 63596370 64169195 64737293 65338849 65943391 66495502 66992078
9370F6992078M91047N08253M85018M31024M17559M48523M34525L41350K72067
$$ 66992078 67483125 67991378 68476396 68907420 69324979 69773502 70208027 70549377 70821444
9361G0821444L15859L89146L45828K05339J33463J94783K63992K27055J44852
$$ 70821444 71137303 71526449 71872277 72077616 72211079 72405862 72669854 72896909 73041761
9352G3041761J35312J88966K08010J72375J53512J79764J92712J54384J14265
$$ 73041761 73177073 73366039 73574049 73746424 73899936 74079700 74272412 74426796 74541061
9343G4541061J29642J74120J74624J13013M3907J4914R064j6420o1376q7612q5913
$$ 74541061 74670703 74844823 75019447 75132460 75176367 75191281 75200345 75183925 75122549 75034937 74949024
9332G4949024r4376j32028j57043j31398r2631j01265j36447j18669l7530K4481
$$ 74949024 74854648 74722620 74565577 74434179 74341548 74240283 74103836 73985167 73947637 73972118
9322G3972118J8458j670K1480N7691O1035O5171J22470J95670K06724J69120J71713
$$ 73972118 73990576 73988906 74010386 74068077 74129112 74194283 74316753 74512423 74719147 74888267 75059980
9311G5059980K35369K85809K84468K88334L41946L98493M06847M04754M50897
$$ 75059980 75295349 75581158 75865626 76153960 76495906 76894399 77301246 77706000 78156897
9302G8156897N16284N29442N03011N23587O12073O79979O58095O01901O13823
$$ 78156897 78673181 79202623 79705634 80229221 80841294 81521273 82179368 82781269 83395092
9293H3395092O99660P66859P56272P14060P16124P70906Q32786Q78649R22721
$$ 83395092 84094752 84861611 85617883 86331943 87048067 87818973 88651759 89530408 90453129
9284I0453129R68569R99147J020875J067826J141178J189650J184392J174715
$$ 90453129 91421698 92420845 93441720 94509546 95650724 96840374 98024766 99199481
9276I9199481J221831J304310J347680J336545J332485J371569J407234J386008
$$ 99199481 100421312 101725622 103073302 104409847 105742332 107113901 108521135 109907143
9268A09907143J330644J303422J317853J334741J329979J317226J303892J270917
$$ 109907143 111237787 112541209 113859062 115193803 116523782 117841008 119144900 120415817
9260A20415817J212140J158376J136935J130757J107788J074788J063116J064067
$$ 120415817 121627957 122786333 123923268 125054025 126161813 127236601 128299717 129363784
9252A29363784J026396R38691Q68438Q73651R06829Q71745P66598O93469P05497
$$ 129363784 130390180 131328871 132197309 133070960 133977789 134849534 135616132 136309601 137015098
9243A37015098P22943O52209N23005M31342L89977L28390K25854J44841J15824
$$ 137015098 137738041 138390250 138913255 139344597 139734574 140062964 140288818 140433659 140549483
9234A40549483Q0026j1474j15277j67977j84784k20640k71001k83251k51625k31574
$$ 140549483 140629509 140618035 140502758 140334781 140149997 139929357 139658356 139375105 139123480 138891906
9224A38891906k53910k82001k73271k39827k21292k25711k26152k02326j61936
$$ 138891906 138637996 138355995 138082724 137842897 137621605 137395894 137169742 136967416 136805480
9215A36805480j25414j05990j02232r7023o6831p292N0978P2020O6416Q8869J64607
$$ 136805480 136680066 136574076 136471844 136374821 136307990 136300698 136351676 136423696 136490112 136578981 136743588
9204A36743588K44213K71069K76846L50219N04570O46459P10214P56507Q73971
$$ 136743588 136987801 137258870 137535716 137885935 138390505 139036964 139747178 140503685 141377656
9195A41377656J036198J144820J188414J258562J401831J550250J631319J670587
$$ 141377656 142413854 143558674 144747088 146005650 147407481 148957731 150589050 152259637
9187A52259637J738951J853470J976600K075204K143216K195288K261127K354890
$$ 152259637 153998588 155852058 157828658 159903862 162047078 164242366 166503493 168858383
9179A68858383K441591K478690K492267K544440K617901K624253K556304K525610
$$ 168858383 171299974 173778664 176270931 178815371 181433272 184057525 186613829 189139439
9171A89139439K587802K637233K567565K442278K386854K388305K343152K252753
$$ 189139439 191727241 194364474 196932039 199374317 201761171 204149476 206492628 208745381
9163B08745381K211858K221080K174840K052330J963420J959160J940009J821693
$$ 208745381 210957239 213178319 215353159 217405489 219368909 221328069 223268078 225089771
9155B25089771J667109J566401J490386J362739J196443J052412R18863P35873
$$ 225089771 226756880 228323281 229813667 231176406 232372849 233425261 234344124 235079997
9147B35079997N06019K88673J06812n9473k06647l13611m01270n11040o28095
$$ 235079997 235586016 235874689 235981501 235922028 235715381 235401770 235000500 234489460 233861365
9138B33861365o93350o90750o60771o28663n83066n30139n03341n01623m74821
$$ 233861365 233168015 232477265 231816494 231187831 230604765 230074626 229571285 229069662 228594841
9129B28594841l96742l08690k63878k64423k79604k95440l15375l32874l36131
$$ 228594841 228198099 227889409 227625531 227361108 227081504 226786064 226470689 226137815 225801684
9120B25801684l33953l51376l95576m41814m62126m60668m66559m88510m94374
$$ 225801684 225467731 225116355 224720779 224278965 223816839 223356171 222889612 222401102 221906728
9111B21906728m54323l90283l49335l30898k82565j81493p7682k8609k4890j5260
$$ 221906728 221452405 221062122 220712787 220381889 220099324 219917831 219840149 219811540 219786650 219771390
9101B19771390J9586N3442N5775J3029p5943j95071l15116m27663n57473p18721
$$ 219771390 219790976 219844418 219900193 219913222 219837279 219642208 219327092 218899429 218341956 217623235
9091B17623235q86649j041758j208144j406226j599303j739868j845168j969077
$$ 217623235 216736586 215694828 214486684 213080458 211481155 209741287 207896119 205927042
9083B05927042k116112k244476k343433k442507k545107k616919k646615k659057
$$ 205927042 203810930 201566454 199223021 196780514 194235407 191618488 188971873 186312816
9075A86312816k661485k637547k604984k613732k665115k694494k663915k618253
$$ 186312816 183651331 181013784 178408800 175795068 173129953 170435459 167771544 165153291
9067A65153291k617414k661380k715078k760751k789460k783532k747450k721107
$$ 165153291 162535877 159874497 157159419 154398668 151609208 148825676 146078226 143357119
9059A43357119k725375k726314k686918k620184k555288k485975k393270k288721
$$ 143357119 140631744 137905430 135218512 132598328 130043040 127557065 125163795 122875074
9051A22875074k191633k088256j956742j811980j684516j572799j455871j336292
$$ 122875074 120683441 118595185 116638443 114826463 113141947 111569148 110113277 108776985
9043A08776985j230942j132995j021147q96044p75066o63594n60404m73361l99764
$$ 108776985 107546043 106413048 105391901 104495857 103720791 103057197 102496793 102023432 101623668
9034A01623668l14799k14339j41215j24599j20341o6330K2099P3034O4840M9339
$$ 101623668 101308869 101094530 100953315 100828716 100708375 100642045 100664144 100737178 100802018 100851357
9024A00851357O7139R9582J15589J14774J11303J18319J54716K23010K79922K82120
$$ 100851357 100918496 101018078 101133667 101248441 101359744 101478063 101632779 101855789 102135711 102417831
9014A02417831K62731K97698L85857M37540M09660L73544L99420M45769M33752
$$ 102417831 102680562 102978260 103364117 103801657 104211317 104584861 104984281 105430050 105863802
9005A05863802L75405L42412L41250L11371K38243J79303J65131J53789J11370
$$ 105863802 106239207 106581619 106922869 107234240 107472483 107651786 107816917 107970706 108082076
8996A08082076P0529O8611Q0504O1714K1850N360K2189M5114O2119Q5572J15676
$$ 108082076 108152605 108221216 108301720 108363434 108385284 108390644 108412833 108457947 108520066 108605638 108721314
8985A08721314J38943J62317K04658K50106K58599K38060K54322L36181M17141
$$ 108721314 108860257 109022574 109227232 109477338 109735937 109973997 110228319 110564500 110981641
8976A10981641M22504L81013L85151M55593N19318N31643N45710O24209P41423
$$ 110981641 111404145 111785158 112170309 112625902 113145220 113676863 114222573 114846782 115588205
8967A15588205Q27223Q70993R23335J013396J120079J220411J318283J422262
$$ 115588205 116415428 117286421 118209756 119223152 120343231 121563642 122881925 124304187
8959A24304187J534329J663974J818585J978670K118793K254058K425290K632981
$$ 124304187 125838516 127502490 129321075 131299745 133418538 135672596 138097886 140730867
8951A40730867K831358L002139L187441L422951L680559L915002M135036M381971
$$ 140730867 143562225 146564364 149751805 153174756 156855315 160770317 164905353 169287324
8943A69287324M655877M912296N129129N329453N525604N680696N754029N761444
$$ 169287324 173943201 178855497 183984626 189314079 194839683 200520379 206274408 212035852
8935B12035852N755251N748054N691476N546242N347675N170810N041888M924942
$$ 212035852 217791103 223539157 229230633 234776875 240124550 245295360 250337248 255262190
8927B55262190M801912M719118M723944M794628M882857N002713N214384N519365
$$ 255262190 260064102 264783220 269507164 274301792 279184649 284187362 289401746 294921111
8919B94921111N832835O076820O245901O353663O367308O241200N978082N602930
$$ 294921111 300753946 306830766 313076667 319430330 325797638 332038838 338016920 343619850
8911C43619850N096043M408946L547562K592027J620902O52091l20435j258248
$$ 343619850 348715893 353124839 356672401 359264428 360885330 361537421 361216986 359958738
8903C59958738k079720k728778l219413l598549l875753m013025l990179l855248
$$ 359958738 357879018 355150240 351930827 348332278 344456525 340443500 336453321 332598073
8895C32598073l685855l515510l331125l138900k995187k961983l058621l264654
$$ 332598073 328912218 325396708 322065583 318926683 315931496 312969513 309910892 306646238
8887C06646238l544465l864946m219615m639998n148511n695308o183897o568260
$$ 306646238 303101773 299236827 295017212 290377214 285228703 279533395 273349498 266781238
8879B66781238o875854p121928p264075p274455p195764p076736o904153o654014
$$ 266781238 259905384 252783456 245519381 238244926 231049162 223972426 217068273 210414259
8871B10414259o361885o078655n798607n500527n220014m999962m802303m562040
$$ 210414259 204052374 197973719 192175112 186674585 181454571 176454609 171652306 167090266
8863A67090266m308606m131263m027984l896961l694245l492737l350085l220869
$$ 167090266 162781660 158650397 154622413 150725452 147031207 143538470 140188385 136967516
8855A36967516l054605k889503k777529k688865k569971k442109k361930k323287
$$ 136967516 133912911 131023408 128245879 125557014 122987043 120544934 118183004 115859717
8847A15859717k276572k219234k192563k202988k212617k199464k170957k128935
$$ 115859717 113583145 111363911 109171348 106968360 104755743 102556279 100385322 98256387
8839I8256387k076390k045303k057050k063900j995817j867571j773163j759430
$$ 98256387 96179997 94134694 92077644 90013744 88017927 86150356 84377193 82617763
8831H2617763j765786j714053j605773j497592j421327j366973j318665j269742
$$ 82617763 80851977 79137924 77532151 76034559 74613232 73246259 71927594 70657852
8823G0657852j213286j146740j083125j039311j013925r87677r45258q92029q48953
$$ 70657852 69444566 68297826 67214701 66175390 65161465 64173788 63228530 62336501 61487548
8814F1487548q29573q20899p95177p45580o97687o75418o70611o61614o46137
$$ 61487548 60657975 59837076 59041899 58296319 57598632 56923214 56252603 55590989 54944852
8805E4944852o34934o27186o16190o07058o03933n93114n66511n46555n54678
$$ 54944852 54309918 53682732 53066542 52459484 51855551 51262437 50695926 50149371 49594693
8796D9594693n69844n57801n28706n19271n26233n11577m73643m53920m62844
$$ 49594693 49024849 48467048 47938342 47419071 46892838 46381261 45907618 45453698 44990854
8787D4990854m59458m26486m06092m27527m52839m37736m01622l89271l99529
$$ 44990854 44531396 44104910 43698818 43271291 42818452 42380716 41979094 41589823 41190294
8778D1190294m03236m02396m17071m33894m21962l88635l70262l75578l83506
$$ 41190294 40787058 40384662 39967591 39533697 39111735 38723100 38352838 37977260 37593754
8769C7593754l87120l92145l81523l35733k85056k83676l25958l46527l16778
$$ 37593754 37206634 36814489 36432966 36097233 35812177 35528501 35202543 34856016 34539238
8760C4539238k82888k85503k99063k85798k59966k54862k64852k65973k62716
$$ 34539238 34256350 33970847 33671784 33385986 33126020 32871158 32606306 32340333 32077617
8751C2077617k67429k60244k20902j81237j91496k43201k77671k68570k45442
$$ 32077617 31810188 31549944 31329042 31147805 30956309 30713108 30435437 30166867 29921425
8742B9921425k33613k23683k11868k19430k49301k65165k40899j99229j77016
$$ 29921425 29687812 29464129 29252261 29032831 28783530 28518365 28277466 28078237 27901221
8733B7901221j79290j88699j93010j83315j53822j22891j22169j44587j42322
$$ 27901221 27721931 27533232 27340222 27156907 27003085 26880194 26758025 26613438 26471116
8724B6471116j02573p8190j03223j28219r8014m9107n2674r2441r1229m6121l4632
$$ 26471116 26368543 26290353 26187130 26058911 25960897 25911790 25859116 25766675 25675446 25629325 25594693
8713B5594693p4603q2397r825P0831P7929M0998M1697R3028J47258J75793J71240
$$ 25594693 25520090 25437693 25427868 25498699 25576628 25617626 25659323 25752351 25899609 26075402 26246642
8702B6246642J13426P467q0620j01565j02942j54179k27063k42328k06304j94520
$$ 26246642 26360068 26367535 26286915 26185350 26082408 25928229 25701166 25458838 25252534 25058014
8692B5058014k13210j94907j36944j19789j60084j70527j15179q1256j23746j56917
$$ 25058014 24844804 24649897 24512953 24393164 24233080 24062553 23947374 23866118 23742372 23585455
8682B3585455j01240l4673o9443j55147j52096n7625m041l9838o7972k8582K741
$$ 23585455 23484215 23449542 23380099 23224952 23072856 23015231 23011190 22971352 22903380 22874798 22877539
8671B2877539l8881q5793n0922K6356M7980J4220J0204O1871J03861R5854Q7602
$$ 22877539 22838658 22752865 22701943 22728299 22776279 22790499 22800703 22862574 22966435 23062289 23149891
8660B3149891J36191K13268K39151J87786J17067Q8901Q6740M2128n9084j39088
$$ 23149891 23286082 23499350 23738501 23926287 24043354 24132255 24218995 24261123 24202039 24062951
8650B4062951j28729p2091o9536j27827j47451q0398j5388m5405j17400j03417
$$ 24062951 23934222 23862131 23792595 23664768 23517317 23436919 23421531 23376126 23258726 23155309
8640B3155309J2223J14530J24380R0135Q9537J23737J55475J87667K41525K96222
$$ 23155309 23167532 23282062 23406442 23496577 23586114 23709851 23865326 24052993 24294518 24590740
8630B4590740L13394L00258K90868K78269K25877J45289J00022J12321J19367
$$ 24590740 24904134 25204392 25495260 25773529 25999406 26144695 26244717 26357038 26476405
8621B6476405N6608n2396j30411j50050j61702k21818l24567m09232m18735l52431
$$ 26476405 26533013 26480617 26350206 26200156 26038454 25816636 25492069 25082837 24664102 24311671
8611B4311671k72774k49982k85838l08956k66425j96060j69924j87255j81594
$$ 24311671 24038897 23788915 23503077 23194121 22927696 22731636 22561712 22374457 22192863
8602B2192863j30746r0406r8036j11905q8197n8124o7293q7032o3825k5018m3303
$$ 22192863 22062117 21971711 21873675 21761770 21673573 21615449 21548156 21461124 21397299 21372281 21328978
8591B1328978j03617j04636j4097P1697P0789L5890O1654J33667J58057J08895
$$ 21328978 21225361 21120725 21106628 21178325 21249114 21285004 21346658 21480325 21638382 21747277
8581B1747277N3471L6220K4431j3703n3786p2202r6165j51213k05725k20373k19507
$$ 21747277 21800748 21836968 21861399 21847696 21793910 21721708 21625543 21474330 21268605 21048232 20828725
8570B0828725k55251l19007l49448l25608k91680k77283k51738j88050j22877
$$ 20828725 20573474 20254467 19905019 19579411 19287731 19010448 18758710 18570660 18447783
8561A8447783j05973j22133j16802q2434o2924p4743q1601o1218m3952n7336p7214
$$ 18447783 18341810 18219677 18102875 18020441 17957517 17882774 17801173 17739955 17696003 17638667 17561453
8550A7561453p1886o0451q2313j30240j59706j54563j41102j39992j42263j34655
$$ 17561453 17489567 17429116 17346803 17216563 17056857 16902294 16761192 16621200 16478937 16344282
8540A6344282j17088r3266p0117o2964p4512p7450m9301j2700k542o791J0313
$$ 16344282 16227194 16133928 16063811 16000847 15926335 15848885 15799584 15786884 15784342 15777551 15787864
8529A5787864L7129L0252J195J3760P8048J24228J15728J11461J62505K19684
$$ 15787864 15824993 15855245 15856440 15870200 15948248 16072476 16188204 16299665 16462170 16681854
8519A6681854K19496K04695K64291L81537M39080L75867K55126J62500J08865
$$ 16681854 16901350 17106045 17370336 17751873 18190953 18566820 18821946 18984446 19093311
8510A9093311N7944j0279r4837j88023k66454l01750l00771l03646l25640l35020
$$ 19093311 19151255 19140976 19046139 18858116 18591662 18289912 17989141 17685495 17359855 17024835
8500A7024835l06667k62584k34377k14283j72772j08619n6417m8903q1977j11976
$$ 17024835 16718168 16455584 16221207 16006924 15834152 15725533 15669116 15620213 15538236 15426260
8490A5426260r0852j9650L9556L0002k6091n1794j2580M7148P0620N4515L5111
$$ 15426260 15335408 15315758 15355314 15385316 15359225 15307431 15294851 15341999 15412619 15467134 15502245
8479A5502245M0278P0246J02370J08448R1252R9032J67160K53824K88044K79946
$$ 15502245 15542523 15612769 15715139 15823587 15914839 16013871 16181031 16434855 16722899 17002845
8469A7002845L12047M06727M87267N10021N44124O42939P12109O16273L79789
$$ 17002845 17314892 17721619 18208886 18718907 19263031 19905970 20618079 21234352 21614141
8460B1614141J62894M2280o6796k42199m21037n01372m95833m92748n07199m69596
$$ 21614141 21777035 21819315 21752519 21510320 21089283 20587911 20092078 19599330 19092131 18622535
8450A8622535l60050k63398k54733k93817k89009k30536j94538k21692k59324
$$ 18622535 18262485 17999087 17744354 17450537 17161528 16930992 16736454 16514762 16255438
8441A6255438k46126j97651j65774j56490j43538j33758j52142j75908j55918
$$ 16255438 16009312 15811661 15645887 15489397 15345859 15212101 15059959 14884051 14728133
8432A4728133j03878q2860j00130r1202l6826q301m7695q6890n5963Q70L882k6928
$$ 14728133 14624255 14541395 14441265 14350063 14313237 14304936 14257241 14170351 14114388 14115258 14119140 14092212
8420A4092212j4164M1847P6368Q2132J08353J50921J57059J40685J75711K55874
$$ 14092212 14078048 14119895 14196263 14278395 14386748 14537669 14694728 14835413 15011124 15266998
8410A5266998K79040K07395J28255J02274O4262m8420j71008k14769k15682k65676
$$ 15266998 15546038 15753433 15881688 15983962 16048224 15999804 15828796 15614027 15398345 15132669
8400A5132669l48955l67828l07510k57527k66095k77642k38364j77497j47485
$$ 15132669 14783714 14415886 14108376 13850849 13584754 13307112 13068748 12891251 12743766
8391A2743766j48148j49713j45668j46610j51632j53006j48767j35703j10328
$$ 12743766 12595618 12445905 12300237 12153627 12001995 11848989 11700222 11564519 11454191
8382A1454191q5020p9787r1745r7439r0530q9901j02678j06927q4297m8846k9700
$$ 11454191 11369171 11289384 11197639 11100200 11009670 10919769 10817091 10710164 10625867 10577021 10547321
8371A0547321l8431o2006p7928p2902n4726m3650m6017m7471m0820m0055n0158
$$ 10547321 10508890 10446884 10368956 10296054 10241328 10197678 10151661 10104190 10063370 10023315 9973157
8360I973157m9407k8071j4872k7019k6561J8167N6321J7346o0521n8318M6990
$$ 9973157 9923750 9895679 9880807 9853788 9827227 9845394 9901715 9919061 9858540 9800222 9847212
8349I847212J28434Q3352j8716l9568L3037Q8676O7269K9369M2115Q1912R3093
$$ 9847212 9975646 10058998 10040282 10000714 10033751 10122427 10189696 10219065 10261180 10343092 10436185
8338A0436185Q3607J04088J58175J89332J56197P9110L61o8504j36489j93333
$$ 10436185 10519792 10623880 10782055 10971387 11127584 11206694 11207055 11138551 11002062 10808729
8328A0808729k15729k09757k10797k29523k31325j92042j43476j27774j30710
$$ 10808729 10593000 10383243 10172446 9942923 9711598 9519556 9376080 9248306 9117596
8319I117596j07874o4427n1858q1652j01081p5259l9763l9077n8369n8410m2455
$$ 9117596 9009722 8945295 8893437 8811785 8710704 8635445 8595682 8556605 8498236 8439826 8397371
8308H397371m0036m8091l8431j2332r57j2859k0187j696K9401M5252L2644M756
$$ 8397371 8357335 8309244 8270813 8258481 8257524 8244665 8224478 8222782 8252183 8297435 8330079 8334835
8296H334835l787L2309Q8784J07860P7873O2623J11959J78418J81013J24842Q2224
$$ 8334835 8331048 8363357 8452141 8560001 8637874 8700497 8812456 8990874 9171887 9296729 9378953
8285I378953O6365J2560j00135j96650k15426j96115k03624k24857k06397j52141
$$ 9378953 9445318 9457878 9357743 9161093 8945667 8749552 8545928 8321071 8114674 7962533
8275G962533j14392j12539j22422j28293j28064j04748n2984j8969m7272r6154
$$ 7962533 7848141 7735602 7613180 7484887 7356823 7252075 7199091 7180122 7132850 7036696
8265G036696q0929o685K3671l9836j13843j01472k9514N82m0951q7182q0700l8184
$$ 7036696 6955767 6949082 6972753 6932917 6819074 6717602 6688088 6688670 6647719 6560537 6479837 6441653
8253F441653m745K370j0234l2302m7797m0265j6370l695j3249k3468j4114J724
$$ 6441653 6436908 6439278 6429044 6396742 6348945 6308680 6292310 6288615 6275366 6251898 6237784 6239508
8241F239508l897l3572n8760n2520j8565J3347J7320n051l1232m3991m3190l3479
$$ 6239508 6235611 6202039 6143279 6090759 6072194 6085541 6102861 6097810 6066578 6022587 5979397 5945918
8229E945918j6964m073j1448l4314m0792j5317J0990K424k5051k7357k890M669
$$ 5945918 5928954 5924881 5913433 5879119 5838327 5823010 5834000 5836424 5811373 5784016 5781126 5785795
8217E785795k3969n5745n7613l6199j1362R424J3725j5241n6804n6347l396L6932
$$ 5785795 5761826 5706081 5648468 5612269 5600907 5610331 5624056 5608815 5552011 5495664 5492268 5529200
8205E529200J2228l7688m1786m571J1487j0568k5886j0948M290k961j4652j5539
$$ 5529200 5541428 5503740 5461954 5457383 5468870 5458302 5432416 5421468 5425758 5422797 5408145 5392606
8193E392606j8549k6225j4239K1713M3132K0386k4762n1874m8591k5733L713K0868
$$ 5392606 5374057 5347832 5333593 5355306 5398438 5418824 5394062 5342188 5293597 5267864 5271577 5292445
8181E292445O980k5965l9408k1423m008q963j4748k989J726k4559n4567m5243
$$ 5292445 5299425 5273460 5234052 5212629 5208621 5199658 5184910 5181921 5183647 5159088 5104521 5059278
8169E059278k656K7752K1059r229l7835m4029j9143J5345J8259j5962l8368j2696
$$ 5059278 5056622 5084374 5105433 5096204 5058369 5014340 4995197 5010542 5028801 5012839 4974471 4961775
8157D961775K7952K9894l699k8346k7715j9823j2283M16Q157j922j6708k0132
$$ 4961775 4989727 5019621 5015922 4987576 4959861 4940038 4927755 4928171 4936328 4934406 4917698 4897566
8145D897566k3829l4514k2855K2517M6833M329n1662l8127K3086L8418k987j9578
$$ 4897566 4873737 4839223 4816368 4838885 4885718 4890047 4838385 4800258 4823344 4861762 4858775 4839197
8133D839197J2730K1535k2111m5249p020K1598j5703n5467k4485L0752K4944k3567
$$ 4839197 4851927 4873462 4851351 4806102 4799082 4820680 4804977 4749510 4725025 4755777 4780721 4757154
8121D757154l7200j3676p550j6440K739K9540O386m1132k6010N0253Q1842K0160
$$ 4757154 4719954 4706278 4698728 4682288 4685027 4714567 4720953 4679821 4653811 4704064 4785906 4806066
8109D806066n1308m7776o90J2976j0481j9699k84J5535Q736p999k1023k7485k2384
$$ 4806066 4754758 4706982 4706292 4719268 4708787 4689088 4688804 4704339 4713075 4705076 4684053 4656568 4634184
8096D634184k080K0663K3720P3l1278m0824j9102P757P245j2012r662J8462K3694
$$ 4634184 4632104 4652767 4676487 4676560 4645282 4604458 4585356 4593113 4600358 4588346 4578684 4597146 4620840
8083D620840j5491m5404j8743K2111J2712k1816j0974L0777K2930l5511n2414
$$ 4620840 4605349 4559945 4541202 4563313 4576025 4554209 4543235 4574012 4596942 4561431 4509017
8072D509017M094M9674K4590j3077K588L3809J6846k1492j4004K9371M1017L958
$$ 4509017 4513111 4562785 4587375 4574298 4576886 4610695 4627541 4606049 4592045 4621416 4662433 4666391
8060D666391l3704l4598m138L4090M8599J3325m7350o4830k0997J3066j4544m9737
$$ 4666391 4632687 4598089 4593951 4628041 4676640 4689965 4642615 4577785 4556788 4569854 4555310 4505573
8048D505573k5978J6302k4m6144k9280M4683O9888O308o3029o2553j6898J6340
$$ 4505573 4479595 4495897 4495873 4449729 4420449 4465132 4535020 4541328 4478299 4415746 4398848 4415188
8036D415188K4440J7415k656k0414j3182L698n031k5755j4208J5730O103l4472
$$ 4415188 4439628 4457043 4454387 4433973 4420791 4424489 4419458 4393703 4379495 4395225 4401328 4366856
8024D366856l2422J8119L2406j7555m6319m243K9577j4591p0223m8336R881J1584
$$ 4366856 4334434 4352553 4384959 4367404 4321085 4316842 4346419 4331828 4261605 4213269 4223150 4234734
8012D234734k6625k3830J0610L188l3851j8919M0287M3644l0110q0375m8637m654
$$ 4234734 4208109 4184279 4194889 4198077 4164226 4145307 4185594 4229238 4199128 4118753 4070116 4065462
8000D065462j5325l6047o061L4876J2957n2114p2244j7811M9684O2356J5133m3653
$$ 4065462 4050137 4014090 4008029 4042905 4055862 4003748 3931504 3913693 3963377 4025733 4040866 3997213
7988C997213n9417j8214L4489L8390p765m4783l5060o074M459K16l466j4166l2288
$$ 3997213 3937796 3919582 3954071 3992461 3984696 3939913 3904853 3898779 3903238 3903454 3899988 3885822 3853534
7975C853534l0254j533J1829j4620l6621r958K9348J9170k4760l4333k323J0563
$$ 3853534 3823280 3821747 3833576 3818956 3782335 3772377 3801725 3820895 3796135 3761802 3759479 3770042
7963C770042j6924l3139q187J1476j7919o1448n8967j7432L081k1181m9641l9217
$$ 3770042 3753118 3719979 3711792 3723268 3705349 3643901 3584934 3567502 3570583 3549402 3499761 3460544
7951C460544Q90K7360J6821j1907k5891j8227j0596j6291j8631o08K0333J3962
$$ 3460544 3461434 3488794 3505615 3493708 3467817 3449590 3438994 3422703 3404072 3403464 3423797 3437759
7939C437759j3778k5259o462J3338O126j8918l7261m2012l9157l0917k1550k2352
$$ 3437759 3423981 3398722 3392260 3405598 3411724 3392806 3355545 3313533 3274376 3243459 3221909 3199557
7927C199557l3127l3516j1281J2665P099k7179n4453m3994m483K2729O120l6806
$$ 3199557 3166430 3132914 3121633 3134298 3141397 3114218 3059765 3015771 3011288 3034017 3040137 3003331
7915C003331n2440j6694K6133J8409k7387m3779r286J8953n080m6716m9878k1017
$$ 3003331 2950891 2934197 2960330 2978739 2951352 2907573 2898287 2917240 2912160 2865444 2815566 2794549
7903B794549k065N117K4861M0990J4532l7596n2555j8789N035j2272k5820J577
$$ 2794549 2792484 2797601 2822462 2863452 2877984 2840388 2787833 2769044 2774079 2761807 2735987 2737564
7891B737564L0371J1240k8668l0475j678R18k8028l1850J0590M3952K0412k7538
$$ 2737564 2767935 2779175 2750507 2720032 2718354 2719272 2691244 2659394 2669984 2713936 2734348 2706810
7879B706810l8351j1303J559k0480l7154j0865L3721L9345n650m7281l5101Q908
$$ 2706810 2668459 2657156 2658715 2638235 2601081 2590216 2623937 2663282 2657632 2610351 2575250 2584158
7867B584158J9540j7483m0874m519M5957L5004k6692n4045j8934N638l1927o7135
$$ 2584158 2603698 2586215 2545341 2540822 2586779 2621783 2595091 2541046 2522112 2527750 2495823 2428688
7855B428688j9000O4719O1837l4363q8635k0445P2662O0313k8335n9642k927L5727
$$ 2428688 2409688 2474407 2536244 2501881 2413246 2392801 2465463 2525776 2497441 2437799 2434872 2470599
7843B470599q739o3679m4747J4204K8014o865k7037j2028R25n685j0707o787p238
$$ 2470599 2461860 2398181 2353434 2367638 2395652 2388787 2361750 2349722 2350647 2344962 2334255 2327468 2320230
7830B320230m939J3478K0184j6748n5282k4796M5077M3240m6318r7974l4374M6624
$$ 2320230 2315291 2328769 2348953 2332205 2276923 2252127 2297204 2340444 2294126 2196152 2161778 2208402
7818B208402K8806l5102k1007N0574N1494k8749o1050K537M6908q664p3385l8576
$$ 2208402 2237208 2202106 2181099 2231673 2283167 2254418 2193368 2195905 2242813 2234149 2160764 2122188
7806B122188M3523M9912j9366n9053k8561J1760J8140J2253R923p946l7390l9864
$$ 2122188 2165711 2215623 2196257 2137204 2108643 2120403 2138543 2150796 2160719 2152773 2115383 2075519
7794B075519r789Q344q412k6312j2869J6333L0233K3258N729j3842k4323j9403
$$ 2075519 2065730 2074074 2065662 2039350 2026481 2042814 2073047 2096305 2102034 2088192 2063869 2044466
7782B044466j4118k3265k7956l603K7255K2438o014r339Q243m482m0719l0019
$$ 2044466 2030348 2007083 1979127 1975524 2002779 2025217 2019203 2009864 2018107 2013625 1972906 1942887
7770A942887L1103M4749l1680r2558l8560N8764O3490j2528l9932J3513M5593
$$ 1942887 1973990 2018739 1987059 1894501 1855941 1914705 1978195 1965667 1925735 1939248 1984841
7759A984841O062k5122P955L5385r169o4057m2632J8028K1129k7677l7417J0638
$$ 1984841 1990903 1965781 1973736 2009121 1999952 1935895 1893263 1911291 1932420 1904743 1867326 1877964
7747A877964L5998k745m4370l0387Q772J7423J071k194Q126N989q587j5410j3363
$$ 1877964 1913962 1911217 1866847 1836460 1845232 1862655 1863726 1861532 1869658 1875647 1867060 1851650 1838287
7734A838287j1560J317L3941N1299R601o5688r0509l0817M4914N4010M455l1373
$$ 1838287 1826727 1828044 1861985 1913284 1922885 1857197 1766688 1735871 1780785 1834795 1839250 1807877
7722A807877k2605m494l327J682K2315K3141j8858n6644l1529L1693N0767M651
$$ 1807877 1785272 1780778 1777451 1779133 1801448 1824589 1805731 1749087 1717558 1749251 1800018 1804669
7710A804669l8641k7799K206M97j7508j0990O867l838k9152j9472K0171L0235
$$ 1804669 1766028 1738229 1740435 1740932 1723424 1712434 1719301 1715463 1686311 1666839 1687010 1717245
7698A717245o005l4321j8428P204L660j1735r620j569m409J194K6270L2340o525
$$ 1717245 1711240 1676919 1658491 1665695 1669355 1657620 1648000 1646431 1642022 1643216 1669486 1701826 1695301
7685A695301m1125j6430K9246J6389m3905o2019j2936K8047J2619r984J0184L8553
$$ 1695301 1654176 1637746 1666992 1683381 1639476 1577457 1564521 1592568 1605187 1595203 1605387 1643940
7673A643940K3958j3507k5234j4771j3987j9115j0322j9m731l391J9398K6990
$$ 1643940 1667898 1654391 1629157 1614386 1600399 1581284 1570962 1570943 1566212 1562821 1582219 1609209
7661A609209q562m0338j7235J8439l052m6796k0617N6528O3330k5307q0361j6348
$$ 1609209 1600647 1560309 1543074 1561513 1558461 1511665 1491048 1547576 1610906 1585599 1505238 1488890
7649A488890P1731N5785l4816p5737l6720M747M885j178J0542J3736m260j4702
$$ 1488890 1560621 1616406 1581590 1505853 1469133 1473880 1478765 1477587 1488129 1501865 1497605 1482903
7637A482903k550Q477K205o539o986q260j1099l741P425J992j4539j3865P179
$$ 1482903 1480353 1488830 1491035 1484496 1477510 1469250 1458151 1454410 1461835 1463827 1449288 1435423 1442602
7624A442602J9662Q171j2865k9368l6429k0657K1011M8554J9604l5158m0002J1385
$$ 1442602 1462264 1470435 1457570 1428202 1391773 1371116 1392127 1440681 1460285 1425127 1385125 1396510
7612A396510L9095M20m1918k0716L0227L4485r049l7366k6070j0685j4060j5974
$$ 1396510 1435605 1436025 1394107 1373391 1403618 1438103 1429054 1391688 1365618 1354933 1340873 1324899
7600A324899o46J5890J7093P336o484k3160l1053j4115J7963L1849J2202j9019
$$ 1324899 1324253 1340143 1357236 1364572 1358088 1334928 1303875 1289760 1307723 1339572 1351774 1332755
7588A332755l1614j8335O383K1869J3056j6009l7726k6077J0823L7572L2836R612
$$ 1332755 1301141 1282806 1289189 1311058 1324114 1308105 1270379 1244302 1255125 1292697 1325533 1335145
7576A335145q091j3855j7160k2568k0100J413L2483M2792J5454k3302l0575m624
$$ 1335145 1327054 1313199 1296039 1273471 1253371 1254784 1287267 1330059 1345513 1322211 1291636 1287012
7564A287012J2285j524j4711J850K2652R122k2537k3892P994K6874J0700j1505
$$ 1287012 1299297 1297773 1283062 1284912 1307564 1316686 1294149 1270257 1278251 1305125 1315825 1304320
7552A304320j5161j4841k4570k6127n302J3733M206j6111r969J9388K9876K392
$$ 1304320 1289159 1274318 1249748 1223621 1218319 1232052 1236258 1220147 1210178 1229566 1259442 1261834
7540A261834l0778l0506j700J8146J0384n121l164J2120J7855O766o698j1013
$$ 1261834 1231056 1200550 1198850 1216996 1227380 1222259 1219095 1231215 1249070 1255836 1249138 1238125
7528A238125r273n435J160L962o491k1047j9233m599k231j1008J567L6014L9909
$$ 1238125 1228852 1223417 1224577 1228539 1222048 1201001 1181768 1177169 1174938 1163930 1165497 1201511 1241420
7515A241420j0754n5004k9114L0675L9520m523k4093N939K1445j4841m6814k0047
$$ 1241420 1230666 1175662 1146548 1177223 1216743 1212220 1188127 1194066 1215511 1200670 1153856 1133809
7503A133809K7072K7240j1324k8958j0217Q395Q150N078K857j5648m3016m1037
$$ 1133809 1160881 1188121 1176797 1147839 1137622 1146017 1154167 1159245 1162102 1146454 1103438 1062401
7491A062401J448L8995K4098k6684m9744j7052K4799J7834k2016k3575K9799O2521
$$ 1062401 1063849 1102844 1126942 1100258 1050514 1033462 1058261 1076095 1054079 1030504 1060303 1122824
7479A122824J7388m5649l1785L7927N1741j7884o8420k8806L2679K4486k7576
$$ 1122824 1140212 1094563 1062778 1100705 1152446 1134562 1066142 1037336 1070015 1094501 1066925
7468A066925l9275o679Q321o166o859J0525M131k6096k7578J2619L7500Q210l5332
$$ 1066925 1027650 1020971 1029292 1023126 1016267 1026792 1030923 1004827 977249 989868 1027368 1035578 1000246
7455A000246l3572J2238M7460L0159k6148o4347m0980J6846L3936j1439m6518
$$ 1000246 966674 978912 1026372 1056531 1030383 966036 925056 941902 975838 964399 917881
7444I17881q989M9232L5713l3770n3674O796N7153K8926k6338l0468M538J5638
$$ 917881 908892 958124 993837 960067 906393 913189 970342 999268 972930 942462 947000 962638
7432I62638o777j9709n535Q363q26k2181l0442j3573J5601K9397J7883N605J3617
$$ 962638 955861 936152 930617 938980 938154 915973 885531 871958 887559 916956 934839 940444 954061
7419I54061J9504n508l5599k4106J1430J1113j9386j1085L9418M3705k9520p9516
$$ 954061 973565 968057 932458 908352 919782 930895 911509 900424 939842 983547 954027 874511
7407H74511k3836O2220N6263k3396n4730l257M1377J8083k3588j8599J9603L6791
$$ 874511 850675 912895 969158 945762 891032 887775 929152 947235 923647 905048 924651 961442
7395I61442J4078k5260m9069l8295l834J4492n579l0280j4311K7542L9457P362
$$ 961442 975520 950260 901191 862896 859062 873554 867975 837695 823384 850926 890383 897745
7383H97745k8324l9067l3235j5000K2526N4987L8530j7261m4824j3177K4820J2995
$$ 897745 869421 830354 797119 782119 804645 859632 898162 880901 836077 822900 847720 860715
7371H60715k6656l4784k533K7852L0531J9784J1902J589j6655k9592k2131j938
$$ 860715 834059 799275 796742 824594 855125 874909 886811 888400 871745 842153 820022 818084
7359H18084P134l461j4188n048J4261J9255Q074k015j0142k7157l6576j0512K6604
$$ 818084 825218 821757 807569 802521 816782 836037 844111 842096 831954 804797 768221 757709 784313
7346G84313J3950m1397n0584J9847P6199L6541l4003k8138K5937J9685m1728m8332
$$ 784313 798263 756866 706282 726129 802328 838869 804866 776728 802665 822350 780622 732290
7334G32290J7231M5629p173m3079M316N4776K4179l3072k5303K3060K7788j1081
$$ 732290 749521 795150 787977 744898 749214 803990 828169 795097 769794 792854 820642 809561
7322H09561k7928r002O610J0545K1777K6160p39l3234k9680l297O616M522J3210
$$ 809561 781633 772631 779241 789786 811563 837723 836984 803750 774070 770773 777389 781911 795121
7309G95121J3692j6339l9117j2169K5557J0012l4100l1027J5081K9456j673j4549
$$ 795121 808813 792474 753357 741188 766745 776757 742657 711630 726711 756167 754494 739945
7297G39945J1877K3690j632j5673N294J6700o500k2314l152J2205o668k4595p096
$$ 739945 751822 775512 773880 758207 763501 780201 773701 751387 748235 760440 753772 729177 722081
7284G22081J6985R092j4388j8375n727L765R637J1469l598k4534j6748J3067J1272
$$ 722081 739066 748158 733770 715395 709668 713433 723070 734539 730941 706407 689659 702726 713998
7271G13998k9533m0044J4331O1982L2391k7830k9489J6744K7293j3370l7965j6233
$$ 713998 684465 644421 658752 720734 753125 725295 695806 712550 739843 726473 688508 672275
7259F72275N711j372l526K0574L1248k561m1944l5679J78J2456l438l200K5241
$$ 672275 677986 676614 673088 693662 724910 722349 680405 644726 644904 657360 653922 650722 675963
7246F75963L4768n801n0814l4908K6154M6134q898o3710m0126K5617L8879n442
$$ 675963 710731 704930 654116 619208 645362 691496 682598 618888 578762 604379 643258 637816
7234F37816j9206K8639N4556k466p1298n2375K6943N3717J2m3829j2064M5686
$$ 637816 618610 647249 701805 699339 628041 575666 602609 656326 656338 612509 600445 646131
7222F46131M9027R0l4135j9274J2103J5168j0989k9940j7212R794J6635k86q727
$$ 646131 695158 695248 661113 641839 653942 669110 658121 628181 610969 620763 637398 637112 628385
7209F28385J1435L6055K9323n407k7789r121L4613N7663K9935k6920n5003k7138
$$ 628385 639820 675875 705198 699791 672002 662881 697494 755157 785092 758172 703169 676031
7197F76031J3554R934k6375l5273n121J4226M782J1397M8376N3996n622n8357
$$ 676031 689585 699519 673144 637871 632750 646976 651758 663155 711531 765527 759905 701548
7185G01548k8296L9154M3580j6251n0032k0186J6327J1384j4336k7057k3907p414
$$ 701548 673252 712406 755986 739735 689703 669517 685844 697228 682892 655835 631928 624514
7173F24514K1460L5444O326l5605l0485J6280L5176n2l5042k3721J0993K9082
$$ 624514 645974 681418 687744 652139 621654 637934 673110 673058 638016 614295 625288 654370
7161F54370K6016R592j8791l7307j5144K7663L0819j3503m1326j6817J4608P836
$$ 654370 680386 689978 671187 633880 618736 646399 677218 663715 622389 605572 620180 628016
7149F28016j2397p477Q024M649n708j149L650j2219l3600l5400j8506P427L7642
$$ 628016 615619 608142 616166 620815 615107 613958 617608 605389 571789 536389 517883 525310 562952
7136E62952M8308J1183m4703m8491O218M0829J4007j5164K986K1050j1768m7591
$$ 562952 611260 622443 577740 529249 535467 576296 590303 575139 578125 599175 587407 539816
7124E39816k0972L2038L3401p167k0200L284J5546P071N915P118j0492k2786n72
$$ 539816 518844 550882 584283 577116 556916 560200 575746 582817 588732 595850 585358 562572 562000
7111E62000J9566o639l7848j1269L5896K2174l0435l0106K1345L3479q369k4252
$$ 562000 581566 574927 537079 525810 561706 583880 553445 523339 544684 578163 569794 545542
7099E45542M761O614l1373k9492K5758L8044k3958n3596J1589P2103L1734m1626
$$ 545542 550303 556917 525544 496052 521810 559854 535896 482300 493889 565992 597726 556100
7087E56100l7215J7901K5195j6439l3487j2327M232R024J7014O095l3793m5375
$$ 556100 518885 536786 561981 545542 512055 499728 503960 512984 529998 536093 502300 456925
7075D56925O292M9702J7119k8994k243M3940P540o3830m1352M9098N4129m0023
$$ 456925 463217 512919 530038 501044 498801 542741 550281 486451 445099 494197 548326 508303
7063E08303p1905J8721Q1632J2368o8959k5986O2783M5310m5338n7757J8174M7273
$$ 508303 436398 455119 536751 549119 480160 454174 516957 562267 516929 459172 477346 524619
7051E24619j2654m8008P561O3739L1024l5001l4176J7943K8607j8651m6134r897
$$ 524619 511965 463957 471518 535257 566281 531280 497104 515047 543654 525003 478869 468972
7039D68972L6980L0706j2304k9684n819J5029J143k3573k2653j190J0276O688
$$ 468972 505952 536658 524354 494670 488851 503880 505023 481450 458797 457607 467883 474571
7027D74571R159K0998J9198l851k2349j5296K935Q137J790P27O784Q077K123r49
$$ 474571 483730 504728 523926 520075 497726 482430 485365 493502 495292 496019 502803 510880 513003 512054
7013E12054M787J3313J3932J214j7192k2220m201J8360J8264n13o045J1442K0419
$$ 512054 516841 530154 544086 545300 528108 505888 501687 520047 538311 537798 531753 543195 563614
7000E63614m635m2190n3043l1163l47K2547L3468K5500K98j4212N663L3544J7900
$$ 563614 558979 516789 463746 432583 432236 454783 488251 513751 514049 499837 505500 539044 556944
6987E56944l8700o6920k1728M7490N6423k454n2751l9234N589K0540L592R25K7035
$$ 556944 518244 451324 429596 477086 533509 531055 478304 439070 444659 465199 468791 469716 496751
6974D96751M3985K4310q281j9404j1361n009k034M286L083j3886k2627K431L8327
$$ 496751 540736 565046 556765 537361 526000 520991 518957 523243 526326 512440 489813 492244 530571
6961E30571L7888J165k4419k0052j9688l9957l9103J4684P3369O1295j7645p6324
$$ 530571 568459 569624 545205 525153 505465 465508 426405 441089 514458 575753 558108 481784
6949D81784n2167K1318O4878M5910r94k8842k6662j2439PJ0555J6989J0295q515
$$ 481784 429617 450935 515813 561723 560729 531887 505225 492786 492793 503348 520337 530632 522117
6936E22117k2264j7930j127J7665L5223M3331K5849j3329m0812l5901k0372j8488
$$ 522117 499853 481923 480796 498461 533684 577015 602864 589535 548723 512822 492450 473962
6924D73962j3980J4560M2137L2295K812k586Q120n945l3295k3894J2877J4810
$$ 473962 459982 474542 516679 548974 551786 549200 557320 551375 518080 494186 507063 521873
6912E21873j6829q815M6659N6523j5708o7557j6918N6405L8293l3182m0280J3851
$$ 521873 505044 496229 542888 599411 583703 516146 499228 555633 593926 560744 520464 534315
6900E34315K4785k0914k7720K8396N1584l592m7712n766O0037N4762o814m4184
$$ 534315 559100 538186 510466 538862 590446 586854 539142 533376 593413 648175 641361 597177
6888E97177l4549j2661O970L1952M5466K4217j3848l0676k1007m378J3613L2651
$$ 597177 562628 549967 556937 588889 634355 658572 644724 614048 593041 588663 602276 634927
6876F34927L4121P941j6684p214K2343L4191K2638J0651N693l814j6969j8044
$$ 634927 669048 676989 660305 653091 675434 709625 732263 742914 748607 744793 727824 709780
6864G09780j474K2989M2149M1948J5506j6877j9905Q252K9519K5878K6161M5729
$$ 709780 708306 731295 773444 815392 830898 814021 794116 802368 831887 857765 883926 929655
6852I29655M6792M059l3548q804M6355N0525l491l8822j2540K7471K5546k264
$$ 929655 976447 980506 946958 938154 984509 1035034 1031543 992721 980181 1007652 1033198 1030934
6840A030934p936J2073K3052J2590M603J6283L1041K4628L709J261L0333N8290
$$ 1030934 1022998 1035071 1058123 1070713 1075316 1091599 1122640 1147268 1150977 1152238 1182571 1240861
6828A240861M6436O901j0294J1232L3335K7621J8700L4664N3127L8373L865q911
$$ 1240861 1287297 1294198 1283904 1295136 1328471 1356092 1374792 1409456 1462583 1500956 1504821 1495910
6816A495910N822K2098L4135N4839P2105N8083K1562M169K0291M2920N2962O0337
$$ 1495910 1501732 1523830 1557965 1612804 1684909 1742992 1764554 1768723 1789014 1831934 1884896 1945233
6804A945233O8170N7402K2868n962L134M9547J00910J16512P8583J8972j249L6195
$$ 1945233 2013403 2070805 2093673 2087711 2090845 2140392 2241302 2357814 2436397 2455369 2454120 2490315
6792B490315P6859O7399L1652K8619O2060Q9040R7000J06859J14278R9090Q4560
$$ 2490315 2567174 2634573 2666225 2694844 2756904 2845944 2942944 3049803 3164081 3263171 3347731
6781C347731J10983J53626J49339J07691J05145J54917J79513J41811J06127J24583
$$ 3347731 3458714 3612340 3761679 3869370 3974515 4129432 4308945 4450756 4556883 4681466
6771D681466J55497J52066J48099J89865K55275L05109L46546L86953M01697M10555
$$ 4681466 4836963 4989029 5137128 5326993 5582268 5887377 6233923 6620876 7022573 7433128
6761G433128M95036O60714P86595Q22970R33857J279143J718737J915840J717238
$$ 7433128 7928164 8588878 9375473 10198443 11132300 12411443 14130180 16046020 17763258
6752A7763258J261327P17746J18019n10559j037955j369495j558282j669090j639361
$$ 17763258 19024585 19742331 19860350 19349791 18311836 16942341 15384059 13714969 12075608
6743A2075608j398541j045049p70786o45215n83540n04053m13300l42543k94710
$$ 12075608 10677067 9632018 8861232 8216017 7632477 7128424 6715124 6372581 6077871
6734F077871k69097k70200k76007k48688j88566j37236j20961j26034j32940j41567
$$ 6077871 5808774 5538574 5262567 5013879 4825313 4688077 4567116 4441082 4308142 4166575
6724D166575j57315j76783j89902j82452j46638j02985r0405j13910j28266j00668
$$ 4166575 4009260 3832477 3642575 3460123 3313485 3210500 3120095 3006185 2877919 2777251
6714B777251o0387n1507o7057p3747p2713q1941q3380n1298j6397k9688o9623
$$ 2777251 2716864 2665357 2598300 2524553 2451840 2369899 2286519 2235221 2218824 2189136 2119513
6703B119513o5833k1232j9366q0943j08565l6922M4527J2952r6387j32264m6713
$$ 2119513 2053680 2032448 2013082 1932139 1823574 1786652 1831179 1844131 1747744 1615480 1568767
6692A568767M2505L1636l1308m5751j3330r265m6672o3903l5857j0883k2888m0618
$$ 1568767 1611272 1642908 1611600 1565849 1552519 1543254 1496582 1432679 1396822 1385939 1363051 1322433
6680A322433l2893k1749l1195l5355o611K4915J4884k0083k7963n072L021k1991
$$ 1322433 1289540 1267791 1236596 1201241 1194630 1219545 1234429 1214346 1186383 1181311 1184332 1162341
6668A162341m7596m5218k2144M096K2154J7984j0188l2714k6251j8297m2401o6613
$$ 1162341 1114745 1069527 1047383 1051479 1073633 1091617 1081429 1048715 1022464 1004167 961766 895153
6656H95153l7134J9044K4170j6285j4524M2871N5870k0303q4463m8792J7757J1905
$$ 895153 858019 877063 901233 884948 870424 913295 969165 948862 864399 815607 833364 845269
6644H45269k9586q316N0817M1140l5002o7763k4583J0596n849j9057q15n2k7192
$$ 845269 815683 807367 858184 899324 864322 796559 771976 782572 776723 757666 756851 756799 729607
6631G29607j5603M5845O3672n619o5822l2908K6400J1390m5164m5597J908J0798
$$ 729607 714004 759849 823521 817902 752080 719172 745572 756962 711798 666201 668109 678907
6619F78907k3440k1282L1228N3216O014m5045l9210o659l285k2734k2313L173
$$ 678907 655467 634185 665413 718629 724643 679598 640388 633729 630444 607710 585397 588570
6607E88570J9407P374j3696j6995l660J913q211p291K1912M0662N45o5555o6923
$$ 588570 607977 615351 601655 584660 581000 582913 574702 567411 589323 629985 630530 564975 498052
6594D98052R303O2578K4069l9807l6712J0016J7950j4285k7115j8369l0040m3881
$$ 498052 507355 569933 594002 554195 517483 527499 545449 531164 504049 485680 455640 411759
6582D11759o772N3329N4825K239k0734L83k482l3375j3000O0919P8337r42o8615
$$ 411759 404987 458316 513141 515380 494646 495029 492547 459172 446172 507091 585428 584486 515871
6569E15871m6122p491l0785n5152l573O2306M4388k1314l3994J169Q732r271o05
$$ 515871 469749 462258 431473 376321 372748 435054 479442 458128 424134 425303 434035 424764 424159
6556D24159J2289k2450n8160j5868N5503M1995l5868n2449M687K3069k0945k4281
$$ 424159 436448 413998 355838 339970 395473 437468 401600 349151 353838 376907 355962 331681
6544C31681L5270M6208k2417m5331L2836Q1710J1881n8769j2532N4125L412q9182
$$ 331681 366951 413159 390742 345411 378247 459957 471838 413069 400537 454662 458074 368892
6532C68892o0671N1471O9949k1911o4689j227M5557M344l4532m350J9001k6937
$$ 368892 308221 359692 429641 407730 343041 341814 387371 391715 357183 352833 371834 344897
6520C44897o4365j3256N8817M3368l2730n4731L274N4153L1069l6980p9402n9157
$$ 344897 280532 267276 326093 369461 336731 282000 285274 339427 370496 333516 254114 194957
6508A94957L641N1132M1343j782j7321O729K1721M120q197Q300J6908q186k7492
$$ 194957 198598 249730 291073 289291 271970 278699 300420 304540 296343 304643 321551 313365 285873
6495B85873m033L0909L4664K1381J4778q935n9459p1045N659R3077P3906l1818
$$ 285873 281840 312749 347413 368794 383572 374637 315178 244133 249792 342869 416775 384957
6483C84957q7664m0012J5895k975m5685k5356M0294O3568J9080l2583l9720j7475
$$ 384957 297293 257281 273176 270201 224516 199160 239454 303022 322102 289519 249799 232324
6471B32324n161r078p596P887J9886J2648l445q608n989j3734k5741j3636K0764
$$ 232324 227163 218085 210489 218376 238262 250910 247465 238857 232868 219134 193393 179757 200521
6458B00521L3705N441k0929m568K5351J8092j2103j1418J8506K2453j1243k7692
$$ 200521 234226 239667 218738 214170 239521 257613 245510 234092 252598 275051 263808 236116
6446B36116K387L2436J5333k1421j8921K4025M7001P404o2412q6193l1320M3126
$$ 236116 238503 270939 286272 264851 245930 269955 316956 324360 261948 175755 144435 187561
6434A87561M9858j1852m9209q282M4253K6853k5415k1449L2713M8419O733j9998
$$ 187561 237419 225567 176358 168076 212329 239182 213767 192318 225031 273450 280183 260185
6422B60185m863m058l2415k4310L4118N4416n173n3932j7564L2821N571n0276
$$ 260185 255322 251264 218849 194539 228657 283073 277900 223968 206404 239225 244796 194520
6410A94520l3311L1234L7615j8385m1178j309L0218J4835l902K474L826j4129
$$ 194520 161209 192443 230058 211673 170495 169186 199404 214239 210337 212811 216637 202508
6398B02508k0601n550K642n27J1112L0354K0359j1163j7323L932R186n422k642
$$ 202508 181907 176357 178999 178472 189584 219938 240297 229134 211811 215743 224929 219507 216865
6385B16865J1591m983l6626k4271J7685J3211l0788k0453N1068O6735j6432p5207
$$ 216865 228456 223473 186847 162576 180261 193472 162684 142231 193299 260034 243602 168395
6373A68395j7271O2348M0390l3980l8611J1748J2287l4847l3695K3129M3527N676
$$ 168395 151124 213472 253862 219882 181271 193019 205306 170459 136764 159893 203420 209096
6361B09096r339K6328L5057k2883p2569m5360J8443M5644L3152J8999J1479Q26
$$ 209096 199757 226085 261142 238259 165690 120330 138773 184417 217569 236568 248047 248873
6349B48873m274K479K800j3911k8646k6682j8029o365K0404M9156L7956j8253
$$ 248873 244599 247078 249878 235967 207321 180639 162610 156245 176649 225805 263761 245508
6337B45508o0731m0044J5751L9597R697l3279l9511j215M1440M0687k726l3937
$$ 245508 184777 144733 160484 200081 209778 176499 136988 135773 177213 217900 215174 181237
6325A81237j4686K1050J9660o393k940K8229K7860j7886m6636j6470L0762L6225
$$ 181237 166551 187601 207261 200868 197928 226157 254017 236131 189495 173025 203787 240012
6313B40012K089k9626l1678Q04N2117P4666K7931m9694o7819r710L6085O729m4788
$$ 240012 242101 212475 180797 181601 233718 308384 336315 286621 218802 209092 245177 251906 207118
6300B07118m3319n068J1663Q743K0261K9210k26l9032l0468R195J4397j6289j9770
$$ 207118 163799 158731 170394 179137 199398 228608 228382 189350 158882 168077 182474 166185 146415
6287A46415J6724K9788j1132m8931k8714K0065L4146O584j5707j897K7403K8688
$$ 146415 163139 192927 181795 132864 104150 124215 158361 164945 149238 147341 174744 203432
6275B03432j2095n4078m0712K2362N6872J3418m8287l7982K8354M7747j2689o2946
$$ 203432 191337 137259 96547 118909 175781 189199 140912 102930 131284 179031 166342 103396
6263A03396k5607M9340N9537p492o7291n3046J2610N6993L6977k2187n4337k3786
$$ 103396 77789 127129 186666 179174 111883 58837 71447 128440 165417 143230 88893 65107
6251F5107K9861L8389l562k9952Q80M4974L9579m360k4317k386J5250j930k1499
$$ 65107 94968 133357 129795 99843 100723 145697 185276 180916 156599 154213 169463 167533 146034
6238A46034n855K1451J0583l0345l8618O697M4214K0441k4374j8725K2117K0640
$$ 146034 140179 161630 172213 141868 103250 109947 154161 174602 150228 131503 153620 174260
6226A74260k7648l9448J2859M4374p77m7857j6200L9312K2733l2967k4363L4860
$$ 174260 146612 107164 120023 164397 163620 115763 99563 138875 161608 128641 104278 139138
6214A39138L4933l1916n1647J2281N4619J2678l0863k891L5397J1668k6339r674
$$ 139138 174071 142155 90508 102789 157408 170086 139223 136332 171729 183397 157058 147384
6202A47384K1686K992k7490p625J7773k1218p0409l0941N5885N9579k3238o2820
$$ 147384 169070 172062 144572 136947 154720 133502 63093 32152 88037 147616 124378 61558
6190F1558j2298K8190l421l0768J4131O9759N2480r236l2425n490J8958J1386
$$ 61558 49260 77450 74029 43261 57392 127151 179631 170395 137970 132480 151438 162824
6178A62824j4619l5305k9520O811L6528J7659k3700k0880K1029K5340j9767k8757
$$ 162824 148205 112900 83380 90191 126719 144378 120678 99798 120827 146167 126400 97643
6166I7643K8485N3636j8392q9548m4559N5795O4882j7782n4385O562O2504L4580
$$ 97643 126128 179764 161372 71824 27265 83060 147942 130160 75775 82337 144841 179421
6154A79421k0724k6101M54P904M333J5804J7891j7852n3425l2806K5019M7355
$$ 179421 158697 132596 133050 140954 145287 161091 178982 161130 107705 74899 99918 147273
6142A47273J1473l0160k9002K010K0108Q018j6667k7596j3680J2172K2943M856
$$ 147273 158746 128586 99584 101594 121702 129720 113053 85457 71777 83949 106892 111748
6130A11748k2598k3817R978M3428L4746j0215l8774j7464K0296J9849j2990k0521
$$ 111748 89150 65333 75311 118739 153485 143270 104496 87032 107328 127177 114187 93666
6118I3666J1165K2473k1520n9780k2892M9379N9339J151l3327l998K1205n977
$$ 93666 104831 127304 105784 46004 23112 72491 131830 132981 99654 95656 116861 110884
6106A10884k6794J6913O6991L4956m5590n9990R811N6674J3561n0852m6157Q391
$$ 110884 84090 101003 167994 202950 157360 97370 107181 163855 177416 126564 80407 88798
6094H8798L0537J749k4045j4182P307J4131J1058M800j1907l1719k6665P514L0817
$$ 88798 119335 121084 97039 82857 90164 104295 115353 120153 108246 76527 49862 57376 88193
6081H8193R847l0346l5128O319M4272L0492k1338n0186j9384L6855M9561n45n2279
$$ 88193 98040 67694 32566 38885 83157 113649 92311 42125 22741 59596 109157 108612 56333
6068E6333l8126K3272M6907j378n4004l7414K2607M3007O859k0198K973L5396
$$ 56333 18207 41479 88386 87008 33004 -4410 18197 61204 68063 47865 50838 86234
6056H6234K6417r349k6684j8385o729L836K0326K7800Q020j9478j7884J0752K9845
$$ 86234 112651 103302 76618 58233 51504 55340 75666 103466 111486 92008 74124 84876 114721
6043A14721K5016J5894J1633k533k7580m0135l1151j8430r097J1210L6625L1878
$$ 114721 139737 155631 167264 164731 137151 97016 65865 47435 38338 49548 86173 118051
6031A18051r316l7602j5318K4088K6510j444j2527j409p557l7462m4656n343L7112
$$ 118051 108735 71133 55815 79903 106413 104969 92442 91033 83476 46014 1358 -3985 33127
6018C3127L4034K26j5176q31J3029Q799J57j053j906o473m855O183J3737J0042
$$ 33127 67161 67387 52211 51380 64409 73208 73365 72312 70406 63933 59078 65261 78998 89040
6004H9040L787M73p911k0679j7853Q335L0312J9548r127j7019K079J6859Q025
$$ 89040 92827 93300 85389 64710 46857 55192 85504 105052 95925 78906 80985 97844 105869
5991A05869j0137k1801k9346l0848j1718K3188L9314J8072j1986j4947L231J2383
$$ 105869 95732 73931 44585 13737 2019 25207 64521 82593 70607 55660 58891 71274
5979G1274N060m678j2540k1065j8443N260L0475L1683J9262J9259J9998j2072
$$ 71274 76334 71656 59116 38051 19608 24868 55343 87026 106288 125547 145545 133473
5967A33473o1265o3360O23O0033M1572l2012p3418m3695J1000L3964K6416K2987
$$ 133473 72208 8848 9471 69504 111076 79064 5646 -38049 -27049 6915 33331 56318
5955E6318K9061J8252j2917k7055k750K1518P19l7349k4563L3357M7765j5945
$$ 56318 85379 103631 90714 63659 60909 82427 83146 45797 21234 54591 102356 86411
5943H6411o6997j9676O6857P1291n895n0603j7305J4282j3195m2545r944M6329
$$ 86411 19414 -262 66595 137886 131991 81388 64083 78365 65170 22625 12681 59010
5931E9010N3415J3750j9984k8588k3449n174J6562M803m5592p2996l1948L0802
$$ 59010 112425 126175 106191 77603 54154 48980 65542 70345 24753 -48243 -80191 -49389
5919d9389M4998J9684R632J8738J2709l468N07J2620J658j4101Q39K1305Q11l1715
$$ -49389 -4391 15293 24925 43663 56372 52904 53411 66031 67689 53588 54427 75732 76543 44828
5905D4828r828M6692M9576j2455n1338k1884J5633P766j2776m263J2075P441O96
$$ 44828 35000 81692 131268 118813 67475 45591 61224 68990 56214 51951 64026 71467 72163
5892G2163Q823P440j2794j4413J5425K6005j2690m8663k8009J8863L0687O908
$$ 72163 80986 88426 75632 61219 76644 102649 89959 41296 13287 32150 62837 69745
5880F9745j2763j7330j6890n328J7205K3320N890J457K1395J6636l3871o3370
$$ 69745 56982 39652 22762 17434 34639 57959 63849 65306 86701 103337 69466 6096
5868F096j8361M0878K8767k6934l5213O557K1862k217J902M9011O2163M16o5432
$$ 6096 -12265 28613 57380 30446 -4767 1790 23652 21435 23337 72348 134511 134927 69495
5855F9495n3574J6030N8368L3206k0928m1363p773L5838K7203l3183p0322l2745
$$ 69495 15921 31951 90319 123525 102597 61234 53461 89299 116502 83319 12997 -19748
5843a9748L1117M2585N906j3187K262Q576r584j6686K944K1448K1229J1051j0456
$$ -19748 11369 53954 59860 46673 48935 57511 47927 31241 34185 55633 76862 87913 77457
5830G7457m3976n0955o38N3292L1385l8834n0073J4994N3228J0140l6074j3765
$$ 77457 33481 -17474 -18112 35180 66565 27731 -22342 -7348 45880 56020 19946 6181
5818F181K6481J1206k9905k5611J4814K9242P487r936n632O735J9851K6921J0882
$$ 6181 32662 43868 13963 -11648 3166 32408 39895 29959 24327 31062 50913 77834 88716
5805H8716j8787j9875J3729K9411K299j8988j527R007k3092m6319j0812L4730
$$ 88716 69929 50054 63783 93194 95493 76505 74978 83985 60893 14574 3762 38492
5793C8492K3152j6454j8874J041n360j3596K1037N3328J6272m1202k2304M0529
$$ 38492 61644 45190 26316 27357 21997 8401 29438 82766 99038 57836 35532 76061
5781G6061K8514n2956p0541J0461O0720O5p5425n6599J7890N4191M8199M1236
$$ 76061 104575 51619 -18922 -8461 52259 52324 -23101 -79700 -61810 -7619 40580 81816
5769H1816K1914k5932m9690m431N1921L6671k7389n1526j6808J8254K1589J5225
$$ 81816 103730 77798 28108 23677 75598 112269 84880 33354 16546 34800 56389 71614
5757G1614J2940N202j000R078J7347k507l1367l0345o645J914n218K656K2817
$$ 71614 84554 89756 88756 97834 115181 112674 81307 50962 44317 46231 41013 43669 66486
5744F6486K0341q364k9169k8397k5149k3918p148J9615K6267J1081O332J9151
$$ 66486 86827 78463 49294 20897 -4252 -28170 -35318 -15703 10564 21645 27977 47128
5732D7128J6102j4220l1403n883K8525K3773q549j7691M141Q949k8198o0747l3421
$$ 47128 63230 49010 17607 11724 40249 64022 55473 37782 41923 50872 22674 -38073 -71494
5719g1494L1779N8465K1914j8625j1984J1931K390k3338j3795K2706L2362J1016
$$ -71494 -39715 18750 40664 22039 10055 21986 24376 1038 -12757 9949 42311 53327
5707E3327M292J4490l196m0080k8468L3195N3391l412m5392l974M6056J5127m3912
$$ 53327 57619 72109 68913 28833 365 33560 86951 83539 38147 34173 80229 95356 51444
5694E1444l0181K5559J8205m0730m4137J5479L0461k8238n5804M278O2498L5540
$$ 51444 21263 46822 65027 24297 -19840 -4361 26100 -2138 -57942 -53664 8834 44374
$$ [...]
##END NTUPLES=NMR SPECTRUM
##END=
