##TITLE=1H ikalashn
EC-3334(II-2)
25.10.2024
##JCAMPDX= 6.0         $$ Bruker NMR JCAMP-DX V2.0
##DATA TYPE= NMR SPECTRUM
##DATA CLASS= NTUPLES
##ORIGIN= UXNMR, Bruker Analytische Messtechnik GmbH
##OWNER= root
$$ TOPSPIN		Version 1.3
$$ 2024-10-25 10:42:38.156 +0400  Irina@DPX200
$$ Compression mode = diff/dup
##.OBSERVE FREQUENCY= 200.131300845
##.OBSERVE NUCLEUS= ^1H
##.ACQUISITION MODE= SIMULTANEOUS
##.ACQUISITION SCHEME= undefined
##.AVERAGES= 16
##.DIGITISER RES= 18
##SPECTROMETER/DATA SYSTEM= spect
##.PULSE SEQUENCE= zg
##.SOLVENT NAME= CDCl3
##.SHIFT REFERENCE= INTERNAL, CDCl3, 1, 17.49637
##AUDIT TRAIL= $$ (NUMBER, WHEN, WHO, WHERE, WHAT)
$$ ##TITLE= Audit trail, TOPSPIN		Version 1.3
$$ ##JCAMPDX= 5.01
$$ ##ORIGIN= Bruker BioSpin GmbH
$$ ##OWNER= Irina
$$ $$ F:/spectra/data/iren/nmr/1H/4/pdata/1/auditp.txt
$$ ##AUDIT TRAIL=  $$ (NUMBER, WHEN, WHO, WHERE, VERSION, WHAT)
(   1,<2024-10-25 10:42:08.578 +0400>,<Irina>,<DPX200>,<TOPSPIN 1.3>,
      <created by zg
	started at 2024-10-25 10:41:00.390 +0400,
	POWCHK disabled, PULCHK disabled
       configuration hash MD5:
       BE 6D 3F 07 2A EA 11 49 91 17 2B D3 AF B3 58 0D
       data hash MD5: 16K
       1E BC B6 8B CA B6 80 64 D9 E3 7D 75 15 93 3D 05>)
(   2,<2024-10-25 10:42:19.843 +0400>,<Irina>,<DPX200>,<TOPSPIN 1.3>,
      <Start of raw data processing
       efp BC_mod = 2 LB = 0.02 FT_mod = 6 PKNL = 1 PHC0 = 110.5135 PHC1 = 14.96867 SI = 32K 
       data hash MD5: 32K
       5B 78 24 49 AB F5 3A 4D 84 5E AD F7 8B CF C3 24>)
(   3,<2024-10-25 10:42:22.578 +0400>,<Irina>,<DPX200>,<TOPSPIN 1.3>,
      <apk 
       data hash MD5: 32K
       53 91 46 7F 4D B0 2B 3E 97 DA B1 A4 45 55 0B E0>)
(   4,<2024-10-25 10:42:26.937 +0400>,<Irina>,<DPX200>,<TOPSPIN 1.3>,
      <abs n ABSG = 5 
       data hash MD5: 32K
       59 41 07 84 ED 61 10 28 AE 6B 1A 73 66 0B CF 74>)
$$ ##END=
$$ 
$$ $$ hash MD5
$$ $$ 46 31 98 B3 DF 33 EE 1E 88 2C 93 44 00 9A 58 3A
##$RELAX= 
##$RELAX= 
##$RELAX= 
##$RELAX= 
##$RELAX= 
##$RELAX= 
##$RELAX= 
##$RELAX= 
##$RELAX= 
$$ Bruker specific parameters
$$ --------------------------
##$DU= <F:/spectra>
##$EXPNO= 4
##$NAME= <1H>
##$PROCNO= 1
##$TYPE= <nmr>
##$USER= <iren>
##$AMP= (0..31)
100 100 100 100 100 100 100 100 100 100 100 100 100 100 100 100 100 100 
100 100 100 100 100 100 100 100 100 100 100 100 100 100 
##$ANAVPT= -1
##$AQSEQ= 0
##$AQ_mod= 1
##$AUNM= <au_zg>
##$AUTOPOS= <>
##$BF1= 200.13
##$BF2= 200.13
##$BF3= 200.13
##$BF4= 200.13
##$BF5= 200.13
##$BF6= 200.13
##$BF7= 200.13
##$BF8= 200.13
##$BYTORDA= 1
##$CFDGTYP= 0
##$CFRGTYP= 5
##$CHEMSTR= <none>
##$CNST= (0..63)
1 1 145 1 1 1 1 1 1 1 1 1 1 1 1 1 1 1 1 1 1 1 1 1 1 1 1 1 1 1 1 1 1 1 
1 1 1 1 1 1 1 1 1 1 1 1 1 1 1 1 1 1 1 1 1 1 1 1 1 1 1 1 1 1 
##$CPDPRG= <>
##$CPDPRG1= <>
##$CPDPRG2= <>
##$CPDPRG3= <>
##$CPDPRG4= <mlev>
##$CPDPRG5= <mlev>
##$CPDPRG6= <mlev>
##$CPDPRG7= <mlev>
##$CPDPRG8= <mlev>
##$CPDPRGB= <>
##$CPDPRGT= <>
##$D= (0..63)
$$ [...]
##$SW_h= 4401.40845070422
##$TD= 16384
##$TD0= 1
##$TE= 300
##$TE2= 300
##$TE3= 300
##$TEG= 300
##$TL= (0..7)
0 120 120 120 120 120 120 120 
##$TP= (0..7)
150 150 150 150 150 150 150 150 
##$TP07= 0
##$TPNAME0= <>
##$TPNAME1= <>
##$TPNAME2= <>
##$TPNAME3= <>
##$TPNAME4= <>
##$TPNAME5= <>
##$TPNAME6= <>
##$TPNAME7= <>
##$TPOAL= (0..7)
0.5 0.5 0.5 0.5 0.5 0.5 0.5 0.5 
##$TPOFFS= (0..7)
0 0 0 0 0 0 0 0 
##$TUNHIN= 0
##$TUNHOUT= 0
##$TUNXOUT= 0
##$USERA1= <user>
##$USERA2= <user>
##$USERA3= <user>
##$USERA4= <user>
##$USERA5= <user>
##$V9= 5
##$VALIST= <valist>
##$VCLIST= <CCCCCCCCCCCCCCC>
##$VD= 0
##$VDLIST= <DDDDDDDDDDDDDDD>
##$VPLIST= <PPPPPPPPPPPPPPP>
##$VTLIST= <TTTTTTTTTTTTTTT>
##$WBST= 1024
##$WBSW= 25
##$XGAIN= (0..3)
0 0 0 0 
##$XL= 0
##$YL= 0
##$YMAX_a= 1354137
##$YMIN_a= -1904688
##$ZGOPTNS= <>
##$ZL1= 120
##$ZL2= 120
##$ZL3= 120
##$ZL4= 120
##$ABSF1= 17.49637
##$ABSF2= -4.496376
##$ABSG= 5
##$ABSL= 3
##$ALPHA= 0
##$AQORDER= 0
##$ASSFAC= 0
##$ASSFACI= 0
##$ASSFACX= 0
##$ASSWID= 0
##$AUNMP= <proc_1d>
##$AXLEFT= 0
##$AXRIGHT= 0
##$AXTYPE= 0
##$AXUNIT= <>
##$AZFE= 0.1
##$AZFW= 0.1
##$BCFW= 0
##$BC_mod= 2
##$BYTORDP= 0
##$COROFFS= 0
##$CY= 7568.61572265625
##$DATMOD= 1
##$DC= 0
##$DFILT= <>
##$DTYPP= 0
##$F1P= 17.9538593292236
##$F2P= -4.03888763876832
##$FCOR= 0.5
##$FTSIZE= 32768
##$FT_mod= 6
##$GAMMA= 0
##$GB= 0
##$INTBC= 0
##$INTSCL= 1.936888e-010
##$ISEN= 128
##$LB= 0.02
##$LEV0= 0
##$LPBIN= 0
##$MAXI= 945.577
##$MC2= 0
##$MEAN= 0
##$ME_mod= 0
##$MI= -402.1523
##$NCOEF= 0
##$NC_proc= -3
##$NLEV= 6
##$NOISF1= 8.587773
##$NOISF2= 6.764455
##$NSP= 0
##$NTH_PI= 0
##$NZP= 0
##$OFFSET= 17.49637
##$PC= 1
##$PHC0= 317.7433
##$PHC1= 7.325261
##$PH_mod= 1
##$PKNL= yes
##$PPARMOD= 0
##$PPDIAG= 0
##$PPIPTYP= 0
##$PPMPNUM= 100
##$PPRESOL= 1
##$PSCAL= 0
##$PSIGN= 0
##$REVERSE= no
##$SF= 200.13
##$SI= 32768
##$SIGF1= 16.12182
##$SIGF2= -4.496377
##$SINO= 3.521527
##$SIOLD= 32768
##$SREGLST= <1H.CDCl3>
##$SSB= 0
##$STSI= 32768
##$STSR= 0
##$SW_p= 4401.40845070422
##$SYMM= 0
##$S_DEV= 0
##$TDeff= 16384
##$TDoff= 0
##$TI= <>
##$TILT= no
##$TM1= 0
##$TM2= 0
##$TOPLEV= 0
##$USERP1= <user>
##$USERP2= <user>
##$USERP3= <user>
##$USERP4= <user>
##$USERP5= <user>
##$WDW= 1
##$XDIM= 32768
##$YMAX_p= 282508329
##$YMIN_p= -211458
$$ End of Bruker specific parameters
$$ ---------------------------------
##NTUPLES= NMR SPECTRUM
##VAR_NAME=  FREQUENCY,     SPECTRUM/REAL,   SPECTRUM/IMAG
##SYMBOL=    X,             R,               I
##VAR_TYPE=  INDEPENDENT,   DEPENDENT,       DEPENDENT
##VAR_FORM=  AFFN,          ASDF,            ASDF
##VAR_DIM=   32768,         32768,           32768
##UNITS=     HZ,            ARBITRARY UNITS, ARBITRARY UNITS
##FACTOR=    0.134324425510551, 1,           1
##FIRST=     4401.40845070422, -197679,      -483641
##LAST=      0,             -24249,          -554490
##MIN=       0,             -211458,         0
##MAX=       4401.40845070422, 282508329,    0
$$ Real data points
##PAGE= N=1
##DATA TABLE= (X++(R..R)), XYDATA
$$ [...]
$$ plain form
14392 -81316 -98836 -90830 -64980 -55814 -72819 -88133 -85469 -83956 -96559 -102173 -84422 -65706 -71496
14379 -71496 -86333 -79269 -54772 -44282 -58466 -78831 -89579 -90189 -81698 -65833 -54595 -58677 -69411
14366 -69411 -71198 -66331 -67788 -73861 -72146 -64636 -66097 -78234 -86178 -81660 -72133 -66494 -67108 -74189
14352 -74189 -83001 -80893 -63614 -48478 -51792 -60617 -51837 -33419 -35042 -56721 -62340 -35679 -9125
14339 -9125 -15664 -39643 -42953 -21768 -6643 -14722 -31497 -40648 -46641 -59464 -74217 -77058 -63642
14326 -63642 -44289 -34328 -41601 -59181 -69926 -63712 -50161 -47374 -57981 -66266 -62391 -57415 -64208
14313 -64208 -73520 -66273 -46771 -42918 -66872 -94761 -99300 -86323 -79002 -78592 -68362 -51412 -52121
14300 -52121 -73823 -86260 -70198 -47504 -46145 -58503 -60642 -54763 -61509 -80478 -90492 -86020 -83473
$$ packed form
14392h1316j7520Q006K5850R166j7005j5314K664J513j2603n614J7751J8716n790
14379g1496j4837P064K4497J0490j4184k0365j0748o10Q491J5865J1238m082j0734
14366f9411j787M867j457o073J715P510j461j2137p944M518R527N639o14p081
14352g4189q812K108J7279J5136l314q825Q780J8418j623k1679n619K6661K6554
14339i125o539k3979l310K1185J5125q079j6775r151n993j2823j4753k841J3416
14326f3642J9353R961p273j7580j0745O214J3551K787j0607q285L875M976o793
14313f4208r312P247J9502L853k3954k7889m539J2977P321M10J0230J6950p09
14300e2121k1702j2437J6062K2694J359j2358k139N879o746j8969j0014M472K547
$$ plain form
14287 -83473 -89739 -92043 -84256 -78551 -83203 -89930 -91278 -91480 -92301 -86454 -73559 -65647 -68149 -71504 -69863
14272 -69863 -71562 -81498 -89039 -84546 -74501 -70103 -73053 -80656 -91308 -97227 -87443 -67323 -58700 -69813
14258 -69813 -81871 -77756 -66378 -63562 -66489 -66051 -68863 -84427 -101493 -100908 -86373 -80896 -94747
14245 -94747 -114642 -123526 -116794 -101084 -89015 -91367 -104009 -108853 -97321 -82761 -78671 -79009 -75656
14232 -75656 -78860 -97629 -113695 -103325 -77289 -69677 -89200 -109475 -108843 -94339 -83321 -84134 -97436
14219 -97436 -115608 -120566 -103627 -85264 -90368 -107761 -105219 -83352 -76975 -96801 -109950 -93797
14207 -93797 -71541 -71965 -86505 -92031 -88154 -84933 -79117 -70584 -77483 -104037 -117448 -93140 -61990
14194 -61990 -70258 -107302 -120317 -95391 -74426 -85838 -106103 -107065 -100114 -107352 -120038 -116398 -100743
$$ packed form
14287h3473o266k304P787N705m652o727j348k02q21N847J2895P912k502l355J641
14272f9863j699r936p541M493J0045M398k950p603j0652n919R784K0120Q623j1113
14258f9813j2058M115J1378K816k927M38k812j5564j7066N85J4535N477j3851
14245i4747j9895q884O732J5710J2069k352j2642m844J1532J4560M090l38L353
14232g5656l204j8769j6066J0370K6036P612j9523k0275O32J4504J1018q13j3302
14219i7436j8172m958J6939J8363n104j7393K542K1867O377j9826j3149J6153
14207i3797K2256m24j4540n526L877L221N816Q533o899k6554j3411K4308L1150
14194f1990q268l7044j3015K4926K0965j1412k0265r62O951p238j2686L640J5655
$$ plain form
14181 -100743 -94566 -99866 -99646 -90879 -90910 -107188 -121637 -115590 -97120 -89891 -99852 -107672 -98103 -84010
14167 -84010 -88343 -108480 -117222 -102571 -87068 -94920 -115265 -117429 -94969 -73797 -76605 -96691 -111442
14154 -111442 -109495 -98849 -94356 -100803 -107743 -103858 -95146 -97408 -108736 -107927 -89229 -76623 -86193
14141 -86193 -97070 -85860 -69146 -77058 -99894 -102402 -83273 -75680 -89447 -99490 -97250 -104357 -122219
14128 -122219 -118767 -87453 -69467 -86492 -99535 -75370 -49217 -68584 -109807 -112393 -75353 -54583
14116 -54583 -71725 -89212 -81085 -69784 -76939 -88208 -88319 -88579 -96280 -94119 -75476 -67457 -90352
14103 -90352 -120308 -121572 -96488 -76095 -75774 -85509 -93359 -96091 -93405 -88809 -89574 -94492 -92886 -85811
14089 -85811 -91212 -113767 -128573 -114643 -87801 -77194 -83458 -86402 -83332 -90163 -108328 -119075 -113318
$$ packed form
14181a00743O177n300K20Q767l1j6278j4449O047J8470P229r961p820R569J4093
14167h4010m333k0137q742J4651J5503p852k0345k164K2460K1172k808k0086j4751
14154a11442J947J0646M493o447o940L885Q712k262j1328Q09J8698J2606r570
14141h6193j0877J1210J6714p912k2836k508J9129P593j3767j0043K240p107j7862
14128a22219L452L1314J7986j7025j3043K4165K6153j9367m1223k586L7040K0770
14116e4583j7142j7487Q127J1301p155j1269j11k60p701K161J8643Q019k2895
14103i0352k9956j264K5084K0393L21r735p850k732K686M596p65m918J606P075
14089h5811n401k2555j4806J3930K6842J0607o264k944L070o831j8165j0747N757
$$ plain form
14076 -113318 -103734 -102285 -104452 -100981 -91018 -80487 -78234 -91226 -110871 -111173 -79927 -45974 -49758
14063 -49758 -87074 -110825 -95304 -68962 -67870 -83790 -83876 -64302 -53662 -67608 -87883 -91854 -81954
14050 -81954 -75088 -76861 -80199 -82592 -89616 -100837 -105930 -101331 -99381 -109150 -117006 -104372 -81033 -77166
14036 -77166 -98021 -112984 -102534 -88678 -96055 -108806 -99945 -83147 -90972 -112322 -104261 -69318
14024 -69318 -64076 -110245 -150872 -131887 -83417 -71684 -101150 -120121 -106998 -92520 -97019 -100654
14012 -100654 -88996 -82066 -96802 -116048 -117999 -109236 -106417 -108182 -106798 -107606 -115350 -118848 -110506 -104218
13998 -104218 -111611 -117173 -102939 -83418 -85583 -103652 -107240 -91517 -84165 -97554 -108393 -98253
13986 -98253 -84018 -87672 -100079 -99971 -91670 -95288 -108463 -107685 -87778 -72758 -79748 -94701 -96922
$$ packed form
14076a13318R584J449k167L471R963J0531K253j2992j9645l02L1246L3953l784
14063d9758l7316k3751J5521K6342J092j5920q6J9574J0640j3946k0275l971R900
14050h1954O866j773l338k393p024j1221n093M599J950r769p856J2634K3339L867
14036g7166k0855j4963J0450J3856p377j2751Q861J6798p825k1350Q061L4943
14024f9318N242m6169m0627J8985M8470J1733k9466j8971J3123J4478m499l635
14012a00654J1658O930j4736j9246j951Q763K819j765J384q08p744l498Q342O288
13998a04218p393n562J4234J9521k165j8069l588J5723P352j3389j0839J0140
13986i8253J4235l654j2407J08Q301l618j3175P78J9907J5020o990j4953k221
$$ plain form
13973 -96922 -90073 -91196 -99684 -97778 -80556 -66957 -74616 -96105 -109333 -104681 -92423 -86889 -92847
13960 -92847 -107035 -123029 -131136 -122294 -99612 -80851 -80768 -93439 -101139 -99299 -100535 -110873 -115896
13947 -115896 -101500 -78749 -72024 -85018 -95396 -87034 -72015 -70828 -82368 -87664 -78261 -66324
13935 -66324 -65719 -74557 -80427 -75413 -62140 -50495 -51179 -67223 -88743 -100468 -97198 -87879 -82809 -82668
13921 -82668 -83183 -83866 -86052 -87020 -83351 -77679 -75046 -73725 -67300 -57166 -55621 -71240 -94487 -104525
13907 -104525 -92408 -73219 -69461 -82876 -90909 -76530 -53866 -52162 -76950 -102573 -106992 -98143
13895 -98143 -95522 -99208 -93734 -75877 -60712 -59957 -68640 -75480 -75246 -68915 -61788 -63038 -77044 -93901
13881 -93901 -99116 -93725 -92352 -99163 -100632 -88357 -74547 -74475 -84871 -91517 -89902 -86355 -84676 -83201
$$ packed form
13973i6922O849j123q488J906J7222J3599p659k1489j3228M652J2258N534n958
13960i2847j4188j5994q107Q842K2682J8761Q3j2671p700J840j236j0338n023
13947a15896J4396K2751O725j2994j0378Q362J5019J187j1540n296R403J1937
13935f6324O05q838n870N014J3273J1645o84j6044k1520j1725L270R319N070J41
13921h2668n15o83k186r68L669N672K633J321O425J0134J545j5619k3247j0038
13907a04525J2117J9189L758j3415q033J4379K2664J704k4788k5623m419Q849
13895i8143K621l686N474J7857J5165P55q683o840K34O331P127j250j4006j6857
13881i3901n215N391J373o811j469J2275J3810P2j0396o646J615L547J679J475
$$ plain form
13867 -83201 -81408 -79704 -76089 -71105 -71391 -79703 -86713 -82557 -72107 -68711 -76713 -89870 -102196 -109608
13853 -109608 -106363 -93320 -85437 -95817 -114580 -119543 -106495 -91373 -82610 -72448 -60121 -60375 -76797
13840 -76797 -87064 -73102 -51609 -53217 -78854 -98391 -91830 -72752 -66273 -78105 -93431 -98134
13828 -98134 -92764 -87247 -86970 -87098 -81791 -75736 -79329 -92094 -100840 -98493 -93987 -96076 -98891 -95160 -92360
13813 -92360 -98861 -102531 -85135 -55618 -45013 -63773 -86867 -90899 -84722 -88052 -97955 -97941 -89101 -88663
13799 -88663 -100869 -110871 -109027 -102303 -96907 -87049 -69815 -57332 -62306 -79718 -93819 -97893 -96912
13786 -96912 -94309 -87331 -76575 -71431 -80992 -101510 -115914 -108416 -82046 -59333 -59024 -72432 -72951
13773 -72951 -52411 -35044 -44808 -70162 -79027 -63732 -50045 -58404 -76604 -81728 -73178 -67903 -72012
$$ packed form
13867h3201J793J704L615M984k86q312p010M156J0450L396q002j3157j2326p412
13853a09608L245J3043P883j0380j8763m963J3048J5122Q763J0162J2327k54j6422
13840g6797j0267J3962K1493j608k5637j9537O561J9078O479j1832j5326m703
13828i8134N370N517K77j28N307O055l593j2765q746K347M506k089k815L731K800
13813i2360o501l670J7396K9517J0605j8760k3094m032O177l330r903J4Q840M38
13799h8663j2206j0002J844O724N396R858J7234J2483m974j7412j4101m074R81
13786i6912K603O978J0756N144r561k0518j4404P498K6370K2713L09j3408n19
13773g2951K0540J7367r764k5354q865J5295J3687q359j8200n124Q550N275m109
$$ plain form
13760 -72012 -74835 -69364 -63250 -66130 -76364 -85062 -86839 -82093 -72398 -58311 -42367 -32504 -38350 -59345
13746 -59345 -78977 -80134 -67692 -64265 -78078 -88579 -75846 -52428 -47907 -67819 -87769 -87848 -73846
13733 -73846 -61190 -55837 -57814 -68144 -83026 -92377 -92071 -88432 -85530 -79130 -68368 -60944 -60271 -60090
13719 -60090 -58199 -61047 -67292 -64382 -52858 -54890 -81002 -105322 -96720 -62364 -35833 -31142 -35426
13706 -35426 -41427 -56300 -75962 -80813 -66982 -57055 -66358 -79225 -74874 -60787 -61060 -79618 -92971
13693 -92971 -79732 -46659 -22196 -26510 -49037 -59796 -46880 -34576 -51912 -89917 -109928 -94351
13681 -94351 -67051 -56525 -60172 -58688 -49491 -47859 -61983 -81262 -88175 -75665 -55594 -50213 -67555
13668 -67555 -87420 -85027 -66007 -58079 -68076 -73555 -63204 -55233 -61159 -62375 -46033 -35815 -55453
$$ packed form
13760g2012k823N471O114k880j0234q698j777M746R695J4087J5944R863n846k0995
13746e9345j9632j157J2442L427j3813j0501J2733K3418M521j9912j9950p9J4002
13733g3846J2656N353j977j0330j4882r351L06L639K902O400J0762P424O73J81
13719f0090J891k848o245K910J1524k032k6112k4320Q602L4356K6531M691m284
13706c5426o001j4873j9662m851J3831R927r303j2867M351J4087k73j8558j3353
13693i2971J3239L3073K4463m314k2527j0759J2916J2304j7336l8005k0011J5577
13681i4351K7300J0526l647J484R197J632j4124j9279o913J2510K0071N381j7342
13668f7555j9865K393J9020P928r997n479J0351P971n926j216J6342J0218j9638
$$ plain form
13655 -55453 -83703 -82392 -55267 -40895 -54085 -71690 -75057 -71087 -68340 -64760 -64004 -73775 -82931
13642 -82931 -70647 -44506 -37737 -59144 -77774 -70739 -54915 -53327 -59350 -56725 -50156 -51036 -52829
13629 -52829 -46117 -41790 -53523 -69274 -65032 -39184 -12516 -1213 -7601 -28395 -53351 -63899
13617 -63899 -51527 -31011 -20747 -20250 -22011 -30609 -49217 -61273 -50830 -30614 -23777 -27200 -20918
13604 -20918 -5772 -451 -6213 -8034 -8881 -26404 -52455 -54572 -28379 -11112 -25629 -45393 -38471
13591 -38471 -16101 -8281 -14434 -11186 5028 15161 10528 832 -7778 -18039 -25282 -17869 3160
13578 3160 21869 27677 24631 19884 15984 15094 18710 22541 22163 22648 31264 42462 43319 33874 28410
13563 28410 34166 41343 38608 28526 22504 27180 39159 48300 45461 31992 20202 18916 22537
$$ packed form
13655e5453k8250J311K7125J4372j3190j7605l367L970K747L580P56r771r156
13642h2931J2284K6141O769k1407j8630P035J5824J588o023K625O569q80j793
13629e2829O712M327j1733j5751M242K5848K6668J1303o388k0794k4956j0548
13617f3899J2372K0516J0264M97j761q598j8608j2056J0443K0216O837l423O282
13604b0918J5146N321n762j821q47j7523k6051k117K6193J7267j4517j9764O922
13591c8471K2370P820o153L248J6214J0133m633r696q610j0261p243P413K1029
13578C160J8709N808l046m747l900q90L616L831l78M85Q616J1198Q57r445n464
13563B8410N756P177k735j0082o022M676J1979R141k839j3469j1790j286L621
$$ plain form
13550 22537 22061 20729 26036 31507 24180 9326 7556 22546 32017 21082 5915 8483 22424
13537 22424 24541 12130 6250 17855 31519 30319 21371 24022 40212 50157 38617 16231 8459
13524 8459 25568 50034 56771 41660 23837 20739 28764 31738 21817 6155 -3302 -960 9440
13511 9440 18259 18034 11806 10960 21405 35473 42054 40391 37575 36526 34844 32828 32633 30280 19146
13496 19146 2758 -6666 -5418 -3271 -6554 -7677 752 11779 14574 10850 8992 8861 6101 5961
13482 5961 15991 27345 22259 2544 -8506 578 12756 9851 -691 -2276 2248 -885 -8506
13469 -8506 -4619 10455 18371 12919 9792 18741 26259 18800 7050 10012 24580 29107 14497 -4166
13455 -4166 -9394 -2793 1178 -3566 -7655 -1318 9191 8184 -5430 -11801 2853 23039 24721 12498
$$ packed form
13550B2537m76j332N307N471p327j4854j770J4990R471j0935j5167K568J3941
13537B2424K117j2411n880J1605J3664j200q948K651J6190R945j1540k2386p772
13524H459J7109K4466O737j5111j7823l098Q025K974r921j5662r457K342J0400
13511I440Q819k25o228q46J0445J4068O581j663k816j049j682k016j95k353j1134
13496A9146j6388r424J248K147l283j123Q429J1027K795l724j858j31k760j40
13482E961J0030J1354n086j9715j1050R084J2178k905j0542j585M524l133p621
13469h506L887J5074P916n452l127Q949P518p459j1750K962J4568M527j4610j8663
13455d166n228O601L971m744m089O337J0509j007j3614o371J4654K0186J682j2223
$$ plain form
13441 12498 11729 23369 17090 -18597 -49424 -41990 -13306 -3166 -14325 -16472 -950 8359 324
13428 324 -6031 333 2193 -11086 -19395 -5464 12504 8705 -8191 -9921 5810 13944 2382
13415 2382 -12802 -14457 -5183 3839 8577 10852 12295 13608 13142 6721 -4466 -10216 -4496 3560
13401 3560 3518 2202 13471 33904 45547 41143 30051 20257 12248 10373 19849 29623 19771 -6870
13387 -6870 -21100 -5854 20607 32826 31348 31463 34754 33019 30680 40609 59910 68980 56957
13374 56957 34915 21714 25966 42027 56242 58790 55004 59324 72024 73406 53562 34939 44175
13361 44175 69866 75561 54230 39966 56464 81868 83007 62931 50456 55995 63990 64348 66207
13348 66207 77209 89292 92729 89984 87433 84431 79633 79689 90837 105640 108354 94401 77477
$$ packed form
13441A2498p69J1640o279l5687l0827P434K8684J0140j1159k147J5522R309q035
13428C24o355O364J860j3279q309J3931J7968l799j6896j730J5731Q134j1562
13415B382j5184j655R274R022M738K275J443J313m66o421j1187n750N720Q056
13401C560m2j316J1269K0433J1643m404j1092r794q009j875R476R774r852k6641
13387f870j4230J5246K6461J2219j478J15L291j735k339R929J9301R070j2023
13374E6957k2042j3201M252J6061J4215K548l786M320J2700J382j9844j8623R236
13361D4175K5691N695k1331j4264J6498K5404J139k0076j2475N539P995L58J859
13348F6207J1002J2083L437k745k551l002m798N6J1148J4803K714j3953j6924
$$ plain form
13335 77477 74415 87144 103320 112594 116802 122188 126725 122140 108248 97585 101410 115689 125985
13322 125985 123450 111433 98832 91939 91515 93681 94402 94836 98787 103487 100939 93581 97664 118981
13308 118981 135146 121612 91375 84285 111893 137813 127241 94988 82465 100978 124162 131359
13296 131359 130937 136287 142527 138949 128460 120928 116765 109628 99961 94971 97423 102768 106729 109826
13282 109826 114014 118152 117708 109446 97811 93599 100849 108048 101761 88172 88517 109757 133137 139538
13268 139538 133827 132239 135314 129128 110003 92774 92088 105523 118531 119988 110874 101206 98789
13255 98789 100264 97655 94566 105186 130333 146848 135097 108395 96929 106911 116036 109811 100579
13242 100579 103850 115288 122663 125437 128745 129212 121870 114592 120895 139819 154139 150103 133107
$$ packed form
13335G7477l062J2729J6176R274M208N386M537m585j3892j0663L825J4279J0296
13322A25985k535j2017j2601o893m24K166P21M34L951M700k548p358M083K1317
13308A18981J6165j3534l0237p090K7608K5920j0572l2253j2523J8513K3184P197
13296A31359m22N350O240l578j0489p532m163p137r667m990K452N345L961L097
13282A09826M188M138m44q262j1635m212P250P199o287j3589L45K1240K3380O401
13268A39538n711j588L075o186j9125j7229o86J3435J3008J457r114r668k417
13255I8789J475k609l089J0620K5147J6515j1751k6702j1466R982R125o225r232
13242A00579L271J1438P375K774L308M67p342p278O303J8924J4320m036j6996
$$ plain form
13229 133107 122851 134191 160355 176231 165639 144461 144183 169952 191194 182319 155858 140578
13217 140578 142010 145634 148460 160734 178190 180037 161989 148664 160297 184020 193390 184515 175929
13204 175929 179023 185718 185428 180115 178041 181910 188782 196060 201949 203461 200029 198047 205330 219410
13190 219410 227408 221888 211376 208093 210149 207281 202366 211405 236843 256426 250625 229906 219648
13177 219648 225215 229287 221520 213250 218829 235599 248723 248601 239447 234628 243248 257629 259419 244726
13163 244726 233848 243150 257663 252737 236084 239299 265735 279581 260456 238548 251162 286852
13151 286852 303572 289983 275878 283628 299984 303828 297721 298000 308475 318655 321324 320123 321380
13138 321380 326529 334242 345604 362619 380672 387754 378351 365510 367960 384341 394328 390210 390522
$$ packed form
13229A33107j0256J1340K6164J5876j0592k1178k78K5769K1242q875k6461j5280
13217A40578J432L624K826J2274J7456J847j8048j3325J1633K3723R370q875q586
13204A75929L094O695k90n313k074L869O872P278N889J512l432j982P283J4080
13190B19410P998n520j0512l283K056k868m915R039K5438J9583n801k0719j0258
13177B19648N567M072p767q270N579J6770J3124j22r154m819Q620J4381J790j4693
13163B44726j0878R302J4513m926j6653L215K6436J3846j9125k1908J2614L5690
13151B86852J6720j3589j4105P750J6356L844o107K79J0475J0180K669j201J257
13138C21380N149P713J1362J7015J8053P082r403j2841K450J6381R987m118L12
$$ plain form
13125 390522 410685 435994 442086 431596 429713 448520 474984 491184 489121 470126 448696 451139
13113 451139 486760 524474 526589 505278 511016 557485 596854 590167 565904 574607 612297 632746
13101 632746 623296 620738 647306 674480 670364 651384 658018 695592 729055 733936 726999 737922 767578
13088 767578 789802 788923 779223 782385 798469 811733 818264 830064 850561 865228 865750 866702 883023
13075 883023 903880 908494 900037 901503 919841 936452 936907 929946 930166 939821 956461 981407 1008860
13062 1008860 1021975 1014854 1006850 1019053 1045359 1063217 1065926 1066301 1072923 1082338 1093944 1112359 1131634
13049 1131634 1136821 1128747 1128946 1148563 1168525 1166086 1148350 1140765 1150369 1160963 1161447 1157534 1153334
13036 1153334 1142483 1125271 1116406 1124171 1136347 1139397 1138180 1141421 1140527 1123698 1102891 1101533 1116159
$$ packed form
13125C90522K0163K5309O092j0490j883J8807K6464J6200k063j8995k1430K443
13113D51139L5621L7714K115k1311N738M6469L9369o687k4263Q703L7690K0449
13101F32746r450k558K6568K7174m116j8980O634L7574L3463M881o937J0923K9656
13088G67578K2224q79r700L162J6084J3264O531J1800K0497J4667N22R52J6321
13075H83023K0857M614q457J466J8338J6611M55o961K20R655J6640K4946K7453
13062A008860J3115p121q004J2203K6306J7858K709L75O622R415J1606J8415J9275
13049A131634N187q074J99J9617J9962k439j7736p585R604J0594M84l913m200
13036A153334j0851j7212q865P765J2176L050j217L241q94j6829k0807j358J4626
$$ plain form
13023 1116159 1116385 1090028 1063827 1064942 1081886 1084130 1067372 1055523 1062332 1074495 1076611 1073657 1078933
13010 1078933 1091701 1098174 1090010 1073418 1060871 1058572 1062244 1063193 1058051 1052183 1053096 1062004 1072866
12997 1072866 1077286 1069700 1052403 1037520 1037296 1047812 1049832 1033178 1012291 1006499 1011777 1007672 989113
12984 989113 972794 969292 967329 954584 939087 937057 948780 959531 959362 950953 940986 933635 931401
12971 931401 934268 937793 937021 931737 924800 917957 912465 910262 911371 913921 918432 925550 927633 913394
12957 913394 887326 872933 884896 906624 909701 890343 871587 871977 887487 904625 916340 921711
12945 921711 922406 923378 927018 925341 909921 890704 889555 910162 930119 931155 922193 920863 926162 925472
12931 925472 918918 918411 926534 933395 934351 936415 945144 956568 964212 965374 960612 956049 963945 988810
$$ packed form
13023A116159K26k6357k6201J115J6944K244j6758j1849O809J2163K116k954N276
13010A078933J2768O473q164j6592j2547k299L672R49n142n868R13Q908J0862
12997A072866M420p586j7297j4883k24J0516K020j6654k0887n792N278m105j8559
12984I89113j6319l502j963j2745j5497k030J1723J0751j69q409r967p351k234
12971I31401K867L525p72n284o937o843n492k203J109K550M511P118K083j4239
12957I13394k6068j4393J1963K1728L077j9358j8756L90J5510J7138J1715N371
12945I21711O95R72L640j677j5420j9217j149K0607J9957J036q962j330N299o90
12931I25472o554n07Q123O861R56K064Q729J1424P644J162m762m563P896K4865
$$ plain form
12917 988810 1014047 1017210 1000344 989529 999783 1017451 1026072 1032062 1048821 1068663 1071830 1058621
12905 1058621 1051626 1064191 1084652 1098430 1110948 1137214 1176162 1207201 1212818 1198831 1189836 1204944
12893 1204944 1239050 1270738 1288684 1302996 1325599 1349010 1357520 1353771 1355983 1367647 1369648 1350870
12881 1350870 1328980 1326390 1338470 1343054 1333475 1323101 1320256 1318247 1312975 1312836 1323303 1334506 1334359
12868 1334359 1326929 1328345 1347028 1374202 1393693 1398617 1398681 1410141 1436781 1464626 1480824 1493094
12856 1493094 1520135 1564535 1608226 1637785 1661651 1695086 1737364 1772527 1787173 1780558 1761691
12845 1761691 1742783 1731998 1727317 1719420 1702532 1678803 1652359 1626209 1605057 1591062 1575670 1548413
12833 1548413 1516766 1501172 1503467 1498496 1470038 1437533 1428483 1438916 1444441 1439875 1440557 1448708 1447879
$$ packed form
12917I88810K5237L163j6866j0815J0254J7668Q621N990J6759J9842L167j3209
12905A058621o995J2565K0461J3778J2518K6266L8948L1039N617j3987q995J5108
12893A204944L4106L1688J7946J4312K2603K3411Q510l749K212J1664K001j8778
12881A350870k1890k590J2080M584r579j0374k845k009n272j39J0467J1203j47
12868A334359p430J416J8683K7174J9491M924O4J1460K6640K7845J6198J2270
12856A493094K7041M4400M3691K9559K3866L3435M2278L5163J4646o615j8867
12845A761691j8908j0785m681p897j6888k3729k6444k6150k1152j3995j5392k7257
12833A548413l1647j5594K295m971k8458l2505r050J0433N525m566O82Q151q29
$$ plain form
12820 1447879 1434366 1427368 1438976 1456519 1465635 1471115 1481886 1492420 1493903 1490822 1491919 1495117 1494649
12807 1494649 1493421 1494987 1492136 1477548 1458619 1447394 1441103 1426563 1400178 1370524 1344006 1320775
12795 1320775 1303016 1294267 1289680 1277870 1254764 1228458 1209663 1202543 1202683 1198304 1177956 1145111
12783 1145111 1120387 1119257 1131301 1132695 1115996 1094858 1081250 1073049 1066062 1063470 1066848 1068682 1061487
12770 1061487 1047927 1036376 1031232 1030803 1029640 1021005 1003038 984430 977343 982067 984843 974187 954455
12757 954455 940451 941788 953412 959072 946645 923760 912408 920641 927962 912458 884729 873894
12745 873894 882492 881988 859297 839592 846386 863374 860716 841993 835590 848336 858826 855946 853222
12732 853222 857713 853145 829878 809875 820060 852492 872548 862625 839271 826508 828470 833828
$$ packed form
12820A447879j3513o998J1608J7543R116N480J0771J0534J483l081J097L198m68
12807A494649j228J566k851j4588j8929j1225o291j4540k6385k9654k6518k3231
12795A320775j7759q749m587j1810k3106k6306j8795p120J40m379k0348l2845
12783A145111k4724j130J2044J394j6699k1138j3608q201o987k592L378J834p195
12770A061487j3560j1551n144m29j163q635j7967j8608p087M724K776j0656j9732
12757I54455j4004J337J1624N660j2427k2885j1352Q233P321j5504k7729j0835
12745H73894Q598n04k2691j9705O794J6988k658j8723o403J2746J0490k880k724
12732H53222M491m568k3267k0003J0185L2432K0056r923k3354j2763J962N358
$$ plain form
12720 833828 835120 834549 835764 837733 836379 828784 816259 805024 802172 808373 815569 814634 805196 795420
12706 795420 791953 792892 791780 785402 775273 764200 755277 752211 755113 756244 746545 728842 717992
12693 717992 722625 731941 728845 713869 705405 713284 722809 714819 695523 691291 711158 729974 721358
12680 721358 697065 693524 720277 744918 739397 720188 721787 744422 756432 745330 735570 746599
12668 746599 760727 751928 727571 717103 728223 738612 730886 715131 710810 720317 728458 721028 698365
12655 698365 673979 661876 663071 665402 658457 644673 632904 627971 631564 643918 655519 647691 616150
12642 616150 586293 587067 613297 632542 627638 612305 603926 603305 606758 615561 623282 614710 591064
12629 591064 577174 587096 600139 591611 572465 572848 594590 607814 594729 571370 559681 559139 556741
$$ packed form
12720H33828J292n71J215J969j354p595j2525j1235k852O201P196r35r438r776
12706G95420l467R39j112o378j0129j1073q923l066K902J131r699j7703j0850
12693G17992M633R316l096j4976q464P879R525p990j9296m232J9867J8816q616
12680G21358k4293l541K6753K4641n521j9209J599K2635J2010j1102r760J1029
12668G46599J4128q799k4357j0468J1120J0389p726j5755m321R507Q141p430k2663
12655F98365k4386j2103J195K331o945j3784j1769m933L593J2354J1601p828l1541
12642F16150k9857P74K6230J9245m904j5333q379o21L453Q803P721q572k3646
12629E91064j3890R922J3043q528j9146L83K1742J3224j3085k3359j1689n42k398
$$ plain form
12616 556741 549725 545187 545324 544392 537984 528729 523022 523912 526504 522377 511067 502605 503225 504404 495083
12601 495083 479265 469610 467953 466911 467861 478648 491909 486624 459464 435901 437431 452979 457834
12588 457834 448135 438618 435190 430269 422361 420173 424429 422069 404696 381151 365653 362449 367602
12575 367602 377641 389385 396625 394022 382592 367735 354348 346697 349486 363445 379606 382717
12563 382717 365239 338749 326264 337229 353007 347226 320715 302090 307857 319273 313911 303911
12551 303911 316620 344944 350044 318780 286640 288148 311911 327037 330466 337675 342546 323851
12539 323851 288585 272703 291132 316960 322347 313968 311725 315098 312069 305405 306781 313683 313564
12526 313564 306292 303424 307417 308552 301929 292968 286996 286572 296021 312939 318812 298386 268850 266498
$$ packed form
12616E56741p016m538J37r32o408r255n707Q90K592m127j1310q462O20J179r321
12601D95083j5818r655j657j042R50J0787J3261n285k7160k3563J530J5548M855
12588D57834r699r517l428m921p908k188M256k360j7373k3545j5498l204N153
12575C67602J0039J1744P240k603j1430j4857j3387p651K789J3959J6161L111
12563C82717j7478k6490j2485J0965J5778n781k6511j8625N767J1416n362j0000
12551C03911J2709K8324N100l1264l2140J508K3763J5126L429P209M871j8695
12539C23851l5266j5882J8429K5828N387q379k243L373l029o664J376O902j19
12526C13564p272k868L993J135o623q961n972m24R449J6918N873k0426k9536k352
$$ plain form
12512 266498 297436 324078 313617 280436 262643 271822 287965 295116 297608 301532 302107 295946 290256
12499 290256 291422 294625 292525 287304 287298 295888 308424 317155 316782 308860 302456 306115 317557 326227 327503
12484 327503 328042 333880 340123 338779 332282 331466 340934 353041 357928 355156 352849 357378 366509 372999
12470 372999 373452 371665 372900 377860 384945 395154 408872 419350 418062 408570 405512 414081 420140 411180
12456 411180 398930 404857 425854 434783 421094 410287 427110 454867 455506 424779 400418 409581
12444 409581 432636 434422 413373 397835 402439 411942 409386 399822 398054 406732 416805 421623 421307
12431 421307 417791 413546 413306 420858 434119 446441 452309 450254 441900 430689 421765 421766 435597 459192
12417 459192 476731 473650 455980 447346 459983 478948 484870 479947 475705 468034 448851 433759 446183
$$ packed form
12512B66498L0938K6642j0461l3181j7793R179J6143P151K492L924N75o161n690
12499B90256J166L203k100n221oQ590J2536Q731l73p922o404L659J1442Q670J276
12484C27503N39N838O243j344o497q16R468J2107M887k772k307M529R131O490
12470C72999M53j787J235M960P085J0209J3718J0478j288r492l058Q569O059q960
12456D11180j2250N927K0997Q929j3689j0807J6823K7757O39l0727k4361R163
12444D09581K3055J786k1049j5538M604R503k556r564j768Q678J0073M818l16
12431D21307l516m245k40P552J3261J2322N868k055q354j1211q924JJ3831K3595
12417D59192J7539l081j7670q634J2637J8965N922m923m242p671j9183j5092J2424
$$ plain form
12404 446183 474850 482535 464186 458331 484338 507513 494840 470445 476444 504676 513283 495336
12392 495336 482114 483961 477519 456185 446489 461286 477417 476999 474902 485827 497236 497106 498700
12379 498700 513281 524901 518627 510300 520338 538154 541379 533455 533215 541895 549594 560944 583673
12366 583673 603023 599804 585694 587793 604385 610719 605113 611195 631583 638871 623808 615694 636207
12353 636207 664403 671773 667668 681616 715331 740383 738464 721636 712904 722958 747139 773131
12341 773131 789650 795479 801027 816162 837879 854893 862676 868376 880534 898404 914504 927025
12329 927025 945295 978027 1018508 1050780 1071851 1095891 1131030 1165799 1188739 1207540 1233773
12318 1233773 1261433 1279633 1295825 1323917 1357199 1377830 1387890 1404134 1424563 1429550 1417488
$$ packed form
12404D46183K8667P685j8349n855K6007K3175j2673k4395N999K8232Q607j7947
12392D95336j3222J847o442k1334r696J4797J6131m18k097J0925J1409j30J594
12379D98700J4581J1620o274q327J0038J7816L225p924k40Q680P699J1350K2729
12366E83673J9350l219j4110K099J6592O334n606O082K0388P288j5063q114K0513
12353F36207K8196P370m105J3948L3715K5052j919j6828q732J0054K4181K5992
12341G73131J6519N829N548J5135K1717J7014P783N700J2158J7870J6100J2521
12329I27025J8270L2732M0481L2272K1071K4040L5139L4769K2940J8801K6233
12318A233773K7660J8200J6192K8092L3282K0631J0060J6244K0429M987j2062
$$ plain form
12307 1417488 1409047 1410646 1403940 1380755 1359360 1353931 1354893 1352504 1353219 1358653 1355380 1341218 1334247 1339352
12293 1339352 1335872 1318136 1314972 1342035 1367793 1361442 1344494 1352787 1372485 1363841 1332972 1325638
12281 1325638 1352561 1373351 1362296 1343287 1344208 1356071 1357194 1347540 1339507 1337728 1343521 1358782 1373071
12268 1373071 1367974 1346593 1337633 1356684 1383061 1389952 1380275 1376519 1388169 1404803 1414024 1415205 1419347
12255 1419347 1438148 1467259 1484350 1476069 1460189 1462021 1476145 1478025 1468644 1472990 1491881 1494437
12243 1494437 1470772 1454125 1470287 1498594 1507603 1499469 1491943 1484516 1473685 1477097 1507150 1539216
12231 1539216 1542040 1525381 1521985 1534821 1540456 1536384 1543800 1563911 1571562 1559329 1552749 1570119 1596466
12218 1596466 1610487 1612581 1612743 1612185 1611130 1617240 1632568 1645697 1648204 1646840 1650166 1655195 1656504 1657390
$$ packed form
12307A417488q441J599o706k3185k1395n429R62k389P15N434l273j4162o971N105
12293A339352l480j7736l164K7063K5758o351j6948Q293J9698q644l0869p334
12281A325638K6923K0790j1055j9009R21J1863J123r654q033j779N793J5261J4289
12268A373071n097k1381q960J9051K6377O891r677l756J1650J6634R221J181M142
12255A419347J8801K9111J7091q281j5880J832J4124J880r381M346J8891K556
12243A494437k3665j6647J6162K8307R009q134p526p427j0831L412L0053L2066
12231A539216K824j6659l396J2836N635m072P416K0111P651j2233o580J7370K6347
12218A596466J4021K094J62n58j055O110J5328J3129K507j364L326N029J309Q86
$$ plain form
12204 1657390 1662555 1668892 1671975 1673907 1677430 1678882 1673538 1663493 1656628 1661146 1680318 1706841 1725312
12191 1725312 1729026 1730619 1745020 1766662 1779061 1783545 1798131 1826214 1848324 1853007 1856057 1876184
12179 1876184 1907011 1928681 1937208 1946472 1965727 1988757 2005518 2015375 2026054 2042382 2057770 2059453
12167 2059453 2045249 2031217 2035207 2054656 2069036 2063350 2040965 2014635 1994297 1983091 1976626 1967296
12155 1967296 1956419 1956618 1972427 1987109 1983820 1971245 1968462 1971827 1961982 1939961 1927726 1932101 1938169
12142 1938169 1942237 1958394 1983799 1993108 1983054 1986880 2021413 2053750 2051418 2035844 2047571 2080578
12130 2080578 2094922 2082746 2077202 2097852 2128740 2156060 2189946 2237152 2283619 2319183 2354010
12119 2354010 2394531 2425250 2432974 2432289 2446986 2476260 2497379 2496521 2481355 2465248 2452976 2444002
$$ packed form
12204A657390N165O337L083J932L523J452n344j0045o865M518J9172K6523J8471
12191A725312L714J593J4401K1642J2399M484J4586K8083K2110M683L050K0127
12179A876184L0827K1670Q527R264J9255K3030J6761R857J0679J6328J5388J683
12167B059453j4204j4032L990J9449J4380n686k2385k6330k0338j1206o465r330
12155A967296j0877J99J5809J4682l289j2575k783L365r845k2021j2235M375O068
12142A938169M068J6157K5405R309j0054L826L4533L2337k332j5574J1727L3007
12130B080578J4344j2176n544K0650L0888K7320L3886M7206M6467L5564L4827
12119B354010M0521L0719P724o85J4697K9274K1119q58j5166j6107j2272q974
$$ plain form
12107 2444002 2438734 2435448 2427151 2409478 2390591 2384472 2390769 2390193 2368899 2339585 2323984 2320049 2307231
12094 2307231 2283972 2274285 2288625 2303694 2297222 2280966 2279004 2291661 2303555 2312133 2324239 2336768
12082 2336768 2344491 2355894 2378625 2402414 2420682 2452716 2513889 2579824 2617510 2639772 2685901
12071 2685901 2755631 2810755 2842272 2883394 2945765 2995344 3011633 3021158 3043712 3051054 3016067 2964452
12059 2964452 2934089 2912865 2864978 2799545 2762141 2763711 2764457 2734220 2691134 2667468 2664581 2658976
12047 2658976 2639057 2620749 2627019 2655943 2674939 2657011 2620646 2614132 2654590 2705349 2725742 2719192
12035 2719192 2713941 2720243 2731630 2748530 2771665 2786206 2780592 2769764 2774079 2787983 2795877 2803535
12023 2803535 2822490 2837730 2827447 2805100 2803342 2822007 2831518 2825100 2826441 2844246 2860928 2871713
$$ packed form
12107B444002n268l286q297j7673j8887o119O297n76k1294k9314j5601l935j2818
12094B307231k3259r687J4340J5069o472j6256j962J2657J1894Q578J2106J2529
12082B336768P723J1403K2731K3789J8268L2034O1173O5935L7686K2262M6129
12071B685901O9730N5124L1517M1122O2371M9579J6289R525K2554P342l4987n1615
12059B964452l0363k1224m7887o5433l7404J570P46l0237m3086k3666k887n605
12047B658976j9919j8308O270K8924J8996j7928l6365o514M0458N0759K0393o550
12035B719192n251O302J1387J6900K3135J4541n614j0828M315J3904P894P658
12023B803535J8955J5240j0283k2347j758J8665R511o418J341J7805J6682J0785
$$ plain form
12011 2871713 2892778 2920807 2926574 2903924 2885619 2892030 2901871 2895959 2893598 2917608 2954212 2978350
11999 2978350 2994147 3020212 3055755 3090746 3131469 3186785 3244126 3286687 3320649 3359379 3395758
11988 3395758 3418577 3442099 3487086 3541962 3576128 3587147 3601770 3630085 3650931 3648991 3637793
11977 3637793 3634039 3630558 3608651 3564374 3511648 3467086 3438140 3420252 3401705 3374568 3340759 3305176
11965 3305176 3268427 3231097 3197465 3167729 3134835 3097361 3066477 3050344 3040349 3022642 2994508
11954 2994508 2961191 2928216 2904788 2898761 2898139 2877556 2836646 2807701 2805514 2797510 2753697 2699674
11942 2699674 2679107 2683132 2665794 2620087 2586166 2582381 2579830 2557234 2534055 2530120 2532737 2525830
11930 2525830 2517054 2513532 2502178 2477247 2458565 2459118 2461639 2450693 2440747 2446921 2454550 2446675 2437433
$$ packed form
12011B871713K1065K8029N767k2650j8305O411R841n912k361K4010L6604K4138
11999B978350J5797K6065L5543L4991M0723N5316N7341M2561L3962L8730L6379
11988C395758K2819K3522M4987N4876L4166J1019J4623K8315K0846j940j1198
11977C637793l754l481k1907m4277n2726m4562k8946j7888j8547k7137l3809l5583
11965C305176l6749l7330l3632k9736l2894l7474l0884j6133r995j7707k8134
11954B994508l3317l2975k3428o027o22k0583m0910k8945k187q004m3813n4023
11942B699674k0567M025j7338m5707l3921l785k551k2596k3179l935K617o907
11930B525830q776l522j1354k4931j8682N53K521j0946r946O174P629p875r242
$$ plain form
11917 2437433 2446185 2459266 2451795 2431321 2424766 2433337 2434459 2420766 2404629 2389061 2365698 2339538
11905 2339538 2326304 2325057 2319615 2307310 2301440 2305017 2306499 2302852 2303243 2307104 2300481 2278831 2255584
11892 2255584 2244672 2248255 2260228 2268067 2257457 2231983 2219621 2238685 2266536 2267213 2242066 2224415
11880 2224415 2229804 2242722 2249599 2252372 2249846 2238119 2229859 2240090 2253928 2245317 2226237 2233140 2262467
11867 2262467 2271665 2253977 2253155 2281447 2285503 2234040 2182935 2197482 2252871 2274997 2250948 2232609
11855 2232609 2246576 2266628 2273187 2279458 2291354 2293453 2286163 2292477 2316158 2332642 2331846 2331971 2341019
11842 2341019 2343487 2337107 2343607 2367218 2380038 2367302 2352341 2356542 2368191 2372827 2381036 2400603
11830 2400603 2412792 2405660 2402638 2425910 2456216 2463439 2455773 2461720 2480650 2490973 2496183 2521519
$$ packed form
11917B437433Q752J3081p471k0474o555Q571J122j3693j6137j5568k3363k6160
11905B339538j3234j247n442j2305n870L577J482l647L91L861o623k1650k3247
11892B255584j0912L583J1973P839j0610k5474j2362J9064K7851O77k5147j7651
11880B224415N389J2918O877K773k526j1727q260J0231J3838q611j9080O903K9327
11867B262467R198j7688q22K8292M056n1463n1105J4547N5389K2126k4049j8339
11855B232609J3967K0052O559O271J1896K099p290O314K3681J6484p96J25R048
11842B341019K468o380O500K3611J2820j2736j4961M201J1649M636Q209J9567
11830B400603J2189p132l022K3272L0306P223p666N947J8930J0323N210K5336
$$ plain form
11818 2521519 2567521 2604859 2618619 2625014 2638600 2652559 2659884 2668604 2685023 2700683 2704843 2695820
11806 2695820 2676363 2652441 2636876 2636651 2637011 2618883 2592719 2590184 2616784 2639248 2632554 2615462
11794 2615462 2620433 2646499 2665354 2664539 2660725 2670269 2686626 2695257 2699570 2719076 2761157 2805071 2824665
11781 2824665 2824336 2836736 2878474 2925182 2946001 2947856 2960844 2987812 2999345 2981762 2959638 2958061
11769 2958061 2967643 2965281 2950797 2941063 2938600 2927791 2899933 2865688 2840985 2830419 2826445 2819779
11757 2819779 2809333 2801931 2800585 2796954 2782492 2762657 2748761 2739845 2728062 2718926 2726032 2745155
11745 2745155 2756287 2755272 2758775 2771142 2774249 2762609 2759207 2777302 2794413 2789340 2779544 2790955
11733 2790955 2811961 2812950 2796148 2787878 2791021 2785017 2769344 2766698 2780303 2787019 2781185 2788884 2825493
$$ packed form
11818B521519M6002L7338J3760O395J3586J3959P325Q720J6419J5660M160r023
11806B695820j9457k3922j5565k25L60j8128k6164k535K6600K2464o694j7092
11794B615462M971K6066J8855q15l814R544J6357Q631M313J9506M2081M3914J9594
11781B824665l29J2400M1738M6708K0819J855J2988K6968J1533j7583k2124j577
11769B958061R582k362j4484r734k463j0809k7858l4245k4703j0566l974o666
11757B819779j0446p402j346l631j4462j9835j3896q916j1783r136P106J9123
11745B745155J1132j015L503J2367L107j1640l402J8095J7111n073r796J1411
11733B790955K1006R89j6802q270L143o004j5673k646J3605O716n834P699L6609
$$ plain form
11720 2825493 2871702 2907767 2942288 2989150 3043675 3103354 3187240 3307133 3435692 3530599 3582268
11709 3582268 3614913 3645931 3664858 3650984 3594888 3500957 3379985 3242461 3096336 2953039
11699 2953039 2832428 2748804 2689969 2626630 2549428 2479547 2433191 2395144 2343538 2283197 2233100
11688 2233100 2193865 2151903 2108079 2076780 2058176 2035079 2000678 1969162 1952484 1943012 1927542
11677 1927542 1906558 1890724 1884947 1881996 1868545 1836552 1793617 1760647 1751133 1752957 1740403 1706198
11665 1706198 1671529 1658689 1662100 1655996 1627851 1593274 1573641 1567406 1554394 1526320 1498323 1484309
11653 1484309 1476065 1460992 1447569 1450665 1458224 1440940 1398118 1365695 1367909 1385844 1388377 1371297
11641 1371297 1348186 1324452 1302752 1295621 1307097 1315181 1298100 1267582 1251477 1253192 1254236 1248527
$$ packed form
11720B825493M6209L6065L4521M6862N4525N9679Q3886J19893J28559R4907N1669
11709C582268L2645L1018J8927j3874n6096r3931j20972j37524j46125j43297
11699B953039j20611q3624n8835o3339p7202o9881m6356l8047n1606o0341n0097
11688B233100l9235m1962m3824l1299j8604k3097l4401l1516j6678r472j5470
11677A927542k0984j5834n777k951j3451l1993m2935l2970r514J824j2554l4205
11665A706198l4669j2840L411o104k8145l4577j9633o235j3012k8074k7997j4014
11653A484309q244j5073j3423L096P559j7284m2822l2423K214J7935K533j7080
11641A371297k3111k3734k1700p131J1476Q084j7081l0518j6105J715J044n709
$$ plain form
11629 1248527 1246259 1248649 1246032 1238235 1231768 1221038 1198707 1178993 1180040 1187473 1171297 1138970 1131098
11616 1131098 1156069 1170644 1143895 1103103 1090340 1103525 1110356 1098478 1081152 1067719 1057232
11605 1057232 1052728 1057097 1059808 1048222 1028796 1021261 1034986 1062076 1087076 1094023 1074735 1042229
11593 1042229 1025309 1037457 1061375 1074502 1075230 1071234 1060227 1042205 1034873 1051763 1074782 1074205
11581 1074205 1050983 1034768 1041696 1057477 1063976 1061215 1057741 1056368 1056632 1059901 1066570 1075363 1086906
11568 1086906 1101788 1116658 1129106 1143200 1162974 1184623 1202635 1218896 1238945 1265441 1301195
11557 1301195 1349283 1403102 1447973 1481480 1519225 1570867 1627069 1683053 1755332 1855520 1965671
11546 1965671 2062649 2149436 2235013 2300760 2322077 2312208 2305499 2300969 2262348 2176912 2075320 1984682
$$ packed form
11629A248527k268K390k617p797o467j0730k2331j9714J047P433j6176l2327p872
11616A131098K4971J4575k6749m0792j2763J3185O831j1878j7326j3433j0487
11605A057232m504M369K711j1586j9426p535J3725K7090K5000O947j9288l2506
11593A042229j6920J2148K3918J3127P28l996j1007j8022p332J6890K3019n77
11581A074205k3222j6215O928J5781O499k761l474j373K64L269O669Q793J1543
11568A086906J4882J4870J2448J4094J9774K1649J8012J6261K0049K6496L5754
11557A301195M8088N3819M4871L3507L7745N1642N6202N5984P2279J00188J10151
11546A965671R6978Q6787Q5577O5747K1317r869o709m530l8621q5436j01592r0638
$$ plain form
11534 1984682 1899131 1810575 1733429 1677914 1626664 1561382 1492871 1442975 1411837 1382825 1349105
11523 1349105 1318402 1298058 1286723 1275593 1253757 1221312 1196969 1197102 1207120 1194830 1156122 1123514
11511 1123514 1121123 1135558 1143665 1144709 1147360 1145298 1127326 1099247 1077588 1069999 1073753 1083175 1088912
11498 1088912 1082682 1071866 1074917 1093379 1105213 1096271 1080862 1079118 1090829 1103683 1110807 1109053
11486 1109053 1097417 1086988 1092638 1105941 1100699 1075616 1061943 1073820 1084160 1071446 1056392 1063386
11474 1063386 1077896 1076868 1072226 1084781 1100425 1095248 1082535 1089381 1105515 1103895 1095789 1111685
11462 1111685 1138779 1136385 1110525 1111940 1152900 1185784 1179892 1163273 1165752 1172609 1164075 1155130 1163014
11449 1163014 1173897 1175420 1187324 1224215 1259090 1262095 1249936 1257613 1281804 1292855 1288398 1294618
$$ packed form
11534A984682q5551q8556p7146n5515n1250o5282o8511m9896l1138k9012l3720
11523A349105l0703k0344j1335j1130k1836l2445k4343J33J0018j2290l8708l2608
11511A123514k391J4435Q107J044K651k062j7972k8079k1659p589L754R422N737
11498A088912o230j0816L051J8462J1834q942j5409j744J1711J2854P124j754
11486A109053j1636j0429N650J3303n242k5083j3673J1877J0340j2714j5054O994
11474A063386J4510j028m642J2555J5644n177j2713O846J6134j620q106J5896
11462A111685K7094k394k5860J415M0960L2884n892j6619K479O857q534q945P884
11449A163014J0883J523J1904L6891L4875L005j2159P677K4191J1051m457O220
$$ plain form
11437 1294618 1321407 1353293 1382574 1418389 1461633 1500047 1532658 1575275 1636491 1706975 1776190
11426 1776190 1843581 1910901 1978090 2047935 2120736 2183464 2218304 2224188 2217405 2208019 2186832 2139782
11414 2139782 2066749 1981298 1897075 1819195 1747853 1686673 1642728 1615755 1593316 1565013 1537511
11403 1537511 1524222 1523078 1518928 1506576 1493963 1481623 1459474 1429362 1409730 1408079 1407847 1394217
11391 1394217 1375358 1365143 1361152 1353830 1343207 1333162 1322047 1310492 1304983 1303868 1295953 1282610
11379 1282610 1282042 1299954 1317183 1320090 1320169 1327892 1332919 1330366 1339036 1367328 1387672 1376766 1357526
11366 1357526 1364639 1388655 1394604 1380757 1375994 1388509 1399897 1404635 1413520 1421221 1412422 1398791 1407023
11353 1407023 1429762 1433476 1418499 1422641 1455261 1477265 1464448 1444116 1445468 1456954 1460391 1466886
$$ packed form
11437A294618K6789L1886K9281L5815M3244L8414L2611M2617O1216P0484O9215
11426A776190O7391O7320O7189O9845P2801O2728L4840N884o783r386k1187m7050
11414B139782p3033q5451q4223p7880p1342o1180m3945k6973k2439k8303k7502
11403A537511j3289j144m150j2352j2613j2340k2149l0112j9632j651k32j3630
11391A394217j8859j0215l991p322j0623j0045j1115j1555n509j115p915j3343
11379A282610n68J7912J7229K907P9P723N027k553Q670K8292K0344j0906j9240
11366A357526P113K4016N949j3847m763J2515J1388M738Q885P701q799j3631Q232
11353A407023K2739L714j4977M142L2620K2004j2817k0332J352J1486L437O495
$$ plain form
11341 1466886 1486378 1497986 1486995 1479387 1499941 1524047 1515783 1492355 1501415 1545492 1578502 1576887
11329 1576887 1568509 1583076 1613835 1642209 1666764 1689747 1701884 1701359 1708128 1738148 1776566 1795995
11317 1795995 1792100 1782780 1779297 1778351 1780046 1791320 1806193 1803571 1778710 1761342 1781838 1826696 1851329
11304 1851329 1837911 1816490 1820391 1843894 1860310 1863177 1867407 1881216 1899478 1918456 1936842 1947855
11292 1947855 1950161 1960691 1995484 2042969 2078304 2098499 2118689 2139528 2148515 2152371 2175232 2220044
11280 2220044 2262943 2292690 2324283 2364715 2398537 2420866 2451687 2499033 2538957 2554568 2567052
11269 2567052 2602064 2649014 2681280 2697327 2713393 2730765 2738889 2740890 2750077 2767319 2783060 2796082
11257 2796082 2812683 2833439 2855265 2878963 2903194 2922287 2941126 2976990 3032939 3085559 3114978
$$ packed form
11341A466886J9492J1608j0991p608K0554K4106q264k3428R060M4077L3010j615
11329A576887q378J4567L0759K8374K4555K2983J2137n25O769L0020L8418J9429
11317A795995l895r320l483r46J695J1274J4873k622k4861j7368K0496M4858K4633
11304A851329j3418k1421L901K3503J6416K867M230J3809J8262J8978J8386J1013
11292A947855K306J0530L4793M7485L5335K0195K0190K0839Q987L856K2861M4812
11280B220044M2899K9747L1593M0432L3822K2329L0821M7346L9924J5611J2484
11269B567052L5012M6950L2266J6047J6066J7372Q124K001R187J7242J5741J3022
11257B796082J6601K0756K1826K3698K4231J9093J8839L5864N5949N2620K9419
$$ plain form
11246 3114978 3131279 3154486 3184127 3206644 3218651 3225203 3227968 3230289 3239944 3254269 3260258 3261377
11234 3261377 3281479 3327161 3371784 3395147 3412133 3441436 3475157 3503897 3541136 3593210 3635560
11223 3635560 3652371 3670326 3716079 3769365 3799147 3817859 3854266 3899173 3928295 3955119 4006036
11212 4006036 4062708 4088120 4095586 4130505 4192274 4236944 4254639 4281622 4332306 4379937 4412821
11201 4412821 4452551 4505588 4549779 4580019 4617691 4666359 4707104 4742437 4791839 4840922 4855463
11190 4855463 4852552 4891298 4978393 5051025 5075582 5095742 5153670 5228896 5290932 5351689 5425422
11179 5425422 5491327 5536954 5588774 5660106 5717842 5741269 5765868 5826721 5903723 5964682 6018952
11168 6018952 6087197 6160593 6229149 6306729 6391447 6450569 6482851 6540569 6646255 6747956 6809163
$$ packed form
11246C114978J6301K3207K9641K2517J2007O552K765K321R655J4325N989J119
11234C261377K0102M5682M4623K3363J6986K9303L3721K8740L7239N2074M2350
11223C635560J6811J7955M5753N3286K9782J8712L6407M4907K9122K6824N0917
11212D006036N6672K5412P466L4919O1769M4670J7695K6983N0684M7631L2884
11201D412821L9730N3037M4191L0240L7672M8668M0745L5333M9402M9083J4541
11190D855463k911L8746Q7095P2632K4557K0160N7928P5226O2036O0757P3733
11179E425422O5905M5627N1820P1332N7736K3427K4599O0853P7002O0959N4270
11168F018952O8245P3396O8556P7580Q4718N9122L2282N7718J05686J01701O1207
$$ plain form
11157 6809163 6879626 7011759 7166276 7277423 7361997 7481155 7633660 7771196 7889353 8021417
11147 8021417 8166028 8299286 8435982 8601439 8764884 8880546 8976083 9119882 9316145 9512125
11137 9512125 9694497 9896259 10119766 10336466 10555355 10810144 11086984 11347824 11614337
11128 11614337 11938005 12295399 12612754 12894365 13220722 13607211 13971689 14266284 14536888
11119 14536888 14817645 15067746 15260147 15443125 15660322 15885526 16086535 16284384 16503066
11110 16503066 16726766 16950083 17205162 17497503 17780453 18034009 18302282 18613025 18930635
11101 18930635 19233014 19562631 19950500 20357678 20745311 21138139 21565932 22006360 22440237
11092 22440237 22900334 23410476 23938755 24465339 25030859 25660272 26307724 26941243 27613138
$$ packed form
11157F809163P0463J32133J54517J11147Q4574J19158J52505J37536J18157J32064
11147H021417J44611J33258J36696J65457J63445J15662R5537J43799J96263J95980
11137I512125J82372K01762K23507K16700K18889K54789K76840K60840K66513
11128A1614337L23668L57394L17355K81611L26357L86489L64478K94595K70604
11119A4536888K80757K50101J92401J82978K17197K25204K01009J97849K18682
11110A6503066K23700K23317K55079K92341K82950K53556K68273L10743L17610
11101A8930635L02379L29617L87869M07178L87633L92828M27793M40428M33877
11092B2440237M60097N10142N28279N26584N65520O29413O47452O33519O71895
$$ plain form
11083 27613138 28373507 29177420 29955526 30719247 31515531 32328987 33112307 33872612 34649944
11074 34649944 35446147 36244547 37062928 37923528 38812129 39727176 40722445 41842018 43065476
11065 43065476 44374576 45811206 47408240 49134804 50977263 52994349 55216659 57579649
11057 57579649 60043352 62686049 65583856 68702633 72030510 75720417 79967673 84833788
11049 84833788 90319128 96501056 103444915 111086517 119385193 128516516 138771236 150390148
11041 150390148 163625295 178676789 195221407 212209442 228566588 243948926 258266717
11034 258266717 270548472 279013339 282508329 281271018 275965740 266637527 253250000 236840778
11026 236840778 219385025 202563800 187158549 173481757 161696854 151581531 142545536
$$ packed form
11083B7613138P60369Q03913P78106P63721P96284Q13456P83320P60305P77332
11074C4649944P96203P98400Q18381Q60600Q88601R15047R95269J119573J223458
11065D3065476J309100J436630J597034J726564J842459K017086K222310K362990
11057E7579649K463703K642697K897807L118777L327877L689907M247256M866115
11049H4833788N485340O181928O943859P641602Q298676R131323J0254720J1618912
11041A50390148J3235147J5051494J6544618J6988035J6357146J5382338J4317791
11034B58266717J2281755Q464867L494990j237311n305278r328213j3387527j6409222
11026B36840778j7455753j6821225j5405251j3676792j1784903j0115323r035995
$$ plain form
11019 142545536 134186282 126548581 119715291 113498746 107727380 102516171 98001044 94031050
11011 94031050 90358689 86955690 83916459 81196390 78670269 76345053 74304268 72510139
11003 72510139 70844739 69293608 67918987 66689324 65492263 64293762 63143783 62039220
10995 62039220 60912062 59749169 58604934 57491004 56360041 55209051 54103575 53085190
10987 53085190 52139905 51272773 50530580 49923763 49395528 48899779 48452436 48072539 47720677
10978 47720677 47335367 46901041 46445847 45990715 45531493 45065907 44615893 44218710 43902760
10969 43902760 43671582 43505524 43376889 43268393 43185703 43154378 43195362 43298316 43430586 43579385
10959 43579385 43768111 44018210 44315558 44634788 44975165 45344180 45724512 46090152 46440597
$$ packed form
11019A42545536q359254p637701o833290o216545n771366n211209m515127l969994
11011I4031050l672361l402999l039231k720069k526121k325216k040785j794129
11003G2510139j665400j551131j374621j229663j197061j198501j149979j104563
10995F2039220j127158j162893j144235j113930j130963j150990j105476j018385
10987E3085190r45285q67132p42193o06817n28235m95749m47343l79897l51862
10978D7720677l85310m34326m55194m55132m59222m65586m50014l97183l15950
10969D3902760k31178j66058j28635j08496q2690l1325M0984J02954J32270J48799
10959D3579385J88726K50099K97348L19230L40377L69015L80332L65640L50445
$$ plain form
10950 46440597 46787229 47122626 47438078 47753540 48093119 48452295 48832894 49288340 49882057
10941 49882057 50615798 51448695 52370517 53405613 54566056 55857933 57311623 58943357
10933 58943357 60709884 62569356 64564978 66779795 69241605 71959174 75023834 78573258
10925 78573258 82664018 87270488 92394970 98091131 104409556 111430378 119338983 128379935
10917 128379935 138741790 150478079 163346083 176619777 189387396 201386204 213243049
10910 213243049 225244503 235920388 242650429 244047661 241179203 236012470 229220573 220154365
10902 220154365 208528365 195229807 181508654 168180447 155795525 144867343 135516466
10895 135516466 127309451 119810284 113014047 107006658 101557247 96388183 91586529 87393356
$$ packed form
10950D6440597L46632L35397L15452L15462L39579L59176L80599M55446N93717
10941D9882057P33741Q32897R21822J035096J160443J291877J453690J631734
10933E8943357J766527J859472J995622K214817K461810K717569L064660L549424
10925G8573258M090760M606470N124482N696161O318425P020822P908605R040952
10917A28379935J0361855J1736289J2868004J3273694J2767619J1998808J1856845
10910B13243049J2001454J0675885O730041J397232k868458n166733o791897r066208
10902B20154365j1626000j3298558j3721153j3328207j2384922j0928182r350877
10895A35516466q207015p499167o796237o007389n449411n169064m801654m193173
$$ plain form
10887 87393356 83759032 80428722 77331653 74572071 72125345 69838354 67682738 65747638
10879 65747638 64012668 62361898 60795139 59399045 58124551 56814632 55455966 54191576
10871 54191576 53061244 51925927 50689754 49422142 48211269 47051468 45926448 44863931
10863 44863931 43854825 42842556 41840704 40945222 40185904 39478889 38768835 38100782 37497676
10854 37497676 36881714 36189368 35470162 34795406 34144259 33453913 32723970 32004368 31324612
10845 31324612 30689765 30108329 29577936 29073384 28579535 28106141 27654887 27212485 26787532
10836 26787532 26405448 26056100 25700134 25336857 25005519 24708089 24398057 24061844 23738387
10827 23738387 23434171 23095231 22698617 22298255 21935888 21573666 21165611 20736730 20337609
$$ packed form
10887H7393356l634324l330310l097069k759582k446726k286991k155616j935100
10879F5747638j734970j650770j566759j396094j274494j309919j358666j264390
10871E4191576j130332j135317j236173j267612j210873j159801j125020j062517
10863D4863931j009106j012269j001852q95482p59318p07015p10054o68053o03106
10854C7497676o15962o92346p19206o74756o51147o90346p29943p19602o79756
10845C1324612o34847n81436n30393n04552m93849m73394m51254m42402m24953
10836B6787532l82084l49348l55966l63277l31338k97430l10032l36213l23457
10827B3738387l04216l38940l96614m00362l62367l62222m08055m28881l99121
$$ plain form
10818 20337609 19971684 19621270 19300093 19024133 18766190 18491733 18212592 17961958 17742571
10809 17742571 17536805 17340299 17151947 16958738 16759802 16575019 16405449 16222578 16021156
10800 16021156 15838489 15692721 15549944 15386021 15230526 15109502 14995127 14858100 14721704
10791 14721704 14613590 14510075 14382249 14252619 14147094 14033423 13872638 13694212 13549865
10782 13549865 13423981 13264315 13078072 12919461 12794770 12657069 12492650 12339626 12214882
10773 12214882 12089078 11945775 11806370 11681723 11550774 11403322 11260542 11139149 11032117
10764 11032117 10933237 10845451 10760283 10663882 10564399 10478044 10392141 10283521 10169623 10092792 10050939
10753 10050939 9993493 9895735 9789758 9707523 9637969 9560012 9479289 9409203 9344739 9275344 9202480
$$ packed form
10818B0337609l65925l50414l21177k75960k57943k74457k79141k50634k19387
10809A7742571k05766j96506j88352j93209j98936j84783j69570j82871k01422
10800A6021156j82667j45768j42777j63923j55495j21024j14375j37027j36396
10791A4721704j08114j03515j27826j29630j05525j13671j60785j78426j44347
10782A3549865j25884j59666j86243j58611j24691j37701j64419j53024j24744
10773A2214882j25804j43303j39405j24647j30949j47452j42780j21393j07032
10764A1032117r8880q7786q5168r6401r9483q6355q5903j08620j13898p6831m1853
10753A0050939n7446r7758j05977q2235o9554p7957q0723p0086o4464o9395p2864
$$ plain form
10742 9202480 9131931 9067234 9014554 8973288 8925232 8859723 8801592 8778312 8766751 8718196 8635689
10731 8635689 8575177 8560850 8551269 8507584 8446018 8396581 8353373 8298293 8239635 8193454 8152008
10720 8152008 8100917 8047173 8002994 7958752 7896720 7820225 7750392 7702262 7673762 7647281 7598923
10709 7598923 7522376 7443409 7389601 7349345 7289740 7211146 7145481 7098814 7040393 6958771 6883042
10698 6883042 6831037 6780639 6714704 6652031 6607400 6561126 6498388 6441766 6412112 6390307 6350847
10687 6350847 6302433 6262096 6218970 6158231 6093510 6041459 5990455 5927378 5867726 5825169 5780272
10676 5780272 5715572 5651435 5607570 5560634 5486155 5412792 5381675 5375328 5344025 5286331 5244949
10665 5244949 5231976 5216374 5183380 5151850 5130501 5106723 5081914 5071401 5067491 5048588 5024744
$$ packed form
10742I202480p0549o4697n2680m1266m8056o5509n8131k3280j1561m8555q2507
10731H635689o0512j4327r581m3685o1566m9437m3208n5080n8658m6181m1446
10720H152008n1091n3744m4179m4242o2032p6495o9833m8130k8500k6481m8358
10709G598923p6547p8967n3808m0256n9605p8594o5665m6667n8421q1622p5729
10698F883042n2005n0398o5935o2673m4631m6274o2738n6622k9654k1805l9460
10687F350847m8414m0337m3126o0739o4721n2051n1004o3077n9652m2557m4897
10676E780272o4700o4137m3865m6936p4479p3363l1117o347l1303n7694m1382
10665E244949j2973j5602l2994l1530k1349k3778k4809j0513l910j8903k3844
$$ plain form
10654 5024744 5024543 5035654 5013228 4955085 4912559 4911516 4916200 4891925 4853232 4825357 4804787 4785191
10642 4785191 4778349 4779862 4756116 4697596 4645585 4631075 4625590 4591973 4547094 4527029 4520456 4490695
10630 4490695 4444024 4419174 4417041 4397349 4349559 4314673 4319838 4334291 4315884 4270770 4237629 4230804
10618 4230804 4228858 4214000 4196628 4194116 4202237 4201521 4186886 4176187 4184374 4200855 4204746 4195713 4192538
10605 4192538 4201775 4207128 4196457 4181742 4180327 4189463 4193657 4188322 4181033 4173780 4158732 4133184 4108317
10592 4108317 4097865 4101213 4101934 4085685 4058561 4041430 4043044 4047433 4035587 4010015 3985628 3966087
10580 3966087 3946634 3932397 3931539 3933963 3921363 3898661 3890165 3901329 3910194 3902577 3889564 3881877 3873831
10567 3873831 3863825 3863788 3874543 3878815 3874671 3887002 3923945 3950111 3932568 3891770 3874262 3889837
$$ packed form
10654E024744k01J1111k2426n8143m2526j043M684k4275l8693k7875k0570j9596
10642D785191o842J513k3746n8520n2011j4510n485l3617m4879k0065o573k9761
10630D490695m6671k4850k133j9692m7790l4886N165J4453j8407m5114l3141o825
10618D230804j946j4858j7372k512Q121p16j4635j0699Q187J6481L891r033l175
10605D192538R237N353j0671j4715j415R136M194n335p289p253j5048k5548k4867
10592D108317j0452L348P21j6249k7124j7131J614M389j1846k5572k4387j9541
10580C966087j9453j4237q58K424j2600k2702q496J1164Q865p617j3013p687q046
10567C873831j0006l7J0755M272m144J2331L6943K6166j7543m0798j7508J5575
$$ plain form
10555 3889837 3908513 3910321 3905480 3907568 3914874 3921032 3924101 3923811 3924149 3935384 3960893 3989252 4011868
10542 4011868 4036425 4067804 4091610 4097592 4103796 4131556 4169628 4192010 4200337 4216714 4243186 4264488
10530 4264488 4287259 4336812 4410500 4473253 4511589 4556719 4635856 4731213 4810932 4876480 4950822
10519 4950822 5032854 5091937 5106229 5085565 5051808 5009611 4945468 4852794 4749427 4662613 4598790
10508 4598790 4541279 4481632 4434963 4410649 4386558 4336893 4273776 4231764 4215850 4195964 4154764
10497 4154764 4109891 4080224 4057221 4022721 3974530 3922559 3876691 3846738 3836155 3828103 3797462
10486 3797462 3745576 3703363 3690588 3692632 3687902 3675756 3663469 3648270 3630736 3625668 3637719 3642880
10474 3642880 3618904 3582651 3571074 3590205 3608136 3600352 3580453 3577616 3597950 3620861 3629560 3632167
$$ packed form
10555C889837J8676J808m841K088P306O158L069k90L38J1235K5509K8359K2616
10542D011868K4557L1379K3806N982O204K7760L8072K2382Q327J6377K6472K1302
10530D264488K2771M9553P3688O2753L8336M5130P9137R5357P9719O5548P4342
10519D950822Q2032N9083J4292k0664l3757m2197o4143r2674j03367q6814o3823
10508D598790n7511n9647m6669k4314k4091m9665o3117m2012j5914j9886m1200
10497D154764m4873k9667k3003l4500m8191n1971m5868k9953j0583q052l0641
10486C797462n1886m2213j2775K044m730j2146j2287j5199j7534n068J2051N161
10474C642880k3976l6253j1577J9131J7931p784j9899k837K0334K2911Q699K607
$$ plain form
10462 3632167 3644470 3658717 3648319 3610036 3579986 3587469 3610406 3606720 3578024 3563144 3571791 3570953
10450 3570953 3546569 3530933 3546167 3564033 3554953 3540499 3556835 3593295 3611193 3605988 3607423 3628258
10438 3628258 3653448 3674610 3697695 3719705 3733504 3753785 3802798 3870143 3922032 3952988 3992715
10427 3992715 4056288 4124354 4184094 4254083 4349292 4450516 4532499 4602892 4690291 4805193 4932057
10416 4932057 5054292 5173250 5303768 5455791 5617791 5760664 5865925 5944544 6015025 6070895
10406 6070895 6090547 6074072 6044323 6011833 5967123 5912295 5870078 5850500 5836108 5814341 5798851
10395 5798851 5801892 5809808 5805748 5794508 5782340 5752636 5689044 5607728 5536969 5473352 5387823 5272267
10383 5272267 5151021 5042747 4938237 4827301 4725607 4655231 4608903 4554729 4478448 4403748
$$ packed form
10462C632167J2303J4247j0398l8283l0050P483K2937l686k8696j4880Q647q38
10450C570953k4384j5636J5234J7866r080j4454J6336L6460J7898n205J435K0835
10438C628258K5190K1162K3085K2010J3799K0281M9013O7345N1889L0956L9727
10427C992715O3573O8066N9740O9989R5209J01224Q1983P0393Q7399J14902J26864
10416D932057J22235J18958J30518J52023J62000J42873J05261P8619P0481N5870
10406F070895J9652j6475k9749l2490m4710n4828m2217j9578j4392k1767j5490
10395E798851L041P916m060j1240j2168k9704o3592q1316p0759o3617q5529j15556
10383E272267j21246j08274j04510j10936j01694p0376m6328n4174p6281p4700
$$ plain form
10373 4403748 4358631 4332330 4286893 4212673 4146899 4121569 4115485 4085619 4030264 3983574 3953337
10362 3953337 3908935 3839878 3781310 3758325 3743027 3698564 3635398 3586820 3552018 3505632 3449766
10351 3449766 3411959 3394368 3366375 3313030 3254900 3210157 3169073 3120784 3078907 3061275 3060365 3050180
10339 3050180 3013579 2954614 2894146 2858024 2855510 2862879 2842640 2786792 2727570 2697424 2692943 2688769
10327 2688769 2672690 2651341 2630469 2606849 2577876 2546176 2514174 2483301 2458730 2446315 2442925
10316 2442925 2436584 2419508 2396158 2374252 2352002 2322207 2289018 2269623 2270987 2273461 2252739 2215705
10304 2215705 2195864 2208597 2229499 2227393 2201965 2174217 2154774 2140578 2131873 2131000 2129921 2118222
10292 2118222 2099646 2083988 2068982 2048532 2030979 2026692 2023837 2002246 1967815 1945482 1939483 1930832
$$ packed form
10373D403748m5117k6301m5437p4220o5774k5330o084k9866n5355m6690l0237
10362C953337m4402o9057n8568k2985j5298m4463o3166m8578l4802m6386n5866
10351C449766l7807j7591k7993n3345n8130m4743m1084m8289m1877j7632r10j0185
10339C050180l6601n8965o0468l6122k514P369k0239n5848n9222l0146m481m174
10327B688769j6079k1349k0872k3620k8973l1700l2002l0873k4571j2415l390
10316B442925o341j7076k3350k1906k2250k9795l3189j9395J364K474k0722l7034
10304B215705j9841J2733K0902k106k5428k7748j9443j4196q705q73j079j1699
10292B118222j8576j5658j5006k0450j7553m287k855k1591l4431k2333n999q651
$$ plain form
10280 1930832 1915692 1912514 1923740 1924944 1905594 1887918 1887628 1887369 1871546 1857792 1865827 1880043 1874411
10267 1874411 1854957 1845006 1844104 1835571 1823195 1825281 1838550 1842002 1834066 1833077 1840809 1838521 1823713
10254 1823713 1819131 1835730 1854288 1856099 1848936 1849234 1857043 1861517 1857532 1847548 1838698 1842370 1862570
10241 1862570 1882496 1880095 1859341 1845931 1848940 1850926 1842302 1837918 1846717 1852016 1841102 1831131 1842396
10228 1842396 1863700 1868551 1853308 1837415 1835832 1849589 1871857 1886029 1873155 1841300 1829403 1856345
10216 1856345 1884871 1869260 1823360 1800547 1814714 1827799 1817294 1806800 1815092 1820828 1803961 1785215
10204 1785215 1792074 1812071 1813188 1792548 1773868 1769570 1773598 1781350 1790374 1790102 1775735 1763983 1771118
10191 1771118 1784668 1782168 1768031 1762826 1764518 1753986 1735251 1733534 1750695 1759284 1749156 1743932
$$ packed form
10280A930832j5140l178J1226J204j9350j7676k90k59j5823j3754Q035J4216n632
10267A874411j9454r951r02q533j2376K086J3269L452p936r89P732k288j4808
10254A823713m582J6599J8558J811p163K98P809M474l985r984q850L672K0200
10241A862570J9926k401k0754j3410L009J986q624m384Q799N299j0914r971J1265
10228A842396K1304M851j5243j5893j583J3757K2268J4172j2874l1855j1897K6942
10216A856345K8526j5611m5900k2813J4167J3085j0505j0494Q292N736j6867j8746
10204A785215O859J9997J117k0640j8680m298M028P752R024k72j4367j1752P135
10191A771118J3550k500j4137n205J692j0532j8735j717J7161Q589j0128n224
$$ plain form
10179 1743932 1757136 1766463 1752468 1733211 1734969 1751211 1757144 1748256 1739498 1739022 1744892 1756228 1767643
10166 1767643 1765452 1749700 1745723 1771089 1805058 1816535 1809253 1809802 1821939 1827564 1827925 1845632 1881396
10153 1881396 1904938 1901148 1894755 1912585 1946211 1971273 1985088 2004219 2035690 2069330 2095129 2116293
10141 2116293 2145579 2192332 2250261 2299505 2328064 2348100 2380968 2430978 2487245 2544792 2604936
10130 2604936 2659679 2698043 2725650 2755234 2781261 2790562 2793448 2809876 2825747 2805272 2754134 2723914
10118 2723914 2735970 2747650 2721480 2683184 2673809 2683738 2679249 2662913 2658308 2658862 2642800 2620823
10106 2620823 2617574 2619908 2596892 2561043 2553463 2572388 2574690 2550600 2537601 2550685 2557859 2541710
10094 2541710 2528021 2530638 2524549 2503592 2509099 2560261 2605600 2594107 2555665 2555372 2596314 2626192
$$ packed form
10179A743932J3204R327j3995j9257J758J6242N933q888q758m76N870J1336J1415
10166A767643k191j5752l977K5366L3969J1477p282N49J2137N625L61J7707L5764
10153A881396K3542l790o393J7830L3626K5062J3815J9131L1471L3640K5799K1164
10141B116293K9286M6753N7929M9244K8559K0036L2868N0010N6267N7547O0144
10130B604936N4743L8364K7607K9584K6027R301K886J6428J5871k0475n1138l0220
10118B723914J2056J1680k6170l8296r375R929m489j6336m605N54j6062k1977
10106B620823l249K334k3016l5849p580J8925K302k4090j2999J3084P174j6149
10094B541710j3689K617o089k0957N507N1162M5339j1493l8442k93M0942K9878
$$ plain form
10082 2626192 2623965 2620587 2635705 2647298 2635142 2614673 2612548 2633677 2662375 2678918 2672381 2652156
10070 2652156 2643757 2658700 2677208 2677131 2665603 2660008 2654842 2637889 2624224 2636519 2660262 2659016 2631461
10057 2631461 2612341 2615305 2617092 2604788 2595176 2594402 2581716 2553404 2542239 2565921 2591382 2582586
10045 2582586 2554745 2545302 2553896 2550436 2529037 2514705 2520421 2531408 2533464 2529696 2526611 2526356 2534658
10032 2534658 2555641 2577195 2581587 2572684 2572739 2588617 2601376 2596616 2587299 2595111 2620763 2643759 2646119
10019 2646119 2629691 2612855 2611695 2621610 2621404 2601618 2580597 2579405 2588877 2582443 2558499 2543534 2548137
10006 2548137 2548840 2529348 2513599 2531456 2568396 2580650 2554574 2521057 2509803 2517502 2528229 2538391
9994 2538391 2547272 2545053 2529213 2517014 2522239 2532717 2531883 2530368 2549216 2578221 2582369 2552810 2521379
$$ packed form
10082B626192k227l378J5118J1593j2156k0469k125K1129K8698J6543o537k0225
10070B652156q399J4943J8508p7j1528n595n166j6953j3665J2295K3743j246k7555
10057B631461j9120K964J787j2304r612p74j2686k8312j1165K3682K5461q796
10045B582586k7841r443Q594l460k1399j4332N716J0987K056l768l085k55Q302
10032B534658K0983K1554M392q903N5J5878J2759m760r317P812K5652K2996K360
10019B646119j6428j6836j160R915k06j9786k1021j192R472o434k3944j4965M603
10006B548137P03j9492j5749J7857L6940J2254k6076l3517j1254P699J0727J0162
9994B538391Q881k219j5840j2199N225J0478q34j515J8848K9005M148k9559l1431
$$ plain form
9981 2521379 2514453 2520672 2520667 2522130 2539991 2560887 2558151 2533403 2513871 2510814 2508336 2495764 2484602
9968 2484602 2485502 2491114 2492901 2496361 2507113 2517560 2521035 2526355 2543477 2563762 2569605 2558817 2546659
9955 2546659 2545967 2555635 2568042 2580179 2596410 2622575 2655700 2681087 2687651 2686688 2703609 2746224 2792977
9942 2792977 2819948 2828283 2835777 2852341 2875494 2901040 2924916 2940432 2945517 2947711 2952233 2952375 2942530
9929 2942530 2931567 2929292 2928399 2917192 2903251 2904168 2918298 2926579 2923721 2925404 2940447 2957465 2967093
9916 2967093 2977422 2996183 3015194 3026327 3038689 3064708 3099793 3130306 3152956 3172242 3187336
9905 3187336 3197345 3212702 3243594 3280306 3302416 3306770 3309733 3321141 3333692 3341376 3349799 3360633
9893 3360633 3363708 3356917 3358778 3384485 3419826 3437399 3432974 3427540 3436351 3454861 3474828 3493912 3506028
$$ packed form
9981B521379o926O219nJ463J7861K0896k736k4748j9532l057k478j2572j1162
9968B484602R00N612J787L460J0752J0447L475N320J7122K0285N843j0788j2158
9955B546659o92R668J2407J2137J6231K6165L3125K5387O564r63J6921M2615M6753
9942B792977K6971Q335P494J6564K3153K5546K3876J5516N085K194M522J42r845
9929B942530j0963k275q93j1207j3941R17J4130Q281k858J683J5043J7018R628
9916B967093J0329J8761J9011J1133J2362K6019L5085L0513K2650J9286J5094
9905C187336J0009J5357L0892L6712K2110M354K963J1408J2551P684Q423J0834
9893C360633L075o791J861K5707L5341J7573m425n434Q811J8510J9967J9084J2116
$$ plain form
9880 3506028 3503467 3496511 3509921 3547475 3580316 3587878 3591153 3620972 3668351 3697651 3702893 3716973
9868 3716973 3760916 3815428 3854907 3883428 3919695 3965269 4006394 4035644 4056744 4076516 4102687
9857 4102687 4140379 4182701 4215693 4238450 4263533 4292176 4310210 4318623 4342913 4394103 4444539 4466429
9845 4466429 4473125 4494098 4528562 4557427 4585292 4631218 4686473 4723009 4742430 4775744 4830964 4881432
9833 4881432 4914275 4949875 4999722 5045002 5077130 5121816 5195745 5271753 5318937 5351065 5400387
9822 5400387 5464217 5515845 5555253 5608344 5678287 5735876 5766093 5793616 5847404 5920483 5981650
9811 5981650 6016921 6044291 6088147 6148865 6204695 6243034 6279384 6334790 6402259 6455357 6489642
9800 6489642 6531239 6596446 6667109 6720749 6763296 6812821 6869045 6920323 6966072 7011422 7053625
$$ packed form
9880C506028k561o956J3410L7554L2841P562L275K9819M7379K9300N242J4080
9868C716973M3943N4512L9479K8521L6267M5574M1125K9250K1100J9772K6171
9857D102687L7692M2322L2992K2757K5083K8643J8034Q413K4290N1190N0436K1890
9845D466429O696K0973L4464K8865K7865M5926N5255L6536J9421L3314N5220N0468
9833D881432L2843L5600M9847M5280L2128M4686P3929P6008M7184L2128M9322
9822E400387O3830N1628L9408N3091O9943N7589L0217K7523N3788P3079O1167
9811E981650L5271K7370M3856O0718N5830L8339L6350N5406O7469N3098L4285
9800F489642M1597O5207P0663N3640M2547M9525N6224N1278M5749M5350M2203
$$ plain form
9789 7053625 7094199 7148600 7220418 7283147 7316189 7342984 7398593 7471196 7516664 7528053 7548062
9778 7548062 7605833 7680121 7738321 7778647 7816922 7859443 7907171 7964546 8027411 8080979 8123696
9767 8123696 8174601 8244180 8316975 8376364 8427764 8483633 8544352 8608089 8680053 8756357 8819093
9756 8819093 8866057 8925453 9018220 9122797 9203374 9260854 9328400 9423716 9532827 9638886 9741748
9745 9741748 9846084 9950680 10055238 10163945 10278630 10398034 10523132 10653807 10784395 10913638
9735 10913638 11053110 11211650 11377216 11531309 11677889 11839455 12025394 12223076 12421360
9726 12421360 12623430 12832212 13042303 13253977 13478270 13718858 13964072 14207385 14460973
9717 14460973 14735323 15018415 15292613 15563303 15850562 16155697 16457810 16747497 17043694
$$ packed form
9789G053625M0574N4401P1818O2729L3042K6795N5609P2603M5468J1389K0009
9778G548062N7771P4288N8200M0326L8275M2521M7728N7375O2865N3568M2717
9767H123696N0905O9579P2795N9389N1400N5869O0719O3737P1964P6304O2736
9756H819093M6964N9396R2767J04577Q0577N7480O7546R5316J09111J06059J02862
9745I741748J04336J04596J04558J08707J14685J19404J25098J30675J30588J29243
9735A0913638J39472J58540J65566J54093J46580J61566J85939J97682J98284
9726A2421360K02070K08782K10091K11674K24293K40588K45214K43313K53588
9717A4460973K74350K83092K74198K70690K87259L05135L02113K89687K96197
$$ plain form
9708 17043694 17365667 17703502 18032369 18346906 18663438 18992148 19326885 19664507 20014128
9699 20014128 20378582 20744548 21104426 21473059 21865531 22269827 22661218 23035576 23407109
9690 23407109 23779261 24142063 24495654 24850220 25201758 25535611 25857498 26189333 26525040
9681 26525040 26826046 27080871 27335916 27636029 27959629 28249784 28493724 28731435 28991201
9672 28991201 29256865 29504755 29738596 29973044 30205823 30422388 30615462 30788660 30948343
9663 30948343 31097684 31233097 31345940 31433767 31506346 31573155 31632536 31683492 31736612 31796823 31847531
9652 31847531 31875096 31899602 31952790 32029623 32092319 32122114 32133553 32132840 32098987 32020698 31917464
9641 31917464 31801326 31645885 31420879 31136959 30827929 30504239 30153064 29772963 29377366
$$ packed form
9708A7043694L21973L37835L28867L14537L16532L28710L34737L37622L49621
9699B0014128L64454L65966L59878L68633L92472M04296L91391L74358L71533
9690B3407109L72152L62802L53591L54566L51538L33853L21887L31835L35707
9681B6525040L01006K54825K55045L00113L23600K90155K43940K37711K59766
9672B8991201K65664K47890K33841K34448K32779K16565J93074J73198J59683
9663C0948343J49341J35413J12843Q7827P2579O6809N9381N0956N3120O0211N0708
9652C1847531K7565K4506N3188P6833O2696K9795J1439p13l3853p8289j03234
9641C1917464j16138j55441k25006k83920l09030l23690l51175l80101l95597
$$ plain form
9632 29377366 28968320 28537069 28092515 27661618 27254080 26849672 26430833 26007367 25594192
9623 25594192 25181989 24751784 24310333 23886024 23486187 23080547 22639447 22171527 21705034
9614 21705034 21244653 20773510 20292946 19826434 19376092 18910394 18416136 17931753 17497657
9605 17497657 17097672 16687760 16264713 15861534 15485373 15111628 14740330 14404158 14107102
9596 14107102 13806827 13481317 13166042 12894227 12642712 12375106 12102148 11854659 11624785
9587 11624785 11382806 11133798 10908422 10707458 10502644 10289280 10093107 9922144 9752642
9578 9752642 9570544 9391732 9231938 9086857 8950071 8822216 8695423 8557636 8420443 8312982
9568 8312982 8237102 8157170 8048579 7929818 7829608 7746471 7661420 7571102 7485130 7402508 7312041
$$ packed form
9632B9377366m09046m31251m44554m30897m07538m04408m18839m23466m13175
9623B5594192m12203m30205m41451m24309l99837m05640m41100m67920m66493
9614B1705034m60381m71143m80564m66512m50342m65698m94258m84383m34096
9605A7497657l99985m09912m23047m03179l76161l73745l71298l36172k97056
9596A4107102l00275l25510l15275k71815k51515k67606k72958k47489k29874
9587A1624785k41979k49008k25376k00964k04814k13364j96173j70963j69502
9578I752642j82098j78812j59794j45081j36786j27855j26793j37787j37193j07461
9568H312982p5880p9932j08591j18761j00210q3137q5051r0318q5972q2622r0467
$$ plain form
9557 7312041 7210974 7108024 7011352 6923498 6843741 6767877 6690374 6611519 6536556 6465333 6391171
9546 6391171 6312396 6235520 6164672 6097709 6034369 5977515 5924761 5869500 5810544 5750101 5685243
9535 5685243 5615378 5553154 5508564 5466089 5402097 5324266 5265156 5232209 5195273 5134671 5069981
9524 5069981 5023008 4981597 4925539 4864840 4822282 4793446 4754763 4703272 4659708 4633671 4610280
9513 4610280 4574404 4529535 4487797 4453987 4424084 4392645 4359624 4331811 4314150 4299323 4274982
9502 4274982 4242906 4217710 4201959 4178619 4137129 4091157 4058268 4036003 4011679 3983725 3959146
9491 3959146 3939856 3923921 3910844 3895822 3870713 3839764 3819217 3811185 3796472 3766578 3741929 3739918
9479 3739918 3744962 3733005 3708386 3691669 3685922 3681147 3678960 3685193 3688177 3671972 3643714 3622867 3611850
$$ packed form
9557G312041j01067j02950r6672q7854p9757p5864p7503p8855p4963p1223p4162
9546F391171p8775p6876p0848o6963o3340n6854n2754n5261n8956o0443o4858
9535E685243o9865o2224m4590m2475o3992p7831n9110l2947l6936o0602o4690
9524E069981m6973m1411n6058o0699m2558k8836l8683n1491m3564k6037k3391
9513D610280l5876m4869m1738l3810k9903l1439l3021k7813j7661j4827k4341
9502D274982l2076k5196j5751k3340m1490m5972l2889k2265k4324k7954k4579
9491C959146j9290j5935j3077j5022k5109l0949k0547q032j4713k9894k4649k011
9479C739918N044j1957k4619j6717n747m775k187O233K984j6205k8258k0847j1017
$$ plain form
9466 3611850 3602261 3599899 3615467 3638630 3649712 3650030 3653458 3657733 3654275 3655430 3676725 3701348 3701774
9453 3701774 3690552 3705880 3747722 3774815 3770982 3767956 3790021 3820043 3837573 3849803 3864201 3867820
9441 3867820 3856595 3852173 3867413 3886164 3897803 3918329 3953576 3975872 3967073 3954739 3972688 4010073
9429 4010073 4032514 4033616 4033678 4044121 4062890 4090431 4123217 4145820 4153950 4169459 4208893 4255327
9417 4255327 4285814 4306599 4334570 4365502 4390924 4424954 4480150 4536310 4570382 4600066 4657959
9406 4657959 4737211 4805099 4859101 4924726 5005070 5079267 5149748 5244428 5367019 5488195 5594662
9395 5594662 5707823 5844046 5992683 6143438 6300344 6458259 6600668 6733285 6886407 7070457
9385 7070457 7261129 7441754 7627255 7830795 8040589 8249327 8474273 8724036 8973958 9202075
$$ packed form
9466C611850r589k362J5568K3163J1082L18L428M275l458J155K1295K4623M26
9453C701774j1222J5328M1842K7093l833l026K2065L0022J7530J2230J4398L619
9441C867820j1225m422J5240J8751J1639K0526L5247K2296q799j2334J7949L7385
9429D010073K2441J102O2J0443J8769K7541L2786K2603Q130J5509L9434M6434
9417D255327L0487K0785K7971L0932K5422L4030N5196N6160L4072K9684N7893
9406D657959P9252O7888N4002O5625Q0344P4197P0481R4680J22591J21176J06467
9395E594662J13161J36223J48637J50755J56906J57915J42409J32617J53122J84050
9385G070457J90672J80625J85501K03540K09794K08738K24946K49763K49922K28117
$$ plain form
9375 9202075 9426200 9674888 9936775 10168521 10347495 10493638 10638674 10787410 10912474 10985331
9365 10985331 11012656 11032449 11064058 11078651 11043351 10978287 10931932 10909745 10875136 10819998 10778548
9354 10778548 10760178 10727655 10666154 10616222 10602351 10582053 10511564 10415240 10336293 10258342 10136730
9343 10136730 9978321 9825116 9676243 9490955 9263047 9032873 8824526 8623095 8416768
9334 8416768 8213680 8014066 7810272 7616297 7454386 7313307 7164995 7019541 6912233 6836457
9324 6836457 6746776 6634345 6538313 6469972 6390829 6289080 6212048 6186403 6166393 6107408 6038456
9313 6038456 6007744 5999673 5966207 5909651 5872694 5865108 5857954 5839162 5821601 5803613 5772548 5743498
9301 5743498 5744721 5764679 5762809 5737655 5735051 5775751 5820360 5827391 5809857 5809283 5839730 5881448 5912462
$$ packed form
9375I202075K24125K48688K61887K31746J78974J46143J45036J48736J25064P2857
9365A0985331K7325J9793L1609J4593l5300o5064m6355k2187l4609n5138m1450
9354A0778548j8370l2523o1501m9932j3871k0298p0489r6324p8947p7951j21612
9343A0136730j58409j53205j48873j85288k27908k30174k08347k01431k06327
9334H416768k03088j99614k03794j93975j61911j41079j48312j45454j07308p5776
9324F836457q9681j12431r6032o8341p9143j01749p7032k5645k0010n8985o8952
9313F038456l0712q071l3466n6556l6957p586p154j8792j7561j7988l1065k9050
9301E743498J223J9958j870k5154k604M0700M4609P031j7534n74L0447M1718L1014
$$ plain form
9288 5912462 5926977 5934105 5950972 5987169 6030772 6063097 6088589 6130125 6190777 6244131 6273011 6296474
9276 6296474 6343601 6415650 6488560 6543940 6587969 6644897 6732501 6836299 6916206 6956286 6996909
9265 6996909 7087684 7215406 7319729 7383025 7455444 7572898 7700695 7793598 7868549 7969714
9255 7969714 8092508 8198425 8288431 8402612 8548451 8685034 8789108 8888228 9009445 9136155
9245 9136155 9241188 9331500 9432166 9546858 9659048 9757872 9842924 9916482 9988394 10075952 10181771
9234 10181771 10282959 10358360 10416037 10478047 10548220 10612158 10662115 10705826 10754462 10813036 10877666
9223 10877666 10934613 10971334 10995843 11031136 11080810 11118576 11127075 11126994 11145669 11175651 11192893 11200295
9211 11200295 11218470 11243449 11253018 11252424 11271634 11311526 11335413 11328689 11326426 11358244 11401158 11418055
$$ packed form
9288E912462J4515P128J6867L6197M3603L2325K5492M1536O0652N3354K8880K3463
9276F296474M7127P2049P2910N5380M4029N6928Q7604J03798P9907M0080M0623
9265F996909R0775J27722J04323O3296P2419J17454J27797R2903P4951J01165
9255G969714J22794J05917R0006J14181J45839J36583J04074R9120J21217J26710
9245I136155J05033R0312J00666J14692J12190R8824Q5052P3558P1912Q7558J05819
9234A0181771J01188P5401N7677O2010P0173O3938M9957M3711M8636N8574O4630
9223A0877666N6947L6721K4509L5293M9674L7766Q499q1J8675K9982J7242P402
9211A1200295J8175K4979R569n94J9210L9892K3887o724k263L1818M2914J6897
$$ plain form
9199 11418055 11415248 11426525 11459087 11492215 11519508 11557100 11611912 11671698 11728913 11790650 11862340
9188 11862340 11941241 12027426 12123739 12225158 12324757 12427912 12543417 12664774 12780539 12899438
9178 12899438 13041649 13206080 13371170 13530102 13699726 13889843 14089330 14290430 14501624
9169 14501624 14726288 14953394 15182093 15431102 15707751 15991065 16264977 16547024 16860886
9160 16860886 17197858 17530913 17854284 18183952 18528589 18885145 19256207 19646585 20046592
9151 20046592 20442353 20839739 21253857 21676020 22077097 22447825 22812066 23192286 23581802
9142 23581802 23960052 24317789 24657190 24981859 25297639 25612272 25925037 26225878 26511828
9133 26511828 26794745 27085686 27380038 27664420 27930438 28176732 28406056 28625701 28842878
$$ packed form
9199A1418055k807J1277L2562L3128K7293L7592N4812N9786N7215O1737P1690
9188A1862340P8901Q6185R6313J01419R9599J03155J15505J21357J15765J18899
9178A2899438J42211J64431J65090J58932J69624J90117J99487K01100K11194
9169A4501624K24664K27106K28699K49009K76649K83314K73912K82047L13862
9160A6860886L36972L33055L23371L29668L44637L56556L71062L90378M00007
9151B0046592L95761L97386M14118M22163M01077L70728L64241L80220L89516
9142B3581802L78250L57737L39401L24669L15780L14633L12765L00841K85950
9133B6511828K82917K90941K94352K84382K66018K46294K29324K19645K17177
$$ plain form
9124 28842878 29055060 29252140 29429775 29590256 29728465 29831303 29896687 29939121 29968750 29978783
9114 29978783 29962947 29930958 29894116 29848670 29788657 29723826 29667056 29612314 29544288 29465071 29392235
9103 29392235 29333061 29280016 29231122 29194179 29167484 29136850 29099546 29073025 29069028 29074583 29072144 29065837
9091 29065837 29072014 29092997 29118222 29147645 29196329 29274272 29376718 29499339 29650899 29842726 30072788
9080 30072788 30328996 30606566 30915944 31271668 31675310 32112620 32570881 33057421 33591891
9071 33591891 34176277 34784076 35391312 36009253 36667766 37370228 38087947 38801607 39522156
9062 39522156 40260414 41003435 41741619 42495684 43288198 44105549 44921378 45745388 46609829
9053 46609829 47512645 48418254 49319656 50253062 51234298 52226296 53198068 54175095 55191793
$$ packed form
9124B8842878K12182J97080J77635J60481J38209J02838O5384M2434K9629J0033
9114B9978783j5836l1989l6842m5446o0013o4831n6770n4742o8026p9217p2836
9103B9392235n9174n3045m8894l6943k6695l0634l7304k6521l997N555k439o307
9091B9065837O177K0983K5225K9423M8684P7943J02446J22621J51560J91827K30062
9080C0072788K56208K77570L09378L55724M03642M37310M58261M86540N34470
9071C3591891N84386O07799O07236O17941O58513P02462P17719P13660P20549
9062C9522156P38258P43021P38184P54065P92514Q17351Q15829Q24010Q64441
9053D6609829R02816R05609R01402R33406R81236R91998R71772R77027J016698
$$ plain form
9044 55191793 56226248 57229449 58198286 59168672 60146415 61096834 62003880 62890122 63767350
9035 63767350 64611275 65403036 66159907 66904721 67634183 68336684 69014598 69668452 70282787
9026 70282787 70849260 71385174 71910432 72423520 72916241 73392573 73855382 74293545 74701018
9017 74701018 75091530 75477456 75852744 76213415 76573097 76938368 77291315 77619201 77938064
9008 77938064 78261388 78570876 78850570 79125776 79428849 79746167 80043819 80331580 80652022
8999 80652022 81013313 81386151 81770732 82214373 82749293 83359567 84028524 84777247 85633584
8990 85633584 86599908 87677305 88890717 90263385 91790538 93459857 95271778 97216499
8982 97216499 99255817 101350214 103476682 105593752 107617970 109470314 111125578 112582228
$$ packed form
9044E5191793J034455J003201R68837R70386R77743R50419R07046Q86242Q77228
9035F3767350Q43925P91761P56871P44814P29462P02501O77914O53854O14335
9026G0282787N66473N35914N25258N13088M92721M76332M62809M38163M07473
9017G4701018L90512L85926L75288L60671L59682L65271L52947L27886L18863
9008G7938064L23324L09488K79694K75206L03073L17318K97652K87761L20442
8999H0652022L61291L72838L84581M43641N34920O10274O68957P48723Q56337
8990H5633584R66324J077397J213412J372668J527153J669319J811921J944721
8982I7216499K039318K094397K126468K117070K024218J852344J655264J456650
$$ plain form
8974 112582228 113804964 114739076 115369837 115726238 115832572 115698616 115357519 114870278 114282292
8965 114282292 113610513 112884971 112167854 111510424 110915019 110358751 109834001 109344124 108874184
8956 108874184 108388015 107846591 107211291 106434837 105467959 104278278 102854255 101192580 99291895
8947 99291895 97159512 94815607 92288436 89612554 86836009 84022274 81232629 78500737
8939 78500737 75829807 73221161 70701090 68310027 66068400 63967129 61993119 60147746
8931 60147746 58433134 56836059 55338421 53933602 52621521 51397722 50258011 49201733
8923 49201733 48218104 47283732 46390498 45561361 44816185 44133174 43469578 42812649 42182471
8914 42182471 41589440 41019730 40463162 39923960 39398227 38870825 38343911 37839914 37363949
$$ packed form
8974A12582228J222736R34112O30761L56401J06334j33956l41097m87241n87986
8965A14282292o71779p25542p17117o57430n95405n56268n24750m89877m69940
8956A08874184m86169n41424o35300p76454r66878j189681j424023j661675j900685
8947I9291895k132383k343905k527171k675882k776545k813735k789645k731892
8939G8500737k670930k608646k520071k391063k241627k101271j974010j845373
8931F0147746j714612j597075j497638j404819j312081j223799j139711j056278
8923D9201733r83629r34372q93234q29137p45176o83011o63596o56929o30178
8914D2182471n93031n69710n56568n39202n25733n27402n26914n03997m75965
$$ plain form
8905 37363949 36891057 36406375 35931073 35487803 35063962 34634045 34200462 33785690 33396055
8896 33396055 33019030 32648787 32290423 31942948 31599666 31263868 30945477 30642488 30341495
8887 30341495 30036593 29734873 29444372 29167279 28901325 28637764 28364898 28085403 27820467
8878 27820467 27581236 27347307 27095268 26839470 26615902 26427555 26237636 26024585 25813111
8869 25813111 25633166 25472742 25296718 25099279 24911235 24757730 24630520 24506382 24376636
8860 24376636 24249508 24132542 24023719 23919038 23820636 23732349 23650072 23563844 23472143 23387730
8850 23387730 23322696 23271578 23217413 23152522 23084046 23019348 22957212 22897341 22848101 22815966 22791995
8839 22791995 22757171 22701224 22632347 22568758 22522666 22490694 22457658 22411097 22353988 22302027 22267010
$$ packed form
8905C7363949m72892m84682m75302m43270m23841m29917m33583m14772l89635
8896C3396055l77025l70243l58364l47475l43282l35798l18391l02989l00993
8887C0341495l04902l01720k90501k77093k65954k63561k72866k79495k64936
8878B7820467k39231k33929k52039k55798k23568j88347j89919k13051k11474
8869B5813111j79945j60424j76024j97439j88044j53505j27210j24138j29746
8860B4376636j27128j16966j08823j04681r8402q8287q2277q6228r1701q4413
8850B3387730o5034n1118n4165o4891o8476o4698o2136n9871m9240l2135k3971
8839B2791995l4824n5947o8877o3589m6092l1972l3036m6561n7109n1961l5017
$$ plain form
8828 22267010 22244032 22216233 22171295 22112227 22052255 22000392 21953971 21906218 21857231 21811525 21766162
8817 21766162 21711124 21645181 21581910 21532116 21487548 21432077 21363994 21296210 21237615 21185947 21137141
8806 21137141 21088826 21034580 20968776 20900233 20847334 20813865 20782687 20741347 20700938 20676537 20658721
8795 20658721 20622324 20561771 20501053 20463829 20446444 20428651 20401244 20370549 20339407 20298618 20241671
8784 20241671 20176285 20111964 20043701 19960168 19863799 19768182 19675541 19572766 19454291 19332944 19219221
8773 19219221 19104306 18975964 18838838 18704789 18574076 18441922 18313174 18191728 18064568
8764 18064568 17918085 17763488 17621838 17488170 17337606 17166148 16995527 16833347 16659960
8755 16659960 16465522 16269426 16086433 15901422 15698870 15492688 15301935 15117337 14919207
$$ packed form
8828B2267010k2978k7799m4938n9068n9972n1863m6421m7753m8987m5706m5363
8817B1766162n5038o5943o3271m9794m4568n5471o8083o7784n8595n1668m8806
8806B1137141m8315n4246o5804o8543n2899l3469l1178m1340m0409k4401j7816
8795B0658721l6397o0553o0718l7224j7385j7793k7407l0695l1142m0789n6947
8784B0241671o5386o4321o8263q3533r6369r5617r2641j02775j18475j21347j13723
8773A9219221j14915j28342j37126j34049j30713j32154j28748j21446j27160
8764A8064568j46483j54597j41650j33668j50564j71458j70621j62180j73387
8755A6659960j94438j96096j82993j85011k02552k06182j90753j84598j98130
$$ plain form
8746 14919207 14712753 14518001 14337670 14162795 13998191 13851591 13706561 13540027 13362897
8737 13362897 13208348 13078291 12937233 12767596 12597193 12456442 12336946 12211659 12072977
8728 12072977 11930536 11790378 11657633 11543979 11449556 11349240 11220549 11077802 10954827 10857299
8718 10857299 10756784 10634929 10509907 10407765 10324713 10234588 10126181 10015748 9920718 9835375
8708 9835375 9742962 9644807 9561736 9502438 9444020 9356768 9242037 9130959 9046531 8981378 8915343
8697 8915343 8840213 8759824 8677976 8597035 8521568 8453739 8388670 8320597 8249805 8179622 8112649
8686 8112649 8053670 8007370 7966743 7913215 7838021 7756247 7689280 7639438 7592865 7541172 7486182
8675 7486182 7427107 7360088 7292403 7240897 7208492 7174027 7116228 7041556 6977275 6938208 6910039
$$ packed form
8746A4919207k06454j94752j80331j74875j64604j46600j45030j66534j77130
8737A3362897j54549j30057j41058j69637j70403j40751j19496j25287j38682
8728A2072977j42441j40158j32745j13654r4423j00316j28691j42747j22975r7528
8718A0857299j00515j21855j25022j02142q3052r0125j08407j10433r5030q5343
8708I835375r2413r8155q3071n9298n8418q7252j14731j11078q4428o5153o6035
8697H915343p5130q0389q1848q0941p5467o7829o5069o8073p0792p0183o6973
8686H112649n8979m6300m0627n3528p5194q1774o6967m9842m6573n1693n4990
8675G486182n9075o7019o7685n1506l2405l4465n7799p4672o4281l9067k8169
$$ plain form
8664 6910039 6868795 6810387 6754185 6718391 6698262 6672023 6624402 6559625 6493855 6441420 6408065
8653 6408065 6389976 6375472 6351323 6311040 6258022 6203719 6164014 6148249 6142618 6113912 6047454 5976005
8641 5976005 5946505 5956003 5949544 5893786 5823170 5789178 5788579 5776107 5733477 5686146 5654253 5626691
8629 5626691 5592618 5563570 5547090 5525969 5484930 5437836 5407060 5391286 5374879 5356232 5343530
8618 5343530 5330669 5301743 5258167 5220574 5201731 5194198 5186535 5175312 5157582 5128059 5091469 5064097
8606 5064097 5052946 5043614 5020715 4993020 4983279 4993613 4996273 4967041 4918597 4887612 4890072 4903375
8594 4903375 4898702 4878158 4865650 4868501 4868618 4853929 4838080 4837589 4844885 4840282 4821655 4805143 4800432
8581 4800432 4801335 4799990 4795903 4789840 4781944 4778326 4787363 4805553 4817146 4811828 4794826 4777723 4768399
$$ packed form
8664F910039m1244n8408n6202l5794k0129k6239m7621o4777o5770n2435l3355
8653F408065j8089j4504k4149m0283n3018n4303l9705j5765n631k8706o6458p1449
8641E976005k9500R498o459n5758p0616l3992n99j2472m2630m7331l1893k7562
8629E626691l4073k9048j6480k1121m1039m7094l0776j5774j6407j8647j2702
8618E343530j2861k8926m3576l7593j8843p533p663j1223j7730k9523l6590k7372
8606E064097j1151r332k2899k7695r741J0334K660k9232m8444l0985K460J3303
8594D903375m673k0544j2508K851J17j4689j5849m91P296m603j8627j6512m711
8581D800432R03j345m087o063p896l618R037J8190J1593n318j7002j7103r324
$$ plain form
8568 4768399 4770980 4784571 4799519 4806036 4808369 4817403 4828000 4822253 4801261 4791966 4809060 4831000 4833415
8555 4833415 4826729 4833519 4844457 4833075 4808496 4811997 4853202 4888654 4882609 4855935 4848664 4862017
8543 4862017 4871239 4875668 4895752 4928609 4947672 4949050 4960086 4991507 5016373 5014765 5008738 5027422
8531 5027422 5060783 5078301 5078662 5088255 5115980 5141117 5149011 5151964 5166929 5194248 5228022 5268580
8519 5268580 5313134 5350726 5380657 5421970 5487356 5557182 5599771 5614989 5637719 5693273 5766483
8508 5766483 5826731 5872487 5932959 6025197 6126893 6203744 6254599 6311739 6396150 6491664 6573269
8497 6573269 6644295 6727050 6826480 6925858 7015998 7105167 7196603 7279741 7352640 7430962 7520792
8486 7520792 7602391 7658749 7702679 7753517 7801242 7819855 7807101 7782090 7747464 7684950 7591699
$$ packed form
8568D768399K581J3591J4948O517K333R034J0597n747k0992r295J7094K1940K415
8555D833415o686O790J0938j1382k4579L501M1205L5452o045k6674p271J3353
8543D862017R222M429K0084L2857J9063J378J1036L1421K4866j608o027J8684
8531E027422L3361J7518L61R593K7725K5137P894K953J4965K7319L3774M0558
8519E268580M4554L7592K9931M1313O5386O9826M2589J5218K2730N5554P3210
8508E766483O0248M5756O0472R2238J01696P6851N0855N7140Q4411R5514Q1605
8497F573269P1026Q2755R9430R9378R0140Q9169R1436Q3138P2899P8322Q9830
8486G520792Q1599N6358M3930N0838M7725J8613j2754k5011l4626o2514r3251
$$ plain form
8475 7591699 7490802 7395397 7288570 7153016 6998429 6843889 6693690 6548642 6421595 6318567
8465 6318567 6219131 6100815 5973040 5861954 5769607 5675746 5575636 5485760 5410151 5331902 5246218
8454 5246218 5172571 5120019 5067515 4997976 4928374 4881343 4845796 4795002 4731276 4680096 4644671
8443 4644671 4600987 4543140 4500998 4497392 4512352 4510375 4487447 4469451 4471888 4481754 4480097 4468362
8431 4468362 4466874 4490924 4530174 4554595 4546592 4522961 4510689 4502469 4459492 4366866 4260406 4178966
8419 4178966 4113911 4035364 3949569 3889155 3852463 3798480 3712238 3633620 3599383 3589790 3561009 3505377
8407 3505377 3447988 3401536 3358717 3319522 3292234 3270044 3237497 3201239 3184979 3189201 3184167 3152278
8395 3152278 3111598 3084610 3067527 3047702 3030585 3026742 3025851 3008513 2978613 2961169 2966875 2977230
$$ packed form
8475G591699j00897r5405j06827j35554j54587j54540j50199j45048j27047j03028
8465F318567r9436j18316j27775j11086r2347r3861j00110q9876p5609p8249q5684
8454E246218p3647n2552n2504o9539o9602m7031l5547n0794o3726n1180l5425
8443D644671m3684n7847m2142l606J4960j977k2928j7996K437R866j657j1735
8431D468362j488K4050L9250K4421q003k3631j2272q220m2977r2626j06460q1440
8419D178966o5055p8547q5795o0414l6692n3983q6242p8618l4237r593k8781n5632
8407C505377n7389m6452m2819l9195k7288k2190l2547l6258j6260M222n034l1889
8395C152278m0680k6988j7083j9825j7117l843q91j7338k9900j7444N706J0355
$$ plain form
8383 2977230 2970004 2946240 2925707 2924768 2944955 2976487 3005074 3017128 3005693 2975819 2943327 2923713
8371 2923713 2917903 2909566 2880366 2828275 2768372 2717348 2681666 2658131 2637954 2610492 2571979 2532219
8359 2532219 2504355 2487144 2467632 2442773 2424660 2419107 2413840 2397511 2376524 2359952 2340709 2309414
8347 2309414 2277488 2265036 2269308 2266988 2249115 2232292 2228927 2226624 2209643 2185286 2172062 2169905
8335 2169905 2159913 2133166 2104929 2094480 2099379 2097767 2074513 2039014 2014748 2014278 2028428 2038798
8323 2038798 2035214 2019812 2001072 1988548 1987588 1992483 1989333 1972639 1954236 1947042 1945038 1931811 1906679
8310 1906679 1887622 1885749 1890557 1886399 1872257 1857603 1847708 1841692 1838583 1836620 1830419 1816348 1798766
8297 1798766 1785634 1779384 1775340 1767241 1753077 1738376 1732712 1736886 1735490 1713351 1680418 1665746 1680212
$$ packed form
8383B977230p226k3764k0533r39K0187L1532K8587J2054j1435k9874l2492j9614
8371B923713n810q337k9200n2091n9903n1024l5682k3535k0177k7462l8513l9760
8359B532219k7864j7211j9512k4859j8113n553n267j6329k0987j6572j9243l1295
8347B309414l1926j2452M272k320j7873j6823l365k303j6981k4357j3224k157
8335B169905r992k6747k8237j0449M899j612k3254l5499k4266m70J4150J0370
8323B038798l584j5402j8740j2524r60M895l150j6694j8403p194k004j3227k5132
8310A906679j9057j873M808m158j4142j4654r895o016l109j963o201j4071j7582
8297A798766j3132o250m044q099j4164j4701n664M174j396k2139l2933j4672J4466
$$ plain form
8284 1680212 1699789 1697195 1676986 1663181 1662113 1658679 1646255 1637833 1642054 1646626 1636475 1616676 1605441
8271 1605441 1610222 1620589 1622062 1609496 1588327 1568973 1560119 1562386 1566532 1560425 1540689 1517842 1507326
8258 1507326 1512398 1517589 1505106 1478373 1460815 1466713 1482564 1486465 1477423 1471053 1471186 1464445 1445060
8245 1445060 1426826 1422487 1426015 1425554 1421322 1418464 1412892 1398915 1383474 1377481 1378067 1374675 1368344 1367577
8231 1367577 1367825 1355783 1335912 1330035 1342728 1349382 1332814 1311425 1310442 1321384 1316890 1297071 1290640
8218 1290640 1309167 1329336 1329174 1316363 1307143 1299739 1287369 1279609 1287699 1299669 1293492 1269617 1248714
8205 1248714 1239925 1232727 1220412 1210349 1207403 1206473 1206704 1214682 1226974 1227902 1213612 1200749 1200193 1199339
8191 1199339 1184409 1164528 1156390 1157974 1156743 1154010 1160255 1172466 1177467 1174837 1175739 1179625 1173202 1155240
$$ packed form
8284A680212J9577k594k0209j3805j068l434j2424q422M221M572j0151j9799j1235
8271A605441M781J0367J473j2566k1169j9354q854K267M146o107j9736k2847j0516
8258A507326N072N191j2483k6733j7558N898J5851L901r042o370J33o741j9385
8245A445060j8234m339L528m61m232k858n572j3977j5441n993N86l392o331p67
8231A367577K48j2042j9871n877J2693O654j6568k1389r83J0942m494j9819o431
8218A290640J8527K0169j62j2811r220p404j2370p760Q090J1970o177k3875k0903
8205A248714q789p198j2315j0063k946r30K31P978J2292R28j4290j2863n56q54
8191A199339j4930j9881q138J584j231k733O245J2211N001k630R02L886o423j7962
$$ plain form
8177 1155240 1141960 1141749 1143119 1136159 1128607 1128965 1128189 1113128 1089480 1077214 1086827 1110140 1131141
8164 1131141 1137698 1126575 1105554 1088460 1081728 1078816 1073041 1069976 1078263 1092407 1096365 1084921 1071726
8151 1071726 1072406 1085842 1095919 1088020 1061600 1030571 1013829 1020781 1041200 1051970 1039881 1017019
8139 1017019 1006895 1014814 1021857 1013552 1002762 1009834 1027716 1028683 1007187 991348 1000277 1013051 1001278
8126 1001278 975078 968447 987819 1006065 1006821 1003499 1007389 1006622 991940 979345 987236 1007076 1016216
8113 1016216 1008843 997006 989617 986524 987096 990585 992522 991241 991753 994840 992406 983596 982906 998396
$$ packed form
8177A155240j3280k11J370o960p552L58p76j5061k3648j2266R613K3313K1001
8164A131141O557j1123k1021j7094o732k912n775l065Q287J4144L958j1444j3195
8151A071726O80J3436J0077p899k6420l1029j6742O952K0419J0770j2089k2862
8139A017019j0124P919P043q305j0790P072J7882R67k1496j5839Q929J2774j1773
8126A001278k6200o631J9372J8246P56l322L890p67j4682j2595P891J9840R140
8113A016216p373j1837p389l093N72L489J937j281N12L087k434q810o90J5490
$$ [...]
##END NTUPLES=NMR SPECTRUM
##END=
