##TITLE=1H ikalashn
EC-3334(II-1)
25.10.2024
##JCAMPDX= 6.0         $$ Bruker NMR JCAMP-DX V2.0
##DATA TYPE= NMR SPECTRUM
##DATA CLASS= NTUPLES
##ORIGIN= UXNMR, Bruker Analytische Messtechnik GmbH
##OWNER= root
$$ TOPSPIN		Version 1.3
$$ 2024-10-25 10:46:12.640 +0400  Irina@DPX200
$$ Compression mode = diff/dup
##.OBSERVE FREQUENCY= 200.131300845
##.OBSERVE NUCLEUS= ^1H
##.ACQUISITION MODE= SIMULTANEOUS
##.ACQUISITION SCHEME= undefined
##.AVERAGES= 16
##.DIGITISER RES= 18
##SPECTROMETER/DATA SYSTEM= spect
##.PULSE SEQUENCE= zg
##.SOLVENT NAME= CDCl3
##.SHIFT REFERENCE= INTERNAL, CDCl3, 1, 17.49637
##AUDIT TRAIL= $$ (NUMBER, WHEN, WHO, WHERE, WHAT)
$$ ##TITLE= Audit trail, TOPSPIN		Version 1.3
$$ ##JCAMPDX= 5.01
$$ ##ORIGIN= Bruker BioSpin GmbH
$$ ##OWNER= Irina
$$ $$ F:/spectra/data/iren/nmr/1H/4/pdata/1/auditp.txt
$$ ##AUDIT TRAIL=  $$ (NUMBER, WHEN, WHO, WHERE, VERSION, WHAT)
(   1,<2024-10-25 10:45:55.812 +0400>,<Irina>,<DPX200>,<TOPSPIN 1.3>,
      <created by zg
	started at 2024-10-25 10:44:47.890 +0400,
	POWCHK disabled, PULCHK disabled
       configuration hash MD5:
       BE 6D 3F 07 2A EA 11 49 91 17 2B D3 AF B3 58 0D
       data hash MD5: 16K
       D6 75 84 19 36 9F D6 0F 7F 9B 5A E1 E1 7C C2 BB>)
(   2,<2024-10-25 10:45:56.187 +0400>,<Irina>,<DPX200>,<TOPSPIN 1.3>,
      <Start of raw data processing
       efp BC_mod = 2 LB = 0.02 FT_mod = 6 PKNL = 1 PHC0 = 317.7433 PHC1 = 7.325261 SI = 32K 
       data hash MD5: 32K
       EC 00 84 DB 0B DD 56 7D D3 0A 2B D6 36 2B AE 73>)
(   3,<2024-10-25 10:45:58.765 +0400>,<Irina>,<DPX200>,<TOPSPIN 1.3>,
      <apk 
       data hash MD5: 32K
       71 0A F6 2A F3 80 08 1B A9 97 A3 CB C9 0F F0 97>)
(   4,<2024-10-25 10:46:01.500 +0400>,<Irina>,<DPX200>,<TOPSPIN 1.3>,
      <abs n ABSG = 5 
       data hash MD5: 32K
       1C 8A 01 3D 06 E1 0B E1 16 0D 17 9F 72 96 2D CC>)
$$ ##END=
$$ 
$$ $$ hash MD5
$$ $$ 6E BC 44 01 53 3F CD 8D 33 D0 03 71 37 92 96 85
##$RELAX= 
##$RELAX= 
##$RELAX= 
##$RELAX= 
##$RELAX= 
##$RELAX= 
##$RELAX= 
##$RELAX= 
##$RELAX= 
$$ Bruker specific parameters
$$ --------------------------
##$DU= <F:/spectra>
##$EXPNO= 4
##$NAME= <1H>
##$PROCNO= 1
##$TYPE= <nmr>
##$USER= <iren>
##$AMP= (0..31)
100 100 100 100 100 100 100 100 100 100 100 100 100 100 100 100 100 100 
100 100 100 100 100 100 100 100 100 100 100 100 100 100 
##$ANAVPT= -1
##$AQSEQ= 0
##$AQ_mod= 1
##$AUNM= <au_zg>
##$AUTOPOS= <>
##$BF1= 200.13
##$BF2= 200.13
##$BF3= 200.13
##$BF4= 200.13
##$BF5= 200.13
##$BF6= 200.13
##$BF7= 200.13
##$BF8= 200.13
##$BYTORDA= 1
##$CFDGTYP= 0
##$CFRGTYP= 5
##$CHEMSTR= <none>
##$CNST= (0..63)
1 1 145 1 1 1 1 1 1 1 1 1 1 1 1 1 1 1 1 1 1 1 1 1 1 1 1 1 1 1 1 1 1 1 
1 1 1 1 1 1 1 1 1 1 1 1 1 1 1 1 1 1 1 1 1 1 1 1 1 1 1 1 1 1 
##$CPDPRG= <>
##$CPDPRG1= <>
##$CPDPRG2= <>
##$CPDPRG3= <>
##$CPDPRG4= <mlev>
##$CPDPRG5= <mlev>
##$CPDPRG6= <mlev>
##$CPDPRG7= <mlev>
##$CPDPRG8= <mlev>
##$CPDPRGB= <>
##$CPDPRGT= <>
##$D= (0..63)
$$ [...]
##$SW_h= 4401.40845070422
##$TD= 16384
##$TD0= 1
##$TE= 300
##$TE2= 300
##$TE3= 300
##$TEG= 300
##$TL= (0..7)
0 120 120 120 120 120 120 120 
##$TP= (0..7)
150 150 150 150 150 150 150 150 
##$TP07= 0
##$TPNAME0= <>
##$TPNAME1= <>
##$TPNAME2= <>
##$TPNAME3= <>
##$TPNAME4= <>
##$TPNAME5= <>
##$TPNAME6= <>
##$TPNAME7= <>
##$TPOAL= (0..7)
0.5 0.5 0.5 0.5 0.5 0.5 0.5 0.5 
##$TPOFFS= (0..7)
0 0 0 0 0 0 0 0 
##$TUNHIN= 0
##$TUNHOUT= 0
##$TUNXOUT= 0
##$USERA1= <user>
##$USERA2= <user>
##$USERA3= <user>
##$USERA4= <user>
##$USERA5= <user>
##$V9= 5
##$VALIST= <valist>
##$VCLIST= <CCCCCCCCCCCCCCC>
##$VD= 0
##$VDLIST= <DDDDDDDDDDDDDDD>
##$VPLIST= <PPPPPPPPPPPPPPP>
##$VTLIST= <TTTTTTTTTTTTTTT>
##$WBST= 1024
##$WBSW= 25
##$XGAIN= (0..3)
0 0 0 0 
##$XL= 0
##$YL= 0
##$YMAX_a= 1082711
##$YMIN_a= -1495433
##$ZGOPTNS= <>
##$ZL1= 120
##$ZL2= 120
##$ZL3= 120
##$ZL4= 120
##$ABSF1= 17.49637
##$ABSF2= -4.496376
##$ABSG= 5
##$ABSL= 3
##$ALPHA= 0
##$AQORDER= 0
##$ASSFAC= 0
##$ASSFACI= 0
##$ASSFACX= 0
##$ASSWID= 0
##$AUNMP= <proc_1d>
##$AXLEFT= 0
##$AXRIGHT= 0
##$AXTYPE= 0
##$AXUNIT= <>
##$AZFE= 0.1
##$AZFW= 0.1
##$BCFW= 0
##$BC_mod= 2
##$BYTORDP= 0
##$COROFFS= 0
##$CY= 7568.61572265625
##$DATMOD= 1
##$DC= 0
##$DFILT= <>
##$DTYPP= 0
##$F1P= 17.9538593292236
##$F2P= -4.03888763876832
##$FCOR= 0.5
##$FTSIZE= 32768
##$FT_mod= 6
##$GAMMA= 0
##$GB= 0
##$INTBC= 0
##$INTSCL= 1.936888e-010
##$ISEN= 128
##$LB= 0.02
##$LEV0= 0
##$LPBIN= 0
##$MAXI= 945.577
##$MC2= 0
##$MEAN= 0
##$ME_mod= 0
##$MI= -402.1523
##$NCOEF= 0
##$NC_proc= -3
##$NLEV= 6
##$NOISF1= 8.587773
##$NOISF2= 6.764455
##$NSP= 0
##$NTH_PI= 0
##$NZP= 0
##$OFFSET= 17.49637
##$PC= 1
##$PHC0= 320.1802
##$PHC1= 4.90348
##$PH_mod= 1
##$PKNL= yes
##$PPARMOD= 0
##$PPDIAG= 0
##$PPIPTYP= 0
##$PPMPNUM= 100
##$PPRESOL= 1
##$PSCAL= 0
##$PSIGN= 0
##$REVERSE= no
##$SF= 200.13
##$SI= 32768
##$SIGF1= 16.12182
##$SIGF2= -4.496377
##$SINO= 3.521527
##$SIOLD= 32768
##$SREGLST= <1H.CDCl3>
##$SSB= 0
##$STSI= 32768
##$STSR= 0
##$SW_p= 4401.40845070422
##$SYMM= 0
##$S_DEV= 0
##$TDeff= 16384
##$TDoff= 0
##$TI= <>
##$TILT= no
##$TM1= 0
##$TM2= 0
##$TOPLEV= 0
##$USERP1= <user>
##$USERP2= <user>
##$USERP3= <user>
##$USERP4= <user>
##$USERP5= <user>
##$WDW= 1
##$XDIM= 32768
##$YMAX_p= 275939607
##$YMIN_p= -109180
$$ End of Bruker specific parameters
$$ ---------------------------------
##NTUPLES= NMR SPECTRUM
##VAR_NAME=  FREQUENCY,     SPECTRUM/REAL,   SPECTRUM/IMAG
##SYMBOL=    X,             R,               I
##VAR_TYPE=  INDEPENDENT,   DEPENDENT,       DEPENDENT
##VAR_FORM=  AFFN,          ASDF,            ASDF
##VAR_DIM=   32768,         32768,           32768
##UNITS=     HZ,            ARBITRARY UNITS, ARBITRARY UNITS
##FACTOR=    0.134324425510551, 1,           1
##FIRST=     4401.40845070422, 34986,        -369955
##LAST=      0,             15111,           -399273
##MIN=       0,             -109180,         0
##MAX=       4401.40845070422, 275939607,    0
$$ Real data points
##PAGE= N=1
##DATA TABLE= (X++(R..R)), XYDATA
$$ [...]
14419e6423j7723K166K2196J1461j0015j1572l111o478q819R307K5872R299k0420
14406e4260j8065J0042J4438j3320k6121k256J8540M347j6356o431J7629J7195
14394e4618m273j2408L5Q342J992k103N682J0663Mj5351j5533K523K1440K1346
14380c2259L68k1006k0391n46J2940N538p391n359O556Q106k828o842O592K2347
14366c4175K0129J300j4240j4026o033k712p78J0965K5767J9733j1509l5170k1044
14353f1793J3202K3470N66k0779j6174j932j43m317J017J0863J1837N650L10o152
14339d4375j4213j1987L839J3081J213j2826m849J2705R041j3060j8671M651K6285
14326d9166J6721j2378k6342j1050J3828J9158j591k3293j6543J3269K7750O284
$$ plain form
14419 -56423 -74146 -71980 -49784 -38323 -48338 -59910 -63021 -69499 -78318 -69011 -43139 -33840 -54260
14406 -54260 -72325 -62283 -47845 -61165 -87286 -89542 -71002 -66655 -83011 -89442 -71813 -54618
14394 -54618 -58891 -71299 -71264 -62922 -60930 -63033 -57351 -46688 -46684 -62035 -77568 -75045 -53605 -32259
14380 -32259 -31891 -52897 -73288 -73834 -60894 -55356 -62747 -68106 -61550 -53444 -56272 -63114 -56522 -34175
14366 -34175 -14046 -12746 -26986 -41012 -47045 -49757 -50535 -39570 -13803 5930 -5579 -40749 -61793
14353 -61793 -48591 -25121 -24555 -45334 -61508 -63440 -63583 -67900 -66883 -56020 -44183 -38533 -38223 -44375
14339 -44375 -58588 -70575 -66736 -53655 -52442 -65268 -70117 -57412 -48371 -61431 -80102 -75451 -49166
14326 -49166 -32445 -44823 -71165 -82215 -68387 -49229 -50820 -74113 -90656 -77387 -49637 -43353
14314d3353k2995k2717L97J0682N16l613R755J8915Q170p333r780n001m650m019
14300g5026M901J4769J3625K966o741q670j251J0570J2239m990k2494j1690J9901
14287e1891K8681l123l5380k5801P751J6250n904j7978j455J3141J018j4256p23
14274h9670K5655K2484j0253k3877N956L6441J7204l0894l9994N289M1413J7787
14262b2459k8781l0432J1197L2854P169k3203j7089Q991J7779O084n034p517o208
14249e6649n59R301J2984N775k79K696L415o729j6035j3611p441l902O590K2955
14235d1489K0578p536k5570o001K1117J2888j5705j6937R666K0165L394n353O957
14222b3826R479r505j6505M388J7111l097k1131p05K9760K2146j1003j8958K349
$$ plain form
14314 -43353 -66348 -89065 -88668 -77986 -77470 -81083 -71328 -52413 -44243 -51576 -61356 -66357 -71007 -75026
14300 -75026 -70125 -55356 -41731 -38765 -45506 -54176 -55427 -44857 -32618 -37608 -60102 -71792 -51891
14287 -51891 -23210 -26333 -61713 -87514 -79763 -63513 -69417 -87395 -88850 -75709 -74691 -88947 -89670
14274 -89670 -64015 -41531 -51784 -75661 -69705 -33264 -16060 -46954 -86948 -81659 -40246 -22459
14262 -22459 -51240 -81672 -70475 -37621 -30452 -53655 -70744 -61753 -43974 -37890 -42924 -50441 -56649
14249 -56649 -57208 -47907 -34923 -29148 -29427 -26731 -23316 -30045 -46080 -59691 -67132 -71034 -64444 -41489
14235 -41489 -20911 -28447 -54017 -60018 -38901 -26013 -41718 -58655 -48989 -28824 -25430 -30783 -23826
14222 -23826 -14347 -23852 -40357 -35969 -18858 -21955 -43086 -43791 -14031 8115 -2888 -21846 -19497
14209a9497Q427j4515k7334o006J9568J6725j197n291J175k336j2157p863R304
14196d0997J7051Q546R9J73k561j2192j1736P836K4838J4975j0816k1200r817
14183c5801J232J414M648J5910J6772k1j0907N52J2627K235j1263J794K3362J0960
14169C3514k6736l2576J0293M5431K4746k1821l4313o818J8168J6896K964r365
14157B0383j9173j9550j295K1428K1322n13j1832L710K2674J7152o801k0640j0008
14144A6857J2805K5314J6053n011j5191n038P168o19j9526j8899Q009L0716K3730
14131G6368R61q277o55M655J88k540K913Q316Q115P977J0116O397m863r740J178
14116A01109J4825J3192O55m174J113J900m082j206J2881J6099k415j8467p503
$$ plain form
14209 -19497 -11070 -25585 -52919 -58925 -39357 -22632 -23829 -29120 -27945 -30281 -42438 -50301 -40997
14196 -40997 -23946 -15400 -15301 -15128 -17689 -29881 -41617 -33781 -8943 6032 -4784 -25984 -35801
14183 -35801 -34569 -33155 -28507 -12597 4175 4154 -6753 -6201 6426 8661 -2602 -808 22554 33514
14169 33514 6778 -25798 -15505 29926 54672 32851 -1462 -8280 9888 26784 29748 20383
14157 20383 1210 -18340 -19635 1793 23115 22602 10770 14480 37154 54306 47505 26865 16857
14144 16857 29662 54976 71029 66018 50827 45789 52957 52338 32812 13913 21922 52638 76368
14131 76368 77329 69052 68397 73052 73240 70700 73613 81929 90044 98021 108137 114534 109671 99931 101109
14116 101109 115934 129126 129781 125607 126720 128620 124538 123332 136213 152312 149897 131430 123927
14103A23927J5262J7924J951l686P884J3072M30j2523j1949o282l660k90M53j1295
14089A31218k3481j0437J8586K0904j0730k7265j026K4094L905k9401k0137J5628
14077I1858J7236j7375l0105j678K0663O310j4375j1257j501o116q988O785K1292
14064G2749J0789j2384k2937j9541j2993k921J0202J4087O445L234Q011K086j7487
14051C9340k4016o288Q520J653n521M453R418q538k2921q515R977K084j1143K224
14037i273K0053L858k5106j6941J7069J9871j2764k5600r48J3713p349k4981p494
14024e5892J6739J4093j15n8L359p326j6844o527Q492O476m123o092m266n936
14010e8020P24J9120K4617L591j7332j3396k682r487j7815k817J9072J7215J077
$$ plain form
14103 123927 139189 157113 159064 155378 163262 176334 176764 164241 152292 146010 142350 142060 142513 131218
14089 131218 107737 97300 115886 136790 126060 98795 97769 121863 125768 96367 76230 91858
14077 91858 109094 91719 61614 59936 80599 86909 72534 61277 59776 53660 44672 51457 72749
14064 72749 83538 71154 48217 28676 15683 12762 22964 37051 43496 46730 54741 56827 39340
14051 39340 15324 9036 17556 19209 13688 18141 27559 19021 -3900 -12415 -2438 -354 -11497 -9273
14037 -9273 10780 14638 -10468 -27409 -10340 9531 -3233 -28833 -29781 -16068 -23417 -48398 -55892
14024 -55892 -39153 -25060 -25175 -25233 -21874 -29200 -46044 -52571 -44079 -37603 -41726 -47818 -52084 -58020
14010 -58020 -57296 -38176 -13559 -9968 -27300 -40696 -43378 -52865 -70680 -73497 -54425 -37210 -36133
13997c6133j31P296l212k3028k0402J510J0636L464L785Q471p782l1805j8491
13984a05822K8958M7486Q150l5382k7601R185J9873J615p125L350P549k595o560
13971e8919L103P896j377q651k355M583k042j2766q848P960J5810K890j4509j1982
13957g9207R349K1973R368j0166j1045N93j080j6398j7141O582K6744J8858k561
13944d4131r392n29M717r35q514j1172q259L72Q989N222j0730j8856p158P960
13930i2416P668Q34M788J1601K817j3296j2241M146R281l939j3216n367O580J1726
13916h1034J6234J9907Q288j6983k7860r290J4460J4112l432j0859j797P693Q750
13903f1811P513P776N245j755r381j4286j3764n075P558J3323R614N657M079n202
$$ plain form
13997 -36133 -36264 -28968 -32180 -55208 -75610 -74100 -63464 -60000 -56215 -47744 -55526 -87331 -105822
13984 -105822 -76864 -29378 -21228 -56610 -84211 -75026 -55153 -53538 -60663 -57313 -49764 -52359 -58919
13971 -58919 -55816 -47920 -49297 -57948 -60303 -55720 -57762 -70528 -79376 -71416 -55606 -52716 -67225 -79207
13957 -79207 -69858 -47885 -38517 -48683 -59728 -59135 -60215 -76613 -93754 -87172 -60428 -41570 -44131
13944 -44131 -53523 -54052 -49335 -50270 -58784 -69956 -78215 -77843 -68854 -63632 -74362 -93218 -100376 -92416
13930 -92416 -84748 -83914 -79126 -67525 -64708 -78004 -90245 -86099 -76818 -80757 -93973 -99340 -92760 -81034
13916 -81034 -64800 -44893 -36605 -53588 -81448 -90738 -76278 -62166 -65598 -76457 -78254 -70561 -61811
13903 -61811 -54298 -46522 -41277 -43032 -52413 -66699 -80463 -85538 -77980 -64657 -55043 -49386 -45307 -50509
13889e0509k1440k3082j98K1247J3028j1333j5636M824K0167J3723L6p088j1784
13876f8045j4191l182J6269J8040n276k3273r766J7593K3636M768j3766j7522
13864g4715j3500p885J083R247P710l33k042M141O597J291k215O88R37p665j5855
13849i2516j1442L400J4450J1226k857j3247p712Q963J7316O785q657q897L818
13836g9370R774K223n477m759m012q862r217J859J1903P347l127q92J3225J9514
13822d9871Q211p823j2232n001K200K632k64j167q06l306p132l958Q529J7032
13808e2956O552j5637k3199m677J7981J6667n636j9987j0651O823J0057n11n397
13795h0571O107K1363K0324J575j4350j0589L721N992q025j8539j0374O570J2911
$$ plain form
13889 -50509 -71949 -95031 -95229 -73982 -60954 -72287 -87923 -83099 -62932 -49209 -49173 -56261 -68045
13876 -68045 -82236 -85418 -69149 -51109 -56385 -79658 -89424 -71831 -48195 -43427 -57193 -74715
13864 -74715 -88215 -96100 -95017 -85770 -78060 -78393 -80435 -76294 -69697 -68406 -70621 -69933 -68996 -76661 -92516
13849 -92516 -103958 -100558 -86108 -74882 -77739 -90986 -98698 -89735 -72419 -65634 -74291 -83188 -79370
13836 -79370 -69596 -67373 -72850 -77609 -81621 -90483 -99700 -97841 -85938 -78591 -81718 -82610 -69385 -49871
13822 -49871 -41660 -49483 -61715 -66716 -64516 -61884 -62148 -63315 -64121 -67427 -74559 -78517 -69988 -52956
13808 -52956 -46404 -62041 -85240 -89917 -71936 -55269 -60905 -80892 -91543 -84720 -74663 -75174 -80571
13795 -80571 -74464 -53101 -32777 -31202 -45552 -56141 -52420 -46428 -54453 -72992 -83366 -76796 -63885
13782f3885M321q214j2847l651J6219L0230K1125k378r124R584K0055m685l6622
13769c9872k9693P817K2723j668k1982o281J7207J0710j1855j2239Q957J8406
13757c7770O240m459j096K285l651p709k694K54o504j1578m093O976O487m268
13743f1580j0397k987J1967K0514J3321l975j3481n460O775M253q307q785N407
13730e2735R818p141k0019k783K7143K9430o04k4065j4229P693Q390p641r667
13717e6410P660J4765n073k5415j3350K0128L2819J0272j5507j3501N221J1221
13705b7170K233o16P063O527p784j3871K555K0643J3088j1429j8915J116K1812
13692d748J8259q00j1668r037m492l035p94p41r044j5896l708J9570K1312o606
$$ plain form
13782 -63885 -59564 -67778 -80625 -84276 -68057 -37827 -16702 -19080 -28204 -18620 1435 -3250 -39872
13769 -39872 -69565 -61748 -39025 -40693 -62675 -68956 -51749 -41039 -52894 -65133 -56176 -37770
13757 -37770 -31530 -35989 -37085 -34800 -38451 -46160 -48854 -48600 -55104 -66682 -70775 -63799 -57312 -61580
13743 -61580 -71977 -74964 -62997 -42483 -29162 -33137 -46618 -52078 -45303 -41050 -49357 -58142 -52735
13730 -52735 -42917 -50058 -70077 -72860 -45717 -16287 -16891 -40956 -55185 -47492 -39102 -46743 -56410
13717 -56410 -48750 -33985 -39058 -64473 -77823 -57695 -24876 -14604 -30111 -43612 -38391 -27170
13705 -27170 -24937 -25553 -18490 -11963 -19747 -33618 -31063 -10420 2668 -8761 -27676 -26560 -4748
13692 -4748 13511 12711 1043 -7994 -12486 -15521 -16315 -17056 -26100 -41996 -45704 -26134 -4822 -11428
13678a1428k5676m163K9060K2241j8977l5944n252K6382J5461j5107j9828j756
13666d4987M205m881k244J3270J3658n422j3774J932J5886O761j0735j5262j0135
13653e1728o736k318O497J0052L738k71M543N810k327l723J0238J8737K929k0772
13639b5331k4495r030N317J1976J5892J3213J050o063K383R318j913j2036M698
13626a5021K9320K1126j3830k6247n33K0597M215k3955k3348L113K2485J9098
13614A7020K617j3060j7305m445J4794J8350K753r614m656L994L464L931J3546
13601C1389J6705J502j3813q292P970J4347J3362J4958Q832j2922k5910o797K0122
13588F1453J5722p194l116K5233K5916j3225l6869q721L0265K7711k533j4304
$$ plain form
13678 -11428 -37104 -41267 -12207 10034 -8943 -44887 -50139 -23757 -8296 -23403 -43231 -44987
13666 -44987 -40782 -45663 -47907 -34637 -20979 -26401 -40175 -38243 -22357 -15596 -26331 -41593 -51728
13653 -51728 -58464 -60782 -54285 -44233 -40495 -40766 -36223 -30413 -32740 -36463 -26225 -7488 -4559 -25331
13639 -25331 -49826 -58856 -53539 -41563 -25671 -12458 -11408 -17471 -15088 -5770 -7683 -19719 -15021
13626 -15021 14299 35425 21595 -4652 -5185 15412 19627 -4328 -27676 -24563 -2078 17020
13614 17020 19637 6577 -10728 -15173 -379 17971 20724 11110 6454 10448 13912 17843 31389
13601 31389 48094 49596 35783 27491 35461 49808 63170 78128 86960 74038 48128 41331 61453
13588 61453 77175 69981 66865 92098 118014 104789 67920 59199 89464 117175 114642 100338
13576A00338m624l482j2111n872J2414J3897l062q541N562J2024j941j2889m745
13563H6968L850l190q835L891J6541M467j9365k3120n620N750p2o498j975M679
13549E7471N026K768j26p301j3269o063R356J2007k668j2953m765O064J216r509
13535C7254n425J0589J6873M902j2788k2183j8987m919J1661J6123L739r306o537
13522B0996L539J199j1081j1565N083J8374J2765k506j1380j1234p385k127K934
13509G612N022N421O197J830j1490k0335p970J6045K3937J0374j806k202p600
13496B5035k3650k5953j822J9710R127j6666k1097j986J4688J8624J7094O948
13484B0052j6332l1001j2195K1247K5893L90j1941N681J7262k722k4614j2493
$$ plain form
13576 100338 95714 92232 80121 74249 86663 100560 97498 88957 94519 106543 104602 91713 86968
13563 86968 90818 87628 78793 82684 99225 103692 84327 61207 55587 61337 61265 54767 52792 57471
13549 57471 62497 65265 65139 57838 44569 38506 47862 59869 57201 44248 39483 45547 46763 37254
13535 37254 31829 42418 59291 64193 51405 29222 10235 5316 16977 33100 36839 27533 20996
13522 20996 24535 25734 14653 3088 8171 26545 39310 36804 25424 14190 6805 4678 7612
13509 7612 12634 18055 24252 26082 14592 -5743 -13713 2332 26269 36643 34837 32635 25035
13496 25035 1385 -24568 -26390 -6680 2447 -14219 -35316 -37302 -22614 -3990 13104 20052
13484 20052 3720 -27281 -39476 -18229 7664 8054 -3887 1794 19056 16334 -8280 -20773
13472b0773J7051K2145n78j7266j1017ok196r829n972J0426K3768J9628O78j4193
13458A1866j0267L838O541o667j6795q891Q005J5218O659r445k0010j4933K108
13445c2773J0559k820j8860r048J7054K0249o234k1821k116K2674J9081J838r95
13432c212P95j2632k1999n8K8899J8891j9045k8807J059K1671P203q185J879J0273
13418c268q193k6443j2457J3051J2607m860n022J0185J1651l92M72J2855P257
13405G443j6790k2041M737K6419J3096j1544j0918O824P846r400j4948J52J0984
13392h140L711k221P887J4163m259k7680k0790J0749K4558M136j7735j0627J0111
13379a6137J3253q0o469j397P70j483L284J1439O561r257j4927m517N231N813
$$ plain form
13472 -20773 -3722 18423 17845 579 -10438 -10444 -12640 -22469 -28441 -18015 5753 25381 26059 11866
13458 11866 1599 5437 11978 5311 -11484 -20375 -12370 2848 9507 62 -19948 -34881 -32773
13445 -32773 -22214 -25034 -43894 -52942 -35888 -15639 -21873 -43694 -45810 -23136 -4055 -2217 -3212
13432 -3212 -2417 -15049 -37048 -37106 -8207 10684 -8361 -37168 -36109 -14438 -7235 -15420 -13541 -3268
13418 -3268 -11461 -37904 -50361 -37310 -24703 -29563 -34585 -24400 -12749 -13141 -12669 186 7443
13405 7443 -9347 -31388 -26651 -232 12864 1320 -9598 -2774 5072 -4328 -19276 -19124 -8140
13392 -8140 -4429 -6650 1237 15400 11141 -16539 -37329 -26580 -2022 2114 -15621 -26248 -16137
13379 -16137 -2884 -2964 -9433 -10830 -10060 -11543 -8259 3180 9741 484 -14443 -18960 -13729 -7916
13365g916P326J1519M418j3167j7327P53J5238L722j8519k3380r452M525R463
13352c2797R410Q913J2100J9998J8927o290l7743l4934L675K7563Q804j2349M599
13339a0124K9368J3291k2175j8839J6606K1858j4162l3150p980J5828M775q541
13327a3245O012J8407j884k3335n988K5219K0839j0999k3236q148K748J883R836
13314a891K3744J8155l682j2077n745j2126k8592j8794J9440L7575J1252j8151
13302I108q576J8509J7871q105k1006q944M660N068J153r11o458j2519o165J1578
13288d737K1208J1183o678j4359q278K313P935N042l301r004n945K400N862n20
13274C121j0107j1473j088J1403J2917L400k749L160R844L032j0087j0492J657
$$ plain form
13365 -7916 -590 10929 15347 2180 -15147 -14394 844 4566 -13953 -37333 -46785 -42260 -32797
13352 -32797 -23387 -14474 -2374 17624 36551 30261 -7482 -42416 -38741 -11178 -2374 -14723 -10124
13339 -10124 19244 32535 10360 -8479 8127 29985 15823 -17327 -25307 -9479 -4704 -13245
13327 -13245 -7233 11174 9290 -14045 -20033 5186 26025 15026 -8210 -16358 -13610 -11727 -1891
13314 -1891 21853 40008 36326 24249 18504 6378 -22214 -41008 -21568 16007 27259 9108
13302 9108 532 19041 36912 28807 7801 -1143 3517 8585 9738 8827 2369 -10150 -16315 -4737
13288 -4737 16471 27654 20976 6617 -1661 652 8587 13629 10328 1324 -4621 -2221 3641 3121
13274 3121 -6986 -18459 -19547 -8144 4773 8173 5424 8584 18428 21460 11373 881 2538
13261B538O925q80n714O55M777n40k71J3011J8199j031k3480k0400j102M504l844
13246f653j152J4506J7587R76j1096l903P602R462P840O014n789k3251k2416Q40
13232i433J6687P452l632N056J4539K171j2097J338K4578J6802j5840k6032O4
13219B1653K3504J5844m076j1217j0340j0682j968J8766K7228O905k0205k4872
13207C0540j1404p06O203J7640K2511O155j6861j9439l782N881N507J0807J7982
13194G1034M927k3201k9763k496K2457J3559j0165j2918L533J1325M928L189J0833
13181F7242J1948K163l241J282J818o274o577O916J2122n157j9516k009K6171
13168H6888J7485k4308l7206Q371N5764L9245j6862l3000M706K6226p660m1794
$$ plain form
13261 2538 9463 8583 2869 3524 8301 7761 7490 20501 38700 37669 14189 -6211 -7313 -2809 -6653
13246 -6653 -7805 6701 24288 25264 14168 10265 17867 27329 35169 41183 35394 12143 -10273 -9433
13232 -9433 7254 14706 11074 16130 30669 32840 20743 22081 46659 63461 47621 21589 21653
13219 21653 45157 61001 56925 45708 35368 24686 22718 41484 68712 75617 55412 30540
13207 30540 19136 18430 24633 42273 64784 70939 54078 34639 30857 36738 42245 53052 71034
13194 71034 75961 52760 22997 20501 42958 56517 46352 33434 36967 48292 53220 56409 67242
13181 67242 79190 81353 78112 79394 81212 74938 68361 75277 87399 82242 62726 60717 86888
13168 86888 104373 80065 42859 51230 106994 146239 129377 96377 101083 127309 119649 77855
13156G7855j7811K9112K7263j5055k5635J1983L4174L771l2293k2964R809J7126
13144I7335kq313k919p52J802J5700K2812K264k1717j0146K2541K6379j490j2369
13130A31125R155J9178n820k4412j362K8805J7034k0424l0768p685R088L986J612
13117A29512J3699J8777L794j3200j4546o359R64Q405J3490N675j0955j4020M128
13104A39364K0776J5132k612j0133m023M531J0648J4941J3341M566j274L444J0168
13091B18869Q365L583N752R513M121n161n234J460K556L12P590K0435J9312J321
13077B92794j2830j1601q840j5819j9534o457J0627J1056r54m962J792K651q077
13064B29846j5450q355M563J0096P620M329M162P569J3263J5424Q005m039p406
$$ plain form
13156 77855 60044 89156 116419 101364 75729 87712 121886 125657 93364 70400 80209 97335
13144 97335 97333 89020 86101 85349 87151 102851 125663 127927 106210 96064 118605 144984 143494 131125
13130 131125 140280 159458 153638 129226 127864 156669 173703 153279 122511 114826 123914 127900 129512
13117 129512 143211 161988 165782 152582 138036 131677 132641 141046 154536 160211 149256 135236 139364
13104 139364 160140 175272 172660 162527 158504 163035 173683 188624 201965 206531 205257 208701 218869
13091 218869 227234 230817 236569 246082 250203 245042 239808 241268 243824 244136 251726 272161 291473 292794
13077 292794 279964 268363 259523 243704 224170 217713 228340 239396 238442 233480 235272 237923 229846
13064 229846 214396 206041 210604 220700 228320 232649 236811 244380 257643 273067 281072 277033 269627
13051B69627Q95P465J412j0163j3364o210K593P003O793K412m272p266k476N683
13037B60132R730Q308M842J146j917j738K200O019P509Q490O986l117j7633j9723
13023B71234l802J0822O456m937k041P740j10k0925k1037P708K8110J1305j8766
13010B71757k1907j404O151r953k1067o626J5952J9842M780j0028j3993j1005
12998B22499o145r40J367k201o691k455J0726J8792Q499j4000k6121j4221Q361
12985A97470J6083L004j0315n424R341J2785K077m818K436J0789L803j2961j8715
12972B05555o406P554O382m434p106J403O103j292r508p335k033m332o770L575
12958A81356J7944J5236k757j1234k206K451j0587k0588n105K2223K9782J1094
$$ plain form
13051 269627 270522 277987 279399 269236 255872 249662 252255 259258 266051 268463 264191 256925 254449 260132
13037 260132 269862 278170 283012 284158 282241 280503 282703 288722 296231 304721 311707 308590 290957 271234
13023 271234 267432 278254 284710 279773 277732 285472 285362 264437 243400 251108 279218 290523 271757
13010 271757 249850 248446 254597 244644 223577 216951 232903 252745 257525 247497 233504 222499
12998 222499 216354 215414 216781 214580 207889 205434 216160 234952 243451 229451 203330 189109 197470
12985 197470 213553 216557 206242 200818 210159 222944 225021 220203 222639 233428 237231 224270 205555
12972 205555 199149 206703 213085 208651 201545 202948 209051 207759 198251 190916 188883 184551 177781 181356
12958 181356 199300 214536 211779 200545 198339 200790 190203 169615 164510 186733 216515 227609
12946B27609j2434k2687j8094l454J2926J7471N524p450n412M608N860n20k184
12933B01763q68o432j2342m254J0573J0891k263o200M173P974m279j4197p314
12920A77225M678O614K939M740J1305J5260J1638k689k2222k6564m133K0262J2637
12907B11690j5620j9405Q324K2465n14k3316j0386J5404J6367J412j73N794k478
12894B09564j3165j386J8298J1668j3787j8047N775K3199J5363l10q002j0470
12882B18700o621P903J7074J876j9384j1782J5442J7693j1370k7737r573J1788
12870B04009J0827N015R387N531j4008j9196L969J8633l367k8392j3953K0559
12858A99014K7317O881k129Q417J1360j532r898o192l855n485q02N696P07p639
$$ plain form
12946 227609 215175 192488 174394 170940 183866 201337 206861 199411 193999 198607 204467 203947 201763
12933 201763 200895 194463 182121 177867 188440 199331 197068 190868 195041 203015 198736 184539 177225
12920 177225 181903 188517 191456 196196 207501 222761 234399 231710 209488 182924 178791 199053 211690
12907 211690 196070 176665 184989 207454 206940 183624 173238 188642 205009 206421 206248 212042 209564
12894 209564 196399 195013 213311 224979 211192 193145 198920 222119 237482 237172 229170 218700
12882 218700 212079 219982 237056 238932 219548 207766 223208 240901 229531 201794 192221 204009
12870 204009 214836 219851 229238 234769 220761 201565 205534 224167 220800 192408 178455 199014
12858 199014 226331 233212 231083 239500 250860 249328 239430 233238 229383 223898 223096 228792 229499 221860
12844B21860q57J2839R550n984o380R129J2720j878r305j7L937o820r216R208
12830B38786K3574J1105j2089j8074p359J393K746L159L269J339K646R341J2020
12817B71856M606l822l617R17J717n09k207k871Q27J1321J6773K248k0363j9882
12803B56994O326K1443L655j8228r411J6297J9271n857k7422k4823p845P654J5250
12790B53304J1431j694r440j908O782q06j3639q941O252M215j4266j7494L489
12777B17285J7095K548j6035j0284P339Q433l421k902J1906J8009O599o578j0541
12764B39453j1742j3544q028M107P999o28n341L392R493k474j8342j3942O096
12751A96499J4095J233j0937m949Q912J3016Q262O245Q428P511J811m218q673
$$ plain form
12844 221860 221003 233842 243392 237408 231028 240157 252877 250999 241694 241677 245614 238794 229578 238786
12830 238786 262360 273465 261376 243302 235943 237336 240082 243241 246510 247849 250495 259836 271856
12817 271856 276462 272640 269023 269940 271657 271148 268941 266070 266897 278218 294991 297239 276876 256994
12803 256994 263320 284763 288418 270190 260779 277076 296347 290490 263068 238245 230400 238054 253304
12790 253304 264735 263041 253601 251693 258475 257669 244030 235089 241341 245556 231290 213796 217285
12777 217285 234380 236928 220893 210609 217948 226381 222960 220058 231964 249973 256572 249994 239453
12764 239453 227711 214167 206139 210246 218245 217617 212276 215668 225161 222687 204345 190403 196499
12751 196499 210594 211827 200890 195941 204853 217869 226131 232376 240804 248315 250126 245908 237235
12738B37235j1461r855l386J893J194k954p595j2695j2460J869K1545K1524k593
12725B22261j9533o903J0507r26k5044j9016J3625K4170j956j9807J384K7618
12713B06380J5588j9837l3070j5696L527Q417O361J415p524r418N241K0027J3008
12700A94419n268o914N784M063j6342k5140n750J9654K5507J5603O569J405n332
12687B08258j2067j2614m448J0172K1520J4140j2742l2345k0696N259Q881r358
12675A63960j2559J0327K3855M069k1601j8674K026Q371j001l588M098N708j185
12662A63806k605L600N073m50k900j936o721j2564l507J6050J8048q094l2604
12649A35196k2840J0326K6528J1079q515o266N731J860j3079j2633M239Q914o425
$$ plain form
12738 237235 225774 215919 212533 214426 215620 212666 205071 192376 179916 181785 203330 224854 222261
12725 222261 202728 195825 206332 205406 180362 161346 174971 199141 197185 177378 178762 206380
12713 206380 221968 202131 169061 153365 156892 165309 171670 173085 165561 156143 161384 181411 194419
12700 194419 189151 182237 188021 192084 175742 150602 144852 164506 190013 205616 212185 213590 208258
12687 208258 196191 183577 179129 189301 210821 224961 212219 179874 159178 164437 173318 163960
12675 163960 151401 161728 185583 189652 168051 149377 151403 159774 158773 155185 159283 164991 163806
12662 163806 161201 164801 169874 169424 166524 164588 157867 145303 141796 157846 175894 167800 135196
12649 135196 112356 122682 149210 160289 151774 145508 151239 153099 140020 127387 131626 140540 134115
12636A34115j0198J4904L3381Q442l3347l5922J451K5708J3590k280O17J16j7449
12623A33128k3770j037J9068P684j1158n757N900o288k2432n522K6674K4242j1850
12610A28882l0289j1142J0543Q505q51j72P49n751p899j309J616l72N257J2306
12596A10073l36k4205k3521N421K2013N916j1637m173P998J953n020O331J4688
12583A05501l360k4095j2518J6396K0456j788j3723k700O527m52q250n191j350
12570G5453m726p144k388L448N827P770Q287J345j0801j7264j2847j983Q979J3689
12556F7645O857n819q701R86M772p696j7267l803J9347K4011Q331o294r285o488
12542F6596j153N511M373o656r911M114J3166j313j5018K060K7308J5539k2659
$$ plain form
12636 134115 123917 138821 172202 180644 147297 111375 112826 138534 152124 149844 150461 150577 133128
12623 133128 109358 108321 127389 135073 123915 118158 124058 117770 95338 89816 116490 140732 128882
12610 128882 98593 87451 97994 106499 105648 105476 106225 100474 92575 91266 92882 92510 97767 110073
12596 110073 109737 85532 62011 67432 89445 95361 83724 79551 87549 89502 84482 90813 105501
12583 105501 102141 78046 65528 81924 102380 100592 86869 84169 90696 90244 81994 76803 75453
12570 75453 70727 63583 61195 64643 70470 78240 86527 87872 77071 59807 46960 44977 53956 67645
12556 67645 74502 68683 59982 60968 65740 58044 40777 36974 56321 80332 88663 82369 73084 66596
12542 66596 65443 70954 75327 68671 58760 62874 76040 74727 59709 61769 89077 104616 81957
12529H1957l1107K552K8050J4757o572n784r12j2710k0852l305J9528J8367J288
12516H5257q520j1872j6783j1592R674K1874N158j7329j4262M450R597J286k036
12503E4902j405n550l079J3620K0127q96j7801J916K6774O593l6385l4222J4776
12490C9370L8818O878k6650j5747R829P409r322p955M636P203P033J5018J3866
12477I0386o632j7315L406K3698P585k0259j3161J7587K0345j2302l4809k1636
12465C6893L970J6636J7023R144p111j6607l046J5267O419j7298j1774K2886L3887
12452A06289o2l1594j9802Q615J0927l222q43J1305M204j4827j2810R750J8488
12439H6418K467j0886l213R035O640l608n405J819O586K756m542n235L812J1005
$$ plain form
12529 81957 50850 53402 81452 96209 89637 83853 82941 70231 49379 46074 65602 83969 85257
12516 85257 76737 64865 48082 36490 46164 68038 73196 55867 41605 46055 55652 56938 54902
12503 54902 53497 47947 44868 58488 78615 77719 59918 61834 88608 95201 58816 24594 39370
12490 39370 78188 85066 58416 42669 52498 59907 50585 42630 47266 54469 61502 76520 90386
12477 90386 83754 66439 69845 93543 101128 80869 67708 85295 105640 93338 58529 36893
12465 36893 40863 57499 74522 83666 76555 59948 56902 72169 78588 61290 49516 72402 106289
12452 106289 106227 74633 54831 63446 74373 71151 70308 81613 85817 70990 58180 67930 86418
12439 86418 88885 77999 74786 83821 90461 86853 81448 83267 89853 92609 88067 82832 86644 97649
12425I7649K898j1772q588J2994K1462K470j2738K343J9872J490l1217k5250J5755
12412H7368L3429P439j6609p195O974j537q994Q404K3206N093j9087p889K1189
12399A31791J8144j7138l6100j8189O901J4142J1954J0518M697k441K750J4182
12387A41211Q645j2594j9866k853J2694Q364j192r09M4n319l083J2034J8086J546
12373A56808j4946p454J0008J0344k245m119N895Q280j850j0165r162m062K901
12360A40233J1400J1783j832j2696r72K1072K0994n077k3421j0682J3793J7852
12348A82447N90j1461l110J2158J4046K332n268J835J3417J4072M507l196n741
12335B16628q294o891P244K3265J6201j2822k7924p378K2905K7376J0739K285
$$ plain form
12425 97649 100547 88775 80187 93181 114643 117113 104375 106718 126590 128080 96863 71613 87368
12412 87368 120797 128236 111627 104432 111406 109869 100875 109279 132485 137578 118491 110602 131791
12399 131791 149935 132797 96697 78508 85409 99551 111505 122023 126720 124279 127029 141211
12387 141211 149856 137262 117396 114543 127237 135601 134409 133500 133544 128225 125142 137176 155262 156808
12373 156808 141862 134408 144416 154760 152515 148396 154291 162571 160721 150556 141394 137332 140233
12360 140233 151633 163416 161584 148888 147916 168988 189982 184905 161484 150802 164595 182447
12348 182447 183037 171576 168466 180624 194670 197002 191734 193569 206986 221058 225565 222369 216628
12335 216628 208334 201443 208687 231952 248153 235331 207407 200029 222934 250310 261049 263334
12323B63334P906R642K118k501p19m56j424K018M247p86q85J5109L0057K1655
12309C49315J714l078K106n190j4144L884L3643K9001o324j4924K0080M2611J6065
12296D54759j5863n010K2222J7902l413Q97J9136R084j8347j3756K0577K8556
12284E16744n755l0534j0992J8131J3581j0899j4808O491K3480J7709j140j2872
12272E09136n911J2241J8782L114j1944J109K8158K8400k257k1150l530K1962
12260E78110K2371Q376O124J2425J0357N255J1254J9849J4796M381O657J4574
12248G14529R104k151M839K5685K9741J0180l199Q938K6696K4695R114K174Q575
12235H68920J7402K4012L0160L1233K3363J8924L4814O4189P8342O3726M1986
$$ plain form
12323 263334 271240 280882 283000 280499 279780 279324 277900 279918 284165 283379 282494 297603 327660 349315
12309 349315 351029 347951 350057 344867 330723 334607 368250 397251 390927 376003 396083 438694 454759
12296 454759 438896 433886 456108 474010 470597 471494 490630 499714 481367 467611 488188 516744
12284 516744 510989 480455 469463 487594 501175 490276 475468 481959 505439 523148 522008 509136
12272 509136 503225 515466 534248 537362 525418 526527 554685 583085 580828 559678 556148 578110
12260 578110 600481 608857 614981 627406 637763 643018 654272 674121 688917 693298 699955 714529
12248 714529 723633 721482 726321 752006 781747 791927 788728 797666 824362 849057 858171 860345 868920
12235 868920 886322 910334 940494 971727 995090 1014014 1048828 1113017 1191359 1255085 1297071
12224A297071M1695O1333P6020P4703P0375P1718O6847M7688L1526L6826M8141
12213A923943L1140j8579o6129q1279o9697n3039m0046l0006k5743k6889k4271
12202A519405j5790j4138k3906k6833q962J2462J3280J870N613K4219K8820J0055
12190A526095m708O662K8957L6782L2808L7238N1869N7685M5386K9930L1801N5127
12178A935632Q7403J13179J25074J26426J26678J33295J47199J64986J82484J94777
12168C337133J96228J84291J63053J40573J20876R7424N5998j1220r2249j60961
12158D031146k00234k14364k13581j95454j55068j08287q4766r2141j04280r5999
12148B566972p5545o7224p2272o8003m4065j8008q623j1584j2667j0859j3046
$$ plain form
12224 1297071 1338766 1400099 1476119 1550822 1621197 1692915 1759762 1807450 1838976 1875802 1923943
12213 1923943 1955083 1936504 1870375 1789096 1719399 1666360 1626314 1596308 1570565 1543676 1519405
12202 1519405 1503615 1489477 1465571 1438738 1429776 1442238 1455518 1457388 1463001 1487220 1516040 1526095
12190 1526095 1521387 1528049 1557006 1593788 1626596 1663834 1715703 1773388 1818774 1848704 1880505 1935632
12178 1935632 2023035 2136214 2261288 2387714 2514392 2647687 2794886 2959872 3142356 3337133
12168 3337133 3533361 3717652 3880705 4021278 4142154 4239578 4295576 4284356 4192107 4031146
12158 4031146 3830912 3616548 3402967 3207513 3052445 2944158 2859392 2767251 2662971 2566972
12148 2566972 2491427 2424203 2351931 2283928 2239863 2221855 2213232 2201648 2188981 2178122 2165076
12137B165076j5223o821R917K1675K4114K4375K4357K0052J8782L5119O3689P9852
12125B464964P7928Q2801J07162J26067J20241J16558J47453J91738K02668J81594
12115C819174J70161J73794J53607J02978O6704N8201K1108q2373j96941k43197
12105D043216k23415j99962j96886j86520j57812j33127j19482j01130q3414q9579
12095B551889j07808r5769n0801k3645m2423o9810o1571k7871p374j1559k3244
12084B030014k7286j9106j287J1424K150k1802l3602k4278r523L873K3636L9207
12072A973420K6759j058J506M0652O4510M4486K2204L7664O2876N6169L5485L8665
12060B403338M9759L0286o233j9961k2067n3504j01033j10811q1713o8079q3964
$$ plain form
12137 2165076 2149853 2143032 2152949 2174624 2198738 2223113 2247470 2267522 2286304 2321423 2385112 2464964
12125 2464964 2542892 2625693 2732855 2858922 2979163 3095721 3243174 3434912 3637580 3819174
12115 3819174 3989335 4163129 4316736 4419714 4486418 4544619 4565727 4483354 4286413 4043216
12105 4043216 3819801 3619839 3422953 3236433 3078621 2945494 2826012 2724882 2641468 2551889
12095 2551889 2444081 2348312 2297511 2273866 2231443 2161633 2100062 2072191 2064817 2053258 2030014
12084 2030014 2002728 1983622 1982335 1993759 1995909 1974107 1940505 1916227 1906704 1910577 1934213 1973420
12072 1973420 2000179 1999121 2000627 2041279 2105789 2150275 2172479 2210143 2273019 2329188 2364673 2403338
12060 2403338 2453097 2483383 2477150 2457189 2435122 2381618 2280585 2169774 2088061 2019982 1936018
12049A936018q2285m6192k4955m8340p3283n6597k3966k0803l9891m5227l3083
12038A441396k4196k1809j7804j8244k7125k6307n334J0475m202l1166l5745j9392
12026A220547j0015j4879j8346j5233j3593j3374j1088j4495k5203k2346M721
12015A066696K4801M908l1810l3358K123K3236M252k1355j9738m512l163j1861
12003A000219j2033n769n450o093L753J4753P022j6889l2065k4804p974P14J102
11990I16486L978J0923J0858l471k2122k6332j0121J1177J6713K088j7101k1763
11978H71313q000Q776R072p765j9295p014J6285K0928J645j5035r826M313P596
11965H72993K480K65k422j1997j8076q887N150P319L407Q913J7063Q686j1429
$$ plain form
12049 1936018 1853733 1807541 1782586 1734246 1660963 1604366 1580400 1559597 1519706 1474479 1441396
12038 1441396 1417200 1395391 1377587 1359343 1332218 1305911 1300577 1311052 1306850 1275684 1239939 1220547
12026 1220547 1210532 1195653 1177307 1162074 1148481 1135107 1124019 1109524 1084321 1061975 1066696
12015 1066696 1091497 1096405 1064595 1031237 1033360 1056596 1060848 1039493 1019755 1015243 1012080 1000219
12003 1000219 988186 982417 976967 970874 974627 989380 996402 979513 947448 922644 914670 915384 916486
11990 916486 920464 931387 942245 938774 916652 890320 880199 891376 908089 910177 893076 871313
11978 871313 863313 872089 881161 873396 854101 847087 863372 884300 885945 870910 861084 865397 872993
11965 872993 875473 875738 873316 861319 843243 834356 839506 846825 850232 859145 876208 884894 873465
11952H73465j8464o768M290M701M843Q550M709p156j0690j605L036m602q233L459
11938H49535J5539J0598m465j1484o907o31K87l562o772j863J0775J6065K263
11925H69378j6535j6095J603J2334Q798O337Q625K486p731K51K1781K2190m144
11912I09278j6290O420K5930R409j2498J265K7777J6582k3651l6696p257K1352
11900I21621J9163N705N128J0941J0000O080N751O980R276J2999R525m168r089
11887A009912P919K2369O623j6710m984K9236L2277r8j1837J9705M6320L2202
11875A172934J0282J7066L0250J9193N517J7884L0682R865j5787K991M7333N4992
11863A403202K0790J470K1466M1924L3405J7225J6087J7754J1083J1754K6801
$$ plain form
11952 873465 855001 848233 852523 857224 862067 870617 875326 868170 857480 855875 858911 854309 846076 849535
11938 849535 865074 875672 871207 859723 852816 852185 852472 848910 842138 840275 851050 867115 869378
11925 869378 852843 836748 838351 850685 859483 865820 874445 876931 869200 869451 891232 913422 909278
11912 909278 892988 899408 925338 934747 922249 923514 951291 967873 944222 907526 900269 921621
11900 921621 940784 946489 951617 962558 972558 978638 984389 991369 1000645 1013644 1023169 1019001 1009912
11887 1009912 1017831 1040200 1046823 1030113 1025129 1054365 1086642 1086544 1074707 1094412 1140732 1172934
11875 1172934 1183216 1200282 1230532 1249725 1255242 1273126 1303808 1313673 1297886 1300877 1348210 1403202
11863 1403202 1423992 1425462 1446928 1488852 1522257 1539482 1555569 1573323 1584406 1596160 1622961
11852A622961L3137J6923k49J407R476J0413J7607L9250M9019K4527p713l960
11840A812798L3245N9510N0948K9226K3534L5638M9800N6958N8660N7777N4194
11829B322288M7887M3304M7694O0639O9083O3235N4195N9900P5063P6828O3260
11818B983376N9851P7694R2489Q2682O3825O2346P5798Q4679Q6931R3588J02893
11807C866152J05779J07322J17451J29610J33493J38639J58673J82261J89003
11798E128383J85359J93384K11095K18379K17795K32629K64821K91854L08110
11789G251809L32514L71426M12868M63716N50409O70420P83722Q67791R42074
11780A2646749J024862J111558J212166J352914J505243J567586J471561J271631
$$ plain form
11852 1622961 1656098 1673021 1672772 1674179 1683655 1694068 1711675 1750925 1799944 1824471 1816758 1812798
11840 1812798 1846043 1905553 1956501 1985727 2009261 2044899 2094699 2151657 2210317 2268094 2322288
11829 2322288 2370175 2413479 2461173 2521812 2590895 2654130 2708325 2768225 2843288 2920116 2983376
11818 2983376 3043227 3120921 3213410 3296092 3359917 3422263 3498061 3582740 3669671 3763259 3866152
11807 3866152 3971931 4079253 4196704 4326314 4459807 4598446 4757119 4939380 5128383
11798 5128383 5313742 5507126 5718221 5936600 6154395 6387024 6651845 6943699 7251809
11789 7251809 7584323 7955749 8368617 8832333 9382742 10053162 10836884 11704675 12646749
11780 12646749 13671611 14783169 15995335 17348249 18853492 20421078 21892639 23164270
11772B3164270J078248R27567P58454M83716L9908n80018j262633j774427j928198
11763B0906887j763236j493288j276661j113261r62762q50484q05930p84480p24481
11754A1132304o32782n53065m91538m32350l88397l74565l59973l09964k53249
11745G336421k42577k63221k48448j84390j33275j39568j70170j71217j40753
11736E642802j17010j22143j41906j47577j26311r8122r9314j34778j59991j36444
11726D359206r0106p7108j01230j12606q8269o2579o4744p4605o4211m4165m0843
11715C538740n6285p5121q8252r1085q0926o9416p2099p7267n9225l0832l6641
11704B801591p6028q7447m2296M26j7882o2241o2834k8230k3141n4411o2657k7858
$$ plain form
11772 23164270 24242518 25170085 25928539 26412255 26452163 25872145 24609512 22835085 20906887
11763 20906887 19143651 17650363 16373702 15260441 14297679 13447195 12641265 11856785 11132304
11754 11132304 10499522 9946457 9454919 9022569 8634172 8259607 7899634 7589670 7336421
11745 7336421 7093844 6830623 6582175 6397785 6264510 6124942 5954772 5783555 5642802
11736 5642802 5525792 5403649 5261743 5114166 4987855 4889733 4790419 4655641 4495650 4359206
11726 4359206 4269100 4191992 4090762 3978156 3889887 3827308 3762564 3687959 3623748 3579583 3538740
11715 3538740 3482455 3407334 3319082 3227997 3147071 3077655 3005556 2928289 2869064 2838232 2801591
11704 2801591 2725563 2638116 2595820 2596246 2578364 2516123 2453289 2425059 2401918 2347507 2284850 2256992
11692B256992k886k3305n3547n2628l5333l2196l6550l0438k4820l4467m3393
11681A887429l3714k2636l2150m4987l2205p026o841l1056m1705k5295j0858j8026
11669A580930k6537j5022J161m629k6764l5230j8998M27p19j9828l4444k9693
11657A370654j3216l352o373j0851o450o30p271k3068k9307j8940p284q516j4725
11644A220671j0667O67L737l505p970n541o599j2631r022O963J2332p575k9376
11631A151484k3359j784n60j8361j6548J3009K5978m684l8233k4319J8114K8734
11619A109471k490k4472p340J5361M615k4469k9863m614J8637J4534p919k3208
11607A038243j7794J182J6777J8581R551j498q561p357L977J5459R780j0738j7244
$$ plain form
11692 2256992 2254106 2230801 2177254 2124626 2089293 2057097 2020547 1990109 1965289 1930822 1887429
11681 1887429 1853715 1831079 1798929 1753942 1721737 1714711 1707870 1676814 1635109 1609814 1598956 1580930
11669 1580930 1554393 1539371 1540532 1535903 1509139 1473909 1454911 1455338 1454619 1434791 1400347 1370654
11657 1370654 1357438 1354086 1347713 1336862 1330412 1329782 1322511 1299443 1270136 1251196 1243912 1235396 1220671
11644 1220671 1210004 1210671 1214408 1210903 1202933 1197392 1190793 1178162 1169140 1176103 1188435 1180860 1151484
11631 1151484 1128125 1126341 1125781 1107420 1090872 1103881 1129859 1125175 1086942 1062623 1080737 1109471
11619 1109471 1106981 1082509 1075169 1090530 1095145 1070676 1040813 1036199 1054836 1069370 1061451 1038243
11607 1038243 1020449 1021631 1038408 1056989 1066540 1065042 1056481 1049124 1053101 1068560 1078340 1067602 1050358
11594A050358N569K8889J7770j3866k2579j445J5816J5054J7879K9787K3356o431
11582A160157j8203J4224N6721O5472M7664L5853L4723L3876M4527P7556J06105
11571A658675R6711O3548M8137N7098O3130N6746N1329M3217J3406l1078o0685
11560B060234p0356q3066j03980j10823r4572p2622n6986m4488l9801n0596n9508
11549A273436m2313j4755j5087l7571l6522n422O941k0764m3319k4739K153n487
11537A036551k9220k6808m859q15j6720k2349j0091j012m677j1246j6600k2607
11525H69547k0948o323M703m044j9674k1051j2850j0476q939J464O812p683k3884
11512G46654j7082O88L241j761P732J8044J456k4410j7461J3331J6080j5590k7449
$$ plain form
11594 1050358 1055927 1084816 1102586 1088720 1066141 1064696 1080512 1095566 1113445 1143232 1166588 1160157
11582 1160157 1141954 1156178 1212899 1278371 1326035 1361888 1396611 1430487 1475014 1552570 1658675
11571 1658675 1755386 1818934 1867071 1924169 1987299 2044045 2095374 2138591 2151997 2120919 2060234
11560 2060234 1989878 1906812 1802832 1692009 1597437 1524815 1467829 1423341 1383540 1332944 1273436
11549 1273436 1231123 1216368 1201281 1163710 1127188 1121766 1128707 1107943 1064624 1039885 1042038 1036551
11537 1036551 1007331 980523 975664 974849 958129 935780 925689 924677 920000 908754 892154 869547
11525 869547 848599 842276 846979 842935 823261 802210 789360 778884 769945 771409 778221 770538 746654
11512 746654 729572 730260 733501 731740 739472 757516 758972 734562 717101 730432 746512 730922 703473
11499G03473N435L6552K4010o840j3158n33K204k484M926J7493J3485m064j3235
11486G67264p524J670N913L568m161o743P326K4088J3369k0536l2304l005K4277
11473G73202J0910j2982J542L7807L8136j674k4931l151K5527K2307L221L568
11461H73482K2963L4733K8305J6914J4551K2702L3632L7581L2591K9207L6841
11450A183502M8424N2044N2946O4411Q0026P9179O1384M9767N4960O0417N1711
11439A838771L5809K0496p64k8934m7380m7782m7773o2511p7139p1450n6308n6372
11427A398663o5756n3956j7505O267r815m2439m8606k2362K362R27j3452j6091
11415A118237o038q5l601o379l926l658q103r625o436n944o500L443J8801J5526
$$ plain form
11499 703473 708908 745460 769470 762630 749472 748939 751143 748659 753585 771078 784563 780499 767264
11486 767264 759740 761410 767323 770891 766730 759987 767313 791401 804770 784234 751930 748925 773202
11473 773202 784112 771130 772672 810479 848615 846941 822010 818859 844386 866693 869914 873482
11461 873482 896445 931178 959483 976397 990948 1013650 1047282 1084863 1117454 1146661 1183502
11450 1183502 1231926 1283970 1336916 1401327 1481353 1560532 1621916 1671683 1726643 1787060 1838771
11439 1838771 1874580 1895076 1894312 1865378 1817998 1770216 1722443 1659932 1582793 1511343 1455035 1398663
11427 1398663 1332907 1278951 1261446 1267713 1257898 1215459 1166853 1144491 1146853 1147780 1134328 1118237
11415 1118237 1112199 1112114 1108513 1102134 1098208 1094550 1086447 1076822 1070386 1064442 1057942 1061385 1080186 1095712
11401A095712q828j9306N590L2828K0781j4403k3806m198K315j4440j5477J3399
11389A070167K9656N481k1534r949J7094J4214r510j1783P633J1628m755q033
11377A090309J0155J8427L998n254O671J5486L338p107O169K3546J7001j869k326
11364A178544J4762K2115J2290N126J1173J7406J3443Q006J1146J7647J7678J2573
11352A341909J0759J4125J6273J2776P531O247O029j869j6016k0472o033J2251
11340A383510J4226N434P756K1410K2979O494l009R351K2205J4352J678R264K6752
11327A542402K5095N315m717L464J0277N283K80J963K503L368J7883M0752M4629
11314A698497K0594m665p390K574O923R928K2081L3440K9200J7373J5604K1193
$$ plain form
11401 1095712 1086884 1067578 1073168 1105996 1126777 1112374 1088568 1084370 1086685 1072245 1056768 1070167
11389 1070167 1099823 1105304 1083770 1073821 1090915 1105129 1095619 1083836 1091469 1103097 1098342 1090309
11377 1090309 1100464 1118891 1122889 1117635 1124306 1139792 1143130 1136023 1142192 1165738 1182739 1180870 1178544
11364 1178544 1193306 1215421 1227711 1232837 1244010 1261416 1274859 1282865 1294011 1311658 1329336 1341909
11352 1341909 1352668 1366793 1383066 1395842 1403373 1409620 1415649 1413780 1397764 1377292 1371259 1383510
11340 1383510 1397736 1403170 1410926 1432336 1455315 1461809 1458800 1468151 1490356 1504708 1506386 1515650 1542402
11327 1542402 1567497 1572812 1568095 1571559 1581836 1587119 1587399 1589362 1591865 1595233 1613116 1653868 1698497
11314 1698497 1719091 1714426 1707036 1709610 1716533 1726461 1748542 1781982 1811182 1828555 1844159 1865352
11302A865352J9276J2599J6756K9274K9913J4386M310J5587L4885L8852K5158
11291B106348J2577J4634K3376K2032Q644q01M388J2642P976k176L948K6368L9343
11278B279299K9394J4011J1683J6704J8606K2785L2155L1555J4948O392K4400
11267B501932M4867L4334N194j434K0668L7170K9355J6292J6655K4260K8928L1100
11255B789321K9891K4073K5825M3823N6242L7772J0046J8912N9236P5316M7634
11244C218091K2438L2784M6857K9007R99j79J7312K6852L2645M5623M5211J6026
11232C533666p652J1558M8180N0611K3396J3696L0094L6362K0939J2854K5590
11221C799294L8335L9158L9412M0302K9747J6346K2729M2628M7835L8176L8951
$$ plain form
11302 1865352 1884628 1897227 1913983 1943257 1973170 1987556 1991866 2007453 2042338 2081190 2106348
11291 2106348 2118925 2133559 2156935 2178967 2187611 2186810 2191198 2203840 2211816 2209640 2213588 2239956 2279299
11278 2279299 2308693 2322704 2334387 2351091 2369697 2392482 2424637 2456192 2471140 2477532 2501932
11267 2501932 2546799 2581133 2586327 2584893 2605561 2642731 2672086 2688378 2705033 2729293 2758221 2789321
11255 2789321 2819212 2843285 2869110 2912933 2969175 3006947 3016993 3035905 3095141 3170457 3218091
11244 3218091 3240529 3273313 3320170 3349177 3350176 3349997 3367309 3394161 3426806 3472429 3517640 3533666
11232 3533666 3526014 3537572 3585752 3636363 3659759 3673455 3703549 3739911 3760850 3773704 3799294
11221 3799294 3837629 3876787 3916199 3956501 3986248 4002594 4025323 4067951 4115786 4153962 4192913
11210D192913M9862M7016L5740M5987P1360P2337M9098M8103Q0425R8171P6190
11199D867202N4035O5081Q3729Q0638P5228R1005J07201R8635Q1434P8368P9191
11188E761747P2997P6810R4225R2680O3341N3227Q9853J25518J12576Q4076R4611
11177F721661J26314J26711J02804R9921J15693J13782J01603J15165J42746J42812
11167G909212J26415J41692J83136J97714J80403J81426K12993K30668K20321
11158I583980K23715K57981K85283K87027K97261L34489L66431L72211L78347
11149A2386725M03990M28389M39018M52988M65526M39844L76224L25576L01714
11140A6019994K48795J38226L1743l833J2692K5642L0759N6980J01212J37909
$$ plain form
11210 4192913 4242775 4289791 4325531 4371518 4442878 4515215 4564313 4612416 4692841 4791012 4867202
11199 4867202 4921237 4986318 5070047 5150685 5225913 5316918 5424119 5522754 5604188 5682556 5761747
11188 5761747 5834744 5911554 6005779 6098459 6161800 6215027 6304880 6430398 6542974 6627050 6721661
11177 6721661 6847975 6974686 7077490 7177411 7293104 7406886 7508489 7623654 7766400 7909212
11167 7909212 8035627 8177319 8360455 8558169 8738572 8919998 9132991 9363659 9583980
11158 9583980 9807695 10065676 10350959 10637986 10935247 11269736 11636167 12008378 12386725
11149 12386725 12790715 13219104 13658122 14111110 14576636 15016480 15392704 15718280 16019994
11140 16019994 16268789 16407015 16438758 16434925 16447617 16473259 16504018 16560998 16662210 16800119
11130A6800119J63620J86156J98947K04212K27770K75947L15577L29578L48428
11121A9050354L92429M32483M46490M61630M97713N23608N17735N15555N44969
11112B3382966N71973N67124N66931O07218O55165O74827O98533P58101Q06779
11103B9289617P93807P58756P62101P78868P58497P35466P73688Q49214Q99187
11094C6399201R42181J033850J147022J219445J278896J389505J515916J584707
11086D6510723J640609J780486J964571K071605K120644K243030K439739K579456
11078F3350863K654136K811947L098075L398655L704849M185253M900790N694264
11070I3798832O477983P372354Q417891R435672J0373674J1493039J2917845J4249014
$$ plain form
11130 16800119 16963739 17149895 17348842 17553054 17780824 18056771 18372348 18701926 19050354
11121 19050354 19442783 19875266 20321756 20783386 21281099 21804707 22322442 22837997 23382966
11112 23382966 23954939 24522063 25088994 25696212 26351377 27026204 27724737 28482838 29289617
11103 29289617 30083424 30842180 31604281 32383149 33141646 33877112 34650800 35500014 36399201
11094 36399201 37341382 38375232 39522254 40741699 42020595 43410100 44926016 46510723
11086 46510723 48151332 49931818 51896389 53967994 56088638 58331668 60771407 63350863
11078 63350863 66004999 68816946 71915021 75313676 79018525 83203778 88104568 93798832
11070 93798832 100276815 107649169 116067060 125502732 135876406 147369445 160287290 174536304
11062A74536304J4974990J5084032J4908269J4509787J3602539J1952697R437725
11055B69006343N835372J097892m143020q880943j2651435j5627999j7688518
11048B16947692j8080412j6471616j3815520j1546365j0166186r174501q165615
11041A29527477p314645o782298o306448n633450m909575m372155l970036l547886
11033H6690984l155793k912691k740859k483630k166446j924701j763398j585333
11025F7958133j390633j265663j215061j163283j093441j046873j015050r62755
11017E8805374r30495r83143j076241j101958j057084j037117j063496j045990
11009E0509850r36156p98783o97318o13531n21766m49951m19725m03703l86491
$$ plain form
11062 174536304 189511294 204595326 219503595 234013382 247615921 259568618 269006343
11055 269006343 274841715 275939607 271796587 262915644 250264209 234636210 216947692
11048 216947692 198867280 182395664 168580144 157033779 146867593 137693092 129527477
11041 129527477 122212832 115430534 109124086 103490636 98581061 94208906 90238870 86690984
11033 86690984 83535191 80622500 77881641 75398011 73231565 71306864 69543466 67958133
11025 67958133 66567500 65301837 64086776 62923493 61830052 60783179 59768129 58805374
11017 58805374 57874879 56891736 55815495 54713537 53656453 52619336 51555840 50509850
11009 50509850 49573694 48774911 48077593 47464062 46942296 46492345 46072620 45668917 45282426
11000D5282426l98541m48148m86337m80492m58888m41710l94553k98720k04004
10991D1671033j55547j23766o5545l748J8203J7724M1619Q6083J13252J22508
10981D1721816J44355J83393K22422K62536L08043L35957L31939L27865L49559
10972D4187885L61566L26461K82689K90050L32150L56511L80803M63539N90928
10963D7572582O95836P75501Q81463J001851J075079J122520J234797J407613
10955E5767242J529509J567234J622319J756056J904337K027910K194926K436420
10947G0805953K680607K930771L339774L976720M683941N319020N972168O766725
10939A06475679P630606Q496857R528211J0799395J1891564J2235632J1873568
$$ plain form
11000 45282426 44883885 44435737 43949400 43468908 43010020 42568310 42173757 41875037 41671033
10991 41671033 41515486 41391720 41326175 41322427 41340630 41358354 41399973 41486056 41599308 41721816
10981 41721816 41866171 42049564 42271986 42534522 42842565 43178522 43510461 43838326 44187885
10972 44187885 44549451 44875912 45158601 45448651 45780801 46137312 46518115 46981654 47572582
10963 47572582 48268418 49043919 49925382 50927233 52002312 53124832 54359629 55767242
10955 55767242 57296751 58863985 60486304 62242360 64146697 66174607 68369533 70805953
10947 70805953 73486560 76417331 79757105 83733825 88417766 93736786 99708954 106475679
10939 106475679 114106285 122603142 132131353 142930748 154822312 167057944 178931512
10932A78931512J1475260J1475650J1484719J0644838Q328454M518893o0171m117425
10924B32681730o657383q003705r519225j1894059j4105021j4603175j3221946
10917A54677216j1248782r768603q709057p613227o567341n924022n612229n251032
10909I3982923m719294m191812l749324l317739k919571k666411k521188k324875
10901F7572709k054715j839434j721177j603112j445052j328565j296471j279856
10893E5004327j221287j149345j103960j091051j122147j197092j244529j187109
10885D5687807j071555j024475j067883j088734j010913q88071p94741p28261
10877C8013174o62435o11150n90660n86356n92886o24232o59258o48339o01055
$$ plain form
10932 178931512 190406772 201882422 213367141 224011979 232340433 236859326 236799155 232681730
10924 232681730 226024347 218020642 208501417 196607358 182502337 167899162 154677216
10917 154677216 143428434 133659831 124950774 117337547 110770206 104846184 99233955 93982923
10909 93982923 89263629 85071817 81322493 78004754 75085183 72418772 69897584 67572709
10901 67572709 65517994 63678560 61957383 60354271 58909219 57580654 56284183 55004327
10893 55004327 53783040 52633695 51529735 50438684 49316537 48119445 46874916 45687807
10885 45687807 44616252 43591777 42523894 41435160 40424247 39536176 38741435 38013174
10877 38013174 37350739 36739589 36148929 35562573 34969687 34345455 33686197 33037858 32436803
10868C2436803n91756o42908o77313o30294n41869m87213m73737m60716m34088
10859B7496909m09337l94101l90140m02418m15398l95936l47264l19007l34851
10850B4088457l55141l43004l19503l15539l17734l07515l08425l42196l76211
10841B1103189l70444l45271l45655l63744l55903l18197k86159k70874k52182
10832A8194760k29736k25125k32398k19709j87499j75119j95610k09968j88279
10823A6331317j57536j58455j81994j84242j53091j25832j35253j64037j70794
10814A4900083j48747j32253j42045j53006j36742j11687j15563j42087j49672
10805A3668281j30749j22683j39697j45507j17058q7525r2086j11752j10717r5158
$$ plain form
10868 32436803 31845047 31202139 30524826 29894532 29352663 28865450 28391713 27930997 27496909
10859 27496909 27087572 26693471 26303331 25900913 25485515 25089579 24742315 24423308 24088457
10850 24088457 23733316 23390312 23070809 22755270 22437536 22130021 21821596 21479400 21103189
10841 21103189 20732745 20387474 20041819 19678075 19322172 19003975 18717816 18446942 18194760
10832 18194760 17965024 17739899 17507501 17287792 17100293 16925174 16729564 16519596 16331317
10823 16331317 16173781 16015326 15833332 15649090 15495999 15370167 15234914 15070877 14900083
10814 14900083 14751336 14619083 14477038 14324032 14187290 14075603 13960040 13817953 13668281
10805 13668281 13537532 13414849 13275152 13129645 13012587 12925062 12832976 12721224 12610507 12515349
10795A2515349r1694r6110q9446q1888r3374j08658r9305p6279p3032q7407q8904
10784A1529252p6016p6330r2273r6356q2083p2375p3177o5136m7664m5249o1677
10773A0740916p3068p4817q7042j02726q5331l8451k1424o2170j05642r2502m6189
10762I951554l0226n1505o3998n0449m1142n3565o6012o0802n1554n2576n3795
10751I375930m3412l0901l0167l7422m1288m1480m3324m3855l7182k7299k3357
10740H976243k6147k9834l3869m1150m5093l3083q434M913p628k7208k6245j1222
10728H691243j4671m1205n2347k2969J4387J1260k7986n3969m1461j4859l745
10717H443678p952j5188k2054k4181j2087P728J0692j0661l0209k3784k158R052
$$ plain form
10795 12515349 12423655 12327545 12238099 12156211 12062837 11954179 11854874 11778595 11705563 11618156 11529252
10784 11529252 11453236 11376906 11284633 11188277 11106194 11033819 10960642 10895506 10847842 10802593 10740916
10773 10740916 10667848 10593031 10505989 10403263 10317932 10279481 10258057 10195887 10090245 9997743 9951554
10762 9951554 9921328 9869823 9805825 9755376 9714234 9660669 9594657 9533855 9482301 9429725 9375930
10751 9375930 9332518 9301617 9271450 9234028 9192740 9151260 9107936 9064081 9026899 8999600 8976243
10740 8976243 8950096 8920262 8886393 8845243 8800150 8767067 8758633 8763546 8755918 8728710 8702465 8691243
10728 8691243 8676572 8635367 8583020 8560051 8574438 8585698 8557712 8503743 8462282 8447423 8443678
10717 8443678 8435726 8420538 8398484 8374303 8362216 8369944 8380636 8369975 8339766 8315982 8313824 8322876
10705H322876M611m094j1537j6321j1282K958O825j3033l7114l5428r769J0240
10693H208932R221p5l783l084n3R246K0129J8281L352m666N248J6437J1218J229
10679H291632Q935K8031L0375J2864O696K7057M3015K3941o207O51M1292O1348
10667H569630L6584P938J5287L9148M1320K7498K6667L5129K9778J8945K8479
10656H876403M8456M7234L2151L8608N9970N2634J9760K0259P0518J05706P7851
10645I449550L1062K9123N9964O9955N2696M2250M6951M9569N2471O7129P7112
10634A0027832O4343N2551O9839Q9426P0207L7649N1448J01034J13201P0497M1417
10623A0789444P0020J10647J08940Q2922P7097Q7681Q4882P2216P3249Q4034Q3305
$$ plain form
10705 8322876 8327487 8323393 8311856 8295535 8284253 8287211 8294036 8281003 8243889 8208461 8198692 8208932
10693 8208932 8218153 8218078 8214295 8211211 8211158 8220404 8240533 8258814 8262166 8257500 8262748 8279185 8290403 8291632
10679 8291632 8300567 8328598 8358973 8371837 8378533 8405590 8448605 8472546 8466339 8466990 8508282 8569630
10667 8569630 8606214 8614152 8629439 8668587 8709907 8737405 8764072 8799201 8828979 8847924 8876403
10656 8876403 8924859 8972093 9004244 9042852 9102822 9155456 9175216 9195475 9265993 9371699 9449550
10645 9449550 9480612 9509735 9569699 9639654 9692350 9734600 9781551 9831120 9883591 9950720 10027832
10634 10027832 10092175 10144726 10214565 10303991 10374198 10411847 10463295 10564329 10677530 10748027 10789444
10623 10789444 10859464 10970111 11079051 11161973 11239070 11326751 11411633 11483849 11557098 11641132 11724437
10612A1724437P3136P2124Q1330Q7683Q8759Q8712Q3580P3262P1973Q5272R4453
10601A2624721Q5123P1597P0992P5308P3864P8945R8547J07326Q2367M9761N2807
10590A3471358Q3922R3174O4295L8396N1253Q4210R6660Q0722O0744N3487N1578
10579A4229799M3808L5004L8242N2869O0825N0695L6869M0408N4939N2535K6550
10568A4722543M671Q873K5283K9567K1176J2986O061k296j574J4868K7829J4919
10556A4884906j1787j8139L920K5660K2520N561L982K7568N4200N4242K6671M107
10544A5083411J1173K7090J3970k3263m2940l7500n1699j09001j66722j79349
10534A4525170j64576j62555j67437j53207j36296j49742j75279j66964j31189
$$ plain form
10612 11724437 11797573 11869697 11951027 12038710 12127469 12216181 12299761 12373023 12444996 12530268 12624721
10601 12624721 12709844 12781441 12852433 12927741 13001605 13080550 13179097 13286423 13368790 13418551 13471358
10590 13471358 13555280 13648454 13712749 13751145 13802398 13886608 13983268 14063990 14124734 14178221 14229799
10579 14229799 14273607 14308611 14346853 14399722 14460547 14511242 14548111 14588519 14643458 14695993 14722543
10568 14722543 14727214 14736087 14761370 14790937 14812113 14825099 14831160 14828864 14827290 14842158 14869987 14884906
10556 14884906 14873119 14854980 14858900 14884560 14907080 14912641 14916623 14944191 14998391 15052633 15079304 15083411
10544 15083411 15094584 15121674 15135644 15112381 15069441 15031941 14980242 14871241 14704519 14525170
10534 14525170 14360594 14198039 14030602 13877395 13741099 13591357 13416078 13249114 13117925
10525A3117925j16464j28072j23041r4433q8536j21338j46150j30568j04335r9746
10515A1965242j01310q9988q4899j01116j12618r8973q6378r9547j13420r8993
10505A0978000p9130q7788j07160j00625q0669q5095j05725j02181p5519o6896
10495A0087212q5005r3423p6510o3820p5560r0997q8933p9905p8811p8988p2841
10484I202419p0160p7104q0842p2420o4181o7924p3706o6943n2706m7413n5065
10473H473955o3901o2593n3343n0035o1625p5717o9702m5671l6301n8900q3605
10462G812562p4895m6775l9520n4137n5843l9089l7307n9301o8713m7815l2181
10451G256986m9904p0111n4134k3713k8300o5030q3213o1864l4491l2310m4339
$$ plain form
10525 13117925 13001461 12873389 12750348 12655915 12567379 12446041 12299891 12169323 12064988 11965242
10515 11965242 11863932 11773944 11689045 11587929 11475311 11376338 11289960 11190413 11076993 10978000
10505 10978000 10898870 10811082 10703922 10603297 10522628 10437533 10331808 10229627 10154108 10087212
10495 10087212 10002207 9908784 9832274 9768454 9692894 9601897 9512964 9433059 9354248 9275260 9202419
10484 9202419 9132259 9055155 8974313 8901893 8837712 8769788 8696082 8629139 8576433 8529020 8473955
10473 8473955 8410054 8347461 8294118 8244083 8182458 8106741 8037039 7991368 7955067 7896167 7812562
10462 7812562 7737667 7690892 7651372 7597235 7541392 7502303 7464996 7405695 7336982 7289167 7256986
10451 7256986 7207082 7136971 7082837 7059124 7030824 6965794 6882581 6820717 6786226 6753916 6709577
10440F709577m6395l7310l0044k9257l2521l8191m1621l6789k8330k7570l1644
10429F329905k4468n993L46j6598l1994j8850Q385J1988j1537k2757L941M2068
10417F264436N0209K8734J4227K5850M4319M5882L1998J5230m101l1111n8832
10406F426841p4360p6852p7128q3777r8084j15030j21151j03176p0926n7287p7129
10395E471941r9563q6280m8462l4242n9947q7177p8146m4855k5883l5544n5677
10384D816165o4391n5168l5737k1677k5079m0313m8007l9714k8836l0180l9726
10373D387337m3079l4646k1092j4252k4065m6589n7631l6556o29P754k1901m9797
10361D044854m1828j7784j6894l6430m0134j8117j185j2408l5055l9398k0914
$$ plain form
10440 6709577 6663182 6625872 6595828 6566571 6534050 6495859 6454238 6417449 6389119 6361549 6329905
10429 6329905 6305437 6299444 6299790 6283192 6251198 6232348 6240733 6252721 6241184 6218427 6222368 6264436
10417 6264436 6314645 6343379 6357606 6383456 6427775 6473657 6505655 6520885 6516784 6485673 6426841
10406 6426841 6352481 6275629 6198501 6114724 6016640 5901610 5780459 5677283 5606357 5549070 5471941
10395 5471941 5372378 5286098 5237636 5203394 5143447 5056270 4978124 4933269 4907386 4871842 4816165
10384 4816165 4751774 4696606 4660869 4639192 4614113 4573800 4525793 4486079 4457243 4427063 4387337
10373 4387337 4344258 4309612 4288520 4274268 4250203 4203614 4145983 4109427 4108798 4116552 4094651 4044854
10361 4044854 4003026 3985242 3968348 3931918 3891784 3873667 3872482 3860074 3825019 3785621 3764707
10350C764707m56J738j4861l1180k7177o663K502j6455m2837m4089k0569l205
10338C561455q843k1465k1503j2448r833j9331l4002m2274l4749j4114J049m122
10326C339820j7990j6924k590j276k0320l1656j4133J1022J0021j4078k8604k0417
10314C192875j0146j5462k5113k0348n244n82j4578l2856l7066k5129j0956q262
10302B987133j6675k3148j7311n004k328j4097k4868j9637q074j2957l3357l9183
10290B770494j4005J4782J0408j9857l3778j4905N819k225k6858l5160j8945J206
10278B636976O305l184j4036j4107m396p14j3521k7317j8685M726R936j0974k7802
10265B523207k1237r951j0552q464N325P590j2782k3172k472J1496j6675m8583
$$ plain form
10350 3764707 3764251 3765989 3751128 3719948 3692771 3686108 3688610 3672155 3629318 3585229 3564660 3561455
10338 3561455 3552612 3531147 3509644 3497196 3487363 3468032 3434030 3391756 3357007 3342893 3343942 3339820
10326 3339820 3321830 3304906 3302316 3301040 3280720 3249064 3234931 3245953 3255974 3241896 3213292 3192875
10314 3192875 3182729 3167267 3142154 3121806 3116562 3115980 3101402 3068546 3031480 3006351 2995395 2987133
10302 2987133 2970458 2947310 2929999 2924995 2922667 2908570 2883702 2864065 2855991 2843034 2809677 2770494
10290 2770494 2756489 2771271 2781679 2761822 2728044 2713139 2718958 2716733 2689875 2654715 2635770 2636976
10278 2636976 2643281 2640097 2626061 2611954 2607558 2606844 2593323 2566006 2547321 2552047 2561983 2551009 2523207
10265 2523207 2501970 2492019 2481467 2473003 2478328 2485918 2473136 2449964 2447492 2458988 2442313 2393730
10253B393730k8832J6447J6809k4312l6193k944J3484j3429l0801o209J5331k016
10241B311065k0524m410J1585r553l3314j5661J5241J0651j1827p240J0655N77
10229B257245k1375r832K0237J5365j9259k7579j671R041j0655k0467m024N776
10217B192802n137r395L99l491k0759j4773J2497J0353k8971m3690m586K9813
10205B115062Q443k9835k7273j633l227k4714k4362n584m091j8887k0641j1838
10193A951420j7443k8398j3961J6812K2719k631k3384k1103j3411j1723p383l344
10181A848170j4209k8997j8069J4260K6706K745k4325k3271n963J188m067q929
10169A765239q799m416M405J0033J363j4635j6933l283M827j870o171K173O489
$$ plain form
10253 2393730 2364898 2381345 2398154 2373842 2337649 2334705 2348189 2334760 2303959 2297750 2313081 2311065
10241 2311065 2290541 2286131 2297716 2288163 2254849 2239188 2254429 2265080 2253253 2246013 2256668 2257245
10229 2257245 2235870 2226038 2246275 2261640 2242381 2214802 2213131 2222172 2211517 2191050 2187026 2192802
10217 2192802 2187665 2178270 2178669 2175178 2154419 2139646 2152143 2162496 2133525 2089835 2085249 2115062
10205 2115062 2123505 2093670 2066397 2064764 2061537 2036823 2012461 2006877 2002786 1983899 1963258 1951420
10193 1951420 1933977 1905579 1891618 1908430 1931149 1928518 1905134 1884031 1870620 1858897 1851514 1848170
10181 1848170 1833961 1804964 1786895 1801155 1827861 1830606 1806281 1783010 1777047 1778235 1774168 1765239
10169 1765239 1756440 1752024 1756429 1766462 1767825 1753190 1736257 1732974 1737801 1735931 1729760 1731933 1738422
10156A738422o049j8412j0867N139N067q926j1737N103J9916J1365j1969k1663
10144A695389n049J8020J9548j17j3396n206O932L712m889j02J0804P655n865
10131A727436r176j619l37n578k009P006K814r649n410J3070J4059p336j5384
10118A707887N992K2913P396j6863j6342K9O176N593J3581J8516K819j6568j0627
10105A730502J2354J9825O876l334k382j611j211P570J4414K523j4239o621J9030
10092A783696K6811J0196M82R313R596j0372j9857J444K3933J4794q117p251J3614
10079A848282K0594P854K037J1837J3929k993j5269k769J6231J2680o884r898
10067A895631J0740K4169R497j0065k803J9820J9354p402k0204J466K4560J4520
$$ plain form
10156 1738422 1732373 1713961 1703094 1708233 1713300 1704374 1692637 1697740 1717656 1729021 1717052 1695389
10144 1695389 1690340 1708360 1727908 1727791 1714395 1709189 1716121 1719833 1714944 1714842 1725646 1733301 1727436
10131 1727436 1718260 1716641 1716304 1710726 1708717 1715723 1718537 1708888 1703478 1716548 1730607 1723271 1707887
10118 1707887 1713879 1736792 1744188 1727325 1710983 1711012 1717188 1722781 1736362 1754878 1757697 1741129 1730502
10105 1730502 1742856 1762681 1769557 1766223 1763841 1762230 1761019 1768589 1783003 1785526 1771287 1764666 1783696
10092 1783696 1810507 1820703 1821185 1830498 1840094 1829722 1809865 1811309 1835242 1850036 1841919 1834668 1848282
10079 1848282 1868876 1876730 1878767 1890604 1904533 1901540 1886271 1883502 1899733 1912413 1905529 1895631
10067 1895631 1906371 1930540 1940037 1929972 1927169 1946989 1966343 1958941 1938737 1940203 1964763 1979283
10055A979283j0901j2700Q275K0306J5012J0270P661p710k5810j6568J6497L2197
10043B015812J4532l290M122J5669P166n786k93J1201O120o339m163P493R312
10030B071556K617n58l509r722l702J8137K2344j1980m2033j4969M2543N2856
10018B123580L787l1834p735L0934K5857p866j8064K411J9360J8573J6159J9032
10006B194194J5642L674l615R66J1757K2300K7038J7995k915j6291p555J1125
9994B274315J7980J1345N013M365O073J1287J9009J6753n71j3140j813J9032K1745
9981B391393R566Q417J9740J8017k108j3207J85J7324J6460N113j747o730j3535
9968B448888r565J1806L0816K6560P571m208n065l408K274J4040J6980J85j5020
$$ plain form
10055 1979283 1968382 1955682 1963957 1984263 1999275 2009545 2017206 2009496 1983686 1967118 1983615 2015812
10043 2015812 2030344 2027054 2031176 2046845 2054011 2048225 2047932 2059133 2065253 2058914 2054751 2062244 2071556
10030 2071556 2074173 2073615 2070106 2060384 2056682 2074819 2097163 2085183 2043150 2028181 2070724 2123580
10018 2123580 2127367 2095533 2087798 2118732 2144589 2136723 2118659 2121070 2140430 2159003 2175162 2194194
10006 2194194 2209836 2213510 2209895 2210861 2222618 2244918 2271956 2289951 2287036 2270745 2263190 2274315
9994 2274315 2292295 2303640 2308653 2313018 2319091 2330378 2349387 2366140 2365569 2352429 2350616 2369648 2391393
9981 2391393 2400959 2409376 2429116 2447133 2445025 2431818 2432003 2449327 2465787 2470900 2469153 2462423 2448888
9968 2448888 2439323 2451129 2481945 2508505 2516076 2511868 2506803 2503395 2505669 2519709 2536689 2536874 2521854
9955B521854l36L0754L4733J785k6628j5497J8234L5394K6193J0967N860R883
9943B653196J7287K3143K0679Q638j054M163J9113K6386J9264Q867P902J5953
9931B823537K2749K0519J1325M576O947J4341J7508J5475J5773J9391J6742N236
9919B994119j070Q786K3116K3281J2295R662K0578L0179K9726K7860K9887K6567
9907C234986J4637R371K0676L2904K8664J9595K8062M6417M4914K1113R072K8075
9895C538486N1890M9622L2580L1994M6963M9355L4448K9852M8206O4727N6943
9884D035066L9207L7146M8840N4902N1965N1334N4509N4595N5344O4543P3258
9873D620709O6521N2057N1884O5552P0187O0601N8615P3416Q4081P6730O8766
$$ plain form
9955 2521854 2521518 2552272 2587005 2588790 2562162 2546665 2564899 2600293 2626486 2637453 2643313 2653196
9943 2653196 2670483 2693626 2714305 2722943 2721889 2726052 2745165 2771551 2790815 2799682 2807584 2823537
9931 2823537 2846286 2866805 2878130 2882706 2889653 2903994 2921502 2936977 2952750 2972141 2988883 2994119
9919 2994119 2993049 3001835 3024951 3048232 3060527 3070189 3090767 3120946 3150672 3178532 3208419 3234986
9907 3234986 3249623 3258994 3279670 3312574 3341238 3360833 3388895 3435312 3480226 3501339 3510411 3538486
9895 3538486 3590376 3639998 3672578 3704572 3751535 3800890 3835338 3865190 3913396 3978123 4035066
9884 4035066 4074273 4111419 4160259 4215161 4267126 4318460 4372969 4427564 4482908 4547451 4620709
9873 4620709 4687230 4739287 4791171 4856723 4926910 4987511 5046126 5119542 5203623 5280353 5349119
9862E349119P5174P9540O6242N5880P3702J01607J01657P7199O7922Q5230R5476
9851F228748P7243N6270O4042R1167J05173R5312P8303P2175Q1008R6337J02043
9840G147821Q7749O5013N7322O8227P7220P4404P5703Q9877R6284P7958N4646
9829G972224N4328O8821P0100N8669N9176P2829P3257N4191M3542N6952P0831
9818H654920O1681M4276M5249N9539O1943M9259M1092M3999M3516L3169K5112
9807I163755K5446K2869J2965J1328K5402L2748J2320j5460j1327K2584L9770
9796I342400J6176j4061j1548R167P595j5346k1174O45J6469N216j1622j3819
9784I310098j6298l2947m2217k4085l511j5300m4857m9002k4973j1149k1342k7459
$$ plain form
9862 5349119 5424293 5503833 5570075 5625955 5699657 5801264 5902921 5980120 6048042 6133272 6228748
9851 6228748 6305991 6362261 6426303 6517470 6622643 6717955 6796258 6868433 6949441 7045778 7147821
9840 7147821 7235570 7300583 7357905 7426132 7503352 7577756 7653459 7743336 7839620 7917578 7972224
9829 7972224 8026552 8095373 8165473 8224142 8283318 8356147 8429404 8483595 8527137 8584089 8654920
9818 8654920 8716601 8760877 8806126 8865665 8927608 8976867 9017959 9061958 9105474 9138643 9163755
9807 9163755 9189201 9212070 9225035 9236363 9261765 9294513 9306833 9291373 9280046 9302630 9342400
9796 9342400 9358576 9344515 9332967 9342134 9349729 9334383 9313209 9313854 9330323 9335539 9323917 9310098
9784 9310098 9293800 9260853 9218636 9194551 9191040 9175740 9130883 9081881 9056908 9045759 9024417 8996958
9772H996958j5585j1263k9601m2526k4468K314J522k1273l1460j9738q830j1199
9760H784851j2656k031Q798N020p635j1832l422L528l398j7105j9419o284N960
9747H724375N447L091J1673J8842M835j9606k3254l077J0200K669j934J2686K5046
9734H770993J4965Q17O307J7132P591j0886q543R733J2695l717j3398q381q026
9721H787282j6867j4438L788J3440K360r799q270o630j5210j7186M80J8196J1836
9708H748982r829k0977j6357q985l182N504J2007O425o874j3285q335K14O213
9695H691521Q739P704P502J7280L5463M3961L3040K2252L7107P0918R1280Q3926
9683I150693O9504P2680R2618J12780J26536J40935J61324J83483K01593K16935
$$ plain form
9772 8996958 8981373 8970110 8940509 8897983 8873515 8875829 8877351 8856078 8824618 8804880 8796050 8784851
9760 8784851 8772195 8770164 8778962 8783982 8776347 8764515 8761093 8764621 8761223 8744118 8724699 8718415 8724375
9747 8724375 8729822 8732913 8744586 8763428 8768263 8748657 8725403 8722326 8732526 8735195 8733261 8745947 8770993
9734 8770993 8785958 8786775 8793082 8810214 8817805 8806919 8798376 8808109 8820804 8817087 8803689 8795308 8787282
9721 8787282 8770415 8755977 8759765 8773205 8775565 8765766 8757496 8750866 8735656 8718470 8718950 8737146 8748982
9708 8748982 8739153 8718176 8701819 8692834 8689652 8695156 8707163 8713588 8706714 8693429 8685094 8685308 8691521
9695 8691521 8700260 8707964 8715466 8732746 8768209 8812170 8845210 8867462 8904569 8975487 9066767 9150693
9683 9150693 9220197 9292877 9385495 9498275 9624811 9765746 9927070 10110553 10312146 10529081
9673A0529081K35042K57521K81976L09377L43634L80383M05491M13170M16827
9664A3572502M29568M41812M34560M07969L76548L41159K90738K30076J77310
9655A6702242J31072P1261q17n6602q5847j12231j47330j67833j62269j59593
9645A6012053j77882j84672j52892j19943j34829j74086j76253j44738j43771
9636A4602987j91592k31699k27598k17577k43922k86180l05315l07480l19232
9627A2272392l34716l32458l18895l13004l07890k87375k64265k62765k74266
9618I576758k67635k36476k03387j83039j71341j65940j68269j68563j55027j34217
9608G722864j19863j09930r8808r8763j17617j27907r8451n0697l8556o9052q9244
$$ plain form
9673 10529081 10764123 11021644 11303620 11612997 11956631 12337014 12742505 13155675 13572502
9664 13572502 14002070 14443882 14878442 15286411 15662959 16004118 16294856 16524932 16702242
9655 16702242 16833314 16904575 16903758 16847156 16761309 16649078 16501748 16333915 16171646 16012053
9645 16012053 15834171 15649499 15496607 15376664 15241835 15067749 14891496 14746758 14602987
9636 14602987 14411395 14179696 13952098 13734521 13490599 13204419 12899104 12591624 12272392
9627 12272392 11937676 11605218 11286323 10973319 10665429 10378054 10113789 9851024 9576758
9618 9576758 9309123 9072647 8869260 8686221 8514880 8348940 8180671 8012108 7857081 7722864
9608 7722864 7603001 7493071 7394263 7295500 7177883 7049976 6951525 6900828 6862272 6793220 6703976
9597F703976o4894k7540k0396l5925l8760k2655r464p703m808O150J7833K4130
9585F519944K5602K2801J8283J9643K7989L0949J9884M761j936n808j8575l4948
9573F628589m0440l5912l5172m1956m7294m6755m3239l6361k6722k5742m0417
9562F208579n2781l9606j1401l341k3668m1417l4852k0813k0479k7009k9594l9931
9550E863687o4909p9202o2292m1600n4633q3179p7114l8521k3354n0147o8241
9539E220495m2844j4106k9100o2632o0646k8859j6832l3640m3024l5185l8956
9528D814671n7505n4466k1430k449k4589n3121m8279k4614j7497k5879k7892k5171
9516D431779l1437l8548l2182k3311k8001l3893k3551j3086k6795m8770m4209
$$ plain form
9597 6703976 6639082 6611542 6591146 6555221 6516461 6493806 6484342 6476639 6471831 6477981 6495814 6519944
9585 6519944 6545546 6568347 6586630 6606273 6634262 6665211 6685095 6689856 6687920 6682112 6663537 6628589
9573 6628589 6588149 6552237 6517065 6475109 6427815 6381060 6337821 6301460 6274738 6248996 6208579
9562 6208579 6155798 6116192 6104791 6101450 6077782 6036365 6001513 5980700 5960221 5933212 5903618 5863687
9550 5863687 5798778 5719576 5657284 5615684 5561051 5477872 5400758 5362237 5338883 5288736 5220495
9539 5220495 5177651 5163545 5134445 5071813 5011167 4982308 4965476 4931836 4888812 4853627 4814671
9528 4814671 4757166 4702700 4681270 4678821 4654232 4601111 4552832 4528218 4510721 4484842 4456950 4431779
9516 4431779 4400342 4361794 4329612 4306301 4278300 4244407 4220856 4207770 4180975 4132205 4087996
9505D087996j8618r562k4689l4630k7413k3551l2048l5526k7581k3990k7634k1823
9493C780931p110m290j2376p234Q517L399k1091k1356J2541K9669J259k5911o215
9480C730733K6911J9316j0256m737L1559M2639J7059P98J4023K4620J5048J1472
9468C919185K7509L6244K2475J2078K1992K7576J1324J358K3784N2659M9994K8242
9456D234420K7595M8833N5560L6608K1916L2178N0527N6047N5121O2024P0133
9445D750962O4024M9113M7543O5166Q0992P7232O6504P4006R8416J11044R8264
9434E583266Q3368R2054J14704J25234J23922J32880J54738J67126J61155J56085
9424F894532J67190J84115J91879J91782J91290J93095K02575K24682K45454K41273
$$ plain form
9505 4087996 4069378 4059816 4035127 4000497 3973084 3949533 3917485 3881959 3854378 3830388 3802754 3780931
9493 3780931 3773821 3769531 3757155 3749921 3758438 3761837 3740746 3719390 3731931 3761600 3762859 3736948 3730733
9480 3730733 3757644 3776960 3766704 3761967 3793526 3836165 3853224 3854022 3868045 3892665 3907713 3919185
9468 3919185 3946694 3982938 4005413 4017491 4039483 4067059 4078383 4079741 4103525 4156184 4206178 4234420
9456 4234420 4262015 4310848 4366408 4403016 4424932 4457110 4507637 4563684 4618805 4680829 4750962
9445 4750962 4814986 4864099 4911642 4976808 5057800 5135032 5201536 5275542 5373958 5485002 5583266
9434 5583266 5666634 5758688 5873392 5998626 6122548 6255428 6410166 6577292 6738447 6894532
9424 6894532 7061722 7245837 7437716 7629498 7820788 8013883 8216458 8441140 8686594 8927867
9414H927867K16606K05295K20846K35316K26791K16750K32870K62193K75485K77578
9404A1297597K96081L33466L67347L90649M16306M46630M72255M99219N42736
9395A5062286N92447O17586O12268O03981O08762O07892N81167N35733M86002
9386B0308124M27720L51105K64330J86519J25816P6271K9420j8425o3564r5061
9376B1592255j04699r7817q6307p3525n7617m4826m2924m5093l9583l2967m2462
9365B0924435o7295r2308j19163j64825k25967k77815l17091l71079m47510n09857
9355A8331525n27994n24490n39411n70809n84546n69137n45347n26333n01413
9346A3442045m63143m24497m00209l86675l68006l34405k91857k57166k41020
$$ plain form
9414 8927867 9144473 9349768 9570614 9805930 10032721 10249471 10482341 10744534 11020019 11297597
9404 11297597 11593678 11927144 12294491 12685140 13101446 13548076 14020331 14519550 15062286
9395 15062286 15654733 16272319 16884587 17488568 18097330 18705222 19286389 19822122 20308124
9386 20308124 20735844 21086949 21351279 21537798 21663614 21739885 21769305 21750880 21687316 21592255
9376 21592255 21487556 21389739 21303432 21229907 21172290 21127464 21084540 21039447 20999864 20966897 20924435
9365 20924435 20857140 20764832 20645669 20480844 20254877 19977062 19659971 19288892 18841382 18331525
9355 18331525 17803531 17279041 16739630 16168821 15584275 15015138 14469791 13943458 13442045
9346 13442045 12978902 12554405 12154196 11767521 11399515 11065110 10773253 10516087 10275067
9337A0275067k35032k23360k06680j99224k00395j91594j68602j51235j47936
9328H551009j39438j16973j05810j22323j37239j18882q7787q3565r7096q7946
9318G453950n8493n2768p9564r4883p4862n2016n5458o3560m7950k4550k3830
9307F826016m0303m8670m7162m8323m5179k4460j938p090l5750n1157l4960r599
9295F431425l200j3770j8899q129N644N341n471m429J7409L5579K3321l539k623
9282F458659L0771N1178K9977j203m96K2515L0344J8280J1294J6365J9154J9027
9270F705865K7637L7635L1080J6328J9120L8056M6547L9118L6216M1056L4430
9259G073088J9038K3957N1275O2353L7253P253M646J8170K4858K9175L9055L7274
$$ plain form
9337 10275067 10040035 9816675 9609995 9410771 9210376 9018782 8850180 8698945 8551009
9328 8551009 8411571 8294598 8188788 8066465 7929226 7810344 7722557 7638992 7541896 7453950
9318 7453950 7395457 7342689 7263125 7168242 7093380 7041364 6985906 6922346 6874396 6849846 6826016
9307 6826016 6785713 6737043 6689881 6641558 6596379 6571919 6569981 6562891 6527141 6475984 6441024 6431425
9295 6431425 6428225 6414455 6395556 6387427 6393071 6398412 6392941 6388512 6405921 6441500 6464821 6461282 6458659
9282 6458659 6489430 6540608 6570585 6569382 6568886 6591401 6621745 6640025 6651319 6667684 6686838 6705865
9270 6705865 6733502 6771137 6802217 6818545 6837665 6875721 6922268 6961386 6997602 7038658 7073088
9259 7073088 7092126 7116083 7167358 7229711 7266964 7274217 7278863 7297033 7321891 7351066 7390121 7427395
9247G427395J3107o263N661K9211L0898J8779K2813L8479L6733J9082J5510L1602
9235G683007M2512L9609M0262M8160M5949L3916L5412N3626O1681M8499L7522
9224H170155M4557N3018M9342M8590O2683P4712O9927O4459P6588R3840R6247
9213H904118R1126R6499J08486J13322J15614J26568J38614J39710J39574J53515
9203A0127146J72923J80799J84187J99796K18624K19642K10619K18241K41608
9194A1973585K54313K53022K63279K90403L05133K92437K78229K88138L10105
9185A4508644L19005L13469L07893L09548L21525L46729L72350L74598L57526
9176A7531287L60273M01774M45668M51710M37694M50858M93896N24035N20767
$$ plain form
9247 7427395 7440502 7434239 7439900 7469111 7500009 7518788 7541601 7580080 7616813 7635895 7651405 7683007
9235 7683007 7725519 7765128 7805390 7853550 7899499 7933415 7968827 8022453 8084134 8132633 8170155
9224 8170155 8214712 8267730 8317072 8365662 8428345 8503057 8572984 8637443 8714031 8807871 8904118
9213 8904118 8995244 9091743 9200229 9313551 9429165 9555733 9694347 9834057 9973631 10127146
9203 10127146 10300069 10480868 10665055 10864851 11083475 11303117 11513736 11731977 11973585
9194 11973585 12227898 12480920 12744199 13034602 13339735 13632172 13910401 14198539 14508644
9185 14508644 14827649 15141118 15449011 15758559 16080084 16426813 16799163 17173761 17531287
9176 17531287 17891560 18293334 18739002 19190712 19628406 20079264 20573160 21097195 21617962
9167B1617962N10486N17798N30872N28966N13935M97108M76768M45526M06049
9158B6045470L66758L31902L02569K77760K52503K27464K18403K37231K64405
9149B8524465K65354K39663K26888K51342K87085K96215K79597K65225K61361
9140C0897195K48046K09828J54591R9127N0491K944n3792j20639j81672k21187
9130C1084932k50148k95784l56512l92581l80271l50675l46834l63279l63782
9121B7985066l43992l33361l39584l37137l18065l10144l27960l45373l40935
9112B4988515l37305l64424m08266m31085m28186m30544m55887m86507m97398
9103B1148913m84787m62971m47101m41271m36047m20951m02912l99403m06690
$$ plain form
9167 21617962 22128448 22646246 23177118 23706084 24220019 24717127 25193895 25639421 26045470
9158 26045470 26412228 26744130 27046699 27324459 27576962 27804426 28022829 28260060 28524465
9149 28524465 28789819 29029482 29256370 29507712 29794797 30091012 30370609 30635834 30897195
9140 30897195 31145241 31355069 31509660 31608787 31659278 31662222 31608430 31487791 31306119 31084932
9130 31084932 30834784 30539000 30182488 29789907 29409636 29058961 28712127 28348848 27985066
9121 27985066 27641074 27307713 26968129 26630992 26312927 26002783 25674823 25329450 24988515
9112 24988515 24651210 24286786 23878520 23447435 23019249 22588705 22132818 21646311 21148913
9103 21148913 20664126 20201155 19754054 19312783 18876736 18455785 18052873 17653470 17246780
9094A7246780l96237l58398l25184l23367l28459l03198k63867k58719k85576
9085A4403775k87219k40835j97277k03444k32670k32455k05335j93322k04077
9076A2407141k05443j86929j76226j87306j94868j76716j48688j37337j41717
9067A0851911j43054j35630j28233j25390j24070j22736j21128j16386j08693
9058I726591j04224j04473j01160r0833q4591r0891r7870q9200p1956o8954q3007
9047H739432q9732p4343n7223o5944r2807j02315q0732n6142n9163q1163q9910
9036G889958p6671o4381o9555q0077p9302p1456o9093p2000p5275q3501r6959
9025G051688r7261p2094m4662m8561p6829q8480o8686m8644n5299p4153p9387
$$ plain form
9094 17246780 16850543 16492145 16166961 15843594 15515135 15211937 14948070 14689351 14403775
9085 14403775 14116556 13875721 13678444 13475000 13242330 13009875 12804540 12611218 12407141
9076 12407141 12201698 12014769 11838543 11651237 11456369 11279653 11130965 10993628 10851911
9067 10851911 10708857 10573227 10444994 10319604 10195534 10072798 9951670 9835284 9726591
9058 9726591 9622367 9517894 9416734 9325901 9241310 9150419 9052549 8963349 8891393 8822439 8739432
9047 8739432 8649700 8575357 8518134 8452190 8359383 8257068 8176336 8120194 8061031 7979868 7889958
9036 7889958 7813287 7748906 7679351 7599274 7519972 7448516 7379423 7307423 7232148 7148647 7051688
9025 7051688 6954427 6882333 6837671 6789110 6712281 6623801 6555115 6506471 6451172 6377019 6297632
9014F297632p1889o5619o1320n7647o5088q2487q2696n3203k9592m9686r0597
9003E587808r6967o4055m2184n5337o8322n2363l4197m8078p6494p8017n0801
8992D920993k9354l1171m2530n1019n8607o2027n0053k6807j4810k6073m6292
8981D482250n5026m8694l7559l1039l2092l7563l9174l0931j9305j9374l6226
8970D095267n5039n5211l4002j2233j2948l4116m8615l6865j2697m938j8384l1137
8958C739082l0039k5653k6019k1553j0283j2210l5650n1640l2066K615Q330j8696
8946C486218l9680l3285k0320k1801k7444k0900q544m844r001j2238j3021j2689
8934C262451j0093r451j7704k7411k1953n398l176k1232l0883j2771R438M651
$$ plain form
9014 6297632 6225743 6160124 6098804 6041157 5976069 5893582 5810886 5757683 5728091 5678405 5587808
9003 5587808 5490841 5426786 5384602 5329265 5260943 5208580 5174383 5126305 5049811 4971794 4920993
8992 4920993 4891639 4860468 4817938 4766919 4708312 4646285 4596232 4569425 4554615 4528542 4482250
8981 4482250 4427224 4378530 4340971 4309932 4277840 4240277 4201103 4170172 4150867 4131493 4095267
8970 4095267 4040228 3985017 3951015 3938782 3925834 3891718 3843103 3806238 3793541 3788603 3770219 3739082
8958 3739082 3709043 3683390 3657371 3635818 3625535 3613325 3577675 3526035 3493969 3496584 3504914 3486218
8946 3486218 3446538 3413253 3392933 3371132 3343688 3322788 3314244 3309400 3300399 3288161 3275140 3262451
8934 3262451 3252358 3242907 3225203 3197792 3175839 3170441 3167265 3146033 3115150 3102379 3111817 3116468
8922C116468j7147k2160n406N489n654k3842k8685j8578o031k863j0667j7743
8910B963181j1498J47n103k6659l3172j1099N936j2200l7239k2983J6089K1715
8898B847115j5459l9704j9661M543p660l0833k1047Q455J0444j8996l7690k4467
8886B655040l158K308l097r128j8468k8663k4459m173Q895q91j5649j0848N233
8873B552942L004k1711l7491k1185P739J3226p786k3717j5933l550q902k0401
8861B416235j3753M425O082r812j4597q58K578j7170k8470p751J3805k495l4236
8848B313983k8260J1723K5521r543m1246k2495J8791K6347j733k0564j0370L766
8836B265920O73p746m569M333M530l824j0828j2832j2060q357j578K737p07p252
$$ plain form
8922 3116468 3099321 3077161 3071755 3077244 3071590 3047748 3019063 3000485 2994454 2991591 2980924 2963181
8910 2963181 2951683 2951830 2946727 2920068 2886896 2875797 2881733 2869533 2832294 2809311 2825400 2847115
8898 2847115 2831656 2791952 2772291 2776834 2769174 2738341 2717294 2725749 2736193 2717197 2679507 2655040
8886 2655040 2651882 2654190 2651093 2641965 2623497 2594834 2570375 2566202 2575097 2574206 2558557 2547709 2552942
8873 2552942 2555946 2534235 2496744 2475559 2483298 2496524 2488738 2465021 2449088 2445538 2436636 2416235
8861 2416235 2402482 2406907 2412989 2403177 2388580 2387722 2390300 2373130 2344660 2336909 2350714 2348219 2313983
8848 2313983 2285723 2297446 2322967 2313424 2272178 2249683 2268474 2294821 2293088 2272524 2262154 2265920
8836 2265920 2266593 2258847 2254278 2258611 2263141 2259317 2248489 2235657 2223597 2215240 2213662 2216399 2215692 2208440
8822B208440o360L497J0143K564j2080j4028K859J8352J0152j2893j8437M416
8810B196625K6166J6597j1397j9416J609K0316J2510n641o986L568o57k2661l3467
8797B177166j4651J2943J7676J08j2196o924j073q337j4901l677J2967Q486j4795
8784B152792k4153l371K2633K3654N080p042p040r624j5384o723J6801K7589R619
8771B184831j3254j0020J1702J8107L86j4242n132J3614J8091P824r48j110K857
8758B212706Q942J6921J9264R723j583J255J4739J8575N465r490j3820j3389j4634
8745B254674j0216L517J1491J283j3038r943N369R607l57m155N868J2124L608
8732B269832n017l88N314l210j4269n965J5655K1391K633j3187n07K7047L2531
$$ plain form
8822 2208440 2202080 2205577 2215720 2218284 2206204 2192176 2195035 2213387 2223539 2210646 2192209 2196625
8810 2196625 2222791 2239388 2227991 2208575 2210184 2230500 2243010 2237369 2230383 2233951 2233294 2210633 2177166
8797 2177166 2162515 2175458 2193134 2193242 2181046 2174122 2173049 2164712 2149811 2146134 2159101 2167587 2152792
8784 2152792 2128639 2125268 2147901 2171555 2176635 2169593 2162553 2152929 2137545 2130822 2147623 2175212 2184831
8771 2184831 2171577 2161557 2173259 2191366 2191752 2177510 2172378 2185992 2204083 2211907 2210959 2209849 2212706
8758 2212706 2221648 2238569 2257833 2267556 2265973 2267228 2281967 2300542 2306007 2296517 2282697 2269308 2254674
8745 2254674 2244458 2247975 2259466 2260749 2247711 2237768 2243137 2252744 2252387 2248232 2254100 2266224 2269832
8732 2269832 2264815 2264427 2269741 2266531 2252262 2246297 2261952 2283343 2285976 2272789 2272282 2299329 2331860
8719B331860L937k7773k4738J0467L5525K0591j2418j8249R870L1082J5897j1567
8707B364484j0379J7395L3136J9764J075k60O617N115J095P944J8355J4625l88
8694B478578n182P908K1297J7712K469o718k124R183J6248J3583L933l320j40
8681B553427J0251J5708J0708L791M643J0220J1452Q070O604P385N653L725Q054
8668B659691J3900R207k323o02J9277L3430K2190K75n734L724Q661N612Q345J7412
8654B793065J8620J1808J1693J7332J1754k310m57J8746K3447R68j5672J08K3609
8641B912711J9886O98N31J7762K3455J4126J1237J6712J2933K863P035K1722K2721
8628C084392J1305J2501K5265K1617J828K96K3726L5085J8452P457K2364L1288
$$ plain form
8719 2331860 2335797 2308024 2283286 2293753 2329278 2349869 2337451 2319202 2329072 2360154 2376051 2364484
8707 2364484 2354105 2371500 2404636 2424400 2425475 2425215 2431832 2436947 2438042 2445986 2464341 2478966 2478578
8694 2478578 2473396 2481304 2502601 2520313 2522782 2516064 2513940 2523123 2539371 2552954 2556887 2553567 2553427
8681 2553427 2563678 2579386 2590094 2593885 2598528 2608748 2620200 2628270 2634874 2642259 2647912 2651637 2659691
8668 2659691 2673591 2682798 2680475 2679873 2699150 2732580 2754770 2755045 2749311 2753035 2761696 2767308 2775653 2793065
8654 2793065 2811685 2823493 2835186 2852518 2864272 2861962 2861505 2880251 2903698 2904666 2888994 2889102 2912711
8641 2912711 2932597 2933295 2933826 2951588 2975043 2989169 3000406 3017118 3030051 3032914 3039949 3061671 3084392
8628 3084392 3095697 3108198 3133463 3155080 3156908 3157204 3180930 3216015 3234467 3241924 3264288 3295576
8616C295576J0425o582J4514M4940L9158J0460L086J5696J4374L623J8139N0086
8604C513495N1390J5781l751K2116N3112M3806J0342k45K2292M6752M6901K7643
8592C849634J2888K0775M4360N4603L4953Q842J1553L8762N2485L8425K3262K7912
8580D218454L8864L9326L5989L7430L5677K7979K8781M0507M1057K2689J4531
8569D581284L8229O7100O3186L6023K7775M9913P0397O3128M0396L0182M1313
8558E108926N8675O3401N4125M8978O1369P6875P0669M7305L8113N3365O7552
8547E749353O4949O5496Q3376R4410P6609N3330N7862P9329Q5681Q0176Q8579
8536F579150J04933J00997Q3227Q7904J17244J31393J14626J01821J20990J51048
$$ plain form
8616 3295576 3306001 3299419 3313933 3358873 3398031 3408491 3411577 3427273 3441647 3445270 3463409 3513495
8604 3513495 3564885 3580666 3576915 3599031 3652143 3695949 3706291 3706046 3728338 3775090 3821991 3849634
8592 3849634 3862522 3883297 3927657 3982260 4017213 4026055 4037608 4076370 4128855 4167280 4190542 4218454
8580 4218454 4257318 4296644 4332633 4370063 4405740 4433719 4462500 4503007 4544064 4566753 4581284
8569 4581284 4619513 4686613 4749799 4785822 4813597 4863510 4933907 4997035 5037431 5067613 5108926
8558 5108926 5167601 5231002 5285127 5334105 5395474 5472349 5543018 5590323 5628436 5681801 5749353
8547 5749353 5814302 5879798 5963174 6057584 6134193 6187523 6245385 6324714 6410395 6490571 6579150
8536 6579150 6684083 6785080 6868307 6956211 7073455 7204848 7319474 7421295 7542285 7693333
8526G693333J60525J55141J61224J85623K15004K37723K49054K49454K50220K66794
8516I824095K98231L27239L42815L44898L29504K95982K67140K66454K70498K24785
8506A2791641J21236K0060k6842l5893m7950o1827n1399k3861j6914m6188q9426
8495A2532637j19623j29295j26755j28545j49051j81545j99936j94155j87731
8486A1116001k01528k18018k06556j70580j42852j41101j51219j49865j26923
8477I607359r1656o7673o9876p8382n6390m011L5756M1497M6943Q2886J25417
8466I571870J42398J54316J96108K47449K60977K39575K22173K08106J65523J05745
8456A1514240O8908L0606q8762k91962m62566n02442m47649l93814l62795l11143
$$ plain form
8526 7693333 7853858 8008999 8170223 8355846 8570850 8808573 9057627 9307081 9557301 9824095
8516 9824095 10122326 10449565 10792380 11137278 11466782 11762764 12029904 12296358 12566856 12791641
8506 12791641 12912877 12932937 12906095 12870202 12822252 12760425 12709026 12685165 12668251 12622063 12532637
8495 12532637 12413014 12283719 12156964 12028419 11879368 11697823 11497887 11303732 11116001
8486 11116001 10914473 10696455 10489899 10319319 10176467 10035366 9884147 9734282 9607359
8477 9607359 9515703 9448030 9378154 9299772 9243382 9239371 9275127 9316624 9363567 9446453 9571870
8466 9571870 9714268 9868584 10064692 10312141 10573118 10812693 11034866 11242972 11408495 11514240
8456 11514240 11583148 11613754 11524992 11233030 10770464 10268022 9820373 9426559 9063764 8752621
8446H752621k33535j81569j85338k13502k18621j87316j42317j17316j26376j43944
8436G002787j29687q5661o1598q2814j07700r0667n3474m6851o7223o8301m2789
8425F166022l1944n0725o0294l2245N785J4097j720m733K0528N2400O2976N1300
8413F191447M5112O8964J10012J28234J08382Q1374P6870P9069N8646K4052j232
8402F970930l4136j09991k08861k61670k41723j98250j80040j74655j50964j17984
8392E292656j04001j07929j08421j00538r1907q0342o3893n6592o7216p7852o9337
8381D364628n2389m7489n0006m3756l4618l9180n0639m8385l5275l3449m5538
8370C883904n0810m1119l2124l4168l7694l4414l0860l2852l4896l2715l0929
$$ plain form
8446 8752621 8519086 8337517 8152179 7938677 7720056 7532740 7390423 7273107 7146731 7002787
8436 7002787 6873100 6787439 6725841 6643027 6535327 6444660 6391186 6344335 6277112 6208811 6166022
8425 6166022 6134078 6083353 6023059 5990814 5996599 6010696 6008976 6004243 6024771 6077171 6140147 6191447
8413 6191447 6236559 6305523 6415535 6543769 6652151 6733525 6810395 6889464 6948110 6972162 6970930
8402 6970930 6936794 6826803 6617942 6356272 6114549 5916299 5736259 5561604 5410640 5292656
8392 5292656 5188655 5080726 4972305 4871767 4779860 4699518 4635625 4579033 4511817 4433965 4364628
8381 4364628 4312239 4264750 4214744 4170988 4136370 4097190 4046551 3998166 3962891 3929442 3883904
8370 3883904 3833094 3791975 3759851 3725683 3687989 3653575 3622715 3589863 3554967 3522252 3491323
8359C491323l1458k8131j9084j2709j5462k3170k8339k8105k3239j6878j4717
8348C250031j9373k5757k7819k5635k0072r313O22n734l0123m7833l6967j0972
8336B991055q38j2729k6182k8225k4259j8775j1252r186j9259k7744j7650k509
8324B792447r888l1834l1598o150K616k3526m3605k0200J9347K2562j2900m3098
8312B614173m1049j9692j618K133j0039k6713k5869m365Q369q060k7525j5470
8300B444275J2093J0351k2819m4026l2309j2432m606J308Q795n79k5216l0933
8288B303902o626R469r010k9261j3531J4808R122k2159l0680q429M170j0628k3296
8275B187851j3043N97r31n116q40l156k0673l1122j7488l43m087j5891j1364M07
$$ plain form
8359 3491323 3459865 3431734 3412650 3399941 3384479 3361309 3332970 3304865 3281626 3264748 3250031
8348 3250031 3230658 3204901 3177082 3151447 3131375 3122062 3122684 3116950 3086827 3038994 3002027 2991055
8336 2991055 2990217 2977488 2951306 2923081 2898822 2880047 2868795 2859609 2840350 2812606 2794956 2792447
8324 2792447 2782559 2750725 2719127 2712977 2715593 2692067 2648462 2628262 2647609 2670171 2657271 2614173
8312 2614173 2573124 2553432 2551814 2553947 2543908 2517195 2491326 2486961 2495330 2487270 2459745 2444275
8300 2444275 2456368 2466719 2443900 2399874 2367565 2355133 2350527 2351835 2360630 2360051 2334835 2303902
8288 2303902 2297276 2306745 2297735 2268474 2254943 2269751 2278873 2256714 2226034 2217605 2221775 2211147 2187851
8275 2187851 2174808 2175405 2174474 2169358 2168518 2165362 2144689 2113567 2096079 2095736 2091649 2075758 2064394 2064801
8261B064801m873j9015j3330R014J4692m774k0249j4788p667j4200j7343j397
8249A970871J5166P792j4205k3194j4061l319J121L290P46j1002k0738j3592K270
8236A901145O191l85J976J1660L944k3578l6834j5159J3155J1168j2284j9463
8224A841536k113J0682P42j5079j6098p021k714k782K306J0554J0024k461j6005
8211A811571j9047j1016n85K956l045j2398j5427q917j3K087k596n114j59N279
8197A743576Q70r901j0178O098J8915N706k2818l0740o565J7490J0665j2483j7578
8184A693057l609K256m567j18J8629J9577j0487l4496j7651J6812K1410n043k2287
8171A673483j4413n895j0006o409J4845K6434O155k3485k7424r080J399m045o214
$$ plain form
8261 2064801 2059928 2040913 2027583 2036597 2051289 2046515 2026266 2011478 2003811 1989611 1972268 1970871
8249 1970871 1986037 1993829 1979624 1956430 1942369 1939050 1940171 1943461 1944207 1933205 1912467 1898875 1901145
8236 1901145 1907336 1906951 1908927 1920587 1924531 1900953 1864119 1848960 1862115 1873283 1860999 1841536
8224 1841536 1839423 1850105 1850847 1835768 1819670 1812649 1809935 1807153 1809459 1820013 1830037 1827576 1811571
8211 1811571 1792524 1781508 1780923 1783879 1780834 1768436 1753009 1744092 1744079 1746166 1743570 1738456 1738297 1743576
8197 1743576 1744446 1734545 1724367 1730465 1749380 1755086 1732268 1701528 1694963 1712453 1723118 1710635 1693057
8184 1693057 1689448 1691704 1687137 1687019 1705648 1725225 1714738 1680242 1662591 1679403 1700813 1695770 1673483
8171 1673483 1659070 1653175 1643169 1636760 1651605 1678039 1684194 1660709 1633285 1624205 1625604 1621559 1615345
8158A615345L722J1540O584l145o795l418L583R024M161j0676j5813L005K3374
8145A640491J0055k7668l8592l186L2276K0978j6546k6129K19K1122J3154k619
8133A623555m480n43k834l153P434J8408J6391N018n128j0730r543K279J6011
8120A652685J3343l958r052R313K4385J1588j1395j3327N94K553o645o89K0641
8107A690036K5324L102j3417M08K2335K0021J303k727J0784J5203Q41q673N300
8094A769840K5498K2791j416j6412m695J5208J7477O228N402J7714J9524K069
8082A879228r487M489K3546J8608m98k631J1261J1768m798q660R773K0954P690
8069A961243l752J1173L2686K9815R367r03K826N520O283J2665J5488L088r990
$$ plain form
8158 1615345 1619067 1630607 1637191 1634046 1627251 1623833 1627416 1636440 1640601 1629925 1614112 1617117 1640491
8145 1640491 1650546 1622878 1584286 1581100 1613376 1634354 1617808 1591679 1591898 1613020 1626174 1623555
8133 1623555 1619075 1618532 1615698 1612545 1619979 1638387 1654778 1659796 1654668 1643938 1634395 1636674 1652685
8120 1652685 1666028 1662070 1653018 1662331 1686716 1698304 1686909 1673582 1674176 1676729 1670084 1669395 1690036
8107 1690036 1715360 1718462 1705045 1705453 1727788 1747809 1749112 1746385 1757169 1772372 1773213 1764540 1769840
8094 1769840 1795338 1818129 1816713 1800301 1795606 1810814 1828291 1834519 1839921 1857635 1877159 1879228
8082 1879228 1869741 1874230 1897776 1916384 1915886 1913255 1924516 1936284 1931486 1922826 1932599 1953553 1961243
8069 1961243 1957491 1968664 2001350 2031165 2040532 2039629 2042455 2047975 2054258 2066923 2082411 2085499 2075509
8056B075509k490J4392J2906l016l671J4534K3400J2894O576J6713K2389R351
8044B199487k338P176K2768J9179R06p163L777J9828K5787J8065L753l231N884
8031B313878K0364K0744Q374N411J8531K6256J5397N255J5567L2256L0404J4933
8019B527370J0425K0871K7274K0372J0312N367L744O724J8734L1980L0423J4262
$$ plain form
8056 2075509 2073019 2087411 2100317 2097301 2093630 2108164 2131564 2144458 2151034 2167747 2190136 2199487
8044 2199487 2197149 2204325 2227093 2246272 2247178 2240015 2243792 2263620 2289407 2307472 2311225 2307994 2313878
8031 2313878 2334242 2354986 2363360 2368771 2387302 2413558 2428955 2434210 2449777 2482033 2512437 2527370
8019 2527370 2537795 2558666 2585940 2606312 2616624 2621991 2625735 2632459 2651193 2683173 2713596 2727858
$$ [...]
##END NTUPLES=NMR SPECTRUM
##END=
