##TITLE=1H ikalashn
EC-3334(3)
17.10.2024
##JCAMPDX= 6.0         $$ Bruker NMR JCAMP-DX V2.0
##DATA TYPE= NMR SPECTRUM
##DATA CLASS= NTUPLES
##ORIGIN= UXNMR, Bruker Analytische Messtechnik GmbH
##OWNER= root
$$ TOPSPIN		Version 1.3
$$ 2024-10-17 10:25:37.359 +0400  Irina@DPX200
$$ Compression mode = diff/dup
##.OBSERVE FREQUENCY= 200.131392401
##.OBSERVE NUCLEUS= ^1H
##.ACQUISITION MODE= SIMULTANEOUS
##.ACQUISITION SCHEME= undefined
##.AVERAGES= 32
##.DIGITISER RES= 18
##SPECTROMETER/DATA SYSTEM= spect
##.PULSE SEQUENCE= zg
##.SOLVENT NAME= CDCl3
##.SHIFT REFERENCE= INTERNAL, CDCl3, 1, 17.95386
##AUDIT TRAIL= $$ (NUMBER, WHEN, WHO, WHERE, WHAT)
$$ ##TITLE= Audit trail, TOPSPIN		Version 1.3
$$ ##JCAMPDX= 5.01
$$ ##ORIGIN= Bruker BioSpin GmbH
$$ ##OWNER= Irina
$$ $$ F:/spectra/data/iren/nmr/1H/4/pdata/1/auditp.txt
$$ ##AUDIT TRAIL=  $$ (NUMBER, WHEN, WHO, WHERE, VERSION, WHAT)
(   1,<2024-10-17 10:25:06.296 +0400>,<Irina>,<DPX200>,<TOPSPIN 1.3>,
      <created by zg
	started at 2024-10-17 10:22:56.453 +0400,
	POWCHK disabled, PULCHK disabled
       terminated by command 'halt'
       configuration hash MD5:
       BE 6D 3F 07 2A EA 11 49 91 17 2B D3 AF B3 58 0D
       data hash MD5: 16K
       9C 75 AD B4 66 FF E8 60 F7 E0 D5 AE 51 45 F4 D8>)
(   2,<2024-10-17 10:25:24.453 +0400>,<Irina>,<DPX200>,<TOPSPIN 1.3>,
      <Start of raw data processing
       fp BC_mod = 2 FT_mod = 6 PKNL = 1 PHC0 = 185.4501 PHC1 = 33.30864 SI = 32K 
       data hash MD5: 32K
       B9 34 03 5D D2 42 C3 02 0F F6 8A CA EF 31 49 87>)
(   3,<2024-10-17 10:25:27.187 +0400>,<Irina>,<DPX200>,<TOPSPIN 1.3>,
      <apk 
       data hash MD5: 32K
       3E 43 8F 06 41 5C 63 6C 23 3B C3 BC 1E E3 17 9D>)
(   4,<2024-10-17 10:25:29.703 +0400>,<Irina>,<DPX200>,<TOPSPIN 1.3>,
      <abs n ABSG = 5 
       data hash MD5: 32K
       90 23 FC 48 EF 9E 35 24 B3 A8 D8 36 A5 64 99 3F>)
$$ ##END=
$$ 
$$ $$ hash MD5
$$ $$ 14 3F AC EA 26 45 C9 11 53 F6 DF E1 7D 48 27 9E
##$RELAX= 
##$RELAX= 
##$RELAX= 
##$RELAX= 
##$RELAX= 
##$RELAX= 
##$RELAX= 
##$RELAX= 
##$RELAX= 
$$ Bruker specific parameters
$$ --------------------------
##$DU= <F:/spectra>
##$EXPNO= 4
##$NAME= <1H>
##$PROCNO= 1
##$TYPE= <nmr>
##$USER= <iren>
##$AMP= (0..31)
100 100 100 100 100 100 100 100 100 100 100 100 100 100 100 100 100 100 
100 100 100 100 100 100 100 100 100 100 100 100 100 100 
##$ANAVPT= -1
##$AQSEQ= 0
##$AQ_mod= 1
##$AUNM= <au_zg>
##$AUTOPOS= <>
##$BF1= 200.13
##$BF2= 200.13
##$BF3= 200.13
##$BF4= 200.13
##$BF5= 200.13
##$BF6= 200.13
##$BF7= 200.13
##$BF8= 200.13
##$BYTORDA= 1
##$CFDGTYP= 0
##$CFRGTYP= 5
##$CHEMSTR= <none>
##$CNST= (0..63)
1 1 145 1 1 1 1 1 1 1 1 1 1 1 1 1 1 1 1 1 1 1 1 1 1 1 1 1 1 1 1 1 1 1 
1 1 1 1 1 1 1 1 1 1 1 1 1 1 1 1 1 1 1 1 1 1 1 1 1 1 1 1 1 1 
##$CPDPRG= <>
##$CPDPRG1= <>
##$CPDPRG2= <>
##$CPDPRG3= <>
##$CPDPRG4= <mlev>
##$CPDPRG5= <mlev>
##$CPDPRG6= <mlev>
##$CPDPRG7= <mlev>
##$CPDPRG8= <mlev>
##$CPDPRGB= <>
##$CPDPRGT= <>
##$D= (0..63)
$$ [...]
##$SW_h= 4401.40845070422
##$TD= 16384
##$TD0= 1
##$TE= 300
##$TE2= 300
##$TE3= 300
##$TEG= 300
##$TL= (0..7)
0 120 120 120 120 120 120 120 
##$TP= (0..7)
150 150 150 150 150 150 150 150 
##$TP07= 0
##$TPNAME0= <>
##$TPNAME1= <>
##$TPNAME2= <>
##$TPNAME3= <>
##$TPNAME4= <>
##$TPNAME5= <>
##$TPNAME6= <>
##$TPNAME7= <>
##$TPOAL= (0..7)
0.5 0.5 0.5 0.5 0.5 0.5 0.5 0.5 
##$TPOFFS= (0..7)
0 0 0 0 0 0 0 0 
##$TUNHIN= 0
##$TUNHOUT= 0
##$TUNXOUT= 0
##$USERA1= <user>
##$USERA2= <user>
##$USERA3= <user>
##$USERA4= <user>
##$USERA5= <user>
##$V9= 5
##$VALIST= <valist>
##$VCLIST= <CCCCCCCCCCCCCCC>
##$VD= 0
##$VDLIST= <DDDDDDDDDDDDDDD>
##$VPLIST= <PPPPPPPPPPPPPPP>
##$VTLIST= <TTTTTTTTTTTTTTT>
##$WBST= 1024
##$WBSW= 25
##$XGAIN= (0..3)
0 0 0 0 
##$XL= 0
##$YL= 0
##$YMAX_a= 281909
##$YMIN_a= -307406
##$ZGOPTNS= <>
##$ZL1= 120
##$ZL2= 120
##$ZL3= 120
##$ZL4= 120
##$ABSF1= 17.95386
##$ABSF2= -4.038887
##$ABSG= 5
##$ABSL= 3
##$ALPHA= 0
##$AQORDER= 0
##$ASSFAC= 0
##$ASSFACI= 0
##$ASSFACX= 0
##$ASSWID= 0
##$AUNMP= <proc_1d>
##$AXLEFT= 0
##$AXRIGHT= 0
##$AXTYPE= 0
##$AXUNIT= <>
##$AZFE= 0.1
##$AZFW= 0.1
##$BCFW= 0
##$BC_mod= 2
##$BYTORDP= 0
##$COROFFS= 0
##$CY= 7568.61572265625
##$DATMOD= 1
##$DC= 0
##$DFILT= <>
##$DTYPP= 0
##$F1P= 17.9538593292236
##$F2P= -4.03888763876832
##$FCOR= 0.5
##$FTSIZE= 32768
##$FT_mod= 6
##$GAMMA= 0
##$GB= 0
##$INTBC= 0
##$INTSCL= 1.483618e-010
##$ISEN= 128
##$LB= 0
##$LEV0= 0
##$LPBIN= 0
##$MAXI= 945.577
##$MC2= 0
##$MEAN= 0
##$ME_mod= 0
##$MI= -402.1523
##$NCOEF= 0
##$NC_proc= -6
##$NLEV= 6
##$NOISF1= 8.587773
##$NOISF2= 6.764455
##$NSP= 0
##$NTH_PI= 0
##$NZP= 0
##$OFFSET= 17.95386
##$PC= 1
##$PHC0= 210.8902
##$PHC1= -1.657925
##$PH_mod= 1
##$PKNL= yes
##$PPARMOD= 0
##$PPDIAG= 0
##$PPIPTYP= 0
##$PPMPNUM= 100
##$PPRESOL= 1
##$PSCAL= 0
##$PSIGN= 0
##$REVERSE= no
##$SF= 200.13
##$SI= 32768
##$SIGF1= 16.12182
##$SIGF2= -4.496377
##$SINO= 3.521527
##$SIOLD= 32768
##$SREGLST= <1H.CDCl3>
##$SSB= 0
##$STSI= 32768
##$STSR= 0
##$SW_p= 4401.40845070423
##$SYMM= 0
##$S_DEV= 0
##$TDeff= 16384
##$TDoff= 0
##$TI= <>
##$TILT= no
##$TM1= 0
##$TM2= 0
##$TOPLEV= 0
##$USERP1= <user>
##$USERP2= <user>
##$USERP3= <user>
##$USERP4= <user>
##$USERP5= <user>
##$WDW= 0
##$XDIM= 32768
##$YMAX_p= 529498962
##$YMIN_p= -396673
$$ End of Bruker specific parameters
$$ ---------------------------------
##NTUPLES= NMR SPECTRUM
##VAR_NAME=  FREQUENCY,     SPECTRUM/REAL,   SPECTRUM/IMAG
##SYMBOL=    X,             R,               I
##VAR_TYPE=  INDEPENDENT,   DEPENDENT,       DEPENDENT
##VAR_FORM=  AFFN,          ASDF,            ASDF
##VAR_DIM=   32768,         32768,           32768
##UNITS=     HZ,            ARBITRARY UNITS, ARBITRARY UNITS
##FACTOR=    0.134324425510551, 1,           1
##FIRST=     4401.40845070423, 29491,        -1163004
##LAST=      0,             -496,            -1202140
##MIN=       0,             -396673,         0
##MAX=       4401.40845070423, 529498962,    0
$$ Real data points
##PAGE= N=1
##DATA TABLE= (X++(R..R)), XYDATA
$$ [...]
$$ plain form
11421 7789085 7817999 7907614 7982065 7991752 7978263 7993093 8016730 8003845 7962715 7936917 7930967 7902165
11409 7902165 7823209 7720159 7641477 7603019 7569166 7490891 7365935 7248418 7182663 7144609 7079148
11398 7079148 6979505 6884632 6806545 6718248 6620397 6556992 6540882 6521925 6463879 6400076 6369951
11387 6369951 6349685 6300248 6243884 6227695 6235030 6200871 6110515 6024023 5996009 6017240 6044074
11376 6044074 6047064 6020176 5973457 5929210 5906027 5900415 5895828 5884588 5867707 5844791 5819542 5799691
11364 5799691 5776671 5729720 5668900 5639450 5652975 5654121 5601321 5541277 5539980 5570629 5549818 5472418
11352 5472418 5422514 5440419 5464087 5433325 5378155 5357379 5365071 5350545 5296600 5231798 5185655
11341 5185655 5165237 5160269 5149098 5115886 5073347 5045532 5024688 4981579 4924034 4896649 4906624 4903075
$$ packed form
11421G789085K8914Q9615P4451R687j3489J4830K3637j2885m1130k5798n950k8802
11409G902165p8956j03050p8682l8458l3853p8275j24956j17517o5755l8054o5461
11398G079148r9643r4873p8087q8297r7851o3405j6110j8957n8046o3803l0125
11387F369951k0266m9437n6364j6189P335l4159r0356q6492k8014K1231K6834
11376F044074K990k6888m6719m4247k3183n612m587j1240j6881k2916k5249j9851
11364E799691k3020m6951o0820k9450J3525J146n2800o0044j297L0649k0811p7400
11352E472418m9904J7905K3668l0762n5170k0776P692j4526n3945o4802m6143
11341E185655k0418m968j1171l3212m2539k7815k0844m3109n7545k7385R975l549
$$ plain form
11329 4903075 4856412 4805287 4788820 4782505 4746131 4691772 4655328 4637331 4620222 4608849 4604525 4576364
11317 4576364 4513363 4466959 4478184 4499048 4461586 4393984 4379039 4416132 4425766 4390298 4379189
11306 4379189 4409833 4396913 4298153 4211237 4239457 4332007 4357532 4293660 4238764 4250793 4279070
11295 4279070 4270916 4252425 4261706 4273537 4248464 4211598 4219665 4269874 4299434 4274405 4231014 4218163
11283 4218163 4236092 4249907 4238409 4210737 4190838 4199383 4236483 4272379 4274600 4255677 4267027 4324154
11271 4324154 4368068 4338864 4265893 4235866 4279943 4345111 4379029 4387075 4392521 4398478 4415370 4469912
11259 4469912 4549107 4587701 4559577 4533192 4576097 4647708 4662792 4630514 4639064 4710692 4769686
11248 4769686 4771613 4770007 4813112 4857765 4849313 4823319 4849942 4916042 4944838 4918296 4901918 4941535
$$ packed form
11329D903075m6663n1125j6467o315l6374n4359l6444j7997j7109j1373m324k8161
11317D576364o3001m6404J1225K0864l7462o7602j4945L7093R634l5468j1109
11306D379189L0644j2920r8760q6916K8220R2550K5525o3872n4896J2029K8277
11295D279070q154j8491R281J1831k5073l6866Q067N0209K9560k5029m3391j2851
11283D218163J7929J3815j1498k7672j9899Q545L7100L5896K221j8923J1350N7127
11271D324154M3914k9204p2971l0027M4077O5168L3918Q046N446N957J6892N4542
11259D469912P9195L8594k8124k6385M2905P1611J5084l2278Q550P1628N8994
11248D769686J927j606M3105M4653q452k5994K6623O6100K8796k6542j6378L9617
$$ plain form
11236 4941535 5003724 5040463 5056496 5078110 5097753 5094796 5088367 5121128 5191900 5245261 5242488 5214964
11224 5214964 5225609 5293106 5378085 5438473 5474591 5515089 5576746 5648740 5708453 5746684 5781129
11213 5781129 5841841 5934399 6025677 6083646 6121070 6170705 6225878 6251265 6257161 6305722 6415680
11202 6415680 6514558 6531476 6496103 6492735 6549420 6629840 6706395 6776209 6824742 6842983 6869545
11191 6869545 6946555 7042874 7094708 7113992 7169776 7261192 7310606 7305576 7339871 7462701 7587063
11180 7587063 7623431 7622678 7693123 7833093 7947346 8001196 8061222 8184305 8344861 8486772 8594201
11169 8594201 8694725 8822397 8985525 9160011 9324159 9498232 9713046 9939767 10115360
11160 10115360 10254861 10457135 10760950 11086326 11379349 11718120 12188964 12754225 13352783
$$ packed form
11236D941535O2189L6739J6033K1614J9643k957o429L2761P0772N3361k773k7524
11224E214964J0645O7497Q4979O0388L6118M0498O1657P1994N9713L8231L4445
11213E781129O0712R2558R1278N7969L7424M9635N5173K5387N896M8561J09958
11202F415680R8878J6918l5373l368N6685Q0420P6555O9814M8533J8241K6562
11191F869545P7010R6319N1834J9284N5784R1416M9414n030L4295J22830J24362
11180G587063L6368p53P0445J39970J14253N3850O0026J23083J60556J41911J07429
11169H594201J00524J27672J63128J74486J64148J74073K14814K26721J75593
11160A0115360J39501K02274L03815L25376K93023L38771M70844N65261N98558
$$ plain form
11151 13352783 14035346 14865329 15792069 16809121 18130090 19908186 21771751 22960174
11143 22960174 23068373 22425262 21573064 20605276 19276076 17600041 15992232 14795200 13944033
11134 13944033 13196814 12490439 11921561 11503013 11113865 10670623 10223694 9857503 9569499
11125 9569499 9294055 9011645 8776346 8624264 8503963 8344697 8164409 8037351 7958191 7829762
11115 7829762 7617568 7422307 7331737 7282164 7161463 6987093 6864841 6805032 6710196 6548016
11105 6548016 6410716 6366369 6356422 6296130 6194662 6111512 6054147 5985919 5898035 5814075 5744165
11094 5744165 5680657 5623922 5577047 5529153 5472304 5419699 5382466 5344914 5287971 5223927 5183993
11083 5183993 5178261 5184728 5173652 5134718 5085669 5053991 5041500 5017531 4965744 4920001 4917747 4931362
$$ packed form
11151A3352783O82563Q29983R26740J017052J320969J778096J863565J188423
11143B2960174J08199o43111q52198r67788j329200j676035j607809j197032q51167
11134A3944033p47219p06375n68878m18548l89148m43242m46929l66191k88004
11125I569499k75444k82410k35299j52082j20301j59266j80288j27058p9160j28429
11115G829762k12194j95261r0570m9573j20701j74370j22252n9809r4836j62180
11105F548016j37300m4347r947o0292j01468q3150n7365o8228q7884q3960o9910
11094E744165o3508n6735m6875m7894n6849n2605l7233l7552n6943o4044l9934
11083E183993n732O467j1076l8934m9049l1678j2491k3969n1787m5743k254J3615
$$ plain form
11071 4931362 4897044 4811515 4742780 4731740 4740560 4722763 4688557 4665411 4644912 4613592 4593382
11060 4593382 4600617 4600260 4556554 4501530 4491325 4509983 4482240 4384309 4282419 4243677 4254102 4249488
11048 4249488 4196561 4118115 4055461 4028266 4026105 4026140 4016623 4003344 3993662 3982815 3962097 3931759
11036 3931759 3897757 3863548 3831362 3801949 3769393 3730069 3698295 3690865 3691459 3660293 3590537 3521098
11024 3521098 3475656 3429173 3364522 3319092 3326867 3348235 3318929 3249958 3211955 3224027 3227431 3183107
11012 3183107 3130383 3118067 3129376 3116341 3073463 3034477 3016746 3007780 2996579 2985172 2972059
11001 2972059 2950290 2923005 2901782 2888413 2873677 2855364 2842539 2836729 2821605 2783405 2736904
10990 2736904 2715232 2727184 2738785 2713956 2663883 2630195 2622136 2606101 2567642 2543451 2564104
$$ packed form
11071D931362l4318q5529o8735j1040Q820j7797l4206k3146k0499l1320k0210
11060D593382P235l57m3706n5024j0205J8658k7743r7931j01890l8742J0425m614
11048D249488n2927p8446o2654k7195k161L5r517j3279r682j0847k0718l0338
11036C931759l4002l4209l2186k9413l2556l9324l1774p430N94l1166o9756o9439
11024C521098m5442m6483o4651m5430P775K1368k9306o8971l8003J2072L404m4324
11012C183107n2724j2316J1309j3035m2878l8986j7731q966j1201j1407j3113
11001B972059k1769k7285k1223j3369j4736j8313j2825n810j5124l8200m6501
10990B736904k1672J1952J1601k4829n0073l3688q059j6035l8459k4191K0653
$$ plain form
10979 2564104 2599335 2598942 2563145 2529793 2511679 2493675 2476841 2473148 2465916 2431658 2395876 2403751
10967 2403751 2433735 2413774 2340755 2304831 2355117 2413841 2384677 2290672 2232709 2247211 2279327
10956 2279327 2278459 2249207 2212273 2178333 2164837 2184551 2211330 2205417 2176862 2174349 2205175 2220336
10944 2220336 2193367 2159316 2150280 2143586 2111075 2077390 2082156 2111171 2114131 2078653 2042813 2036445
10932 2036445 2047684 2052386 2046216 2038060 2032767 2029153 2021628 2001553 1970954 1952873 1968150 2000675
10920 2000675 2008986 1979663 1945716 1938112 1941878 1923689 1887158 1869579 1887002 1913687 1923743 1925418
10908 1925418 1936848 1948761 1936047 1897487 1860818 1849886 1864913 1893535 1921884 1933521 1918125
10897 1918125 1887831 1867698 1863404 1856575 1839598 1831525 1842528 1845359 1811155 1761129 1748050 1785135
$$ packed form
10979B564104L5231l93l5797l3352j8114j8004j6834l693p232l4258l5782P875
10967B403751K9984j9961p3019l5924N0286N8724k9164r4005n7963J4502L2116
10956B279327q68k9252l6934l3940j3496J9714K6779n913k8555k513L0826J5161
10944B220336k6969l4051r036o694l2511l3685M766K9015K960l5478l5840o368
10932B036445J1239M702o170q156n293l614p525k0075l0599j8081J5277L2525
10920B000675Q311k9323l3947p604L766j8189l6531j7579J7423K6685J0056J675
10908A925418J1430J1913j2714l8560l6669j0932J5027K8622K8349J1637j5396
10897A918125l0294k0133m294o829j6977q073J1003K831l4204n0026j3079L7085
$$ plain form
10885 1785135 1825267 1822014 1784724 1754973 1749127 1749937 1744463 1740339 1740333 1726108 1683418 1630488 1603098
10872 1603098 1613733 1639181 1649925 1640777 1628828 1629695 1640895 1644035 1621938 1579692 1547756 1552806
10860 1552806 1584082 1603537 1593656 1575636 1569592 1560578 1527569 1487474 1477190 1499502 1521059 1523502
10848 1523502 1521613 1524855 1517362 1492365 1474612 1484007 1499313 1485150 1442784 1409935 1414958 1448581
10836 1448581 1479050 1484519 1471793 1465964 1477922 1489446 1484610 1482863 1509057 1538053 1517056 1452238
10824 1452238 1418972 1457443 1508912 1500565 1451404 1434773 1462906 1477046 1447106 1416335 1432282
10813 1432282 1482530 1521685 1530064 1524492 1529026 1548267 1561688 1545752 1509440 1492412 1511858 1534522
10801 1534522 1528146 1513814 1528396 1560673 1574773 1575965 1593662 1613886 1598229 1566001 1581074 1646894
$$ packed form
10885A785135M0132l253l7290k9751n846Q10n474m124oj4225m2690n2930k7390
10872A603098J0635K5448J0744r148j1949Q67J1200L140k2097m2246l1936N050
10860A552806L1276J9455r881j8020o044r014l3009m0095j0284K2312K1557K443
10848A523502j889L242p493k4997j7753R395J5306j4163m2366l2849N023L3623
10836A448581L0469N469j2726n829J1958J1524m836j747K6194K8996k0997o4818
10824A452238l3266L8471N1469q347m9161j6631K8133J4140k9940l0771J5947
10813A432282N0248L9155Q379n572M534J9241J3421j5936l6312j7028J9446K2664
10801A534522o376j4332J4582L2277J4100J192J7697K0224j5657l2228J5073O5820
$$ plain form
10789 1646894 1692138 1683494 1675230 1710380 1747478 1738302 1714590 1732225 1775557 1785430 1753375 1726317
10777 1726317 1736744 1779653 1839522 1891932 1899166 1854226 1811040 1820608 1854112 1842754 1780660 1730063
10765 1730063 1727593 1742761 1737950 1720117 1715491 1727529 1736785 1722915 1681514 1633810 1613362 1626926
10753 1626926 1643119 1638372 1629360 1633252 1628865 1599163 1580097 1610768 1658990 1662047 1627700 1623315
10741 1623315 1667424 1706261 1706821 1698648 1702456 1690085 1650574 1632267 1673087 1737381 1768742 1767206
10729 1767206 1768574 1779200 1779502 1772374 1783282 1818956 1857987 1879566 1882257 1879620 1887739 1908489 1924701
10716 1924701 1929059 1949466 2011344 2080920 2096921 2064665 2058649 2111012 2161692 2157156 2135955 2159368
10704 2159368 2208089 2218865 2191024 2180753 2203903 2218402 2204864 2196801 2214953 2228761 2209293
$$ packed form
10789A646894M5244q644q264L5150L7098r176k3712J7635M3332R873l2055k7058
10777A726317J0427M2909N9869N2410P234m4940m3186R568L3504j1358o2094n0597
10765A730063k470J5168m811j7833m626J2038R256j3870m1401m7704k0448J3564
10753A626926J6193m747r012L892m387k9702j9066L0671M8222L057l4347m385
10741A623315M4109L8837N60q173L808j2371l9511j8307M0820O4294L1361j536
10729A767206J368J0626L02p128J0908L5674L9031K1579K691k637Q119K0750J6212
10716A924701M358K0407O1878O9576J6001l2256o016N2363N0680m536k1201K3413
10704B159368M8721J0776k7841j0271K3150J4499j3538q063J8152J3808j9468
$$ plain form
10693 2209293 2177176 2166830 2172119 2160080 2123687 2090089 2076184 2060481 2015007 1955077 1930988
10682 1930988 1959459 1989310 1965054 1906551 1881877 1908040 1932269 1918975 1896679 1896264 1900062 1887778
10670 1887778 1881588 1901830 1921641 1911203 1886862 1870955 1846798 1805276 1789348 1828104 1868736
10659 1868736 1848538 1800065 1802370 1852978 1877166 1851176 1824723 1822521 1814665 1795308 1803350 1843432
10647 1843432 1864362 1841933 1815081 1817085 1835189 1856477 1887480 1912823 1905673 1893534 1933320 2003167
10635 2003167 2011474 1944308 1904081 1952639 2015127 2007799 1969458 1980763 2030176 2055354 2057277 2074879
10623 2074879 2092443 2070583 2036306 2047944 2093516 2111225 2091483 2075457 2070575 2050218 2022098
10612 2022098 2015674 2015408 1987004 1954430 1965372 1993974 1971136 1905359 1875718 1901075 1915464 1887108
$$ packed form
10693B209293l2117j0346N289j2039l6393l3598j3905j5703m5474n9930k4089
10682A930988K8471K9851k4256n8503k4674K6163K4229j3294k2296m15L798j2284
10670A887778o190K0242J9811j0438k4341j5907k4157m1522j5928L8756M0632
10659A868736k0198m8473K305N0608K4188k5990k6453k202p856j9357Q042M0082
10647A843432K0930k2429k6852K004J8104K1288L1003K5343p150j2139L9786O9847
10635B003167Q307o7166m0227M8558O2488p328l8341J1305M9413K5178J923J7602
10623B074879J7564k1860l4277J1638M5572J7709j9742j6026m882k0357k8120
10612B022098o424k66k8404l2574J0942K8602k2838o5777k9641K5357J4389k8356
$$ plain form
10600 1887108 1863687 1876022 1890914 1889201 1899771 1922052 1905335 1845998 1816251 1848613 1879527
10589 1879527 1862576 1848651 1884816 1917788 1882959 1819948 1807548 1839474 1859160 1870684 1912738
10578 1912738 1955212 1929732 1851715 1810748 1837311 1872210 1877955 1888518 1924433 1943508 1915640
10567 1915640 1878675 1875468 1889672 1889342 1888744 1916368 1953753 1958819 1934643 1926901 1953709 1978111 1962878
10554 1962878 1925958 1919297 1960760 2009619 2018244 1990921 1969620 1970478 1968583 1951541 1948611 1982696
10542 1982696 2026266 2038951 2025439 2020294 2034258 2052541 2069875 2088754 2097485 2089256 2087447 2109881
10530 2109881 2126660 2104911 2077626 2103160 2164143 2181025 2133661 2092770 2108480 2143243 2151743
10519 2151743 2155197 2184103 2209468 2195762 2174691 2195839 2238274 2244747 2221201 2225258 2264550 2285370
$$ packed form
10600A887108k3421J2335J4892j713J0570K2281j6717n9337k9747L2362L0914
10589A879527j6951j3925L6165L2972l4829o3011j2400L1926J9686J1524M2054
10578A912738M2474k5480p8017m0967K6563L4899N745J0563L5915J9075k7868
10567A915640l6965l207J4204l30n98K7624L7385N066k4176p742K6808K4402j5233
10554A962878l6920o661M1463M8859Q625k7323k1301Q58j895j7042k930L4085
10542A982696M3570J2685j3512n145J3964J8283J7334J8879Q731q229j809K2434
10530B109881J6779k1749k7285K5534O0983J6882m7364m0891J5710L4763Q500
10519B151743L454K8906K5365j3706k1071K1148M2435O473k3546M057L9292K0820
$$ plain form
10507 2285370 2270391 2270767 2313558 2345246 2314857 2264885 2278902 2359625 2419811 2400717 2350897 2359090
10495 2359090 2436030 2503011 2497703 2452627 2442988 2481856 2511709 2497291 2474457 2482809 2496593 2470493
10483 2470493 2425908 2429987 2492053 2542065 2530083 2493548 2491370 2514554 2513489 2489488 2496804 2550698
10471 2550698 2592852 2576312 2539670 2551674 2609501 2647974 2641718 2635036 2655690 2663683 2627214 2594155
10459 2594155 2622094 2673442 2663187 2599552 2584465 2656512 2725550 2710713 2663000 2677917 2744936
10448 2744936 2773390 2738227 2707328 2725972 2757634 2757722 2738854 2734734 2749396 2771195 2799566 2831969
10436 2831969 2852197 2851191 2838176 2823191 2813194 2825536 2870882 2921260 2935097 2918138 2916019 2942060
10424 2942060 2963851 2969950 2988339 3018026 3009329 2950274 2910475 2947234 3018908 3048500 3030335 3013604
$$ packed form
10507B285370j4979L76M2791L1688l0389m9972J4017Q0723O0186j9094m9820Q193
10495B359090P6940O6981n308m5076r639L8868K9853j4418k2834Q352J3784k6100
10483B470493m4585M079O2066N0012j1982l6535k178K3184j065k4001P316N3894
10471B550698M2154j6540l6642J2004N7827L8473o256o682K0654P993l6469l3059
10459B594155K7939N1348j0255o3635j5087P2047O9038j4837m7713J4917O7019
10448B744936K8454l5163l0899J8644L1662Q8j8868m120J4662K1799K8371L2403
10436B831969K0228j006j3015j4985r997J2342M5346N0378J3837j6959k119K6041
10424B942060K1791O099J8389K9687q697n9055l9799L6759P1674K9592j8165j6731
$$ plain form
10412 3013604 3017838 3029647 3053030 3095713 3128567 3124419 3116395 3151106 3205665 3224388 3217205 3237330
10400 3237330 3275505 3273611 3243652 3266832 3353070 3407875 3380458 3345194 3378524 3444985 3475159
10389 3475159 3476902 3490100 3501549 3492026 3506154 3579641 3649860 3643816 3610820 3649009 3729900 3731844
10377 3731844 3645720 3604096 3672860 3749206 3731192 3672206 3678444 3743113 3784852 3789188 3805620 3838823
10365 3838823 3844361 3821159 3819633 3856585 3897500 3928469 3974508 4034744 4067280 4060446 4059093 4091357
10353 4091357 4122559 4118815 4111924 4153998 4234394 4289599 4287445 4263530 4272596 4330622 4409258 4468284
10341 4468284 4487808 4480867 4480010 4505921 4547812 4578468 4586360 4585936 4595804 4615133 4629748 4639294 4664744
10328 4664744 4718743 4778413 4806967 4800026 4787830 4790408 4800420 4818282 4864525 4932926 4972483 4958341
$$ packed form
10412C013604M234J1809K3383M2683L2854m148q024L4711N4559J8723p183K0125
10400C237330L8175j894k9959K3180Q6238N4805k7417l5264L3330O6461L0174
10389C475159J743J3198J1449r523J4128P3487P0219o044l2996L8189Q0891J944
10377C731844q6124m1624O8764P6346j8014n8986O238O4669M1739M336J6432L3203
10365C838823N538k3202j526L6952M0915L0969M6039O0236L2536o834j353L2264
10353D091357L1202l744o891M2074Q0396N5205k154k3915R066N8026P8636N9026
10341D468284J9524o941q57K5911M1891L0656P892m24R868J9329J4615R546K5450
10328D664744N3999N9670K8554o941j2196K578J0012J7862M6243O8401L9557j4142
$$ plain form
10316 4958341 4945709 4995724 5073662 5094775 5062063 5070822 5158891 5242622 5248596 5229116 5273901 5365451
10304 5365451 5411412 5389505 5366943 5382167 5398541 5392811 5406411 5467626 5525736 5517918 5464726 5443873
10292 5443873 5485051 5539435 5553866 5536358 5533339 5564420 5602503 5618161 5624494 5657305 5714444 5747568
10280 5747568 5731853 5710592 5733113 5775492 5778482 5750318 5761026 5826918 5877495 5869228 5858713 5907568
10268 5907568 5977239 5994799 5980843 6021865 6131670 6231736 6276397 6310743 6376369 6437407 6448643
10257 6448643 6438849 6466820 6528939 6567966 6557490 6528783 6519450 6534303 6556222 6566016 6552179 6523623
10245 6523623 6508681 6522831 6547647 6562355 6580308 6624931 6684000 6726100 6756100 6811339 6898287
10234 6898287 6976121 7019637 7061681 7147709 7274194 7399668 7500450 7590189 7694509 7828527
$$ packed form
10316D958341j2632N0015P7938K1113l2712Q759Q8069Q3731N974j9480M4785R1550
10304E365451M5961k1907k2562J5224J6374n730J3600O1215N8110p818n3192k0853
10292E443873M1178N4384J4431j7508l019L1081L8083J5658O333L2811N7139L3124
10280E747568j5715k1261K2521M2379K990k8164J0708O5892N0577q267j0515M8855
10268E907568O9671J7560j3956M1022J09805J00066M4661L4346O5626O1038J1236
10257F448643r794K7971O2119L9027j0476k8707r333J4853K1919R794j3837k8556
10245F523623j4942J4150K4816J4708J7953M4623N9069M2100L0000N5239Q6948
10234F898287P7834M3516M2044Q6028J26485J25474J00782Q9739J04320J34018
$$ plain form
10224 7828527 7992438 8168441 8324830 8442134 8539036 8661822 8844356 9081763 9342591 9605111
10214 9605111 9882982 10211198 10601820 11026616 11462519 11937999 12487922 13051973 13467209
10205 13467209 13600472 13463241 13162957 12771702 12293058 11737745 11162384 10618635 10115723
10196 10115723 9656156 9265706 8957380 8697595 8442682 8190047 7963836 7766881 7579787
10187 7579787 7400195 7251244 7146367 7065661 6974421 6857195 6732069 6633103 6572552 6520724
10177 6520724 6437254 6323218 6219637 6148335 6085159 6009233 5944295 5917370 5903245 5855179 5777576
10166 5777576 5720816 5705485 5696925 5661733 5608642 5561544 5528506 5511009 5508988 5502029 5461827 5401697
10154 5401697 5375420 5401494 5427469 5404456 5360038 5349513 5363971 5347658 5294514 5261275 5276602
$$ packed form
10224G828527J63911J76003J56389J17304R6902J22786J82534K37407K60828K62520
10214I605111K77871L28216L90622M24796M35903M75480N49923N64051M15236
10205A3467209J33263j37231l00284l91255m78644n55313n75361n43749n02912
10196A0115723m59567l90450l08326k59785k54913k52635k26211j96955j87094
10187G579787j79592j48951j04877q0706r1240j17226j25126r8966o0551n1828
10177F520724q3470j14036j03581p1302o3176p5926o4938k6925j4125m8066p7603
10166E777576n6760j5331q560l5192n3091m7098l3038j7497k021o959m0202o0130
10154E401697k6277K6074K5975k3013m4418j0525J4458j6313n3144l3239J5327
$$ plain form
10143 5276602 5298758 5287077 5261733 5256919 5259661 5242188 5222021 5233300 5256138 5237089 5180214 5154174
10131 5154174 5189293 5226791 5207994 5163083 5155220 5172645 5149112 5079898 5038196 5060539 5089672
10120 5089672 5068509 5026654 5017375 5018982 4972774 4892049 4852480 4875363 4894953 4857502 4787626 4731228
10108 4731228 4691915 4659789 4651346 4673447 4685020 4645520 4578309 4539017 4537226 4534859 4511363 4484350
10096 4484350 4467150 4449160 4426574 4417639 4432628 4451171 4443808 4405576 4361449 4342569 4354683 4367845
10084 4367845 4348573 4305088 4279723 4288806 4299722 4283987 4257861 4242808 4223701 4187554 4168279
10073 4168279 4197658 4238178 4228835 4181424 4161077 4177932 4176383 4141051 4132506 4187119 4250737 4254563
10061 4254563 4205378 4160347 4154838 4188189 4237367 4254605 4200698 4113648 4089387 4154905 4221278
$$ packed form
10143E276602K2156j1681k5344m814K742j7473k0167J1279K2838j9049n6875k6040
10131E154174L5119L7498j8797m4911p863J7425k3533o9214m1702K2343K9133
10120E089672k1163m1855r279J607m6208q0725l9569K2883J9590l7451o9876n6398
10108D731228l9313l2126q443K2101J1573l9500o7211l9292j791k367k3496k7013
10096D484350j7200j7990k2586q935J4989J8543p363l8232m4127j8880J2114J3162
10084D367845j9272m3485k5365R083J0916j5735k6126j5053j9107l6147j9275
10073D168279K9379M0520r343m7411k0347J6855j549l5332q545N4613O3618L826
10061D254563m9185m5031n509L3351M9178J7238n3907q7050k4261O5518O6373
$$ plain form
10050 4221278 4213383 4179337 4198621 4243799 4231904 4172915 4154971 4194950 4217213 4192184 4186974 4243809
10038 4243809 4304727 4309140 4286782 4292793 4315090 4313715 4302112 4317566 4346050 4349193 4344159 4382646
10026 4382646 4456065 4492651 4460888 4415688 4418208 4457420 4481948 4474383 4458123 4451931 4454531 4466614
10014 4466614 4494712 4529312 4545666 4537731 4531963 4551856 4583021 4593478 4579437 4565581 4562277 4553499
10002 4553499 4535379 4532895 4556122 4570042 4542474 4500926 4499150 4537343 4562390 4549126 4534466 4557038
9990 4557038 4604268 4640574 4653489 4647727 4624267 4593976 4587577 4622102 4675023 4717439 4753230 4797202
9978 4797202 4836219 4850124 4856737 4891644 4946942 4977338 4976437 4999438 5082729 5178782 5214299 5194056
9966 5194056 5196138 5261257 5338080 5365291 5365215 5405886 5493253 5567084 5606685 5666918 5775337 5863730
$$ packed form
10050D221278p895l4046J9284M5178j1895n8989j7944L9979K2263k5029n210N6835
10038D243809O0918M413k2358O011K2297j375j1603J5454K8484L143n034L8487
10026D382646P3419L6586l1763m5200K520L9212K4528p565j6260o192K600J2083
10014D466614K8098L4600J6354p935n768J9893L1165J0457j4041j3856l304q778
10002D553499j8120k484K3227J3920k7568m1548j776L8193K5047j3264j4660K2572
9990D557038M7230L6306J2915n762k3460l0291o399L4525N2921M2416L5791M3972
9978D797202L9017J3905O613L4907N5298L0396r01K3001Q3291R6053L5517k0243
9966E194056K082O5119P6823K7211p6M0671Q7367P3831L9601O0233J08419Q8393
$$ plain form
9954 5863730 5868765 5850931 5923560 6084114 6214567 6256892 6288176 6384942 6504910 6567486 6580318
9943 6580318 6605516 6646594 6654296 6622039 6595316 6592383 6587095 6573917 6584119 6623530 6650887 6640169
9931 6640169 6620456 6629602 6660711 6677987 6665134 6640214 6632948 6653775 6679156 6674373 6639612 6614471
9919 6614471 6620374 6626757 6603627 6576050 6583273 6612509 6627215 6636065 6669172 6705605 6702211 6685920
9907 6685920 6728891 6823486 6875522 6849363 6826557 6872792 6933965 6933172 6899317 6914364 6979637 7022484
9895 7022484 7013021 6995056 7007407 7039269 7064361 7069478 7051118 7024545 7027752 7077654 7135273 7152760
9883 7152760 7136771 7124191 7119990 7111199 7118925 7172708 7247168 7291890 7317252 7377846 7469050 7520018
9871 7520018 7508556 7505121 7565957 7650181 7691994 7700748 7731686 7795766 7859147 7911145 7975612 8061055
$$ packed form
9954E863730N035j7834P2629J60554J30453M2325L1284R6766J19968O2576J2832
9943F580318K5198M1078P702l2257k6723k933n288j3178J0202L9411K7357j0718
9931F640169j9713R146L1109J7276j2853k4920p266K0827K5381m783l4761k5141
9919F614471N903O383k3130k7577P223K9236J4706Q850L3107L6433l394j6291
9907F685920M2971R4595N2036k6159k2806M6235O1173p93l3855J5047O5273M2847
9895G022484r463j7965J2351L1862K5092N117j8360k6573L207M9902N7619J7487
9883G152760j5989j2580m201q791P726N3783P4460M4722K5362O0594R1204N0968
9871G520018j1462l435O0836Q4224M1813Q754L0938O4080O3381N1998O4467Q5443
$$ plain form
9859 8061055 8146733 8220256 8291892 8367643 8440002 8512672 8607190 8732999 8871290 9003278 9140841
9848 9140841 9311635 9519820 9741663 9964185 10206584 10484990 10772396 11024867 11239543 11441842
9838 11441842 11608401 11660701 11570837 11422118 11307689 11207773 11039214 10801465 10586028 10442954
9828 10442954 10329697 10213092 10131212 10107908 10084432 10002915 9904023 9871667 9916152 9978248 10022669
9817 10022669 10060451 10093289 10102308 10094120 10104113 10145375 10194212 10230801 10258413 10278563 10280689 10264216
9805 10264216 10246822 10245274 10260990 10278537 10269208 10217258 10157093 10150236 10198398 10221799 10167489 10093408
9793 10093408 10079141 10093790 10044053 9934433 9870465 9888217 9889112 9791170 9652755 9577289 9564243
9782 9564243 9533759 9453065 9357749 9273085 9189655 9107538 9039671 8972597 8879075 8770159 8684121
$$ packed form
9859H061055Q5678P3523P1636P5751P2359P2670R4518J25809J38291J31988J37563
9848I140841J70794K08185K21843K22522K42399K78406K87406K52471K14676K02299
9838A1441842J66559N2300q9864j48719j14429r9916j68559k37749k15437j43074
9828A0442954j13257j16605q1880k3304k3476q1517r8892l2356M4485O2096M4421
9817A0022669L7782L2838R019q188R993M1262M8837L6589K7612K0150K126j6473
9805A0264216j7394j548J5716J7547r329n1950o0165o857M8162K3401n4310p4081
9793A0093408j4267J4649m9737j09620o3968J7752Q95r7942j38415p5466j3046
9782I564243l0484q0694r5316q4664q3430q2117o7867o7074r3522j08916q6038
$$ plain form
9771 8684121 8621550 8541306 8428752 8320762 8248150 8193474 8124190 8034912 7939027 7847061 7771263
9760 7771263 7726209 7705267 7676218 7617992 7546084 7487726 7448307 7415723 7380338 7334757 7270696
9749 7270696 7196136 7142976 7133975 7145976 7127639 7058153 6973754 6928044 6933318 6950472 6936956 6895105
9737 6895105 6862725 6860365 6868745 6867356 6871314 6903618 6946332 6956970 6932739 6920069 6949834 6998011
9725 6998011 7027186 7034239 7034835 7032124 7029719 7047900 7092943 7133882 7146193 7154453 7187768 7217427 7198855
9712 7198855 7162170 7187304 7281036 7354647 7352460 7331082 7363740 7429290 7462304 7465977 7495588 7555033
9700 7555033 7593062 7597696 7614617 7660915 7695354 7698324 7711977 7763813 7811660 7814024 7805607 7844026
9688 7844026 7916377 7962755 7972644 7991498 8034860 8060842 8044095 8023664 8047051 8101859 8137009 8133857
$$ packed form
9771H684121o2571q0244j12554j07990p2612n4676o9284q9278r5885r1966p5798
9760G771263m5054k0942k9049n8226p1908n8358l9419l2584l5385m5581o4061
9749G270696p4560n3160r001J2001j8337o9486q4399m5710N274J7154j3516m1851
9737F895105l2380k360Q380j389L958L2304M2714J0638k4231j2670K9765M8177
9725F998011K9175P053N96k711k405J8181M5043M0939J2311Q260L3315K9659j8572
9712G198855l6685K5134R3732P3611k187k1378L2658O5550L3014L673K9611N9445
9700G555033L8029M634J6921M6298L4439K970J3653N1836M7847K364q417L8419
9688G844026P2351M6378R889J8854M3362K5982j6747k0431K3387N4808L5150l152
$$ plain form
9676 8133857 8125845 8151974 8212247 8272371 8301614 8301569 8300427 8322133 8364763 8409702 8444865 8473143
9664 8473143 8503898 8543135 8587731 8624626 8642476 8648174 8661156 8685328 8700422 8691023 8670167 8661337
9652 8661337 8669239 8680561 8680997 8661589 8625938 8602253 8624210 8683459 8728793 8733709 8731632 8754846
9640 8754846 8779036 8775528 8779939 8841287 8926826 8956841 8928555 8922907 8977883 9038712 9060939 9082232
9628 9082232 9146295 9224386 9270171 9299720 9356168 9434304 9499230 9549700 9608220 9674216 9738710
9617 9738710 9820442 9934801 10048469 10116036 10140471 10147063 10124171 10050897 9961427 9911259 9889948
9606 9889948 9839419 9756244 9699743 9689062 9668721 9600979 9523051 9477064 9443381 9387584 9325119
9595 9325119 9289595 9270925 9233945 9177373 9131063 9107129 9089167 9061523 9021169 8969562 8917678
$$ packed form
9676H133857q012K6129O0273O0124K9243m5j142K1706M2630M4939L5163K8278
9664H473143L0755L9237M4596L6895J7850N698J2982K4172J5094r399k0856q830
9652H661337P902J1322M36j9408l5651k3685K1957N9249M5334M916k077K3214
9640H754846K4190l508M411O1348Q5539L0015k8286n648N4976O0829K2227K1293
9628I082232O4063P8091M5785K9549N6448P8136O4926N0470N8520O5996O4494
9617I738710Q1732J14359J13668O7567K4435O592k2892p3274q9470n0168k1311
9606I889948n0529q3175n6501j0681k0341o7742p7928m5987l3683n5797o2465
9595I325119l5524j8670l6980n6572m6310k3934j7962k7644m0354n1607n1884
$$ plain form
9584 8917678 8889630 8896576 8914326 8910312 8886961 8874336 8882099 8884811 8862369 8833390 8830370 8851826
9572 8851826 8862968 8848384 8838509 8861807 8891629 8881759 8847813 8857044 8921687 8964310 8930667 8881635
9560 8881635 8909762 9004216 9073850 9081243 9073882 9091471 9123677 9162896 9219908 9275972 9295238 9298021
9548 9298021 9343640 9424668 9464087 9442096 9433330 9481277 9532981 9550501 9585527 9668642 9721977 9682822
9536 9682822 9635085 9700430 9852340 9958585 9973739 9970386 9999953 10042574 10091297 10170660 10260186
9525 10260186 10303406 10309756 10351804 10444773 10525373 10570067 10632349 10730520 10801477 10815020 10838864
9514 10838864 10927483 11029318 11076339 11096531 11159740 11266141 11367359 11457172 11562185 11669625
9504 11669625 11740596 11783710 11851043 11964181 12095438 12218781 12334516 12446336 12553877 12667827
$$ packed form
9584H917678k8048O946J7750m014k3351j2625P763K712k2442k8979l020K1456
9572H851826J1142j4584r875K3298K9822r870l3946R231O4643M2623l3643m9032
9560H881635K8127R4454O9634P393p361J7589L2206L9219N7012N6064J9266K783
9548I298021M5619Q1028L9419k1991q766M7947N1704J7520L5026Q3115N3335l9155
9536I682822m7737O5345J51910J06245J5154l353K9567M2621M8723P9363Q9526
9525A0260186M3220O350M2048R2969Q0600M4694O2282R8171P0957J3543K3844
9514A0838864Q8619J01835M7021K0192O3209J06401J01218Q9813J05013J07440
9504A1669625P0971M3114O7333J13138J31257J23343J15735J11820J07541J13950
$$ plain form
9494 12667827 12800117 12939432 13061088 13158360 13246399 13342991 13458008 13586761 13703336 13783230
9484 13783230 13843448 13929649 14050068 14161088 14238938 14319983 14436705 14558919 14644291 14709719
9474 14709719 14800277 14916011 15024047 15121425 15229273 15338296 15416740 15469487 15539518 15647847
9464 15647847 15772295 15887997 15994189 16099420 16209568 16330224 16458001 16575860 16677315
9455 16677315 16782471 16909926 17049964 17183745 17304142 17400000 17457107 17499625 17584324 17719157
9445 17719157 17839844 17910673 17986214 18112123 18233177 18286736 18325584 18437278 18588318 18677546
9435 18677546 18716823 18814958 18985684 19124420 19199406 19310279 19503615 19680822 19771787 19863618
9425 19863618 20049729 20267421 20412292 20523165 20714469 20986999 21245447 21464795 21702322
$$ packed form
9494A2667827J32290J39315J21656R7272Q8039R6592J15017J28753J16575P9894
9484A3783230O0218Q6201J20419J11020P7850Q1045J16722J22214Q5372O5428
9474A4709719R0558J15734J08036R7378J07848J09023P8444N2747P0031J08329
9464A5647847J24448J15702J06192J05231J10148J20656J27777J17859J01455
9455A6677315J05156J27455J40038J33781J20397R5858N7107M2518Q4699J34833
9445A7719157J20687P0829P5541J25909J21054N3559L8848J11694J51040Q9228
9435A8677546L9277R8135J70726J38736P4986J10873J93336J77207R0965R1831
9425A9863618J86111K17692J44871J10873J91304K72530K58448K19348K37527
$$ plain form
9416 21702322 21964360 22195973 22403845 22662049 22975329 23249863 23432273 23579727 23756567
9407 23756567 23953347 24151442 24380723 24655748 24926934 25159290 25401853 25711305 26052808
9398 26052808 26351444 26613872 26920936 27304005 27699399 28042390 28351973 28692551 29087585
9389 29087585 29507609 29925893 30347412 30781812 31222011 31666186 32134838 32638453 33145949
9380 33145949 33622986 34094395 34622724 35219058 35825621 36405459 36994137 37625938 38263979
9371 38263979 38863611 39464204 40141498 40887041 41614419 42287143 42965869 43712545 44515016
9362 44515016 45333269 46160313 47000646 47837960 48668567 49532246 50465356 51444049 52412118
9353 52412118 53351521 54292725 55264781 56265523 57279583 58301585 59334307 60373985 61405642
$$ packed form
9416B1702322K62038K31613K07872K58204L13280K74534J82410J47454J76840
9407B3756567J96780J98095K29281K75025K71186K32356K42563L09452L41503
9398B6052808K98636K62428L07064L83069L95394L42991L09583L40578L95034
9389B9087585M20024M18284M21519M34400M40199M44175M68652N03615N07496
9380C3145949M77037M71409N28329N96334O06563N79838N88678O31801O38041
9371C8263979N99632O00593O77294P45543P27378O72724O78726P46676Q02471
9362D4515016Q18253Q27044Q40333Q37314Q30607Q63679R33110R78693R68069
9353E2412118R39403R41204R72056J000742J014060J022002J032722J039678J031657
$$ plain form
9344 61405642 62418954 63430235 64474229 65559946 66649402 67702428 68727700 69759429
9336 69759429 70797990 71813804 72801004 73779865 74747681 75678897 76579537 77486032 78395252
9327 78395252 79252166 80032127 80782296 81548104 82305895 83006881 83646469 84248232 84814559
9318 84814559 85336977 85827337 86296917 86727061 87096434 87413841 87691712 87916227 88079700
9309 88079700 88210899 88330523 88405079 88391444 88302735 88181943 88031785 87820853 87541990 87214232
9299 87214232 86840477 86412394 85945665 85461934 84945422 84363911 83723155 83056098 82371054
9290 82371054 81656239 80919579 80175483 79413585 78637213 77905236 77256413 76603583 75791413
9281 75791413 74769515 73629904 72461901 71256578 69982401 68670065 67372720 66104331
$$ packed form
9344F1405642J013312J011281J043994J085717J089456J053026J025272J031729
9336F9759429J038561J015814R87200R78861R67816R31216R00640R06495R09220
9327G8395252Q56914P79961P50169P65808P57791P00986O39588O01763N66327
9318H4814559N22418M90360M69580M30144L69373L17407K77871K24515J63473
9309H8079700J31199J19624P4556j3635q8709j20792j50158k10932k78863l27758
9299H7214232l73755m28083m66729m83731n16512n81511o40756o67057o85044
9290H2371054p14815p36660p44096p61898p76372p31977o48823o52830q12170
9281G5791413j021898j139611j168003j205323j274177j312336j297345j268389
$$ plain form
9273 66104331 64863593 63666644 62515345 61382541 60264911 59198738 58188714 57180439
9265 57180439 56147114 55144334 54226615 53364033 52498393 51630937 50793532 49982601 49189204
9256 49189204 48448047 47780400 47127841 46425561 45711019 45072505 44511635 43949014 43355634
9247 43355634 42782871 42258454 41747382 41234915 40760586 40338988 39923544 39485885 39065740
9238 39065740 38703935 38382726 38068304 37759357 37459482 37154424 36852315 36594949 36391993
9229 36391993 36194728 35972172 35758053 35579525 35399875 35189424 34995806 34871018 34775102 34636184
9219 34636184 34473332 34366802 34320534 34251107 34121563 33995569 33932344 33906668 33871135 33830130
9209 33830130 33804644 33779270 33739642 33721777 33764991 33840815 33886542 33897004 33927288 34004948 34093477
$$ packed form
9273F6104331j240738j196949j151299j132804j117630j066173j010024j008275
9265E7180439j033325j002780r17719q62582q65640q67456q37405q10931p93397
9256D9189204p41157o67647o52559p02280p14542o38514n60870n62621n93380
9247D3355634n72763n24417n11072n12467m74329m21598m15444m37659m20145
9238C9065740l61805l21209l14422l08947k99875l05058l02109k57366k02956
9229C6391993j97265k22556k14119j78528j79650k10451j93618j24788r5916j38918
9219C4636184j62852j06530m6268o9427j29544j25994o3225k5676l5533m1005
9209C3830130k5486k5374l9628j7865M3214P5824M5727J0462L0284P7660Q8529
$$ plain form
9198 34093477 34158899 34228435 34351958 34528945 34706804 34846657 34965709 35110070 35303477 35533496
9188 35533496 35777454 36025838 36280567 36545185 36824118 37122739 37441993 37781930 38154522
9179 38154522 38575441 39030695 39473367 39880941 40300479 40798090 41366987 41930839 42450636
9170 42450636 42982835 43601208 44296404 44996851 45671635 46365076 47127117 47948884 48783616
9161 48783616 49608520 50447463 51339863 52297629 53293533 54292832 55294574 56328978 57409141
9152 57409141 58506243 59590644 60678225 61806564 62976092 64149276 65306932 66471582
9144 66471582 67669020 68896972 70141488 71397965 72665540 73944405 75246871 76585838
9136 76585838 77945274 79291569 80621852 81964141 83316107 84629109 85881331 87121670
$$ packed form
9198C4093477O5422O9536J23523J76987J77859J39853J19052J44361J93407K30019
9188C5533496K43958K48384K54729K64618K78933K98621L19254L39937L72592
9179C8154522M20919M55254M42672M07574M19538M97611N68897N63852N19797
9170D2450636N32199O18373O95196P00447O74784O93441P62041Q21767Q34732
9161D8783616Q24904Q38943Q92400R57766R95904R99299J001742J034404J080163
9152E7409141J097102J084401J087581J128339J169528J173184J157656J164650
9144F6471582J197438J227952J244516J256477J267575J278865J302466J338967
9136G6585838J359436J346295J330283J342289J351966J313002J252222J240339
$$ plain form
9128 87121670 88396492 89668757 90864766 91976667 93057021 94123713 95136828 96075020
9120 96075020 96972180 97858734 98718257 99527629 100297704 101047635 101774982 102476687 103165053
9111 103165053 103835669 104452539 104995126 105488955 105955198 106358084 106642864 106806202 106887301
9102 106887301 106901219 106821958 106628552 106332912 105960199 105527901 105045231 104513375 103929424 103303881
9092 103303881 102660109 101998883 101286732 100507716 99700683 98903594 98083085 97173945 96177425
9083 96177425 95157093 94132418 93041644 91832967 90535578 89207181 87859386 86475499
9075 86475499 85061809 83632072 82167078 80640002 79070886 77513900 75996698 74508520
9067 74508520 73041139 71601672 70183812 68764769 67340924 65936834 64567894 63220331
$$ packed form
9128H7121670J274822J272265J196009J111901J080354J066692J013115R38192
9120I6075020Q97160Q86554Q59523Q09372P70075P49931P27347P01705O88366
9111A03165053O70616O16870N42587M93829M66243M02886K84780J63338Q1099
9102A06887301J3918p9261j93406k95640l72713m32298m82670n31856n83951o25543
9092A03303881o43772o61226p12151p79016q07033p97089q20509r09140r96520
9083I6177425j020332j024675j090774j208677j297389j328397j347795j383887
9075H6475499j413690j429737j464994j527076j569116j556986j517202j488178
9067G4508520j467381j439467j417860j419043j423845j404090j368940j347563
$$ plain form
9059 63220331 61880413 60557216 59257027 57956511 56628697 55286533 53972906 52705522
9051 52705522 51455951 50193547 48929776 47699978 46514462 45354152 44212152 43109408
9043 43109408 42058459 41038173 40024854 39029756 38083007 37194071 36349776 35536704 34741726
9034 34741726 33947940 33160412 32417739 31739551 31080237 30385071 29680037 29042598 28482216
9025 28482216 27921407 27314035 26710088 26167580 25667901 25168398 24679378 24228421 23797671
9016 23797671 23362603 22950485 22588493 22231627 21824848 21409195 21073481 20812159 20529205
9007 20529205 20189710 19868575 19620487 19392903 19116449 18809221 18534289 18305547 18089859
8998 18089859 17865248 17631963 17397014 17182050 17011496 16863460 16676344 16438040 16217983
$$ packed form
9059F3220331j339918j323197j300189j300516j327814j342164j313627j267384
9051E2705522j249571j262404j263771j229798j185516j160310j142000j102744
9043D3109408j050949j020286j013319r95098r46749q88936q44295q13072p94978
9034C4741726p93786p87528p42673o78188o59314o95166p05034o37439n60382
9025B8482216n60809o07372o03947n42508m99679m99503m89020m50957m30750
9016B3797671m35068m12118l61992l56866m06779m15653l35714k61322k82954
9007B0529205l39495l21135k48088k27584k76454l07228k74932k28742k15688
8998A8089859k24611k33285k34949k14964j70554j48036j87116k38304k20057
$$ plain form
8989 16217983 16066839 15937672 15764693 15569888 15416429 15294317 15141776 14963429 14832108
8980 14832108 14764364 14682729 14532835 14365265 14255830 14197931 14125513 14008982 13877276 13760777
8970 13760777 13658145 13560600 13475747 13414469 13367584 13306973 13212731 13099106 13006294 12957945 12932897
8959 12932897 12891477 12823719 12754493 12704331 12665319 12618391 12558170 12496168 12449806 12428348 12421392
8948 12421392 12406654 12377697 12351875 12338747 12320258 12284167 12255118 12258563 12271916 12255411 12220674
8937 12220674 12216769 12248433 12265212 12245340 12233138 12263617 12299136 12283295 12224560 12181840 12185015 12207586
8925 12207586 12208348 12171371 12112784 12068242 12061321 12068228 12033819 11941573 11842709 11790732 11773544 11743370
8913 11743370 11689318 11638466 11601027 11559523 11506539 11452536 11398904 11340935 11293632 11273116 11252779
$$ packed form
8989A6217983j51144j29167j72979j94805j53459j22112j52541j78347j31321
8980A4832108o7744q1635j49894j67570j09435n7899p2418j16531j31706j16499
8970A3760777j02632r7545q4853o1278m6885o0611r4242j13625r2812m8349k5048
8959A2932897m1420o7758o9226n0162l9012m6928o0221o2002m6362k1458o956
8948A2421392j4738k8957k5822j3128j8489l6091k9049L445J3353j6505l4737
8937A2220674l905L1664J6779j9872j2202L0479L5519j5841n8735m2720L175K2571
8925A2207586P62l6977n8587m4542o921O907l4409r2246r8864n1977j7188l0174
8913A1743370n4052n0852l7439m1504n2984n4003n3632n7969m7303k0516k0337
$$ plain form
8902 11252779 11183798 11067862 10964647 10909855 10867135 10786334 10674522 10577343 10514592 10468309 10420569
8891 10420569 10370139 10314470 10241646 10147132 10046765 9967581 9925050 9904437 9867319 9789578 9692777
8880 9692777 9620828 9584506 9551772 9498687 9441964 9406060 9385020 9360993 9339243 9334688 9336198 9315814
8868 9315814 9270518 9228137 9210052 9209286 9208008 9198253 9181170 9159765 9136579 9110996 9081101 9054700
8856 9054700 9048568 9064769 9080352 9077986 9072812 9084748 9097938 9082156 9048420 9043174 9082450 9131115
8844 9131115 9159286 9180399 9213882 9247300 9263938 9277427 9306757 9341969 9367977 9398442 9447381
8833 9447381 9488830 9491548 9480049 9508650 9578288 9633774 9650721 9669993 9726760 9796667 9841775 9865379
8821 9865379 9885320 9892011 9876907 9872104 9911793 9973276 10006011 10007613 10020299 10057112 10086877 10100305
$$ packed form
8902A1252779o8981j15936j03215n4792m2720q0801j11812r7179o2751m6283m7740
8891A0420569n0430n5669p2824r4514j00367p9184m2531k0613l7118p7741r6801
8880I692777p1949l6322l2734n3085n6723l5904k1040k4027k1750m555J510k0384
8868I315814m5296m2381j8085p66j278r755j7083k1405k3186k5583k9895k6401
8856I054700o132J6201J5583k366n174J1936J3190j5782l3736n246L9276M8665
8844I131115K8171K1113L3483L3418J6638J3489K9330L5212K6008L0465M8939
8833I447381M1449K718j1499K8601O9638N5486J6947J9272N6767O9907M5108K3604
8821I865379J9941O691j5104m803L9689O1483L2735J602J2686L6813K9765J3428
$$ plain form
8809 10100305 10135698 10213091 10286302 10298348 10260843 10241690 10282359 10356317 10409941 10423638 10424802
8798 10424802 10449376 10500319 10549330 10577043 10597162 10631724 10677877 10717353 10745495 10766510 10772251
8787 10772251 10757722 10748967 10776017 10820263 10833871 10816731 10823097 10874667 10919999 10912071 10879241 10877280
8775 10877280 10909118 10939571 10959165 10982125 11003851 11013348 11031870 11085928 11152864 11186948 11192333 11214348
8763 11214348 11261869 11299462 11321639 11369297 11452349 11518081 11530698 11531452 11577258 11657081 11714630 11730937
8751 11730937 11742620 11788462 11868434 11950858 12003559 12026942 12061866 12143906 12247480 12311802 12331698
8740 12331698 12372756 12469521 12562386 12584424 12567353 12597107 12690548 12786073 12846061 12897258 12963682
8729 12963682 13027299 13076582 13135888 13215535 13280487 13305839 13325397 13382809 13461918 13512132 13528573
$$ packed form
8809A0100305L5393P7393P3211J2046l7505j9153M0669P3958N3624J3697J164
8798A0424802K4574N0943M9011K7713K0119L4562M6153L9476K8142K1015N741
8787A0772251j4529q755K7050M4246J3608j7140O366N1570M5332p928l2830j961
8775A0877280L1838L0453J9594K2960K1726R497J8522N4058O6936L4084N385K2015
8763A1214348M7521L7593K2177M7658Q3052O5732J2617P54M5806P9823N7549J6307
8751A1730937J1683M5842P9972Q2424N2701K3383L4924Q2040J03574O4322J9896
8740A2331698M1058R6765R2865K2038j7071K9754R3441R5525N9988N1197O6424
8729A2963682O3617M9283N9306P9647O4952K5352J9558N7412P9109N0214J6441
$$ plain form
8718 13528573 13559699 13635167 13728939 13806555 13872512 13945477 14012744 14048323 14070655 14138964 14272607
8707 14272607 14407726 14472146 14485508 14535073 14651199 14764538 14812550 14833712 14904408 15020791
8697 15020791 15112559 15159466 15217988 15320634 15420522 15471623 15508224 15594557 15730210 15857558 15944496
8686 15944496 16011482 16085268 16171922 16276494 16406656 16545600 16656015 16728406 16801039 16914352
8676 16914352 17063951 17215309 17349306 17474107 17601990 17734308 17866950 17995881 18117563
8667 18117563 18234048 18354668 18482127 18602592 18705845 18812062 18956021 19138652 19316295
8658 19316295 19451649 19556773 19667643 19793854 19919828 20044258 20185124 20345004 20501849
8649 20501849 20641747 20776136 20919024 21070853 21231795 21404703 21575886 21722235 21851200
$$ packed form
8718A3528573L1126P5468R3772P7616O5957P2965O7267L5579K2332O8309J33643
8707A4272607J35119O4420J3362M9565J16126J13339M8012K1162P0696J16383
8697A5020791R1768M6907N8522J02646R9888N1101L6601Q6333J35653J27348Q6938
8686A5944496O6986P3786Q6654J04572J30162J38944J10415P2391P2633J13313
8676A6914352J49599J51358J33997J24801J27883J32318J32642J28931J21682
8667A8117563J16485J20620J27459J20465J03253J06217J43959J82631J77643
8658A9316295J35354J05124J10870J26211J25974J24430J40866J59880J56845
8649B0501849J39898J34389J42888J51829J60942J72908J71183J46349J28965
$$ plain form
8640 21851200 22003828 22200037 22409954 22599960 22776917 22962810 23157257 23354335 23565816
8631 23565816 23795947 24024652 24247957 24495118 24765000 24995079 25154858 25321871 25582045
8622 25582045 25892345 26144125 26340474 26590001 26921241 27235570 27482762 27754902 28134095
8613 28134095 28556263 28919707 29243230 29612421 30033592 30450587 30862002 31311842 31791043
8604 31791043 32254441 32720646 33251724 33837425 34400111 34922469 35475143 36100824 36760962
8595 36760962 37421660 38105602 38823575 39533376 40211845 40902804 41647098 42418932 43174643
8586 43174643 43915160 44657674 45391782 46108889 46836026 47596042 48365832 49112799 49842975
8577 49842975 50578752 51321330 52071409 52855682 53693470 54561176 55423749 56278633 57140516
$$ packed form
8640B1851200J52628J96209K09917J90006J76957J85893J94447J97078K11481
8631B3565816K30131K28705K23305K47161K69882K30079J59779J67013K60174
8622B5582045L10300K51780J96349K49527L31240L14329K47192K72140L79193
8613B8134095M22168L63444L23523L69191M21171M16995M11415M49840M79201
8604C1791043M63398M66205N31078N85701N62686N22358N52674O25681O60138
8595C6760962O60698O83942P17973P09801O78469O90959P44294P71834P55711
8586D3174643P40517P42514P34108P17107P27137P60016P69790P46967P30176
8577D9842975P35777P42578P50079P84273Q37788Q67706Q62573Q54884Q61883
$$ plain form
8568 57140516 58009336 58880168 59754351 60614184 61421292 62167731 62888418 63593112 64237416
8559 64237416 64805285 65366080 65986648 66630441 67216990 67749270 68302571 68906863 69523580
8550 69523580 70134016 70769628 71446502 72142790 72855515 73613654 74417452 75225517 76020077
8541 76020077 76827148 77655855 78480312 79303003 80169881 81091215 82013318 82911882 83851502
8532 83851502 84896507 86014504 87135033 88266913 89484340 90814317 92208421 93625992
8524 93625992 95085314 96623046 98252282 99974739 101793452 103696070 105658146 107681511
8516 107681511 109804209 112055375 114422484 116882945 119450652 122166311 125046691 128065723
8508 128065723 131191731 134429076 137811277 141359803 145066099 148916035 152910531 157044406
$$ packed form
8568E7140516Q68820Q70832Q74183Q59833Q07108P46439P20687P04694O44304
8559F4237416N67869N60795O20568O43793N86549N32280N53301O04292O16717
8550F9523580O10436O35612O76874O96288P12725P58139Q03798Q08065P94560
8541G6020077Q07071Q28707Q24457Q22691Q66878R21334R22103Q98564R39620
8532H3851502J045005J117997J120529J131880J217427J329977J394104J417571
8524I3625992J459322J537732J629236J722457J818713J902618J962076K023365
8516A07681511K122698K251166K367109K460461K567707K715659K880380L019032
8508A28065723L126008L237345L382201L548526L706296L849936L994496M133875
$$ plain form
8500 157044406 161281397 165581424 169950761 174432596 179040123 183731614 188468633 193268287
8492 193268287 198171970 203189098 208308539 213551075 218969850 224598738 230434453 236475657
8484 236475657 242749584 249288691 256106674 263213217 270630794 278374799 286429866 294771155
8476 294771155 303407851 312382962 321722030 331399674 341374007 351646481 362266963 373277133
8468 373277133 384669377 396411875 408489739 420886054 433515883 446196309 458685638
8461 458685638 470738110 482121609 492610595 501991039 510085349 516781387 522044417 525894460
8453 525894460 528364713 529498962 529410741 528326845 526531631 524263394 521688630 518958885
8445 518958885 516230174 513607758 511119651 508765571 506540699 504378863 502124676 499613158
$$ packed form
8500A57044406M236991M300027M369337M481835M607527M691491M737019M799654
8492A93268287M903683N017128N119441N242536N418775N628888N835715O041204
8484B36475657O273927O539107O817983P106543P417577P744005Q055067Q341289
8476B94771155Q636696Q975111R339068R677644R974333J0272474J0620482J1010170
8468C73277133J1392244J1742498J2077864J2396315J2629829J2680426J2489329
8461D58685638J2052472J1383499J0488986R380444Q094310O696038N263030L850043
8453E25894460K470253J134249q8221j083896j795214k268237k574764k729745
8445E18958885k728711k622416k488107k354080k224872k161836k254187k511518
$$ plain form
8437 499613158 496740287 493401594 489391781 484425162 478239216 470633420 461453147 450639823
8429 450639823 438318058 424768452 410295711 395171215 379694439 364210429 349010018
8422 349010018 334262956 320087397 306624061 293979556 282138061 271003511 260520500
8415 260520500 250698398 241523315 232906236 224734851 216938723 209487497 202355288 195508652
8407 195508652 188914079 182538796 176350105 170329222 164490893 158882603 153550869 148499741
8399 148499741 143691401 139099712 134749512 130677820 126867017 123256296 119821072 116593815
8391 116593815 113589244 110758018 108049243 105477423 103080819 100843477 98711696 96669898
8383 96669898 94745551 92946481 91246466 89633254 88120041 86703160 85356108 84074225
$$ packed form
8437D99613158k872871l338693m009813m966619o185946p605796r180273j0813324
8429D50639823j2321765j3549606j4472741j5124496j5476776j5484010j5200411
8422C49010018j4747062j4175559j3463336j2644505j1841495j1134550j0483011
8415B60520500r822102r175083q617079q171385p796128p451226p132209o846636
8407A95508652o594573o375283o188691o020883n838329n608290n331734n051128
8399A48499741m808340m591689m350200m071692l810803l610721l435224l227257
8391A16593815l004571k831226k708775k571820k396604k237342k131781k041798
8383I6669898j924347j799070j700015j613212j513213j416881j347052j281883
$$ plain form
8375 84074225 82876644 81750188 80641484 79526601 78440381 77408379 76398328 75378932
8367 75378932 74382338 73454845 72577407 71695923 70812664 69983711 69229187 68509553 67800965
8358 67800965 67133717 66533044 65975986 65439923 64945442 64506025 64073755 63590779 63071584
8349 63071584 62574525 62101812 61591406 61013881 60413066 59825757 59218137 58542781 57815136
8340 57815136 57082712 56347339 55573329 54758298 53941841 53148284 52372233 51620907 50915441
8331 50915441 50240151 49547836 48838227 48175368 47590368 47017222 46376996 45688712 45035748
8322 45035748 44443166 43852172 43210547 42526460 41825545 41113190 40399827 39714139 39061614
8313 39061614 38406286 37722410 37034156 36375967 35742275 35109559 34484957 33895159 33340504
$$ packed form
8375H4074225j197581j126456j108704j114883j086220j032002j010051j019396
8367G5378932r96594r27493q77438q81484q83259q28953p54524p19634p08588
8358F7800965o67248o00673n57058n36063m94481m39417m32270m82976n19195
8349F3071584m97059m72713n10406n77525o00815n87309o07620o75356p27645
8340E7815136p32424p35373p74010q15031q16457p93557p76051p51326p05466
8331E0915441o75290o92315p09609o62859n85000n73146o40226o88284o52964
8322D5035748n92582n90994o41625o84087p00915p12355p13363o85688o52525
8313C9061614o55328o83876o88254o58189o33692o32716o24602n89798n54655
$$ plain form
8304 33340504 32797286 32260787 31752972 31286509 30848054 30418883 29989298 29553883 29118108
8295 29118108 28710112 28357238 28045035 27728362 27393516 27078659 26813467 26568287 26296146
8286 26296146 26007035 25759630 25580202 25427950 25253689 25062736 24898106 24781896 24699689 24632982
8276 24632982 24579651 24541515 24514648 24500155 24509486 24549896 24613170 24682482 24738949 24756363 24703539
8265 24703539 24564720 24352083 24089055 23785527 23436041 23037291 22600430 22149223 21709848
8256 21709848 21298649 20918265 20568718 20254708 19969496 19683514 19378318 19087697 18863110
8247 18863110 18689323 18486438 18224953 17983746 17838446 17738092 17572719 17339664 17147191
8238 17147191 17047748 16966754 16831652 16679161 16572989 16491651 16379885 16256487 16177305 16123388
$$ packed form
8304C3340504n43218n36499n07815m66463m38455m29171m29585m35415m35775
8295B9118108m07996l52874l12203l16673l34846l14857k65192k45180k72141
8286B6296146k89111k47405j79428j52252j74261j90953j64630j16210q2207o6707
8276B4632982n3331l8136k6867j4493R331M0410O3274O9312N6467J7414n2824
8265B4703539j38819k12637k63028l03528l49486l98750m36861m51207m39375
8256B1709848m11199l80384l49547l14010k85212k85982l05196k90621k24587
8247A8863110j73787k02885k61485k41207j45300j00354j65373k33055j92473
8238A7147191r9443q0994j35102j52491j06172q1338j11766j23398p9182n3917
$$ plain form
8228 16123388 16026135 15894524 15815703 15812739 15796474 15697864 15568137 15492066 15463792 15414535 15321644
8217 15321644 15220881 15132587 15041356 14943412 14857536 14784291 14699628 14595813 14490898 14392432 14288745
8206 14288745 14181994 14090419 14006314 13892238 13740113 13598488 13511486 13456394 13373571 13240902
8196 13240902 13088087 12950057 12837204 12743776 12654300 12543277 12397425 12241077 12114263 12021104
8186 12021104 11922899 11787579 11623682 11458864 11306965 11165591 11026567 10879232 10720873 10569685
8176 10569685 10446315 10338228 10211199 10064542 9938257 9847227 9750396 9618795 9493269 9423342
8166 9423342 9378323 9283329 9131391 8992196 8906568 8839766 8755704 8670478 8599919 8514753 8395181
8155 8395181 8282065 8217729 8170455 8079194 7952458 7857925 7817933 7778026 7692445 7587328 7511511
$$ packed form
8228A6123388r7253j31611p8821k964j6265r8610j29727p6071k8274m9257r2891
8217A5321644j00763q8294r1231r7944q5876p3245q4663j03815j04915r8466j03687
8206A4288745j06751r1575q4105j14076j52125j41625q7002n5092q2823j32669
8196A3240902j52815j38030j12853r3428q9476j11023j45852j56348j26814r3159
8186A2021104r8205j35320j63897j64818j51899j41374j39024j47335j58359j51188
8176A0569685j23370j08087j27029j46657j26285r1030r6831j31601j25526o9927
8166I423342m5019r4994j51938j39195q5628o6802q4062q5226p0559q5166j19572
8155H395181j13116o4336m7274r1261j26736r4533l9992l9907q5581j05117p5817
$$ plain form
8144 7511511 7462559 7397767 7301655 7208607 7155689 7133941 7100231 7031814 6950829 6884819 6822705
8133 6822705 6739906 6656654 6623427 6638006 6629752 6557347 6472974 6441365 6437291 6388915 6296418 6231831
8121 6231831 6227106 6237117 6222424 6197138 6173875 6128909 6056395 6000046 5989288 5989499 5957936 5908853
8109 5908853 5877585 5854785 5808557 5749312 5719662 5728243 5738092 5719352 5678445 5636044 5606301 5597388
8097 5597388 5605783 5608217 5580222 5524719 5468920 5436203 5431415 5444893 5458789 5458258 5445288 5430697
8085 5430697 5410808 5374813 5338244 5333774 5355481 5353174 5306511 5262510 5264405 5284342 5272673 5237497
8073 5237497 5219635 5217825 5201833 5179817 5184686 5203498 5190585 5150492 5137005 5160886 5169813 5139821
8061 5139821 5117576 5140046 5173978 5175426 5155930 5143434 5123333 5071994 5016249 5003655 5030583 5048645
$$ packed form
8144G511511m8952o4792r6112r3048n2918k1748l3710o8417q0985o6010o2114
8133F822705q2799q3252l3227J4579q254p2405q4373l1609m074m8376r2497o4587
8121F231831m725J0011j4693k5286k3263m4966p2514n6349j0758K11l1563m9083
8109E908853l1268k2800m6228n9245k9650Q581R849j8740m0907m2401k9743q913
8097E597388Q395K434k7995n5503n5799l2717m788J3478J3896n31j2970j4591
8085E430697j9889l5995l6569m470K1707k307m6663m4001J895J9937j1669l5176
8073E237497j7862j810j5992k2016M869J8812j2913m0093j3487K3881Q927k9992
8061E139821k2245K2470L3932J448j9496j2496k0101n1339n5745j2594K6928J8062
$$ plain form
8049 5048645 5033649 5006319 4988690 4976642 4958008 4931393 4903826 4885101 4880703 4880183 4865231 4840616
8037 4840616 4837178 4867598 4903086 4917676 4930431 4969992 5017895 5030520 5009116 5002821 5037134 5079826
8025 5079826 5093354 5089328 5107802 5161022 5221654 5260735 5278116 5292085 5311291 5327815 5336548 5348321
8013 5348321 5373805 5403539 5421693 5435941 5470410 5525214 5568892 5584073 5597934 5647714 5731707
8002 5731707 5814272 5868558 5896789 5917863 5951823 6009536 6083252 6152307 6206832 6257555 6316703
7991 6316703 6382629 6448914 6511220 6559738 6588201 6617905 6682347 6773107 6835121 6839822 6829932 6859644
7979 6859644 6920589 6966357 6984834 6999849 7017721 7021581 7013578 7017956 7040732 7063089 7075650 7086458
7967 7086458 7096431 7099141 7102820 7121251 7146328 7159810 7164765 7172555 7170289 7141463 7108730 7109000 7130173
$$ packed form
8049E048645j4996k7330j7629j2048j8634k6615k7567j8725m398n20j4952k4615
8037D840616l438L0420L5488J4590J2755L9561M7903J2625k1404o295L4313M2692
8025E079826J3528m026J8474N3220O0632L9081J7381J3969J9206J6524Q733J1773
8013E348321K5484K9734J8154J4248L4469N4804M3678J5181J3861M9780Q3993
8002E731707Q2565N4286K8231K1074L3960N7713P3716O9055N4525N0723N9148
7991F316703O5926O6285O2306M8518K8463K9704O4442R0760O2014M701r890K9712
7979F859644O0945M5768J8477J5015J7872L860q003M378K2776K2357J2561J0808
7967G086458R973K710L679J8431K5077J3482M955P790k266k8826l2733K70K1173
$$ plain form
7954 7130173 7122062 7071385 7017095 6987829 6973406 6963147 6961061 6956351 6932453 6912890 6939380 6994503
7942 6994503 7013969 6994231 7011307 7097253 7176028 7178595 7154617 7199291 7320186 7451915 7563988
7931 7563988 7675219 7787717 7888007 8002866 8178948 8408943 8645218 8885272 9176239 9534838
7921 9534838 9937839 10399427 10966798 11594890 12101056 12317017 12252206 12047553 11795950 11479165
7911 11479165 11077544 10663206 10339967 10128169 9960676 9786824 9633775 9547672 9510611 9455214
7901 9455214 9350676 9235145 9157241 9118032 9084782 9037457 8985353 8953897 8964490 9011302 9055716
7890 9055716 9066686 9065207 9095959 9156885 9204647 9236619 9307326 9439982 9583670 9695634 9806238
7879 9806238 9955795 10127138 10297974 10500972 10765340 11059249 11367753 11760416 12281305 12843878
$$ packed form
7954G130173q111n0677n4290k9266j4423j0259k086m710k3898j9563K6490N5123
7942F994503J9466j9738J7076Q5946P8775K567k3978M4674J20895J31729J12073
7931G563988J11231J12498J00290J14859J76082K29995K36275K40054K90967L58599
7921I534838M03001M61588N67371O28092N06166K15961o4811k04653k51603l16785
7911A1479165m01621m14338l23239k11798j67493j73852j53049q6103l7061n5397
7901I455214j04538j15531p7904l9209l3250m7325n2104l1456J0593M6812M4414
7890I055716J0970j479L0752O0926M7762L1972P0707J32656J43688J11964J10604
7879I806238J49557J71343J70836K02998K64368K93909L08504L92663N20889N62573
$$ plain form
7869 12843878 13376489 14015695 14956029 16087857 16978273 17295174 17104171 16660395 16063296
7860 16063296 15261895 14289351 13307998 12445511 11724026 11143326 10712675 10388536 10081320
7851 10081320 9751537 9434925 9163836 8926678 8711506 8529111 8382635 8262876 8174956 8122756
7841 8122756 8074377 7996788 7916162 7883023 7882988 7850261 7773118 7714816 7714546 7734720 7729523 7703995 7677054
7828 7677054 7644016 7610556 7612487 7661726 7715259 7740212 7775481 7883877 8064773 8255962 8415114
7817 8415114 8572723 8806524 9167488 9609325 9985124 10146880 10065450 9826197 9502288 9084021
7807 9084021 8558866 8001643 7521330 7142968 6803962 6462170 6151837 5921588 5761895 5618402
7797 5618402 5453339 5272396 5102943 4963672 4853492 4757949 4660782 4552960 4438690 4335164
$$ packed form
7869A2843878N32611O39206R40334J131828Q90416L16901j91003m43776n97099
7860A6063296q01401r72544r81353q62487p21485n80700m30651l24139l07216
7851A0081320l29783l16612k71089k37158k15172j82395j46476j19759q7920n2200
7841H122756m8379p7589q0626l3139l5l2727p7143n8302k70K0174n197k5528k6941
7828G677054l3038l3460J931M9239N3533K4953L5269J08396J80896J91189J59152
7817H415114J57609K33801L60964M41837L75799J61756q1430k39253l23909m18267
7807I084021n25155n57223m80313l78362l39006l41792l10333k30249j59693j43493
7797E618402j65063j80943j69453j39271j10180r5543r7167j07822j14270j03526
$$ plain form
7787 4335164 4257290 4196817 4128713 4047481 3977897 3930605 3871286 3769741 3659879 3599876 3580565
7776 3580565 3533830 3438421 3352341 3318384 3302872 3264951 3224841 3211960 3198988 3150420 3094174
7765 3094174 3075447 3071704 3028312 2955985 2912365 2898147 2857401 2784980 2745532 2762730 2771835 2721831
7753 2721831 2653738 2626369 2622772 2590996 2535124 2500785 2495281 2484352 2456971 2436754 2429417 2407881
7741 2407881 2358130 2302558 2267691 2256712 2260793 2271735 2275534 2256087 2215529 2175710 2152957 2142520
7729 2142520 2129481 2104369 2070526 2046655 2053223 2080821 2085670 2041805 1984610 1966460 1977291 1958234
7717 1958234 1900094 1870136 1910675 1963577 1948104 1878831 1841700 1868045 1902310 1900133 1887779 1895261
7705 1895261 1891999 1839468 1767522 1739937 1762997 1783001 1767042 1734076 1704876 1673612 1642077 1634174
$$ packed form
7787D335164p7874o0473o8104q1232o9584m7292n9319j01545j09862o0003j9311
7776C580565m6735r5409q6080l3957j5512l7921m0110j2881j2972m8568n6246
7765C094174j8727l743m3392p2327m3620j4218m0746p2421l9448J7198R105n0004
7753B721831o8093k7369l597l1776n5872l4339n504j0929k7381k0217p337k1536
7741B407881m9751n5572l4867j0979M081J0942L799j9447m0558l9819k2753j0437
7729B142520j3039k5112l3843k3871O568K7598M849m3865n7195j8150J0831j9057
7717A958234n8140k9958M0539N2902j5473o9273l7131K6345L4265k177j2354P482
7705A895261l262n2531p1946k7585K3060K0004j5959l2966k9200l1264l1535p903
$$ plain form
7693 1634174 1653231 1664522 1647721 1631754 1644782 1660720 1637717 1589306 1569477 1592369 1612017
7682 1612017 1588848 1538820 1502895 1497087 1509538 1524930 1534069 1534352 1535184 1549754 1569045 1559644 1505069
7669 1505069 1437163 1403867 1410625 1417877 1399260 1375999 1377447 1388476 1366615 1307693 1261035 1266154
7657 1266154 1301410 1318625 1307383 1293250 1286675 1274099 1256385 1251260 1249548 1215402 1150376 1113011
7645 1113011 1142437 1199387 1221342 1204340 1185967 1175124 1152604 1125339 1122947 1142710 1148877 1129698
7633 1129698 1110022 1104106 1099320 1089736 1083018 1072840 1049897 1038609 1068892 1110892 1102556 1051404
7621 1051404 1035658 1081432 1116486 1085011 1031614 1016429 1019129 998329 982623 1015826 1059601 1045886
7609 1045886 994455 980243 1004279 1000860 966064 968622 1019846 1042909 1005042 975909 1002904 1024651
$$ packed form
7693A634174J9057J1291j6801j5967J3028J5938k3003m8411j9829K2892J9648
7682A612017k3169n0028l5925n808J2451J5392R139K83Q32J4570J9291r401n4575
7669A505069o7906l3296O758P252j8617k3261J448J1029k1861n8922m6658N119
7657A266154L5256J7215j1242j4133o575j2576j7714n125j712l4146o5026l7365
7645A113011K9426N6950K1955j7002j8373j0843k2520k7265k392J9763O167j9179
7633A129698j9676n916m786r584o718j0178k2943j1288L0283M2000q336n1152
7621A051404j5746M5774L5054l1475n3397j5185K700k0800j5706L3203M3775j3715
7609A045886n1431j4212K4036l419l4796K558N1224K3063l7867k9133K6995K1747
$$ plain form
7597 1024651 979411 918125 922773 972222 983389 947507 930414 955797 978934 974737 969146 972614
7585 972614 956681 916921 895222 913332 937300 933870 914442 898204 880036 864347 881286 930027
7573 930027 951420 907369 851056 858682 914844 931742 876065 810801 799509 827593 843728 832681
7561 832681 814186 802547 799995 806483 808341 780465 728129 702296 738443 800075 822268 795777
7549 795777 763642 745329 718279 678197 661135 684213 711247 707478 691219 697599 721916 736358
7537 736358 738723 744039 744435 719290 677696 651816 649727 649492 640205 635618 643216 650443 648532 644463
7523 644463 643445 642275 642954 649673 651730 635599 614265 614323 631537 633502 613371 603704 622949 644582
7509 644582 639591 616435 595843 578522 565274 576338 614477 636269 604123 549558 537976 577913
$$ packed form
7597A024651m5240o1286M648M9449J1167l5882j7093K5383K3137m197n591L468
7585I72614j5933l9760k1699J8110K3968l430j9428j6238j8168j5689J6939M8741
7573I30027K1393m4051n6313P626N6162J6898n5677o5264j1292K8084J6135j1047
7561H32681j8495j1639k552O488J858k7876n2336k5833L6147O1632K2193k6491
7549G95777l2135j8313k7050m0082j7062K3078K7034l769j6259O380K4317J4442
7537G36358K365N316L96k5145m1594k5880k089k35r287m587P598P227j911m069
7523F44463j018j170O79O719K057j6131k1334N8J7214J965k0131r667J9245K1633
7509F44582m991k3156k0592j7321j3248J1064L8139K1792l2146n4565j1582L9937
$$ plain form
7497 577913 612177 601715 573026 568534 588275 603590 601663 591342 581448 576665 584982 607768 627072
7484 627072 622497 601303 593286 608681 617342 586293 530268 501512 523800 560346 566248 553483
7472 553483 570785 624993 662682 642489 591052 563051 570997 583841 578516 561583 547856 546928
7460 546928 567852 609119 641822 629313 573523 523282 524171 569393 609133 604025 564079 535840
7448 535840 552573 599376 631651 624299 592109 564967 560643 581798 615650 631272 605402 561531
7436 561531 551239 580924 596179 566183 539594 570108 624493 628855 584224 562615 592031 621218
7424 621218 612658 597864 609329 621200 602073 577558 589069 622835 629181 593470 547858 527070
7412 527070 543584 589051 632078 636305 608553 601236 635543 659695 630452 596645 631275 705628
$$ packed form
7497E77913L4264j0462k8689m492J9741J5315j927j0321r894m783Q317K2786J9304
7484F27072m575k1194q017J5395Q661l1049n6025k8756K2288L6546N902j2765
7472E53483J7302N4208L7689k0193n1437k8001P946J2844n325j6933j3727r28
7460E46928K0924M1267L2703j2509n5790n0241Q89M5222L9740n108l9946k8239
7448E35840J6733M6803L2275p352l2190k7142m324K1155L3852J5622k5870m3871
7436E61531j0292K9685J5255k9996k6589L0514N4385M362m4631k1609K9416K9187
7424F21218q560j4794J1465J1871j9127k4515J1511L3766O346l5711m5612k0788
7412E27070J6514M5467M3027M227k7752p317L4307K4152k9243l3807L4630P4353
$$ plain form
7400 705628 719286 656231 617273 667650 739421 740323 688343 664590 683238 693582 683087 688339
7388 688339 709408 701843 667097 667051 719356 756742 734082 702458 717397 740597 711149 660445
7376 660445 661534 700010 700490 662778 656556 681560 660828 598142 605057 710258 775378 698536
7364 698536 585677 591340 681511 708224 657814 651330 719364 754429 707981 670541 706120 752065
7352 752065 750371 749074 792853 827247 802194 771271 791825 815232 779082 729148 738640 773123
7340 773123 753342 699128 689393 719190 720153 694820 704543 738992 725210 666321 645972 681464
7328 681464 693851 650231 619218 645172 675158 662017 643439 659127 673515 645760 606882 602631
7316 602631 617426 615994 610368 627320 652214 659054 659220 673341 689860 691979 688948 685583 663527
$$ packed form
7400G05628J3658o3055l8958N0377P1771R02n1980k3753J8648J0344j0495N252
7388F88339K1069p565l4746m6N2305L7386k2660l1624J4939K3200k9448n0704
7376F60445J089L8476M80l7712o222K5004k0732o2686O915J05201O5120p6842
7364F98536j12859N663R0171K6713n0410o484O8034L5065m6448l7440L5579M5945
7352G52065j694j297M3779L4394k5053l0923K0554K3407l6150m9934R492L4483
7340G73123j9781n4214r735K9797R63k5333R723L4449j3782n8889k0349L5492
7328F81464J2387m3620l1013K5954K9986j3141j8578J5688J4388k7755l8878m251
7316F02631J4795j432n626J6952K4894O840J66J4121J6519K119l031l365k2056
$$ plain form
7303 663527 627511 620445 652030 664866 619435 561413 550099 568636 566939 551299 563271 599395
7291 599395 616732 598275 560347 518926 495248 520386 581829 604919 549007 482152 489026 543716
7279 543716 559711 534930 544378 598077 615340 559865 502962 512399 555763 563310 528844 495976
7267 495976 482966 471859 454560 449342 470003 496915 488550 431114 374931 390504 471425 521639
7255 521639 476606 395766 378899 427115 459784 445067 427677 431878 424190 386448 349909 337342
7243 337342 337452 351156 393778 435978 418527 350207 314721 347651 381574 354626 301624 286397
7231 286397 307240 325889 336223 346738 341116 312503 296411 315773 331409 300992 252400 243233
7219 243233 274959 299103 287578 253529 222810 219129 252044 291597 289272 249839 235818 270713
$$ packed form
7303F63527l6016p066L1585J2836m5431n8022j1314J8537j697j5640J1972L6124
7291E99395J7337j8457l7928m1421k3678K5138O1443K3090n5912o6855O874N4690
7279E43716J5995k4781R448N3699J7263n5475n6903R437M3364P547l4466l2868
7267D95976j3010j1107j7299n218K0661K6912q365n7436n6183J5573Q0921N0214
7255E21639m5033q0840j6867M8216L2669j4717j7390M201p688l7742l6539j2567
7243C37342J10J3704M2622M2200j7451o8320l5486L2930L3923k6948n3002j5227
7231B86397K0843J8649J0334J0515n622k8613j6092J9362J5636l0417m8592r167
7219B43233L1726K4144j1525l4049l0719l681L2915L9553k325l9433j4021L4895
$$ plain form
7207 270713 296588 270091 235835 246218 270954 257702 226952 226686 240855 227943 207950 221853
7195 221853 243445 226167 201144 224810 261055 232242 166645 166311 231822 254907 202207 167812
7183 167812 203156 229903 186703 139986 163372 210042 203987 176140 202237 263087 275347 227804
7171 227804 187136 184953 188651 179433 179350 194664 199153 186041 183360 204073 223216 218167 199089
7158 199089 187344 187332 189423 186058 179895 181812 196838 210203 200886 171612 146674 138365 139900 151009
7144 151009 176453 197116 185329 156613 157887 191895 208430 189755 182027 210637 230175 204151
7132 204151 171692 177477 192223 169924 135116 138618 165918 167691 150003 152696 161355 126403 59852
7119 59852 31410 67598 125806 168422 194931 201725 179361 152802 159499 185654 186691 166357
$$ packed form
7207B70713K5875k6497l4256J0383K4736j3252l0750k66J4169j2912j9993J3903
7195B21853K1592j7278k5023K3666L6245k8813o5597l34O5511K3085n2700l4395
7183A67812L5344K6747m3200m6717K3386M6670o055k7847K6097O0850J2260m7543
7171B27804m0668k183L698r218q3J5314M489j3112k681K0713J9143n049j9078
7158A99089j1745j2K091l365o163J917J5026J3365r317k9274k4938q309J535J1109
7144A51009K5444K0663j1787k8716J274L4008J6535j8675p728K8610J9538k6024
7132B04151l2459N785J4746k2299l4808L502K7300J773j7688K693Q659l4952o6551
7119E9852k8442L6188N8208M2616K6509O794k2364k6559O697K6155J037k0334
$$ plain form
7107 166357 166405 183351 173970 142816 138638 157361 140921 89519 78299 130652 169720 141205 96918
7094 96918 102113 138765 159559 165614 169400 149156 104698 92819 138706 175682 146662 102943
7082 102943 119324 169255 178094 151305 147081 158996 136320 98760 116314 178285 193588 133886
7070 133886 73694 66490 78723 78266 94121 141632 170123 142034 100139 99006 122240 124102 108948
7057 108948 111119 128823 134619 130057 138164 154142 148994 118275 91461 91190 106832 111061 91587
7044 91587 68051 76099 121469 157230 135533 78225 55347 88681 125120 121637 104145 111211
7032 111211 127674 117645 87566 70638 74474 86454 107787 140106 158270 138906 100884 79664
7020 79664 77479 75019 73047 82879 94418 94737 98969 119956 130326 105026 78207 97289 138488
$$ packed form
7107A66357M8J6946r381l1154m178J8723j6440n1402j1220N2353L9068k8515m4287
7094I6918N195L6652K0794O055L786k0244m4458j1879M5887L6976k9020m3719
7082A02943J6381M9931Q839k6789m224J1915k2676l7560J7554O1971J5303n9702
7070A33886o0192p204J2233m57J5855M7511K8491k8089m1895j133K3234J862j5154
7057A08948K171J7704N796m562Q107J5978n148l0719k6814k71J5642M229j9474
7044I1587k3536Q048M5370L5761k1697n7308k2878L3334L6439l483j7492P066
7032A11211J6463j0029l0079j6928L836J1980K1333L2319J8164j9364l8022k1220
7020G9664k185k460j972R832J1539L19M232K0987J0370k5300k6819J9082M1199
$$ plain form
7007 138488 137179 92584 66757 79337 83645 59141 44656 55289 49546 16461 13321 64899
6995 64899 102952 73152 32926 61230 127201 141724 99568 70144 70922 55836 24417 34397
6983 34397 88760 111715 71582 36186 58969 93195 79913 48789 56919 83223 68170 23811
6971 23811 17792 61459 94566 84272 68213 83679 112281 117742 96228 69108 57123 72076
6959 72076 103403 110835 68865 18856 26864 82631 101665 50273 1625 22340 66219 51831
6947 51831 774 6160 76296 109199 48113 -24198 -2586 88759 134656 91095 32943 36368
6935 36368 80711 98041 75217 60913 87009 125179 128073 87812 40698 25636 47502 76523
6923 76523 78945 51080 22663 22298 44896 63922 69451 73633 78450 65701 32314 10446 28973
$$ packed form
7007A38488j309m4595k5827J2580M308k4504j4485J0633n743l3085l140N1578
6995F4899L8053k9800m0226K8304O5971J4523m2156k9424P78j5086l1419R980
6983C4397N4363K2955m0133l5396K2783L4226j3282l1124Q130K6304j5053m4359
6971B3811o019M3667L3107j0294j6059J5466K8602N461k1514k7120j1985J4953
6959G2076L1327P432m1970n0009Q008N5767J9034n1392m8648K0715M3879j4388
6947E1831n1057N386P0136L2903o1086p2311K1612R1345M5897m3561n8152L425
6935C6368M4343J7330k2824j4304K6096L8170K894m0261m7114j5062K1866K9021
6923G6523K422k7865k8417l65K2598J9026N529M182M817j2749l3387k1868J8527
$$ plain form
6910 28973 71812 99833 100435 87277 64185 27145 -2276 10926 59995 92811 81627 61681
6898 61681 75521 108667 113178 76288 31853 11898 15830 25959 31082 33093 43309 69937 101454
6885 101454 112634 96660 76901 74512 81367 80572 74110 69295 57720 34453 21045 37852 65167
6872 65167 64784 33763 5470 1062 9700 15342 15888 15652 20241 34627 48835 40030 10265 -1515
6858 -1515 23599 44967 24933 226 27547 81012 84078 36381 17672 52980 69754 24526
6846 24526 -19735 825 47543 51558 24854 20881 34762 25692 2919 6605 26623 19339 -10741
6833 -10741 -20628 -7037 -1916 -1179 27040 70505 85876 78675 89747 104504 67321 -3965 -17646
6820 -17646 47956 96828 58852 -7467 -17211 14760 24139 9482 11146 24862 20777 15850 44004
$$ packed form
6910B8973M2839K8021O02j3158k3092l7040k9421J3202M9069L2816j1184j9946
6898F1681J3840L3146M511l6890m4435j9955L932J0129N123K011J0216K6628L1517
6885A01454J1180j5974j9759k389O855p95o462m815j1575k3267j3408J6807K7315
6872F5167l83l1021k8293m408Q638N642N46k36M589J4386J4208q805k9765j1780
6858a515K5114K1368k0034k4707K7321N3465L066m7697j8709L5308J6774m5228
6846B4526m4261K0560M6718M015k6704l973J3881r070k2773L686K0018p284l0080
6833a0741r887J3591N121P37K8219M3465J5371p201J1072J4757l7183p1286j3681
6820a7646O5602M8872l7976o6319r744L1971R379j4657J664J3716m085m927K8154
$$ plain form
6807 44004 76603 55982 -2995 -26389 4609 31553 20088 7991 30415 63943 75215 69804
6795 69804 61279 41296 13473 10466 39906 56550 31217 7051 33886 79122 69975 9922
6783 9922 -19091 20449 63765 39730 -27474 -58368 -27696 16672 31092 23056 17264 16434 11392
6770 11392 1496 -11077 -25621 -29168 -3281 39514 53127 16016 -31967 -40574 -15305 3906
6758 3906 10535 29376 55249 50412 11631 -14727 -5579 1136 -26713 -55641 -37161 13468 37370
6745 37370 13017 -27745 -53899 -62901 -58873 -43238 -29068 -31448 -41293 -37670 -24490 -22527 -25790
6732 -25790 -4212 42801 74311 65719 43945 41179 43971 21912 -12723 -15494 21008 47296 23697
6719 23697 -20101 -22541 22729 54167 28042 -16887 -12072 43804 84280 68217 26048 1603
$$ packed form
6807D4004L2599k0621n8977k3394L0998K6944j1465j2097K2424L3528J1272n411
6795F9804q525j9983k7823l007K9440J6644k5333k4166K6835M5236r147o0053
6783I922k9013L9540M3316k4035o7204l0894L0672M4368J4420q036n792q30n042
6770A1392r896j2573j4544l547K5887M2795J3613l7111m7983q607K5269J9211
6758C906O629J8841K5873m837l8781k6358R148O715k7849k8928J8480N0629K3902
6745C7370k4353m0762k6154r002M028J5635J4170k380r845L623J3180J963l263
6732b5790K1578M7013L1510q592k1774k766K792k2059l4635k771L6502K6288k3599
6719B3697m3798k440M5270L1438k6125m4929M815N5876M0476j6063m2169k4445
$$ plain form
6707 1603 -4717 -9323 -6300 6547 -1150 -46670 -84983 -59064 13582 57776 39598 -2075 -23148
6694 -23148 -22224 -13130 1408 12090 -131 -30329 -44607 -23866 15534 53084 83591 97620
6682 97620 79673 39243 9542 2274 -3520 -18116 -24077 -13418 -1650 6935 24706 40218 24186
6669 24186 -7806 678 52736 74048 25898 -23689 -1834 55138 64692 28552 13255 30150
6657 30150 28384 -2416 -14712 4758 11152 -10658 -13510 25633 56962 37097 -622 -2755 22118
6644 22118 28550 10145 -60 12189 28617 36253 42685 53046 58454 51324 35867 20998 12310
6631 12310 10309 10473 7264 586 -5435 -9089 -10515 -8242 -4385 -6916 -16136 -17923 -4220 10396
6617 10396 8764 -5519 -23121 -47943 -74639 -70025 -16710 41891 47637 8371 -18468 -14815 -14460
$$ packed form
6707A603o320m606L023J2847p697m5520l8313K5919P2646M4194j8178m1673k1073
6694b3148R24R094J4538J0682j2221l0198j4278K0741L9400L7550L0507J4029
6682I7620j7947m0430k9701p268n794j4596n961J0659J1768Q585J7771J5512j6032
6669B4186l1992Q484N2058K1312m8150m9587K1855N6972R554l6140j5297J6895
6657C0150j766l0800j2296J9470O394k1810k852L9143L1329j9865l7719k133K4873
6644B2118O432j8405j0205J2249J6428P636O432J0361N408p130j5457j4869q688
6631A2310k001J64l209o678o021l654j426K273L857k531r220j787J3703J4616
6617A0396j632j4283j7602k4822k6696M614N3315N8601N746l9266k6839L653L55
$$ plain form
6604 -14460 -26934 -18241 16662 30751 3273 -21643 -10930 2281 -16536 -38433 -23090 11616
6592 11616 28034 34475 53002 60678 30020 -4078 8803 44419 39208 1818 3446 54433 78677
6579 78677 34981 -15544 -4442 45452 66995 47496 25081 15483 -1387 -30441 -44184 -24700
6567 -24700 5958 10643 -18920 -52577 -56645 -34138 -19637 -29683 -37272 -14961 15506 11443 -21577
6554 -21577 -31430 4474 46699 53088 33009 18957 15709 8206 -1510 2205 17957 27252 22051
6541 22051 12766 10043 12941 15050 13309 11354 17479 35338 55759 64175 55131 32364 1338 -25073
6527 -25073 -23674 12784 51882 52528 19240 -4756 -222 7551 -1770 -12554 -8335 -1170 -2695 1219
6513 1219 19833 31332 17754 75 5833 24602 30031 25722 32127 44575 43424 33671 35415
$$ packed form
6604a4460j2474Q693L4903J4089k7478k4916J0713J3211j8817k1897J5343L4706
6592A1616J6418O441J8527P676l0658l4098J2881L5616n211l7390J628N0987K4244
6579G8677m3696n0525J1102M9894K1543j9499k2415r598j6870k9054j3743J9484
6567b4700L0658M685k9563l3657m068K2507J4501j0046p589K2311L0467m063l3020
6554b1577r853L5904M2225O389k0079j4052l248p503r716L715J5752R295n201
6541B2051r285k723K898K109j741j955O125J7859K0421Q416r044k2767l1026k6411
6527b5073J399L6458L9098O46l3288k3996M534P773r321j0784M219P165j525L914
6513A219J8614J1499j3578j7679N758J8769N429m309O405J2448j151r753J744
$$ plain form
6500 35415 44579 42688 37262 49222 64913 49063 9685 367 42324 89043 92261 65132 50354
6487 50354 56609 62179 61609 70897 92006 103694 91529 66737 50203 50624 62285 75474 84657
6474 84657 89374 89901 85362 79278 81148 92765 97616 78980 47209 30624 36889 44041 36350 26142
6460 26142 26803 26605 10462 -9678 -11524 2438 13661 22074 39202 49967 22026 -34523 -56954
6447 -56954 -9156 58220 67384 17402 -18427 1743 36225 32099 3529 -18 27050 46489
6435 46489 41784 35362 40096 39173 25157 19001 32400 45693 44034 43867 59005 70305 58502 40456
6421 40456 38786 39218 17873 -7888 -1809 28513 40295 25693 22732 46867 61662 40669 15943
6408 15943 30521 70901 85092 54937 15707 4514 16733 22652 11594 4647 22883 54004
$$ packed form
6500C5415R164j891n426J1960J5691j5850l9378r318M1957M6719L218k7129j4778
6487E0354O255N570n70R288K1109J1688j2165k4792j6534M21J1661J3189R183
6474H4657M717N27m539o084J870J1617M851j8636l1771j6585O265P152p691j0208
6460B6142O61j98j6143k0140j846J3962J1223Q413J7128J0765k7941n6549k2431
6447e6954M7798O7376R164m9982l5829K0170L4482m126k8570l547K7068J9439
6435D6489m705o422M734r23j4016o156J3399J3293j659j67J5138J1300j1803j8046
6421D0456j670M32k1345k5761O079L0322J1782j4602k961K4135J4795k0993k4726
6408A5943J4578M0380J4191l0155l9230j1193J2219N919j1058o947J8236L1121
$$ plain form
6396 54004 65745 53001 48144 68186 76634 32740 -35991 -57429 -12889 36703 38802 17743
6384 17743 25491 60508 76499 52833 17429 4991 20482 42166 43278 16368 -12478 -7800
6372 -7800 25048 37172 3698 -33025 -20237 28082 53739 41139 32632 56039 84964 86079
6360 86079 65895 48196 36427 24921 23941 44191 70438 78331 69561 64322 63959 50816 28975
6347 28975 33203 77814 119911 105281 43611 3626 25793 71527 79149 44359 14254 17089
6335 17089 35127 44500 45907 48174 50756 53356 59708 64137 56758 45815 47970 53977 38717 11323
6321 11323 12742 48417 69590 46826 16289 18885 38356 43309 47815 74523 92875 60430 4533
6308 4533 -6144 36866 74741 74703 65446 71728 76075 63539 51232 51221 47917 33039 25621 39750
$$ packed form
6396E4004J1741j2744m857K0042Q448m3894o8731k1438M4540M9592K099k1059
6384A7743P748L5017J5991k3666l5404j2438J5491K1684J112k6910k8846M678
6372g800L2848J2124l3474l6723J2788M8319K5657j2600q507K3407K8925J115
6360H6079k0184j7699j1769j1506r80K0250K6247P893q770n239l63j3143k1841
6347B8975M228M4611M2097j4630o1670l9985K2167M5734P622l4790l0105K835
6335A7089J8038R373J407K267K582K600O352M429p379j0943K155O007j5260k7394
6321A1323J419L5675K1173k2764l0537K596J9471M953M506K6708J8352l2445n5897
6308D533j0677M3010L7875l8r257O282M347j2536j2307j1l304j4878p418J4129
$$ plain form
6294 39750 64899 88969 107723 106796 73428 30973 19813 39148 51554 47075 52208 72941 86664
6281 86664 95253 120994 142130 108704 39439 18362 65344 99594 74978 56767 100858 149671
6269 149671 132233 85766 79354 88170 55822 23021 67196 152304 172178 125030 109105 145701
6257 145701 146625 81582 41963 87223 146147 138684 98973 101595 141111 160597 144259 115902
6245 115902 90772 81794 107533 148805 150152 108128 94896 141902 172126 120694 54736 77685
6233 77685 162997 192124 136037 89178 118202 176561 195574 178718 165389 159931 141449 110991
6221 110991 93342 105833 140945 169707 163842 130253 112020 132358 157101 147226 126060 143682
6209 143682 188902 198458 155428 116893 129065 170081 198301 207555 208489 199845 188739 201018 238864
$$ packed form
6294C9750K5149K4070J8754r27l3368m2455j1160J9335J2406m479N133K0733J3723
6281H6664Q589K5741K1136l3426o9265k1077M6982L4250k4616j8211M4091M8813
6269A49671j7438m6467o412Q816l2348l2801M4175Q5108J9874m7148j5925L6596
6257A45701R24o5043l9619M5260N8924p463l9711K622L9516J9486j6338k8357
6245A15902k5130q978K5739M1272J347m2024j3232M7006L0224n1432o5958K2949
6233G7685Q5312K9127n6087m6859K9024N8359J9013j6856j3329n458j8482l0458
6221A10991j7649J2491L5112K8762n865l3589j8233K0338K4743r875k1166J7622
6209A43682M5220R556m3030l8535J2172M1016K8220R254R34q644j1106J2279L7846
$$ plain form
6196 238864 260280 233564 184688 158748 160493 167791 180130 211429 247319 253639 229346 214803
6184 214803 236942 273377 286902 277437 277854 302523 323202 309946 281700 287585 334731 369073
6172 369073 350301 314209 320172 359012 368928 337314 321728 353434 384466 368723 341522 362872
6160 362872 418694 444171 428356 426311 462682 488980 463888 424542 434522 491042 532851 530884
6148 530884 522439 544683 576758 579347 565768 588743 658222 716598 713910 672975 650530 659756
6136 659756 669615 665985 669609 694175 726556 755424 784823 811018 819721 816723 826804 848774 848291
6123 848291 815925 796483 830853 896915 941851 953165 963541 996818 1040043 1065532 1059977 1036349
6111 1036349 1029581 1068821 1142135 1204403 1230927 1241869 1262618 1290228 1317647 1356556 1407732 1442365
$$ packed form
6196B38864K1416k6716m8876k5940J745P298J2339L1299L5890O320k4293j4543
6184B14803K2139L6435J3525r465M17K4669K0679j3256k8246N885M7146L4342
6172C69073j8772l6092N963L8840R916l1614j5586L1706L1032j5743k7201K1350
6160C62872N5822K5477j5815k045L6371K6298k5092l9346R980N6520M1809j967
6148E30884q445K2244L2075K589j3579K2975O9479N8376k688m0935k2445R226
6136F59756R859l630L624K4566L2381K8868K9399K6195Q703k998J0081K1970m83
6123H48291l2366j9442L4370O6062M4936J1314J0376L3277M3225K5489n555k3628
6111A036349o768L9240P3314O2268K6524J0942K0749K7610K7419L8909N1176L4633
$$ plain form
6099 1442365 1448846 1466657 1530175 1606332 1638840 1633859 1646469 1695157 1747875 1787789 1833092 1887277
6087 1887277 1927378 1953434 1995995 2058374 2103394 2119950 2153128 2236294 2334006 2389875 2403002
6076 2403002 2421224 2477557 2565033 2661989 2754596 2839581 2923966 3020155 3132811 3257137 3393885
6065 3393885 3553345 3737286 3926627 4094447 4230349 4355065 4508939 4708783 4915001 5073221
6055 5073221 5197969 5369088 5623093 5908923 6193727 6538748 6999367 7530408 8095146 8781535
6045 8781535 9656639 10592118 11471697 12532887 14159911 16208766 17853812 18372950 17888863
6036 17888863 17049964 16151028 14954405 13329221 11626817 10270930 9292698 8481253 7766152
6027 7766152 7211432 6779331 6349243 5911546 5542127 5221869 4863383 4497607 4256193 4157954
$$ packed form
6099A442365O481J7811O3518P6157L2508m981J2610M8688N2718L9914M5303N4185
6087A887277M0101K6056M2561O2379M5020J6556L3178Q3166R7712N5869J3127
6076B403002J8222N6333Q7476R6956R2607Q4985Q4385R6189J12656J24326J36748
6065C393885J59460J83941J89341J67820J35902J24716J53874J99844K06218J58220
6055E073221J24748J71119K54005K85830K84804L45021M60619N31041N64738O86389
6045H781535Q75104R35479Q79579J061190J627024K048855J645046N19138m84087
6036A7888863q38899q98936j196623j625184j702404j355887r78232q11445p15101
6027G766152n54720m32101m30088m37697l69419l20258l58486l65776k41414r8239
$$ plain form
6017 4157954 4074050 3935578 3823721 3796285 3760570 3608896 3383164 3203274 3091994 2971034
6007 2971034 2803172 2645592 2555933 2512545 2451463 2345629 2224903 2133706 2084165 2048894 1995599
5996 1995599 1924219 1861340 1819644 1779854 1720369 1649465 1593863 1562742 1537031 1493787 1431786
5985 1431786 1369729 1323516 1291087 1261149 1229535 1198048 1163179 1122535 1090301 1082584 1082952 1052774
5973 1052774 991408 953429 975572 1012753 988986 899119 815461 795152 823731 856063 869814
5962 869814 861217 825769 772215 733518 735001 760397 769541 744403 703177 673536 664229 661625 646468
5949 646468 613724 577541 555272 549326 549577 549314 550774 557885 570257 580207 572265 537293 493259
5936 493259 473682 482807 484496 455577 424834 428528 452017 457438 449715 462922 491716 495273 469408
$$ packed form
6017D157954q3904j38472j11857k7436l5715j51674k25732j79890j11280j20960
6007B971034j67862j57580q9659m3388o1082j05834j20726r1197m9541l5271n3295
5996A995599p1380o2879m1696l9790n9485p0904n5602l1121k5711m3244o2001
5985A431786o2057m6213l2429k9938l1614l1487l4869m0644l2234p717L68l0178
5973A052774o1366l7979K2143L7181k3767q9867q3658k0309K8579L2332J3751
5962H69814q597l5448n3554l8697J483K5396R144k5138m1226k9641r307k604j5157
5949F46468l2744l6183k2269n946K51k63J460P111J2372R950p942l4972m4034
5936D93259j9577R125J689k8919l0743L694K3489N421p723J3207K8794L557k5865
$$ plain form
5923 469408 452771 452798 432173 389358 381899 431145 469519 437062 375336 359726 382237 378123 341207
5910 341207 328550 355782 369004 336331 298967 302815 331516 340378 319487 291787 274700 270220
5898 270220 274445 276774 264798 243411 233254 241273 251750 254141 257242 265889 267619 255914 244374
5885 244374 243274 243197 237210 237683 252701 265077 254849 226613 196171 167516 143589 141021 167031
5872 167031 195681 197773 186006 197714 234574 253814 227507 180891 156397 161950 173291 171635
5860 171635 158686 142446 127024 115516 110550 111729 118969 133577 149498 153257 144364 143749 162039
5847 162039 170570 136195 83714 82014 150685 220064 217308 160306 121351 121649 120631 101743 100452
5834 100452 130705 146700 113049 64432 54048 80708 109382 129105 142654 129816 77773 27956
$$ packed form
5923D69408j6637K7k0625m2815p459M9246L8374l2457o1726j5610K2511m114l6916
5910C41207j2657K7232J3222l2673l7364L848K8701Q862k0891k7700j7087m480
5898B70220M225K329j1976k1387j0157Q019J0477K391L101Q647J730j1705j1540
5885B44374j100p7n987M73J5018J2376j0228k8236l0442k8655k3927k568K6010
5872A67031K8650K092j1767J1708L6860J9240k6307m6616k4494N553J1341j656
5860A71635j2949j6240j5422j1508m966J179P240J4608J5921L759q893o15J8290
5847A62039Q531l4375n2481j700O8671O9379k756n7002l8955K98j018j8888j291
5834A00452L0253J5995l3651m8617j0384K6660K8674J9723J3549j2838n2043m9817
$$ plain form
5822 27956 33184 77622 96396 70534 45009 51159 69634 79932 90930 105841 106815 92534 85854
5809 85854 88904 77688 55362 56913 81452 79315 36082 8663 36515 74703 67629 38242 41610
5796 41610 70458 75599 53558 45631 64272 81715 82617 74586 58000 36696 41806 87666 121484
5783 121484 83902 9012 -9751 46670 98744 87268 41110 7532 -9704 -12331 20274 77551
5771 77551 97630 51078 -4269 -2392 39361 58816 41168 18018 4556 -5188 -1363 27032
5759 27032 52666 38305 -425 -10029 22530 52087 43068 15101 6482 21709 33630 23202
5747 23202 3506 4942 35421 58785 31487 -34635 -74874 -53350 -10447 -844 -15839 -9010
5735 -9010 24303 44643 36398 26631 32680 36781 24156 9015 8713 20921 37524 55795 67716
$$ packed form
5822B7956N228M4438J8774k5862k5525O150J8475J0298J0998J4911R74j4281o680
5809H5854L050j1216k2326J551K4539k137m3233k7419K7852L8188p074k9387L368
5796D1610K8848N141k2041p927J8641J7443R02q031j6586k1304N110M5860L3818
5783A21484l7582p4890j8763N6421N2074j1476m6158l3578j7236k627L2605N7277
5771G7551K0079m6552n5347J877M1753J9455j7648k3150j3462r744L825K8395
5759B7032K5634j4361l8730r604L2559K9557r019k7967q619J5227J1921j0428
5747B3202j9696J436L0479K3364k7298o6122m0239K1524M2903R603j4995O829
5735i010L3313K0340q245r767O049M101j2625j5141l02J2208J6603J8271J1921
$$ plain form
5722 67716 62394 45765 35805 35700 34556 31812 31991 20310 -17626 -52083 -32289 35379 79753
5709 79753 56391 2730 -24843 -25157 -26886 -28276 -10546 13893 17268 7737 17835 46913 58538
5696 58538 36256 3492 -15620 -20473 -15336 -1472 5633 -14041 -48160 -58925 -39860 -29916 -51211
5683 -51211 -68769 -42918 7661 33506 24713 11685 7413 -4787 -26280 -32534 -19883 -21266 -53597
5670 -53597 -83441 -71989 -28024 10759 25328 16252 -17029 -61841 -79675 -51590 -19800 -35099
5658 -35099 -74874 -70934 -15227 28293 25952 16172 24815 15289 -31004 -56698 -17694 29535 11968
5645 11968 -34924 -22292 40678 58907 10282 -21102 7381 26615 -17426 -65018 -44855 1676
5633 1676 -11686 -73420 -94369 -48043 -246 1791 -10158 5274 32955 36460 17769 8168 20566
$$ packed form
5722F7716n322j6629r960j05j144k744J79j1681l7936l4457J9794O7668M4374
5709G9753k3362n3661k7573l14j729j390J7730K4439L375r531J0098K9078J1625
5696E8538k2282l2764j9112m853N137J3864P105j9674l4119j0765J9065R944k1295
5683e1211j7558K5851N0579K5845q793j3028m272j2200k1493o254J2651j383l2331
5670e3597k9844J1452M3965L8783J4569r076l3281m4812j7834K8085L1790j5299
5658c5099l9775L940N5707M3520k341r780Q643r526m6293k5694L9004M7229j7567
5645A1968m6892J2632O2970J8229m8625l1384K8483J9234m4041m7592K0163M6531
5633A676j3362o1734k0949M6326M7797K037j1949J5432K7681L505j8691r601J2398
$$ plain form
5620 20566 36329 31818 4901 -22040 -23379 2106 29610 38573 33529 28401 27117 30747 43381
5607 43381 55670 45903 17385 8014 35223 59135 37991 -3348 -5983 37406 78806 88781 82585
5594 82585 73051 51896 29439 40881 88238 117119 83582 17870 -10245 22498 66298 57058
5582 57058 -9788 -68683 -52987 24717 80797 60358 196 -33220 -33660 -37081 -44342 -27751 -30
5569 -30 -2092 -22383 -7663 34245 28866 -38958 -82940 -49137 -5320 -23612 -50889 3811 103742
5556 103742 122034 29765 -63911 -71457 -29386 -11255 -22485 -28888 -26989 -32072 -36930 -31174 -33060
5543 -33060 -58717 -81501 -64410 -20253 -34 -24491 -60459 -69593 -54888 -48487 -68028 -96250
5531 -96250 -100514 -67832 -19356 11149 11384 -2203 -9593 -9681 -13860 -25594 -34334 -28168 -8277 9885
$$ packed form
5620B0566J5763m511k6917k6941j339K5485K7504Q963n044n128j284L630J2634
5607D3381J2289r767k8518r371K7209K3912k1144m1339k635M3389M1400R975o196
5594H2585r534k1155k2457J1442M7357K8881l3537o5712k8115L2743M3800r240
5582E7058o6846n8895J5696P7704N6080k0439o0162l3416m40l421p261J6591K7721
5569c0k062k0291J4720M1908n379o7824m3982L3803M3817j8292k7277N4700R9931
5556A03742J8292r2269r3676p546M2071J8131j1230o403J899n083m858N756j886
5543c3060k5657k2784J7091M4157K0219k4457l5968r134J4705O401j9541k8222
5531i6250m264L2682M8476L0505K35j3587p390q8m179j1734q740O166J9891J8162
$$ plain form
5517 9885 9768 -11085 -38547 -53145 -43078 -12188 17992 21187 -4988 -28630 -20516 3027 348
5504 348 -33652 -60496 -59016 -51251 -51084 -35321 1679 13204 -29920 -75367 -58891 -7723 112
5491 112 -38232 -50985 -18705 -8076 -53385 -91986 -66134 -15575 -6168 -24811 -19056 3 -23059
5478 -23059 -82991 -108223 -67120 -14484 -12043 -51091 -78853 -67845 -33996 -6187 947 -8643
5466 -8643 -24544 -45819 -77466 -105091 -93556 -34615 20986 14983 -40437 -74677 -51585 -10419
5454 -10419 -1730 -21649 -35344 -34746 -37806 -47309 -47306 -36902 -34643 -43934 -42910 -22382 -9987 -32835
5440 -32835 -69398 -68745 -19718 27320 22645 -20278 -47739 -38421 -23050 -31689 -51816 -53014 -33033
5427 -33033 -19158 -30181 -51920 -53005 -21845 14102 14468 -22283 -48564 -28759 5100 -6072
$$ packed form
5517I885j17k0853k7462j4598J0067L0890L0180L195k6175k3642Q114K3543k679
5504C48l4000k6844J480P765J67J5763L7000J1525m3124m5447J6476N1168P835
5491A12l8344j2753L2280J0629m5309l8601K5852N0559R407j8643N755J9059k3062
5478b3059n9932k5232M1103N2636K441l9048k7762J1008L3849K7809P134r590
5466h643j5901k1275l1647k7625J1535N8941N5601o003n5420l4240K3092M1166
5454a0419Q689j9919j3695N98l060r503LJ0404K259r291J024K0528J2395k2848
5440c2835l6563O53M9027M7038m675m2923k7461R318J5371q639k0127j198J9981
5427c3033J3875j1023k1739j085L1160L5947L66l6751k6281J9805L3859j1172
$$ plain form
5415 -6072 -59119 -87488 -59067 -24054 -36582 -73870 -77772 -45062 -23705 -34558 -49092 -43998
5403 -43998 -32477 -32999 -42153 -48876 -49659 -42803 -29605 -23417 -34866 -48137 -37332 -7709 6120
5390 6120 -12421 -41258 -52644 -44626 -33331 -33126 -49216 -73248 -85259 -75943 -62027 -59825 -53683
5377 -53683 -20474 22236 30705 -1162 -31367 -30512 -15032 -8560 -8380 -8114 -18940 -45260 -67070
5364 -67070 -68507 -59983 -53606 -42777 -26044 -23527 -44111 -59807 -41036 -1028 20014 2098 -42959
5351 -42959 -91765 -121250 -115689 -82857 -52263 -42123 -41192 -34549 -27775 -31049 -39545 -45025 -47197 -41357
5337 -41357 -19299 5945 7376 -10335 -10935 9170 4271 -42628 -77259 -56081 -21346 -32961 -68315
5324 -68315 -65981 -37986 -49107 -96583 -106362 -59549 -29202 -59575 -92019 -60270 6766 35211
$$ packed form
5415f072n3047k8369K8421L5013j2528l7288l902L2710K1357j0853j4534N094
5403d3998J1521n22r154o723p83O856J3198O188j1449j3271J0805K9623J3829
5390F120j8541k8837j1386Q018J1295K05j6090k4032j2011R316J3916K202O142
5377e3683L3209M2710Q469l1867l0205Q55J5480O472J80K66j0826k6320k1810
5364f7070j437Q524O377J0829J6733K517k0584j5696J8771M0008K1042j7916m5057
5351d2959m8806k9485N561L2832L0594J0140R31O643O774l274q496n480k172N840
5337d1357K2058K5244J431j7711o00K0105m899m6899l4631K1178L4735j1615l5354
5324f8315K334K7995j1121m7476r779M6813L0347l0373l2444L1749O7036K8445
$$ plain form
5312 35211 10842 -24666 -46940 -60904 -62440 -41844 -14187 -2228 1624 17393 32486 16358
5300 16358 -24833 -50209 -43657 -33276 -42666 -57228 -55126 -44541 -47689 -63150 -66635 -45087 -13282
5287 -13282 5187 2552 -11210 -23164 -27999 -28720 -34517 -54407 -82362 -92066 -64630 -23729 -17650
5274 -17650 -52804 -72869 -31954 34312 50736 3834 -45311 -50790 -36260 -43308 -67467 -74775
5262 -74775 -55675 -33169 -30124 -47743 -67305 -64225 -33633 -4988 -10991 -41576 -58105 -54243 -60699
5249 -60699 -79093 -63765 -166 47669 16897 -60632 -99911 -77664 -47717 -47664 -49021 -15482 33171
5236 33171 43188 -5333 -72637 -99500 -69193 -25905 -20933 -45376 -45538 -9624 6688 -32583
5224 -32583 -78937 -70151 -28036 -22486 -61026 -84655 -66291 -41629 -36031 -30532 -17863 -25965 -57995
$$ packed form
5312C5211k4369l5508k2274j3964j536K0596K7657J1959L852J5769J5093j6128
5300A6358m1191k5376O552J0381r390j4562K102J0585l148j5461l485K1548L1805
5287a3282J8469k635j3762j1954m835p21n797j9890k7955r704K7436M0901O079
5274a7650l5154k0065M0915O6266J6424m6902m9145n479J4530p048k4159p308
5262g4775J9100K2506L045j7619j9562L080L0592K8645o003l0585j6529L862o456
5249f0699j8394J5328O3599M7835l0772p7529l9279K2247K9947N3j357L3539M8653
5236C3171J0017m8521o7304k6863L0307M3288M972k4443j62L5914J6312l9271
5224c2583m6354Q786M2115N550l8540k3629J8364K4662N598N499J2669q102l2030
$$ plain form
5211 -57995 -69527 -41514 -21718 -49694 -86951 -73220 -18617 13042 -8715 -58104 -99947 -114043
5199 -114043 -87228 -28943 11886 -8009 -63373 -84791 -50530 -13068 -22745 -63468 -85430 -72155
5187 -72155 -47491 -32896 -25954 -18038 -11404 -12716 -21117 -30907 -41850 -57830 -73672 -73882 -54739
5174 -54739 -39159 -50818 -76224 -77822 -50384 -34107 -53922 -76101 -57326 -14129 212 -21841
5162 -21841 -32842 -10052 6125 -21806 -65491 -71897 -39733 -10879 -1599 8725 22532 9964
$$ packed form
5211e7995j1532K8013J9796k7976l7257J3731N4603L1659k1757m9389m1843j4096
5199a14043K6815N8285M0829j9895n5364k1418L4261L7462r677m0723k1962J3275
5187g2155K4664J4595O942P916O634j312q401r790j0943j5980j5842k10J9143
5174e4739J5580j1659k5406j598K7438J6277j9815k2179J8775M3197J4341k2053
5162b1841j1001K2790J6177k7931m3685o406L2164K8854R280J0324J3807j2568
$$ [...]
##END NTUPLES=NMR SPECTRUM
##END=
