##TITLE=1H ikalashn
EC-3334(3)
17.10.2024
##JCAMPDX= 6.0         $$ Bruker NMR JCAMP-DX V2.0
##DATA TYPE= NMR SPECTRUM
##DATA CLASS= NTUPLES
##ORIGIN= UXNMR, Bruker Analytische Messtechnik GmbH
##OWNER= root
$$ TOPSPIN		Version 1.3
$$ 2024-10-17 10:25:11.562 +0400  Irina@DPX200
$$ Compression mode = diff/dup
##.OBSERVE FREQUENCY= 200.131392401
##.OBSERVE NUCLEUS= ^1H
##.ACQUISITION MODE= SIMULTANEOUS
##.ACQUISITION SCHEME= undefined
##.AVERAGES= 32
##.DIGITISER RES= 18
##SPECTROMETER/DATA SYSTEM= spect
##.PULSE SEQUENCE= zg
##.SOLVENT NAME= CDCl3
##.SHIFT REFERENCE= INTERNAL, CDCl3, 1, 17.95386
##AUDIT TRAIL= $$ (NUMBER, WHEN, WHO, WHERE, WHAT)
$$ ##TITLE= Audit trail, TOPSPIN		Version 1.3
$$ ##JCAMPDX= 5.01
$$ ##ORIGIN= Bruker BioSpin GmbH
$$ ##OWNER= Irina
$$ $$ F:/spectra/data/iren/nmr/1H/4/pdata/1/auditp.txt
$$ ##AUDIT TRAIL=  $$ (NUMBER, WHEN, WHO, WHERE, VERSION, WHAT)
(   1,<2024-10-17 10:22:56.453 +0400>,<Irina>,<DPX200>,<TOPSPIN 1.3>,
      <acquisition in progress>)
(   2,<2024-10-17 10:23:36.187 +0400>,<Irina>,<DPX200>,<TOPSPIN 1.3>,
      <Start of raw data processing
       fp BC_mod = 2 FT_mod = 6 PKNL = 1 PHC0 = 185.4501 PHC1 = 33.30864 SI = 32K 
       data hash MD5: 32K
       C0 89 C2 98 B0 AB 40 9E EA 3F D9 9A D0 1D 77 6A>)
(   3,<2024-10-17 10:24:49.406 +0400>,<Irina>,<DPX200>,<TOPSPIN 1.3>,
      <abs n ABSG = 5 
       data hash MD5: 32K
       57 32 8B 04 3D 43 82 6F D4 00 2E 32 64 93 D3 92>)
$$ ##END=
$$ 
$$ $$ hash MD5
$$ $$ E9 FF D8 40 58 0A 1D B4 69 82 AA 64 A5 EF BA DE
##$RELAX= 
##$RELAX= 
##$RELAX= 
##$RELAX= 
##$RELAX= 
##$RELAX= 
##$RELAX= 
##$RELAX= 
##$RELAX= 
$$ Bruker specific parameters
$$ --------------------------
##$DU= <F:/spectra>
##$EXPNO= 4
##$NAME= <1H>
##$PROCNO= 1
##$TYPE= <nmr>
##$USER= <iren>
##$AMP= (0..31)
100 100 100 100 100 100 100 100 100 100 100 100 100 100 100 100 100 100 
100 100 100 100 100 100 100 100 100 100 100 100 100 100 
##$ANAVPT= -1
##$AQSEQ= 0
##$AQ_mod= 1
##$AUNM= <au_zg>
##$AUTOPOS= <>
##$BF1= 200.13
##$BF2= 200.13
##$BF3= 200.13
##$BF4= 200.13
##$BF5= 200.13
##$BF6= 200.13
##$BF7= 200.13
##$BF8= 200.13
##$BYTORDA= 1
##$CFDGTYP= 0
##$CFRGTYP= 5
##$CHEMSTR= <none>
##$CNST= (0..63)
1 1 145 1 1 1 1 1 1 1 1 1 1 1 1 1 1 1 1 1 1 1 1 1 1 1 1 1 1 1 1 1 1 1 
1 1 1 1 1 1 1 1 1 1 1 1 1 1 1 1 1 1 1 1 1 1 1 1 1 1 1 1 1 1 
##$CPDPRG= <>
##$CPDPRG1= <>
##$CPDPRG2= <>
##$CPDPRG3= <>
##$CPDPRG4= <mlev>
##$CPDPRG5= <mlev>
##$CPDPRG6= <mlev>
##$CPDPRG7= <mlev>
##$CPDPRG8= <mlev>
##$CPDPRGB= <>
##$CPDPRGT= <>
##$D= (0..63)
0 2 0 0 0 0 0 0 0 0.06 0 0.03 0 0 0 0 0.0002 0 0 0 0 0 0 0 0 0 0 0 0 0 
0 0 0 0 0 0 0 0 0 0 0 0 0 0 0 0 0 0 0 0 0 0 0 0 0 0 0 0 0 0 0 0 0 0 
##$DATE= 1729146303
##$DBL= (0..7)
120 120 120 120 120 120 120 120 
##$DBP= (0..7)
150 150 150 150 150 150 150 150 
##$DBP07= 0
##$DBPNAM0= <>
##$DBPNAM1= <>
##$DBPNAM2= <>
##$DBPNAM3= <>
##$DBPNAM4= <>
##$DBPNAM5= <>
##$DBPNAM6= <>
##$DBPNAM7= <>
##$DBPOAL= (0..7)
0.5 0.5 0.5 0.5 0.5 0.5 0.5 0.5 
##$DBPOFFS= (0..7)
0 0 0 0 0 0 0 0 
$$ [...]
##$SW_h= 4401.40845070422
##$TD= 16384
##$TD0= 1
##$TE= 300
##$TE2= 300
##$TE3= 300
##$TEG= 300
##$TL= (0..7)
0 120 120 120 120 120 120 120 
##$TP= (0..7)
150 150 150 150 150 150 150 150 
##$TP07= 0
##$TPNAME0= <>
##$TPNAME1= <>
##$TPNAME2= <>
##$TPNAME3= <>
##$TPNAME4= <>
##$TPNAME5= <>
##$TPNAME6= <>
##$TPNAME7= <>
##$TPOAL= (0..7)
0.5 0.5 0.5 0.5 0.5 0.5 0.5 0.5 
##$TPOFFS= (0..7)
0 0 0 0 0 0 0 0 
##$TUNHIN= 0
##$TUNHOUT= 0
##$TUNXOUT= 0
##$USERA1= <user>
##$USERA2= <user>
##$USERA3= <user>
##$USERA4= <user>
##$USERA5= <user>
##$V9= 5
##$VALIST= <valist>
##$VCLIST= <CCCCCCCCCCCCCCC>
##$VD= 0
##$VDLIST= <DDDDDDDDDDDDDDD>
##$VPLIST= <PPPPPPPPPPPPPPP>
##$VTLIST= <TTTTTTTTTTTTTTT>
##$WBST= 1024
##$WBSW= 25
##$XGAIN= (0..3)
0 0 0 0 
##$XL= 0
##$YL= 0
##$YMAX_a= 281909
##$YMIN_a= -307406
##$ZGOPTNS= <>
##$ZL1= 120
##$ZL2= 120
##$ZL3= 120
##$ZL4= 120
##$ABSF1= 17.95386
##$ABSF2= -4.038887
##$ABSG= 5
##$ABSL= 3
##$ALPHA= 0
##$AQORDER= 0
##$ASSFAC= 0
##$ASSFACI= 0
##$ASSFACX= 0
##$ASSWID= 0
##$AUNMP= <proc_1d>
##$AXLEFT= 0
##$AXRIGHT= 0
##$AXTYPE= 0
##$AXUNIT= <>
##$AZFE= 0.1
##$AZFW= 0.1
##$BCFW= 0
##$BC_mod= 2
##$BYTORDP= 0
##$COROFFS= 0
##$CY= 7568.61572265625
##$DATMOD= 1
##$DC= 0
##$DFILT= <>
##$DTYPP= 0
##$F1P= 17.9538593292236
##$F2P= -4.03888763876832
##$FCOR= 0.5
##$FTSIZE= 32768
##$FT_mod= 6
##$GAMMA= 0
##$GB= 0
##$INTBC= 0
##$INTSCL= 1.483618e-010
##$ISEN= 128
##$LB= 0
##$LEV0= 0
##$LPBIN= 0
##$MAXI= 945.577
##$MC2= 0
##$MEAN= 0
##$ME_mod= 0
##$MI= -402.1523
##$NCOEF= 0
##$NC_proc= -5
##$NLEV= 6
##$NOISF1= 8.587773
##$NOISF2= 6.764455
##$NSP= 0
##$NTH_PI= 0
##$NZP= 0
##$OFFSET= 17.95386
##$PC= 1
##$PHC0= 185.4501
##$PHC1= 33.30864
##$PH_mod= 1
##$PKNL= yes
##$PPARMOD= 0
##$PPDIAG= 0
##$PPIPTYP= 0
##$PPMPNUM= 100
##$PPRESOL= 1
##$PSCAL= 0
##$PSIGN= 0
##$REVERSE= no
##$SF= 200.13
##$SI= 32768
##$SIGF1= 16.12182
##$SIGF2= -4.496377
##$SINO= 3.521527
##$SIOLD= 32768
##$SREGLST= <1H.CDCl3>
##$SSB= 0
##$STSI= 32768
##$STSR= 0
##$SW_p= 4401.40845070423
##$SYMM= 0
##$S_DEV= 0
##$TDeff= 16384
##$TDoff= 0
##$TI= <>
##$TILT= no
##$TM1= 0
##$TM2= 0
##$TOPLEV= 0
##$USERP1= <user>
##$USERP2= <user>
##$USERP3= <user>
##$USERP4= <user>
##$USERP5= <user>
##$WDW= 0
##$XDIM= 32768
##$YMAX_p= 304055572
##$YMIN_p= -265470
$$ End of Bruker specific parameters
$$ ---------------------------------
##NTUPLES= NMR SPECTRUM
##VAR_NAME=  FREQUENCY,     SPECTRUM/REAL,   SPECTRUM/IMAG
##SYMBOL=    X,             R,               I
##VAR_TYPE=  INDEPENDENT,   DEPENDENT,       DEPENDENT
##VAR_FORM=  AFFN,          ASDF,            ASDF
##VAR_DIM=   32768,         32768,           32768
##UNITS=     HZ,            ARBITRARY UNITS, ARBITRARY UNITS
##FACTOR=    0.134324425510551, 1,           1
##FIRST=     4401.40845070423, -70854,       -619465
##LAST=      0,             45146,           -926216
##MIN=       0,             -265470,         0
##MAX=       4401.40845070423, 304055572,    0
$$ Real data points
##PAGE= N=1
##DATA TABLE= (X++(R..R)), XYDATA
$$ [...]
11450G161087n3661r1255j14171j18188r5519n2696k6716n3435j18213j63654
11440F273579j55407j19584j00896j01704q7433m6415j3308j8980m0872l1917
11430E557063J0558M0094L0618J4106K8217N8675O7397N4510N0073N7441N2059
11419F020811L3413K8747L9051L2017L697m525K3735M2985J7596j3714N291O0004
11407F289108Q9730Q0744P6585J02630J35759J52951J61502J70209J70336J57890
11397G587444J43545J32216J21109J19694J37565J50779J21130N7489J4759J5458
11387H601188J5403k6653q4477j05763r0294q5392j16119j57365j74543j63857
11377G612128j46866j42772j52384j61709j58048j43329j30071j27479j36872
$$ y = [7161087, 7107426, 7016171, 6902000, 6783812, 6688293, 6635597, 6608881, 6555446, 6437233, 6273579, 6118172, 5998588, 5897692, 5795988, 5708555, 5662140, 5648832, 5629852, 5588980, 5557063, 5567621, 5607715, 5638333, 5652439, 5680656, 5739331, 5806728, 5861238, 5911311, 5968752, 6020811, 6054224, 6082971, 6122022, 6154039, 6157736, 6153211, 6176946, 6219931, 6237527, 6223813, 6229104, 6289108, 6378838, 6459582, 6536167, 6638797, 6774556, 6927507, 7089009, 7259218, 7429554, 7587444, 7730989, 7863205, 7984314, 8104008, 8241573, 8392352, 8513482, 8570971, 8585730, 8601188, 8616591, 8589938, 8505461, 8399698, 8309404, 8224012, 8107893, 7950528, 7775985, 7612128, 7465262, 7322490, 7170106, 7008397, 6850349, 6707020, 6576949, 6449470, 6312598]
11368F312598j52917j58923j34158q5717n8636q3621j26010j26514q6484o3822
11358E235796q1952r9784q7804p4602q7005r9248q4078o6759p8297r4922p9196
11347D302149m9014m7458o8815p4182o1484n8900o2639m4998j7147j9200m7346
11336C750966n4383k9421j5160l3203n1918m6982l7804m1009l9591k4201j7398
11325C359896k9796l6493k3968j6752k9704l7911k4828j5881k9100l5802j1290
11314C068371J5024N726k2592l0547j9257j4151j2247L285J7708O312j4709j0587
11302B992336J0868J1476j2667k9132k6783k6052l3390l2783k3570k2327k6635
11291B781341k0251j2215k4344m2331l1571k105L51k5371k8647L848J9121j1900
$$ y = [6312598, 6159681, 6000758, 5866600, 5780883, 5722247, 5638626, 5512616, 5386102, 5299618, 5235796, 5153844, 5054060, 4966256, 4891654, 4804649, 4705401, 4621323, 4554564, 4476267, 4381345, 4302149, 4253135, 4205677, 4136862, 4062680, 4001196, 3942296, 3879657, 3834659, 3817512, 3798312, 3750966, 3696583, 3667162, 3652002, 3618799, 3566881, 3519899, 3482095, 3441086, 3401495, 3377294, 3359896, 3330100, 3293607, 3269639, 3252887, 3223183, 3185272, 3160444, 3144563, 3115463, 3079661, 3068371, 3083395, 3089121, 3066529, 3035982, 3016725, 3002574, 2990327, 2993612, 3011320, 3017632, 3002923, 2992336, 3003204, 3014680, 3002013, 2972881, 2946098, 2920046, 2886656, 2853873, 2830303, 2807976, 2781341, 2761090, 2748875, 2724531, 2682200, 2650629, 2648524, 2648875, 2623504, 2594857, 2598705, 2617826, 2605926]
11279B605926m0290j9420J7889J8037l939K208L1168L3754L830j3077K994K0823
11267B659903J8345J5463K9454M2594L7496K9083L4697L9572K1471q346j9061
11256B900671p160l83j3369k5091j2983Q844P148k0265l7001j8990R532J0943
11244B801896j0358j5985Q331L4098L3797J4290k913p884K576K8592N1922M5579
11232B983941J6444P723L6491O2640N1615L3353N3148R1783R3110N7952M6437
11221C534637Q2369J16664J05398P1237N7944O5901O7107N2998L3039Q800j8311
11210D177783l1576k1670j0161k1501m3938m7380l0299j8113j9619j6511O25J3993
11198C931633P074p993n501K0204M7254N1542L4425K1256L0190M9260N6143N5215
$$ y = [2605926, 2565636, 2546216, 2564105, 2582142, 2578203, 2580411, 2611579, 2645333, 2649163, 2636086, 2639080, 2659903, 2678248, 2693711, 2723165, 2765759, 2803255, 2832338, 2867035, 2906607, 2928078, 2919732, 2900671, 2893511, 2893128, 2879759, 2854668, 2841685, 2850529, 2857677, 2837412, 2800411, 2781421, 2790953, 2801896, 2791538, 2775553, 2783884, 2817982, 2851779, 2866069, 2863156, 2855272, 2857848, 2886440, 2938362, 2983941, 3000385, 3008108, 3044599, 3107239, 3158854, 3192207, 3245355, 3337138, 3430248, 3488200, 3534637, 3617006, 3733670, 3839068, 3910305, 3968249, 4034150, 4101257, 4154255, 4187294, 4196094, 4177783, 4146207, 4124537, 4114376, 4092875, 4048937, 4001557, 3971258, 3953145, 3933526, 3917015, 3917640, 3931633, 3938707, 3930714, 3925213, 3945417, 3992671, 4044213, 4078638, 4099894, 4130084, 4179344, 4235487, 4290702]
11186D290702P2296J09241J32023J18689R2245Q2738Q1586O5064M2603M1310N3350
11175E181847M3018N601k4428l0630l6899n8790p4726o8741o3925q2596j04272
11164D685459r8712p6493o8281p1986o1796l8531k8138l3837l2253j9217j7132
11153D139083k8390k4192L799K1154M894j5901n561K1759K9035J7733J9709M0086
11141D223208N1914M4482L5011K9168J0968j8814l4039k8385l1459n8903q2936
11130D140215q0659p6510r8399j20829j00781n3085l5391o1280q3224p0851n2192
11119C307014n5460n9820l9135j4521j9331m0266m1490k8545l6065n9901n7146
11108B855334k0146L180j7086m5720l9091j0924k998j7571k2528r116r39q998
$$ y = [4290702, 4362998, 4472239, 4604262, 4722951, 4815196, 4897934, 4979520, 5044584, 5087187, 5128497, 5181847, 5224865, 5230466, 5206038, 5175408, 5138509, 5079719, 5004993, 4936252, 4872327, 4789731, 4685459, 4586747, 4510254, 4441973, 4369987, 4308191, 4269660, 4241522, 4207685, 4175432, 4156215, 4139083, 4110693, 4086501, 4090300, 4111454, 4116348, 4100447, 4094886, 4116645, 4145680, 4163413, 4183122, 4223208, 4275122, 4319604, 4354615, 4383783, 4394751, 4375937, 4341898, 4313513, 4282054, 4223151, 4140215, 4059556, 3983046, 3884647, 3763818, 3663037, 3609952, 3574561, 3513281, 3430057, 3359206, 3307014, 3251554, 3191734, 3152599, 3138078, 3118747, 3078481, 3036991, 3008446, 2972381, 2912480, 2855334, 2835188, 2838368, 2821282, 2775562, 2736471, 2725547, 2722549, 2704978, 2682450, 2673334, 2672395, 2663397]
11096B663397j6701j2926o236m41J3053L1112L6738K9646K9200L7984L7036L0608
11084B872470N3643J07267J28585O9432k4754o7314m2983j1255q137j1304r403
11073C056247l4817r6894j42913j31227r8138j00278j24866j15912o8873l6757
11063B105572m5714o2528n5438l7859l4433m3051n0326n3525m9300k8976k720
11052A641702q32l0393n5342m3232j1546j697k1493m0070l3416j1470N12p899
11040A384824k3802k6831j3588l658j2875k6565j8767M674J0049j2270l1220k3336
11028A206635n866j935l671L253O585p881k1673j0543J1256J1764o762j6000j1656
11015A153506j3680k1692j4170N930P760j6204l3820k1135N658J8849J1573q706
$$ y = [2663397, 2646696, 2633770, 2627534, 2627093, 2640146, 2671258, 2707996, 2737642, 2766842, 2804826, 2841862, 2872470, 2926113, 3033380, 3161965, 3231397, 3206643, 3139329, 3096346, 3085091, 3076954, 3065650, 3056247, 3021430, 2924536, 2781623, 2650396, 2552258, 2451980, 2327114, 2211202, 2142329, 2105572, 2059858, 1997330, 1941892, 1904033, 1869600, 1826549, 1776223, 1722698, 1673398, 1644422, 1641702, 1640870, 1610477, 1555135, 1511903, 1500357, 1498660, 1477167, 1437097, 1403681, 1392211, 1392723, 1384824, 1361022, 1334191, 1320603, 1316945, 1304070, 1277505, 1258738, 1263412, 1273461, 1261191, 1229971, 1206635, 1200769, 1198834, 1195163, 1198416, 1205001, 1197120, 1175447, 1164904, 1176160, 1187924, 1181162, 1165162, 1153506, 1139826, 1118134, 1103964, 1109894, 1117654, 1101450, 1067630, 1046495, 1052153, 1071002, 1082575, 1073869]
11003A073869l1184l7620j6326J1540J0594j5704k5680m071J3576k44k1562j7468
10991I39720K717J0366K712p158j9548l3947k9756K181K8783J4146k4667l9314
10979H46235j7263R402J4776L611j0369j8186j1310P136J2891q621l1170k0826
10967G76306R087J5299p937k1923o760J1310O253j1941k1906j9748j0044M248
10955G22244J2258K230j4291j3066L103O933o562j2774m006j446r319l193J7968
10942G00079J7685j3557l0183m429K1684M438k6435j9041J1122J1118j4863j5977
10930F41641J0775J4656j4858k5071P379L1302M758l4697l0584N622K0062N99
10918F31584j6414r381M743P069K77o924j1396r299P48Q210K431q359p625L344
$$ y = [1073869, 1042685, 1005065, 988739, 1000279, 1010873, 995169, 969489, 965418, 978994, 978750, 957188, 939720, 942437, 952803, 955515, 948357, 928809, 894862, 865106, 867287, 896070, 910216, 885549, 846235, 828972, 838374, 853150, 856761, 846392, 828206, 816896, 824032, 836923, 828302, 797132, 776306, 785393, 800692, 792755, 770832, 764072, 775382, 781635, 769694, 747788, 728040, 717996, 722244, 734502, 736732, 722441, 709375, 712478, 719411, 712849, 700075, 696069, 694623, 685304, 682111, 700079, 717764, 704207, 674024, 669595, 691279, 695717, 669282, 650241, 661363, 672481, 657618, 641641, 652416, 667072, 652214, 627143, 634522, 665824, 670582, 635885, 605301, 610923, 630985, 631584, 615170, 605789, 610532, 617601, 617878, 610954, 599558, 590259, 591007, 599217, 601648, 593289, 585664, 589008]
10904E89008Q396K588m200p737j2966j6555p572R840J4998O80j3147p314R004
10891E65023J2889K48j1721j0726l555k306p261q964k285P164J0247M648l522
10878E49879p216n208r38K385L011p15q796j6784j8336j1921k901J916L36m518
10864D80194p487m921K716J0285J1240L365q037j3587q345K045N629k684j3707
10851D56706j3900k158R098J0192M187k274q908j5276j3381Q16J3997R464o708
10838D41855j1283J058Q387k728j2845k27K0676J8703m422j5724l039Q166M1r021
10824D39597j001P183m588j8181n712J7397J2814j3938j7134J2895K8763J518
10812D59613l0904k4114L896Q073r236j0366P651R848j1663k1569r67K1748J8512
$$ y = [589008, 597404, 599992, 595792, 588055, 575089, 558534, 550962, 560802, 575800, 576480, 563333, 556019, 565023, 577912, 578160, 566439, 555713, 552158, 549852, 542591, 533627, 531342, 538506, 548753, 553401, 549879, 542663, 537455, 536517, 538902, 541913, 541198, 532402, 515618, 497282, 485361, 482460, 484376, 484712, 480194, 472707, 467786, 470502, 480787, 492027, 495392, 487355, 473768, 465423, 467468, 473097, 470413, 456706, 442806, 440648, 449746, 459938, 464125, 461851, 452943, 437667, 424286, 425102, 439099, 448563, 441855, 430572, 431630, 440017, 437289, 424444, 424217, 444893, 463596, 459174, 443450, 440411, 448577, 448618, 439597, 438596, 445779, 441191, 423010, 417298, 434695, 447509, 433571, 416437, 429332, 458095, 459613, 428709, 404595, 408491, 416564, 407328, 396962, 404613, 414461, 402798, 381229, 380262, 402010, 420522]
10799D20522L210J955J0350P271p474j4765n607R815J6579P380j1979k3386j3887
10786C99984M573Q835k98J19J3439J3947p974k3666j1226P914O314l336M877J9971
10772D33473J2932r509j4838q20L771p216q922M449P201q356j4110L703J7725
10759D19483P057n803M316K0134J2744p874j1203K762Q901J751k145L89k608p928
10745D39976n63J2589P822j2387j7183K504J6824N703q942k476J0494L533j4499
10732D43395j5016Q77N940m291m124J4934K5229P681j4367j0287R907J2368o823
10719D65423j6455N48K1435J8002m457j8422j1958J505O378L338K755Q515J2899
10706D89506O732o711j1751P87J8515K1092P247m925m913k09L663J2312K1996
$$ y = [420522, 423732, 425687, 436037, 443308, 435834, 421069, 415462, 425277, 441856, 449236, 437257, 413871, 399984, 404557, 413392, 413094, 413213, 426652, 440599, 432625, 408959, 397733, 405647, 411961, 408625, 413502, 433473, 446405, 436896, 422058, 421238, 425009, 417793, 408871, 413320, 420521, 412165, 398055, 401758, 419483, 426540, 420737, 425053, 445187, 457931, 450057, 438854, 441616, 450517, 452268, 450123, 450512, 447904, 439976, 439413, 452002, 459824, 447437, 430254, 432758, 449582, 455285, 446343, 443867, 454361, 457894, 443395, 428379, 429256, 435196, 430905, 426781, 441715, 466944, 474625, 460258, 449971, 459878, 472246, 465423, 448968, 449516, 470951, 488953, 484496, 466074, 454116, 455621, 461999, 465337, 468092, 476607, 489506, 496238, 489527, 477776, 478563, 497078, 518170, 525417, 520492, 515579, 515370, 519033, 531345, 553341]
10693E53341J3771j3770k8531p961K1013J8215p764j3827P905K0552O742n563
10681E64123K664P668r499k2783n346J9251J3868q444o098J9533K5546j415k4934
10668E74134j8341m37M181K341Q214J3328O009k758J254Q008M74j3911j4384o88
10654E67424Q636O918M758O144K483n820l724J2666K2500P661j7135k0168L960
10641E96303K5217J8171m353j0992M369J7106R170p560j2042j905J0489J6918
10629F60891J5727O481m482l616J0550J8945Q803m244j356O398k279j7635j2039
10616F82144J0607J7579J683p806K176O675r213k0977q474P497L052o710J369
10603F79602J3468M033j6071j7578k216O242N304P154L850j5494k6505q01L3732
$$ y = [553341, 567112, 553342, 524811, 516850, 537863, 556078, 548314, 534487, 542392, 562944, 569686, 564123, 566787, 574455, 564956, 542173, 536827, 556078, 569946, 561502, 555404, 574937, 600483, 599068, 574134, 555793, 555356, 559537, 561878, 570092, 583420, 589429, 586671, 587925, 595933, 596407, 582496, 568112, 567424, 576060, 582978, 587736, 593880, 596363, 590543, 586819, 599485, 621985, 629646, 612511, 592343, 596303, 621520, 639691, 635338, 624346, 628715, 645821, 654991, 647431, 635389, 633484, 643973, 660891, 676618, 683099, 678617, 675001, 685551, 704496, 713299, 709055, 707699, 714097, 711818, 694183, 682144, 692751, 710330, 712013, 704207, 706383, 713058, 703845, 682868, 674394, 681891, 684943, 678233, 679602, 693070, 697103, 681032, 663454, 661238, 667480, 672784, 679938, 683788, 668294, 641789, 640988, 674720]
10590F74720K3545k0619l0949Q796L2916Q84l4469j4030L0763L1799o144k1608
10578F75604k33J1383p165j8327L162K6217J6469r769j6045q59Q871J498r698
10565F81108j1297l189P823J3302O823o862j2090j590J0778P431p411j1895L479
10552F76410K0918J6841o674k2061j1444Q582J0286l299k558J8979K7849J988
10540G35817k7606j8603J6726K7600Q86k2583j3507P345J2537R869J4851J4955
10528G58287m821k5062j7435Q382J9382J0681N834J0796N743j3712k3129q443
10516G26503J0985J3501N370L252O267M454Q06N266J4609J5512M687p008r724
10503G94480m708N54J333m76L57M325M709j850o480J08J0242Q185l941o818N796
$$ y = [674720, 698265, 677646, 646697, 655493, 688409, 689293, 654824, 640794, 671557, 703356, 697212, 675604, 675371, 686754, 679589, 661262, 664424, 690641, 707110, 697341, 681296, 680437, 689308, 690806, 681108, 669811, 666622, 674445, 687747, 694570, 687708, 675618, 674028, 684806, 692237, 684826, 672931, 676410, 697328, 714169, 707495, 685434, 673990, 682572, 692858, 689559, 687001, 705980, 733829, 735817, 708211, 689608, 706334, 733934, 734820, 712237, 698730, 706075, 718612, 728481, 743332, 758287, 753466, 728404, 710969, 719351, 738733, 749414, 755248, 766044, 771787, 758075, 734946, 726503, 737488, 750989, 756359, 759611, 765878, 770332, 771138, 776404, 791013, 806525, 811212, 804204, 794480, 789772, 790326, 791659, 791183, 791540, 795865, 800574, 798724, 792244, 792352, 802594, 810779, 806838, 800020, 805816]
10488H05816J6293J0877l02k368K146M817Q793J6800J6298j735j9708j2954J3468
10475H58241L0707K5611J1304J54q934j3919n618J2165K0662J3608O630R272Q854
10462I68737l856j3369l791J1358P488j1446j6087O249L3419L7107J5231r726
10450A021314j5487M59J9385J8620l415k1367j1095J8286L2888J6505q961j3147
10438A053985L942J6298J0463K900J2735L0329K8672L122j8699j4294K553M441
10426A136447o471k275K3818M0801K2471j3110k5692l787K5459L3068J8134M91
10414A249354l574N403J4609J4405R691J1660J8570J6208J850o787L168J9518
10402A354075K4425K0954K1849K3047J1887l884q05K4601M5999L8770O832k4294
$$ y = [805816, 822109, 832986, 832684, 830316, 832462, 837279, 846072, 862872, 879170, 877435, 857727, 844773, 858241, 888948, 914559, 925863, 926017, 917083, 903164, 897546, 909711, 930373, 943981, 950611, 959883, 968737, 964881, 951512, 947721, 959079, 966567, 955121, 939034, 945283, 978702, 1015809, 1031040, 1021314, 1005827, 1006286, 1025671, 1044291, 1040876, 1019509, 1008414, 1026700, 1059588, 1076093, 1067132, 1053985, 1057927, 1074225, 1084688, 1087588, 1100323, 1130652, 1159324, 1162446, 1143747, 1129453, 1132006, 1136447, 1129976, 1127701, 1151519, 1192320, 1214791, 1201681, 1175989, 1172202, 1197661, 1230729, 1248863, 1249354, 1245780, 1251183, 1265792, 1280197, 1289888, 1301548, 1320118, 1336326, 1338176, 1331389, 1334557, 1354075, 1378500, 1399454, 1421303, 1444350, 1456237, 1452353, 1451548, 1476149, 1522148, 1560918, 1567750, 1543456]
10390A543456k8995J219M6577O8721M9107J3721P59J1382J8193J4485J8986L2020
10378A789631K8891P715K163K6713M7949L7431J7811K2507L9646L6282J5703P228
10366B079670J3687J3703Q589K1612M9359N6816L0733K194K218K3325L9029L8306
10354B379241K7574J7248J7098K9576M1392L7186K3614K1074L0981L5069K9376
10343B689429L0445M0430L6978J2690m265R932L7611M6475L5548K8965L6283M4055
10331C044576M1102L1211K3537K5612M1676O4765P6376O6818M9746M4765N3430
10320C563614O4790P4556Q2703Q1386O5334M9564N5335P7872Q8202P2621N2859
10309D328836N6156P7031Q3944O1672L2686K8403M7596N9088M6816L2141L8116
$$ y = [1543456, 1514461, 1515680, 1562257, 1630978, 1680085, 1693806, 1694565, 1705947, 1724140, 1738625, 1757611, 1789631, 1818522, 1826237, 1828400, 1855113, 1903062, 1940493, 1958304, 1980811, 2020457, 2056739, 2072442, 2079670, 2093357, 2107060, 2115649, 2137261, 2186620, 2243436, 2274169, 2276363, 2278581, 2301906, 2340935, 2379241, 2406815, 2424063, 2441161, 2470737, 2512129, 2549315, 2572929, 2594003, 2624984, 2660053, 2689429, 2719874, 2760304, 2797282, 2809972, 2805707, 2815639, 2853250, 2899725, 2935273, 2964238, 3000521, 3044576, 3085678, 3116889, 3140426, 3166038, 3207714, 3272479, 3348855, 3415673, 3465419, 3510184, 3563614, 3628404, 3702960, 3785663, 3867049, 3932383, 3981947, 4037282, 4115154, 4203356, 4275977, 4328836, 4384992, 4462023, 4545967, 4607639, 4640325, 4668728, 4716324, 4775412, 4822228, 4854369, 4892485]
10298D892485N0736M2108K0518K1779N0423O8190N3287L4537M4640P0856Q0549
10287E430108P0923O2243O1006O1337O6866P9318Q0166N7516L7601N1429Q0340
10276F138853P7639M0852J6997L0942N2940N0878L4902L0168L7986M5810M9961
10265F607928M8683L5702J8063J6725L2137L4377P120k4957l6762m4057p2497
10254F622462j07804j16342j02568j03251j26378j38407j21669j04780j14370
10245E586893j27966j06955n8612k8521l3952m0942j9290J1706J7744O482J2771
10234E219358L6612L9941J1292j2246q522j1206n0827r4199r4267p2149q6093
10223D877694j32102j46421j10719q1996r6915j15537r6385o5510o2443o9440
$$ y = [4892485, 4943221, 4985329, 5005847, 5027626, 5078049, 5146239, 5199526, 5234063, 5278703, 5349559, 5430108, 5501031, 5563274, 5624280, 5685617, 5752483, 5831801, 5911967, 5969483, 6007084, 6058513, 6138853, 6216492, 6257344, 6274341, 6305283, 6358223, 6409101, 6444003, 6474171, 6512157, 6557967, 6607928, 6656611, 6692313, 6710376, 6727101, 6759238, 6793615, 6800735, 6775778, 6739016, 6694959, 6622462, 6514658, 6398316, 6295748, 6192497, 6066119, 5927712, 5806043, 5701263, 5586893, 5458927, 5351972, 5293360, 5264839, 5230887, 5189945, 5170655, 5182361, 5200105, 5206587, 5219358, 5255970, 5295911, 5307203, 5294957, 5286435, 5275229, 5224402, 5130203, 5035936, 4963787, 4877694, 4745592, 4599171, 4488452, 4406456, 4309541, 4194004, 4097619, 4032109, 3969666, 3900226]
10213C900226n1687k7164l3750n6223n1180k5003k0542l6918l1376j179N631k5259
10201C545576m4262j8464J4258P929k0132k4130m350K95k1037l6282k3149k432
10189C373820o436l3216m8596l1104k311j586l3223n7256m2740j0672k587k1941
10177C082152l5862k6594q516L692J0474R064o692k2377j2430J7044K7798M414
10165C042167k2264k2665q295m026r067r741q296j3631j9794j6075o156l81q28
10152B900948n391j1635r218J0485L0795K4114q24j511L2552N7088M2185K2517
10140C092105M0039P3353P3681M5111L4106N2758O6955N8024M6162M7513N0931
10129C680738M6217L9903L4236K0314j266j8439k8272l5464l4887k4062k4722
$$ y = [3900226, 3848539, 3821375, 3787625, 3731402, 3680222, 3655219, 3634677, 3597759, 3566383, 3565204, 3570835, 3545576, 3501314, 3482850, 3497108, 3505037, 3484905, 3460775, 3456425, 3456720, 3435683, 3399401, 3376252, 3373820, 3367384, 3334168, 3285572, 3254468, 3252157, 3250571, 3217348, 3160092, 3117352, 3106680, 3104093, 3082152, 3046290, 3019696, 3011180, 3014872, 3025346, 3034410, 3027718, 3005341, 2992911, 3009955, 3037753, 3042167, 3019903, 2997238, 2988943, 2984917, 2975850, 2966109, 2957813, 2944182, 2924388, 2908313, 2902157, 2901776, 2900948, 2895557, 2883922, 2874704, 2885189, 2915984, 2940098, 2939274, 2937763, 2970315, 3027403, 3069588, 3092105, 3132144, 3205497, 3279178, 3324289, 3358395, 3411153, 3478108, 3536132, 3582294, 3629807, 3680738, 3726955, 3766858, 3801094, 3821408, 3820142, 3801703, 3773431, 3737967, 3703080, 3679018, 3654296]
10118C654296n5618r0232q5067m9012l6076o2447q2507o4219l7328l8484n3557
10107B999749n1277l8564m0994n3479n1993l8368l4448m1126l9209k6842k2947
10096B560502l1974l4238j8517k213q037l2767m9161l6218l899J4593p98l1396
10084B325877m1428k3712o679j2091k6235k4734q157L666J016q674j6219j9172
10072B143458j8354j5184j0412l119L411k069k3004l8739k5544M594J2595j2584
10060B015049l5717k6627k223L770j0391k1282j8448j0179l377o06p051k0382
10048A862536k3931q497R957J1836R37p210r956j2055j0274k950l45o436o714
10035A796898O138J3615J041j4821j3410l978k728K36J6737K6620Q822j4135q417
$$ y = [3654296, 3598678, 3508446, 3423379, 3374367, 3338291, 3275844, 3193337, 3129118, 3091790, 3053306, 2999749, 2948472, 2909908, 2868914, 2815435, 2763442, 2725074, 2690626, 2649500, 2610291, 2583449, 2560502, 2528528, 2494290, 2475773, 2473560, 2465523, 2432756, 2383595, 2347377, 2343478, 2358071, 2357273, 2325877, 2284449, 2260737, 2254058, 2241967, 2215732, 2190998, 2182841, 2186507, 2187523, 2178849, 2162630, 2143458, 2125104, 2109920, 2099508, 2096389, 2099800, 2097731, 2074727, 2035988, 2010444, 2015038, 2027633, 2015049, 1979332, 1952705, 1950482, 1954252, 1943861, 1922579, 1904131, 1893952, 1890575, 1889969, 1882918, 1862536, 1838605, 1830108, 1840065, 1851901, 1852838, 1845628, 1835672, 1823617, 1813343, 1810393, 1810048, 1803612, 1796898, 1803036, 1816651, 1817692, 1802871, 1789461, 1785483, 1782755, 1782991, 1799728, 1826348, 1835170, 1821035, 1812618]
10022A812618J1791Q112j2487r380J6636K1538m352j8341J417K2073J5898J777
10010A867300K594Q072N989P557J6263J2815l896l362K2309L4928J2050j1958
9998A970661k619J9508K1220J3548K0212K6421J0330o110P840L2468K9370R565
9986B152414J1058K7672K4046Q337K0631N1845M6629j799k8954M886N6140O7268
9974B440173M4202K7837K9067L2112L3549L9838M4456L8480L0363L1955L9019
9963B831051M3897M9857N5575M7098K5954K2043N2012Q5368Q3436N6813M9366
9952C402470P3347R6927R6764Q8012R1675J00727R6418P9779O7195O3801N8989
9941D316104M5989L0835J9256P038q928j8814j1299O042J2364K979j642J4439
$$ y = [1812618, 1824409, 1832521, 1820034, 1810654, 1827290, 1848828, 1844476, 1826135, 1827552, 1849625, 1865523, 1867300, 1869894, 1877966, 1883955, 1891512, 1907775, 1920590, 1916694, 1913332, 1935641, 1970569, 1982619, 1970661, 1968042, 1987550, 2008770, 2022318, 2042530, 2068951, 2079281, 2073171, 2081011, 2113479, 2142849, 2152414, 2163472, 2191144, 2215190, 2223527, 2244158, 2296003, 2342632, 2340833, 2311879, 2316765, 2372905, 2440173, 2484375, 2512212, 2541279, 2573391, 2606940, 2646778, 2691234, 2729714, 2760077, 2792032, 2831051, 2874948, 2924805, 2980380, 3027478, 3053432, 3075475, 3127487, 3212855, 3296291, 3353104, 3402470, 3475817, 3572744, 3669508, 3757520, 3849195, 3949922, 4046340, 4126119, 4193314, 4257115, 4316104, 4362093, 4392928, 4412184, 4419222, 4410294, 4391480, 4380181, 4386223, 4398587, 4401566, 4399924, 4414363]
9929D414363L7115M1624K8933K4347M2137O8899Q4770Q7589R1157J06850J28472
9918E156256J32735J02335N5190L6541O6248J07147J08091O7966K9977K0535K6746
9907E909767L2224L7467L7701J7507j7662l7200l0803k8179n2252q1452q5523
9896E701595p4203p7893r6280j00622q0634n8381n3803n9636n6101l6773j4854
9885D992415q577j9618k7298j3293J0939J9531J3329J8028L6736M0199K0099J3562
9873E096052M5269P9750P1371L5616K3559M2007N0149L0522J1666J2758J2605
9862E511324q243l1697l2780k0569k3087m4583n9991m9519k4540j3524k4759l2422
9850E145610j1655J9561K0656o306j0310L0219O5562M9399J6335K9276P7628R6346
$$ y = [4414363, 4451478, 4493102, 4522035, 4546382, 4588519, 4657418, 4742188, 4829777, 4920934, 5027784, 5156256, 5288991, 5391326, 5446516, 5483057, 5549305, 5656452, 5764543, 5832509, 5862486, 5883021, 5909767, 5941991, 5979458, 6017159, 6034666, 6017004, 5979804, 5949001, 5920822, 5868570, 5787118, 5701595, 5627392, 5549499, 5453219, 5352597, 5271963, 5213582, 5159779, 5100143, 5044042, 5007269, 4992415, 4983838, 4964220, 4936922, 4923629, 4934568, 4954099, 4967428, 4985456, 5022192, 5062391, 5082490, 5096052, 5141321, 5221071, 5292442, 5328058, 5351617, 5393624, 5443773, 5474295, 5485961, 5498719, 5511324, 5503081, 5471384, 5438604, 5418035, 5394948, 5350365, 5290374, 5240855, 5216315, 5202791, 5178032, 5145610, 5133955, 5153516, 5174172, 5167866, 5157556, 5187775, 5253337, 5302736, 5319071, 5348347, 5425975, 5522321]
9838E522321P3829O5843R7067J23884J16264J07489J28961J56097J60254J62547
9828F714556J90150K23111K33695K41506K78088L27017L52712L65486M03564M65945
9818I795830N16201N43460N66864N81013N46999M46639L08362J72168N8473k8112
9808A3507897r6495j72392k73054l76355m42579m65061m69545m67436m45946m05835
9798I893199l71027l52792l37602l18621l06761l01306k82669k47358k19640k13623
9788F941800k11479j94811j72024j58196j50736j40992j30008j19376j05807r4913
9778E463458r8700j10734j09380r4687r1677j04718j04193p8233o0514p7347j01326
9767D431949r4690p0455o7450q5742r3563q4961q1928q4889p0711m3246l7510
$$ y = [5522321, 5596150, 5661993, 5759060, 5882944, 5999208, 6106697, 6235658, 6391755, 6552009, 6714556, 6904706, 7127817, 7361512, 7603018, 7881106, 8208123, 8560835, 8926321, 9329885, 9795830, 10312031, 10855491, 11422355, 12003368, 12550367, 12997006, 13305368, 13477536, 13536009, 13507897, 13411402, 13239010, 12965956, 12589601, 12147022, 11681961, 11212416, 10744980, 10299034, 9893199, 9522172, 9169380, 8831778, 8513157, 8206396, 7905090, 7622421, 7375063, 7155423, 6941800, 6730321, 6535510, 6363486, 6205290, 6054554, 5913562, 5783554, 5664178, 5558371, 5463458, 5364758, 5254024, 5144644, 5049957, 4958280, 4853562, 4749369, 4671136, 4610622, 4533275, 4431949, 4337259, 4266804, 4199354, 4113612, 4020049, 3935088, 3853160, 3768271, 3697560, 3654314, 3616804]
9756C616804o1540p8288o4364m6663n4596p0405o0867l3807k4975m1041n2844
9745C027414m3937l2658l8233n1067n0939l8018k9853l5394m5561m7537l8583
9734B575634k5326j6296j6649k5240l4541l6841l2394k8552k9179k9150k2834
9723B278632j3730r818j2255j5964j9629k5953l1832k9019j8223j2123j7805k4987
9711B047294k0483p777k402j1634k7329l6103k9447q270J3752J6309o165l1853
9699A895892l3740j4127j660j0858k2563j5287O27j18j6027j9557j587J1191l070
9686A769116k5354k3959m416nj6251k0877J158J8175P76k8687k9418n661L062
9673A637659j3462k3872r983P392Q857N162P842M960j0610j8224k393J5581R168
$$ y = [3616804, 3555264, 3476976, 3412612, 3365949, 3311353, 3240948, 3180081, 3146274, 3121299, 3080258, 3027414, 2983477, 2950819, 2912586, 2861519, 2810580, 2772562, 2742709, 2707315, 2661754, 2614217, 2575634, 2550308, 2534012, 2517363, 2492123, 2457582, 2420741, 2388347, 2359795, 2330616, 2301466, 2278632, 2264902, 2255084, 2242829, 2226865, 2207236, 2181283, 2149451, 2120432, 2102209, 2090086, 2072281, 2047294, 2026811, 2019034, 2016632, 2004998, 1977669, 1941566, 1912119, 1903849, 1917601, 1933910, 1927745, 1895892, 1862152, 1848025, 1846365, 1835507, 1812944, 1797657, 1798284, 1798166, 1782139, 1762582, 1760995, 1772186, 1769116, 1743762, 1719803, 1715387, 1715382, 1699131, 1678254, 1679412, 1697587, 1698363, 1669676, 1640258, 1634597, 1637659, 1624197, 1600325, 1590342, 1597734, 1606591, 1611753, 1619595, 1624555, 1613945, 1595721, 1593328, 1608909, 1618077]
9660A618077r830j1612K724O955m709j2103o138K66q63k554j818l241k217J0052
9646A582989K3141J5832p614j7105j035J5430R069p860r697M831J5630J1757K341
9633A637709Q21Q985J6206J1123m366j5204j1763k156K164L641Q531J0541L013
9620A669245k890M988J4289O439q224n912O623K300j4067q830J8637K5941k847
9607A705692k4961m393L1550L6140J0781q654p393L183J5594K6515K3669L850
9595A811573j1807p791M45k035O32K0466K9935M166k6847j9149J1981J6175p671
9582A820073j2930J1771K4585M668j5035p386Q544R590O082J2648J9356J5600
9570A897566J0401R640M293l795J605J5922J3436m486m773J6932K1108o099k1465
$$ y = [1618077, 1608247, 1596635, 1599359, 1606314, 1601605, 1589502, 1583364, 1583630, 1582767, 1580213, 1578395, 1575154, 1572937, 1582989, 1606130, 1621962, 1614348, 1597243, 1596208, 1611638, 1620707, 1612847, 1603150, 1607981, 1623611, 1635368, 1637709, 1638530, 1647515, 1663721, 1674844, 1670478, 1655274, 1643511, 1641355, 1643519, 1647160, 1655691, 1666232, 1669245, 1666355, 1671343, 1685632, 1692071, 1683847, 1677935, 1684558, 1686858, 1672791, 1663961, 1682598, 1708539, 1705692, 1680731, 1676338, 1707888, 1744028, 1754809, 1746155, 1738762, 1741945, 1757539, 1784054, 1807723, 1811573, 1799766, 1791975, 1792420, 1790385, 1791017, 1811483, 1841418, 1845584, 1818737, 1799588, 1811569, 1827744, 1820073, 1807143, 1818914, 1843499, 1848167, 1833132, 1825746, 1834290, 1843880, 1849962, 1862610, 1881966, 1897566, 1907967, 1917607, 1921900, 1918105, 1919710, 1935632, 1949068, 1944582, 1939809, 1956741, 1977849, 1971750, 1950285]
9557A950285K607K6732J0819j7118j2478Q709O136p027P632L3692K3217j3705
9545B019501j9897J0478K1579o035k2252M374L3820K4478k007o546M096L509k570
9532B062528M695J5072R322o53P236K1859J6697j990m894J0009J5704L292n260
9519B153617M034J7049J8737J4418J2960R781k96p947o33J8382L2117K8669J3779
9506B314667N424J4928L2229L5700K0508P611J5680L4287L9701K9284K0814K0920
9494B591753J6933M217r54J2221K7591K4015P361J318J1852K1364J8712J4176
9482B750559J7096J8111Q385J102J2650L1588L1650J3246M057J3924J9668P812
9470B929848Q53J7063L2370J6411j4129j8846K282J2663J926l236N563L211j5216
$$ y = [1950285, 1952892, 1979624, 1990443, 1973325, 1960847, 1969556, 1975692, 1968665, 1976297, 2009989, 2033206, 2019501, 1999604, 2010082, 2031661, 2025626, 2003374, 2007748, 2041568, 2066046, 2064039, 2057493, 2061589, 2065098, 2062528, 2067223, 2082295, 2091617, 2090964, 2098200, 2120059, 2136756, 2134766, 2129872, 2139881, 2155585, 2158877, 2153617, 2157651, 2174700, 2193437, 2207855, 2220815, 2230596, 2230300, 2222353, 2221720, 2240102, 2272219, 2300888, 2314667, 2320091, 2335019, 2367248, 2402948, 2423456, 2431067, 2446747, 2481034, 2520735, 2550019, 2570833, 2591753, 2608686, 2612903, 2611949, 2624170, 2651761, 2675776, 2683137, 2684455, 2696307, 2717671, 2736383, 2750559, 2767655, 2785766, 2794151, 2795253, 2807903, 2839491, 2871141, 2884387, 2888444, 2902368, 2922036, 2929848, 2930701, 2947764, 2980134, 2996545, 2982416, 2963570, 2965852, 2978515, 2980441, 2977205, 2982768, 2985979, 2970763]
9457B970763j6930Q178J8794j1406m3074l1549k76o43k6654l0295o489J407k0156
9444B811670l3128j5831K483m696j9760j8082p298l209j64P904O893r594j9359
9431B697829p585K023j5498m0157l5063n862O699j2234l4229l2801j5456m068
9419B503598o667j6314k2030j6228k777L206n198j3611p444K528l692k0192k1431
9406B373748j965J6203J8603J4473J2100M603q425j0003O912K1701J5069m38j95
9393B462386J4334K0628J2007N432J1707J9273J4553K294m160k379j27j446l948
9380B550554p387j4315k0759j6280K92J2739N530j3518k1676j2655l904p097r186
9367B442338L344J6996R723j2226k1027q623M171K535l787l970l302n824l360
$$ y = [2970763, 2953833, 2962011, 2980805, 2969399, 2926325, 2894776, 2894500, 2893857, 2867203, 2836908, 2830419, 2831826, 2811670, 2778542, 2762711, 2765194, 2760498, 2740738, 2722656, 2715358, 2712149, 2711985, 2719889, 2726782, 2717188, 2697829, 2690244, 2692267, 2676769, 2636612, 2601549, 2595687, 2602386, 2590152, 2555923, 2523122, 2507666, 2503598, 2496931, 2480617, 2458587, 2442359, 2439582, 2442788, 2437590, 2423979, 2416535, 2419063, 2415371, 2395179, 2373748, 2371783, 2387986, 2406589, 2421062, 2433162, 2437765, 2429340, 2419337, 2426249, 2447950, 2463019, 2462581, 2462386, 2476720, 2497348, 2509355, 2514787, 2526494, 2545767, 2560320, 2562614, 2558454, 2556075, 2555948, 2554502, 2550554, 2543167, 2528852, 2508093, 2491813, 2492105, 2504844, 2510374, 2496856, 2475180, 2462525, 2458621, 2451524, 2442338, 2445682, 2462678, 2472401, 2460175, 2439148, 2430525, 2434696, 2437231, 2433444, 2429474, 2426172, 2420348, 2416988]
9354B416988M365K227j0888j0526J2787K7539P660j8325o827K7678L0433n650
9342B477461k6549l936K1612J2788k025J5815L9865J9769k6299k9727K0300N5072
9330B574146L0317r536n324K8630L7639J4085j964P171J9250K1472K8077M1356
9318B785319L9087J6244J793J4216L2766L5100L2951M2847M9061L0491M028K406
9306C086309K1405K8674J7961J2866J7587Q817j4675j8892R842L5575K5507p98
9294C230178o151P543J2712N903N973J4969J7890J4887J8994K6020K0843J1048
9282C380809J8550L7377L7696J6947P736K3812L7370K7724J5251K2967L7955L9467
9270C703661L5618M0018L8944J9079N070K6208O0878O1178K7231R238L1464N9506
$$ y = [2416988, 2421353, 2423580, 2412692, 2402166, 2414953, 2442492, 2450152, 2431827, 2425000, 2452678, 2483111, 2477461, 2450912, 2446976, 2468588, 2481376, 2479351, 2495166, 2535031, 2554800, 2528501, 2498774, 2519074, 2574146, 2604463, 2594927, 2589603, 2618233, 2655872, 2669957, 2667993, 2675164, 2694414, 2715886, 2743963, 2785319, 2824406, 2840650, 2842443, 2856659, 2889425, 2924525, 2957476, 3000323, 3049384, 3079875, 3083903, 3086309, 3107714, 3136388, 3154349, 3167215, 3184802, 3193619, 3178944, 3160052, 3169894, 3205469, 3230976, 3230178, 3224027, 3231570, 3244282, 3250185, 3256158, 3271127, 3289017, 3303904, 3322898, 3348918, 3369761, 3380809, 3399359, 3436736, 3474432, 3491379, 3499115, 3522927, 3560297, 3588021, 3603272, 3626239, 3664194, 3703661, 3739279, 3779297, 3818241, 3837320, 3842390, 3868598, 3929476, 3990654, 4017885, 4027123, 4058587, 4118093]
9258D118093N6760L3974K2052K6526L2383L2193K8022K1512J8901L0731N1965
9247D473112N8391L8406J3818J3016L5576N8095O4035N4499M0382L5643M7711
9236D932684O5423O9802O3337O8663Q9013R6667P7908O0546P0055Q5053P1889
9225E751040M2269L4181M8531N0850L1885J9597K6551L1054K2559K2659M1902
9214F123078N4330M0217K2316L1204N9097P6308P4615O7821O4644O5422P2647
9203F751699Q3334Q4144P3446P1892R0331J06318R8095Q2897Q9856J10682J14391
9192G757085J01390J02299J24089J37519J25461J08080J07468J17395J23164J26355
9182H930305J33453J39707J39759J39206J43707J49883J54944J60716J62886J54178
$$ y = [4118093, 4174853, 4208827, 4230879, 4257405, 4289788, 4321981, 4350003, 4371515, 4390416, 4421147, 4473112, 4531503, 4569909, 4583727, 4596743, 4632319, 4690414, 4754449, 4808948, 4849330, 4884973, 4932684, 4998107, 5067909, 5131246, 5199909, 5288922, 5385589, 5463497, 5524043, 5594098, 5679151, 5751040, 5793309, 5827490, 5876021, 5926871, 5958756, 5978353, 6004904, 6035958, 6058517, 6081176, 6123078, 6177408, 6217625, 6239941, 6271145, 6330242, 6406550, 6481165, 6548986, 6613630, 6679052, 6751699, 6835033, 6919177, 6992623, 7064515, 7154846, 7261164, 7359259, 7442156, 7532012, 7642694, 7757085, 7858475, 7960774, 8084863, 8222382, 8347843, 8455923, 8563391, 8680786, 8803950, 8930305, 9063758, 9203465, 9343224, 9482430, 9626137, 9776020, 9930964, 10091680, 10254566, 10408744]
9172A0408744J43594J51116J75539J91184J87512J86562K04747K22656K16233
9163A2087887J97879J98802K22656K43565K44722K36288K36890K54197K81837
9154A4204723L03805L07394L00247L03755L21273L31275L25523L30202L65385
9145A7093582M05509M12723L94074L89330M11767M39323M59227M80504N01450
9136B0987489N06809N04534N24209N66592N95357N96341O03833O42650O83361
9127B6211175O90625O83896P06485P54761P85004P83111P83030Q11773Q53143
9118C3063003Q77688Q81312Q80352Q86748R00775R17590R32411R44377R56589
9109D1240845R68385R74175R77899R96861J036109J071202J078048J069804J076909
$$ y = [10408744, 10552338, 10703454, 10878993, 11070177, 11257689, 11444251, 11648998, 11871654, 12087887, 12285766, 12484568, 12707224, 12950789, 13195511, 13431799, 13668689, 13922886, 14204723, 14508528, 14815922, 15116169, 15419924, 15741197, 16072472, 16397995, 16728197, 17093582, 17499091, 17911814, 18305888, 18695218, 19106985, 19546308, 20005535, 20486039, 20987489, 21494298, 21998832, 22523041, 23089633, 23684990, 24281331, 24885164, 25527814, 26211175, 26901800, 27585696, 28292181, 29046942, 29831946, 30615057, 31398087, 32209860, 33063003, 33940691, 34822003, 35702355, 36589103, 37489878, 38407468, 39339879, 40284256, 41240845, 42209230, 43183405, 44161304, 45158165, 46194274, 47265476, 48343524, 49413328, 50490237]
9100E0490237J097005J098497J075323J061197J076637J095429J084740J051213
9092E9130278J021380R97525R62870R17522Q79059Q52665Q27514Q00935P81302
9083F7171050P66319P42606P10832O87927O77114O58515O21665N86355N72884
9074G3195267N67154N37502M77456M08560L44306K76515K01519J34228Q1707K2616
9064G6246830o4898j64792k36443k65516k80643l15031l69290m20114m50776m62777
9054G3216550m68542m82844n12820n48925n75826n98132o39279p04007p61602
9045F7924573p86863q01260q45441r20279r86543j021021j040892j067862j098825
9036E9355587j122340j136629j138141j117645j083308j063815j070331j077064
$$ y = [50490237, 51587242, 52685739, 53761062, 54822259, 55898896, 56994325, 58079065, 59130278, 60151658, 61149183, 62112053, 63029575, 63908634, 64761299, 65588813, 66389748, 67171050, 67937369, 68679975, 69390807, 70078734, 70755848, 71414363, 72036028, 72622383, 73195267, 73762421, 74299923, 74777379, 75185939, 75530245, 75806760, 76008279, 76142507, 76224214, 76246830, 76181932, 76017140, 75780697, 75515181, 75234538, 74919507, 74550217, 74130103, 73679327, 73216550, 72748008, 72265164, 71752344, 71203419, 70627593, 70029461, 69390182, 68686175, 67924573, 67137710, 66336450, 65491009, 64570730, 63584187, 62563166, 61522274, 60454412, 59355587, 58233247, 57096618, 55958477, 54840832, 53757524, 52693709, 51623378, 50546314]
9028E0546314j059781j032790j023718j029446j025047j004973r87845r86500
9020D2396214r97021j012130j023722j018051r90547r60593r50669r55785r53308
9011C3534388r35436r10430q81133q47747q22912q15330q06013p71974p26223
9002B6017190o99272o87673o62675o26571o11036o14519n96166n48537n20337
8993B0450404n37464n54242n24424m75154m59175m68880m56371m17210l93674
8984A6163810m01324m07512l87161l54646l32047l21691l17660l15226l04908
8975A3021635k82549k63373k60772k59443k40212k19274k23221k35688k17751
8966A0819352j77476j64036j86976j99180j76095j54108j63389j76260j59238
$$ y = [50546314, 49486533, 48453743, 47430025, 46400579, 45375532, 44370559, 43382714, 42396214, 41399193, 40387063, 39363341, 38345290, 37354743, 36394150, 35443481, 34487696, 33534388, 32598952, 31688522, 30807389, 29959642, 29136730, 28321400, 27515387, 26743413, 26017190, 25317918, 24630245, 23967570, 23340999, 22729963, 22115444, 21519278, 20970741, 20450404, 19912940, 19358698, 18834274, 18359120, 17899945, 17431065, 16974694, 16557484, 16163810, 15762486, 15354974, 14967813, 14613167, 14281120, 13959429, 13641769, 13326543, 13021635, 12739086, 12475713, 12214941, 11955498, 11715286, 11496012, 11272791, 11037103, 10819352, 10641876, 10477840, 10290864, 10091684, 9915589, 9761481, 9598092, 9421832, 9262594]
8957I262594j31204j27622j42182j46059j36553j27060j14750r6355r0645j06835
8947H043329j16523r7345p7168q8847j07943r0701n3611n1983q7648j03340p3848
8936G094372m1207m3566o3037o6937n6567m9973n0459n3966n9837n9506m2668
8925F506649k4289l2559o0932o9956m8514l1177l8272m4525l1705k5717m6367
8914F052636o2370m0042l629M20k5090m0263l4190l0744l7869l7263k3571j4830
8902E703195k1343l4702m7252n5611m9683k6065o220j2464l2922m0029l4357l5838
8890E306709m0823k8666o996o394k7109l4691j6925k786j1838k5142k3750j9023
8878E062566k4086k8304k1829j6114j9306j9541j2245j3635k5998k3099L069J5611
$$ y = [9262594, 9131390, 9003768, 8861586, 8715527, 8578974, 8451914, 8337164, 8240809, 8150164, 8043329, 7926806, 7829461, 7752293, 7663446, 7555503, 7464802, 7411191, 7359208, 7271560, 7168220, 7094372, 7053165, 7009599, 6946562, 6879625, 6823058, 6773085, 6722626, 6668660, 6608823, 6549317, 6506649, 6482360, 6449801, 6388869, 6318913, 6270399, 6239222, 6200950, 6156425, 6124720, 6099003, 6052636, 5990266, 5950224, 5946595, 5947015, 5921925, 5881662, 5847472, 5816728, 5778859, 5741596, 5718025, 5703195, 5681852, 5647150, 5599898, 5544287, 5494604, 5468539, 5462319, 5449855, 5416933, 5376904, 5342547, 5306709, 5265886, 5237220, 5230224, 5223830, 5196721, 5162030, 5145105, 5142319, 5130481, 5105339, 5081589, 5062566, 5038480, 5010176, 4988347, 4972233, 4952927, 4933386, 4921141, 4907506, 4881508, 4858409, 4861478, 4877089]
8866D877089j1862m4244l3253O465J9486m533j9677M80K5669K1546m72p646P281
8853D836329K6018L4082L1095K2223J4050J2698J6831J7987J3050R181J2012J6982
8841E062538J7399J3757R607M535k580p687n642P04J375p979j7886j6117o611
8828E045413o769k0163k5697r053P982m494l3391l4103J594K6745O586l0132l6288
8815D888230j4875n221j8809k9578k2177j2189j5213k5319l0309k7544k1744k1913
8803D643339l5843n3262m7658j4953Q088o650l0839k1218Q224P412k4442l4774
8791D397424n272J8237L808j6648o947J4599J5567O198J1648K1368J2753o96Q526
8778D480565L0776L5437K3925K2544L2764L1858J7768J2563K2664L2038L3875
$$ y = [4877089, 4865227, 4820983, 4787730, 4794195, 4813681, 4809148, 4789471, 4789951, 4815620, 4837166, 4836694, 4829048, 4836329, 4862347, 4896429, 4927524, 4949747, 4963797, 4976495, 4993326, 5011313, 5024363, 5033544, 5045556, 5062538, 5079937, 5093694, 5103301, 5107836, 5105256, 5097569, 5091927, 5092631, 5094006, 5086027, 5068141, 5052024, 5045413, 5038644, 5018481, 4992784, 4983731, 4991713, 4987219, 4953828, 4919725, 4921319, 4948064, 4954650, 4924518, 4888230, 4873355, 4868134, 4849325, 4819747, 4797570, 4785381, 4770168, 4744849, 4714540, 4686996, 4665252, 4643339, 4607496, 4554234, 4506576, 4491623, 4499711, 4493061, 4462222, 4441004, 4449228, 4456640, 4432198, 4397424, 4392152, 4410389, 4414197, 4397549, 4390602, 4405201, 4420768, 4426966, 4438614, 4459982, 4472735, 4472039, 4480565, 4511341, 4546778, 4570703, 4593247, 4626011, 4657869, 4675637, 4688200, 4710864, 4742902, 4776777]
8767D776777L5377L3485J9921P219J3907K6600J6028r540j0576J8466L6076K0166
8755D983906K654J3633L0955J9086j0604j6677R645L3359K5009m003j9463m572
8743E062928K2039K6809J764k1819j2888J4507J9858l662k0518j0305K552o318
8731E074947k0833j4993L859J2526J0935J2225J2299K626k204J3584K9266J2923
8719E147160k0582k1703J8575M9780L4505O60m392J9223L5214K8982J8842J8385
8707E324649K1048K2659L0454M2794M3613K7909J3947J7432K9303L3583L3020
8696E640411L8605M5143M0391L2045L8665N4030N0699K6635J6637L9829O5472
8685F088562N8054L1863K5980M2546N0740M3522M5658O3293O9791N3363L8509
$$ y = [4776777, 4812154, 4845639, 4865560, 4872779, 4886686, 4913286, 4929314, 4919774, 4909198, 4927664, 4963740, 4983906, 4986560, 5000193, 5031148, 5050234, 5039630, 5022953, 5032598, 5065957, 5090966, 5086963, 5067500, 5062928, 5084967, 5111776, 5113540, 5091721, 5078833, 5093340, 5113198, 5109536, 5089018, 5078713, 5081265, 5074947, 5054114, 5039121, 5042980, 5055506, 5066441, 5078666, 5090965, 5093591, 5091387, 5104971, 5134237, 5147160, 5126578, 5104875, 5123450, 5173230, 5207735, 5208395, 5204003, 5223226, 5258440, 5287422, 5306264, 5324649, 5345697, 5368356, 5398810, 5441604, 5485217, 5513126, 5527073, 5544505, 5573808, 5607391, 5640411, 5679016, 5724159, 5764550, 5796595, 5835260, 5889290, 5939989, 5966624, 5983261, 6023090, 6088562, 6146616, 6178479, 6204459, 6247005, 6297745, 6341267, 6386925, 6450218, 6520009, 6573372, 6611881]
8674F611881M2601M8256M1247M1013O3879Q5242P3606M2100L0237M6870O5366
8663G192298O8443O5860O8688P3388P4301P2058O7622O2166O0824O5056O7524
8652G938228O5354O7692P7719Q1675P1331O1486O6836P8246Q1940Q3382Q9347
8641H763236Q7667P2227O5166Q1273R3997P7063N6621P2507J06209J05810P2742
8630I654518N9481Q0651R3540P8667P2321R5244J11964R4674P2418P7830R3253
8619A0584561R1423Q6361R8862J09447R3982P4658Q5983J14520J21145J04548
8609A1565490R5888J04526J13089J15763J21012J24971J18550J11968J19473J31582
8599A2722312J33702J35732J49488J57087J41393J27606J48773J86677J96651
$$ y = [6611881, 6654482, 6702738, 6743985, 6784998, 6848877, 6934119, 7007725, 7049825, 7080062, 7126932, 7192298, 7260741, 7326601, 7395289, 7468677, 7542978, 7615036, 7682658, 7744824, 7805648, 7870704, 7938228, 8003582, 8071274, 8148993, 8230668, 8301999, 8363485, 8430321, 8508567, 8590507, 8673889, 8763236, 8850903, 8923130, 8988296, 9069569, 9163566, 9240629, 9297250, 9369757, 9475966, 9581776, 9654518, 9713999, 9794650, 9888190, 9966857, 10039178, 10134422, 10246386, 10341060, 10413478, 10491308, 10584561, 10675984, 10762345, 10861207, 10970654, 11064636, 11139294, 11225277, 11339797, 11460942, 11565490, 11661378, 11765904, 11878993, 11994756, 12115768, 12240739, 12359289, 12471257, 12590730, 12722312, 12856014, 12991746, 13141234, 13298321, 13439714, 13567320, 13716093, 13902770, 14099421]
8590A4099421J78442J70472J83194J93119J97942K19523K50203K54373K32283
8581A5978972K27316K56912K87939K95693K97521L10778L25453L37339L62223
8572A8680146L97254M13204M05691M09856M43013M77083M89773M98014N17205
8563B2731239N32963N37901N49788N68553N65837N43849N47146N81982N86972
8554B7746230N31025M77882M92232N37278N37522M97601M79214M93929N02228
8545C2295141M97768N10162N34569N36122N19669N22192N39064N30007M96982
8536C6981676M82325M87145M67189M17130L81932L71397L41526K80868K37515
8527D0448703K33104K25955J92661J71301J84068J90944J67771J58739J95391
$$ y = [14099421, 14277863, 14448335, 14631529, 14824648, 15022590, 15242113, 15492316, 15746689, 15978972, 16206288, 16463200, 16751139, 17046832, 17344353, 17655131, 17980584, 18317923, 18680146, 19077400, 19490604, 19896295, 20306151, 20749164, 21226247, 21716020, 22214034, 22731239, 23264202, 23802103, 24351891, 24920444, 25486281, 26030130, 26577276, 27159258, 27746230, 28277255, 28755137, 29247369, 29784647, 30322169, 30819770, 31298984, 31792913, 32295141, 32792909, 33303071, 33837640, 34373762, 34893431, 35415623, 35954687, 36484694, 36981676, 37464001, 37951146, 38418335, 38835465, 39217397, 39588794, 39930320, 40211188, 40448703, 40681807, 40907762, 41100423, 41271724, 41455792, 41646736, 41814507, 41973246, 42168637]
8518D2168637K31215K21554K06389K39792K90844K96772K72316K79291L17083
8509D4523893L31992L17870L20146L46460L57270L47510L57966L96927M26468
8500D7726502M39614M76221N42586N89614N99903O25933P03007P88424Q34692
8491E3326496Q67584R36214J029326J101045J149807J212373J297023J378238
8483F2298106J449904J533331J631934J721605J792700J865794J955667K047818
8475G6296859K122419K180835K236775K294986K348423K389039K415731K434611
8467I4719678K452029K466820K474906K481980K500399K530152K557470K578718
8459A14762152K608795K656281K709236K759141K817941K891086K953339K978877
$$ y = [42168637, 42399852, 42621406, 42827795, 43067587, 43358431, 43655203, 43927519, 44206810, 44523893, 44855885, 45173755, 45493901, 45840361, 46197631, 46545141, 46903107, 47300034, 47726502, 48166116, 48642337, 49184923, 49774537, 50374440, 51000373, 51703380, 52491804, 53326496, 54194080, 55130294, 56159620, 57260665, 58410472, 59622845, 60919868, 62298106, 63748010, 65281341, 66913275, 68634880, 70427580, 72293374, 74249041, 76296859, 78419278, 80600113, 82836888, 85131874, 87480297, 89869336, 92285067, 94719678, 97171707, 99638527, 102113433, 104595413, 107095812, 109625964, 112183434, 114762152, 117370947, 120027228, 122736464, 125495605, 128313546, 131204632, 134157971, 137136848]
8451A37136848K981859K996596L025122L035827L011527K966810K914755K848168
8443A60917512K763839K677411K598828K514645K411141K297674K190985K091780
8435A80463815J994345J905442J832436J762106J675034J577329J492761J420626
8427A94123894J328871J203740J083772J018424J002566R80263R14613Q26533
8419B02482676P54822P03975O51778N89665N29117M76860M28096L79599L28054
8410B07324642K62639J83634J19357R2653P8024L3612k5232l5434J9406Q0547
8400B08133848J06737J38187K24004L38536M33137N32313P01317R36942J172581
8391B12717602J394292J673513K064016K532987L022468L520223M034167M546109
$$ y = [137136848, 140118707, 143115303, 146140425, 149176252, 152187779, 155154589, 158069344, 160917512, 163681351, 166358762, 168957590, 171472235, 173883376, 176181050, 178372035, 180463815, 182458160, 184363602, 186196038, 187958144, 189633178, 191210507, 192703268, 194123894, 195452765, 196656505, 197740277, 198758701, 199761267, 200741530, 201656143, 202482676, 203237498, 203941473, 204593251, 205182916, 205712033, 206188893, 206616989, 206996588, 207324642, 207587281, 207770915, 207890272, 207982925, 208060949, 208094561, 208069329, 208033895, 208053301, 208133848, 208240585, 208378772, 208602776, 208941312, 209374449, 209906762, 210608079, 211545021, 212717602, 214111894, 215785407, 217849423, 220382410, 223404878, 226925101, 230959268, 235505377]
8383B35505377N030739N481781N882091O181744O340529O359246O236083N931086
8375B82948676N418251M741447L971049L130811K216956J267923L60459m53886
8367C03601686j161296j745651k184646k479968k646532k679085k574616k376981
8359B85752911k146938j897899j623746j386553j301387j415821j671909k012578
8351B72296080k458515l043201l735633m477738n246814o026301o758672p388496
8343B33160710p920424q374539q710412q859245q816767q645208q393906q074810
8335A65365399p705304p310339o881511o396279n884870n418233n018658m642661
8327A16107544m267558l929571l648758l382211l096079k828024k623558k455675
$$ y = [235505377, 240536116, 246017897, 251899988, 258081732, 264422261, 270781507, 277017590, 282948676, 288366927, 293108374, 297079423, 300210234, 302427190, 303695113, 304055572, 303601686, 302440390, 300694739, 298510093, 296030125, 293383593, 290704508, 288129892, 285752911, 283605973, 281708074, 280084328, 278697775, 277396388, 275980567, 274308658, 272296080, 269837565, 266794364, 263058731, 258580993, 253334179, 247307878, 240549206, 233160710, 225240286, 216865747, 208155335, 199296090, 190479323, 181834115, 173440209, 165365399, 157660095, 150349756, 143468245, 137071966, 131187096, 125768863, 120750205, 116107544, 111839986, 107910415, 104261657, 100879446, 97783367, 94955343, 92331785, 89876110]
8319H9876110k270707k081128j943050j858161j769458j654793j557468j508900
8311G5232445j480649j440269j404218j397274j396661j362523j304098j269628
8303F4177125j274251j278245j245071j188216j142576j112479j073844j018770
8295E4843673r70519r48291r37684r10974q65634q25534q08108q07538q11014
8286D6958377q14219q15352q09274p96329p85050p78262p68653p55308p48949
8277C9886981p49599p36645o98872o59524o48347o57884o52439o17024n73748
8268C3892899n48761n43609n41916n27147m92429m48513m20682m20984m27317
8259B9521541m10029l73939l48661l41843l34125l20001l15402l17624k99628
$$ y = [89876110, 87605403, 85524275, 83581225, 81723064, 79953606, 78298813, 76741345, 75232445, 73751796, 72311527, 70907309, 69510035, 68113374, 66750851, 65446753, 64177125, 62902874, 61624629, 60379558, 59191342, 58048766, 56936287, 55862443, 54843673, 53873154, 52924863, 51987179, 51076205, 50210571, 49385037, 48576929, 47769391, 46958377, 46144158, 45328806, 44519532, 43723203, 42938153, 42159891, 41391238, 40635930, 39886981, 39137382, 38400737, 37701865, 37042341, 36393994, 35736110, 35083671, 34466647, 33892899, 33344138, 32800529, 32258613, 31731466, 31239037, 30790524, 30369842, 29948858, 29521541, 29111512, 28737573, 28388912, 28047069, 27712944, 27392943, 27077541, 26759917, 26460289]
8250B6460289k60774k41021k58989k76543k59245k33537k38908k56750k43474
8241B4191048k11616k12183k43945k49856k12462j84711k01411k22577k03461
8232B2248826j67670j60532j70697j56778j25917j22806j49718j58424j27361
8223B0908923r2912q8108r6390q9160p1200o0563n2833l6190k0541k0229k2291
8212B0258506l083L1836N4125N5889N8715P7825J02641J19526J32860J53852J82962
8201B1225654K11498K30309K33671K26249K26246K45754K67604K62040K29110
8192B3358135J99220J84183J58587J07573O1252N0259N1766K0682l9058p9218
8182B4073381q0069p2583q0892q8334p9473p4839r4525j17741j12347q5068p0852
$$ y = [26460289, 26199515, 25958494, 25699505, 25422962, 25163717, 24930180, 24691272, 24434522, 24191048, 23979432, 23767249, 23523304, 23273448, 23060986, 22876275, 22674864, 22452287, 22248826, 22081156, 21920624, 21749927, 21593149, 21467232, 21344426, 21194708, 21036284, 20908923, 20816011, 20727903, 20631513, 20542353, 20471153, 20410590, 20357757, 20321567, 20301026, 20280797, 20258506, 20255423, 20287259, 20341384, 20397273, 20455988, 20533813, 20636454, 20755980, 20888840, 21042692, 21225654, 21437152, 21667461, 21901132, 22127381, 22353627, 22599381, 22866985, 23129025, 23358135, 23557355, 23741538, 23900125, 24007698, 24068950, 24119209, 24170975, 24191657, 24152599, 24073381, 23993312, 23920729, 23839837, 23751503, 23672030, 23597191, 23502666, 23384925, 23272578, 23187510, 23116658]
8171B3116658q5712j17836j53955j87621k10672k21735k35834k64488k97389l24161
8161B1017255l56017l98245m22716m06269l78770l85366m12732m08630l71265
8152A7477245l54274l71809l68306l13055k59390k61667k87686k74363k29908
8143A4756787k11236k23828k17581j76587j43508j44886j52942j40856j25033
8134A3220330j27240j35487j29334j12561r7074q1985o9572p3915r1779r2769
8124A2208614o3690l6274m1766o1657n7471l1479j9372l1760m1531l0059j1785
8113A1781770n671r897j5154k0575k4657j8038J608J9964K3216J6319J4163K1236
8101A1784284K9409L1699K9502K7693K9200L4760M2930M8920M7486M0627L9828
$$ y = [23116658, 23030946, 22913110, 22759155, 22571534, 22360862, 22139127, 21903293, 21638805, 21341416, 21017255, 20661238, 20262993, 19840277, 19434008, 19055238, 18669872, 18257140, 17848510, 17477245, 17122971, 16751162, 16382856, 16069801, 15810411, 15548744, 15261058, 14986695, 14756787, 14545551, 14321723, 14104142, 13927555, 13784047, 13639161, 13486219, 13345363, 13220330, 13093090, 12957603, 12828269, 12715708, 12618634, 12536649, 12467077, 12393162, 12301383, 12208614, 12144924, 12108650, 12066884, 12005227, 11947756, 11916277, 11896905, 11865145, 11823614, 11793555, 11781770, 11776099, 11766202, 11751048, 11730473, 11705816, 11687778, 11689386, 11709350, 11732566, 11748885, 11763048, 11784284, 11813693, 11845392, 11874894, 11902587, 11931787, 11966547, 12009477, 12058397, 12105883, 12146510, 12186338]
8090A2186338N4136P5112Q2243O8882N3881N7030P1539P7098P3772P9506R3971
8079A2973508R3237P0602N5225P0936R9119J07396R7737R7137J11716J21222J15555
8068A4013390J07380J07151J11419J18548J31112J39220J27108J03151R8038J22671
8058A5179188J50828J56123J44975J38383J40700J43834J46570J51792J56577
8049A6508970J60405J70791J86405J89335J72104J57634J70123J97547K08581
8040A8121895J99349J95403K08618K20601K15360K04095K06060K22106K38735
8031B0032222K46164K43703K38052K42300K64049K88702K90104K67342K54186
8022B2366824K76501L14576L28953L14906L05552L21293L43664L49922L49763
$$ y = [12186338, 12240474, 12315586, 12397829, 12466711, 12520592, 12577622, 12649161, 12726259, 12800031, 12879537, 12973508, 13066745, 13137347, 13192572, 13263508, 13362627, 13470023, 13567760, 13664897, 13776613, 13897835, 14013390, 14120770, 14227921, 14339340, 14457888, 14589000, 14728220, 14855328, 14958479, 15056517, 15179188, 15330016, 15486139, 15631114, 15769497, 15910197, 16054031, 16200601, 16352393, 16508970, 16669375, 16840166, 17026571, 17215906, 17388010, 17545644, 17715767, 17913314, 18121895, 18321244, 18516647, 18725265, 18945866, 19161226, 19365321, 19571381, 19793487, 20032222, 20278386, 20522089, 20760141, 21002441, 21266490, 21555192, 21845296, 22112638, 22366824, 22643325, 22957901, 23286854, 23601760, 23907312, 24228605, 24572269, 24922191, 25271954]
8013B5271954L66367L95317M09094M00245L93608M07901M28493M34894M36999
8004B8944872M59024M96065N15932N07334M98636N16149N46798N62062N62404
7995C3609276N72674O00798O26892O35002O34123O41294O59954O82319P00885
7986C9363217P11641P16528P26892P52601P84093P99557P95603P94252Q10457
7977D6254841Q30636Q38002Q41119Q55178Q68764Q58408Q30888Q19285Q32764
7968E3829885Q40887Q19895P86248P64373P45399P05768O50787O06869N76487
7959F0326598N34196M70255M06333L57106L05125K31937J50474Q2651K2101n2950
7949F2833826j39569k12786k66947l25611m03504m83093n41481n82125o24595
$$ y = [25271954, 25638321, 26033638, 26442732, 26842977, 27236585, 27644486, 28072979, 28507873, 28944872, 29403896, 29899961, 30415893, 30923227, 31421863, 31938012, 32484810, 33046872, 33609276, 34181950, 34782748, 35409640, 36044642, 36678765, 37320059, 37980013, 38662332, 39363217, 40074858, 40791386, 41518278, 42270879, 43054972, 43854529, 44650132, 45444384, 46254841, 47085477, 47923479, 48764598, 49619776, 50488540, 51346948, 52177836, 52997121, 53829885, 54670772, 55490667, 56276915, 57041288, 57786687, 58492455, 59143242, 59750111, 60326598, 60860794, 61331049, 61737382, 62094488, 62399613, 62631550, 62782024, 62864675, 62886776, 62833826, 62694257, 62481471, 62214524, 61888913, 61485409, 61002316, 60460835, 59878710, 59254115]
7940E9254115o75151p23172p60502p90609q19695q47520q68087q77004q79222
7931E2013153q87048r03800r12995q97041q66382q52382q65330q77510q59547
7922D4091118q18301p84088p72023p71601p66001p46924p16803o88344o74397
7913C7352636o68583o48169o07952n74492n68657n71870n54642n22783n03243
7904C2132245m95443m75057m42753m27855m37213m39929m16365l86833l73771
7895B8237026l67646l51839l33097l23714l17358l05371k94448k86638k67087
7886B5389828k35670k21863k36201k36504j86730j28267j38725k24916l09129
7877B3471823l28917l04112k90400l07979l39294l66487l84364l92999l96141
$$ y = [59254115, 58578964, 57855792, 57095290, 56304681, 55484986, 54637466, 53769379, 52892375, 52013153, 51126105, 50222305, 49309310, 48412269, 47545887, 46693505, 45828175, 44950665, 44091118, 43272817, 42488729, 41716706, 40945105, 40179104, 39432180, 38715377, 38027033, 37352636, 36684053, 36035884, 35427932, 34853440, 34284783, 33712913, 33158271, 32635488, 32132245, 31636802, 31161745, 30718992, 30291137, 29853924, 29413995, 28997630, 28610797, 28237026, 27869380, 27517541, 27184444, 26860730, 26543372, 26238001, 25943553, 25656915, 25389828, 25154158, 24932295, 24696094, 24459590, 24272860, 24144593, 24005868, 23780952, 23471823, 23142906, 22838794, 22548394, 22240415, 21901121, 21534634, 21150270, 20757271, 20361130]
7868B0361130l96231l84215l50978l11810k94793k98788k92206k64189k43750
7859A7524170k49760k56343k36715k10859k11582k25694k14082j78879j62373
7850A5577883j77366j86035j62757j35884j39728j57177j47421j13346r8767j18163
7840A4141239j30064r9100n2912m3275o6422o5803j8546K7514L1143L2059R4498
7829A3850331J91830K12665J00039o6703j61949j50148r7156p6975j12598j90508
7819A3498828k81027l41949l44168l04991k69217k54105k40868k19537k05300
7810A1037666k02998j93311j69855j55745j62959j67086j47658j24899j25861
7801I587294j38309j33659j17628j18295j33575j32181j06627q5682q6656r1343
$$ y = [20361130, 19964899, 19580684, 19229706, 18917896, 18623103, 18324315, 18032109, 17767920, 17524170, 17274410, 17018067, 16781352, 16570493, 16358911, 16133217, 15919135, 15740256, 15577883, 15400517, 15214482, 15051725, 14915841, 14776113, 14618936, 14471515, 14358169, 14259402, 14141239, 14011175, 13912075, 13859163, 13815888, 13749466, 13683663, 13665117, 13692631, 13723774, 13755833, 13850331, 14042161, 14254826, 14354865, 14288162, 14126213, 13976065, 13878909, 13801934, 13689336, 13498828, 13217801, 12875852, 12531684, 12226693, 11957476, 11703371, 11462503, 11242966, 11037666, 10834668, 10641357, 10471502, 10315757, 10152798, 9985712, 9838054, 9713155, 9587294, 9448985, 9315326, 9197698, 9079403, 8945828, 8813647, 8707020, 8621338, 8534682, 8443339]
7791H443339q2722p2883p5164p6890o4656n4066o4363p8578o2836k0519P172P49
7779G798583q187J6500O1453P8589M3437k1546p7157j01575r5008p1561n6061
7768G567467p4036j28283j87891k12429j90285j48355j22631j23306j31080j24758
7758F124413j06388r4305r4459r1040p2837n6598o5691r0428r4465o6262l8778
7747E253162m2922o4283o9139n5405m8105n4940n9120n3172m7513m3841l2349
7736D682373k0099k8241n1709n7146l5561k0441l2492m4609l1969j9460l7331
7725D303315o1132m8572j4960j2041m0325m6772j5524L447k2527n5634n1356k6867
7713C911052k3579l8738m0701k6584j8823k1344k1814k4571l9901n1075l4625
$$ y = [8443339, 8360617, 8287734, 8212570, 8135680, 8071024, 8016958, 7952595, 7874017, 7811181, 7790662, 7797834, 7798583, 7790396, 7806896, 7868349, 7946938, 7990375, 7968829, 7891672, 7790097, 7695089, 7623528, 7567467, 7493431, 7365148, 7177257, 6964828, 6774543, 6626188, 6503557, 6380251, 6249171, 6124413, 6018025, 5923720, 5829261, 5738221, 5665384, 5608786, 5543095, 5452667, 5358202, 5291940, 5253162, 5210240, 5145957, 5076818, 5021413, 4973308, 4918368, 4859248, 4806076, 4758563, 4714722, 4682373, 4662274, 4634033, 4582324, 4525178, 4489617, 4469176, 4436684, 4392075, 4360106, 4340646, 4303315, 4242183, 4193611, 4178651, 4166610, 4126285, 4079513, 4063989, 4067436, 4044909, 3989275, 3937919, 3911052, 3887473, 3848735, 3808034, 3781450, 3762627, 3741283, 3719469, 3694898, 3654997, 3603922, 3569297]
7702C569297o602m667k6717l3250j3716k379j7307l1722k5987k2283l8418m8119
7690C298130k5630K303o068l9015m7639k1391j122j4231l7603l7216j4295L373
7678C059596l357l0002n4883n4836k7310J879O520p666j6799j8224k8167m2267
7666B784484l4229k809J5346k437l1465l9823l2210k7074j8710K914J7233q03
7654B630417l3259l9937j9474p511j6141j9839o864K44j1044k0369j5002j4181
7642B427040k8990l5098j6027K13j4985l8430l0023N09R828p471j4368J595P387
7629B261180j6804m1829l4673o356R839M155r118j9024k3751k1612j4951j3531
7617B073525j9558j9771o087P258K700j3681k0344j0325J274j720j7740k9796
$$ y = [3569297, 3562695, 3558028, 3531311, 3498061, 3484345, 3481966, 3464659, 3432937, 3406950, 3384667, 3346249, 3298130, 3272500, 3274803, 3268735, 3229720, 3182081, 3160690, 3159568, 3145337, 3107734, 3070518, 3056223, 3059596, 3056239, 3026237, 2971354, 2916518, 2889208, 2891087, 2897607, 2889941, 2873142, 2854918, 2826751, 2784484, 2750255, 2747446, 2762792, 2760355, 2728890, 2689067, 2656857, 2629783, 2611073, 2613987, 2631220, 2630417, 2597158, 2557221, 2537747, 2530236, 2514095, 2494256, 2487392, 2487636, 2476592, 2456223, 2441221, 2427040, 2398050, 2362952, 2346925, 2347138, 2332153, 2293723, 2263700, 2264209, 2274037, 2266566, 2252198, 2253793, 2261180, 2244376, 2202547, 2167874, 2161518, 2171357, 2175512, 2166394, 2147370, 2123619, 2102007, 2087056, 2073525, 2053967, 2034196, 2028109, 2035367, 2038067, 2024386, 2004042, 1993717, 1994991, 1993271, 1975531, 1945735]
7605A945735k3430m511M016q490k1353j0882Q933L239k5899l6176j1323J0365
7593A830224j741k0067q166J3971L465k9892l7763j2196O650Q87m149K528m069
7580A739682k9998l8649j0336J9471J4522q303j4964r222j1946j5542l529P307
7568A638493q492l3378k7357P076K6599J2458r211j5750j4718j4010n262Q470
7556A564918M213k2202l8366j8923J5299K4958L737j9494k1396q406j891j0537
7544A471910k0757j5192M74J652j5975k1654L413K5364L127l8889l6460J4581
7532A371594M3720J0433l5180l2315J755J2142n127j3427o997j0190j9800r374
7520A307234J3318J1611j4653k4861o353P488M47q02J5405J7136j1413l2061j3697
$$ y = [1945735, 1922305, 1917794, 1921810, 1913320, 1891967, 1881085, 1890018, 1893257, 1867358, 1831182, 1819859, 1830224, 1828483, 1808416, 1800250, 1814221, 1817686, 1787794, 1750031, 1737835, 1744485, 1745372, 1741223, 1743751, 1739682, 1709684, 1671035, 1660699, 1680170, 1694692, 1686389, 1671425, 1662203, 1650257, 1634715, 1631186, 1638493, 1630001, 1596623, 1569266, 1576342, 1602941, 1615399, 1606188, 1590438, 1575720, 1561710, 1556448, 1564918, 1569131, 1546929, 1508563, 1489640, 1504939, 1529897, 1533634, 1514140, 1492744, 1484338, 1482447, 1471910, 1451153, 1435961, 1436435, 1438087, 1422112, 1400458, 1403871, 1429235, 1432362, 1393473, 1357013, 1371594, 1415314, 1425747, 1390567, 1358252, 1360007, 1372149, 1367022, 1353595, 1346598, 1336408, 1316608, 1307234, 1320552, 1332163, 1317510, 1292649, 1286296, 1293784, 1294231, 1293429, 1308834, 1325970, 1314557, 1282496, 1268799]
7507A268799J2086K389k5404k5053J145J1675j885p670M406O823j1431k2404p710
7494A205766R018O74k0536k2961q78K1061K0280q92k0688k0172l553N786l603
7481A169302j3249l129J3528R568r112r910J1570K0413j922k6884k4396p257k965
7468A125557p970k987N711k516k0391j9144L748J7674O102r236l919J2807J4573
7455A120009l494k0545j9556o960n31n513r935m574O61q692k4198k0389O391K5784
7441A028458J4841p036o735J2855J9382Q33k0169k2625j1387k65N871N537k351
7428A017209r502m953M657J871j0801j1542K564O590r417j8166K198K8600K5328
7415A024636k089j7385q051K819k659j3552j2324J029J3797J5271L518j1360j2249
$$ y = [1268799, 1280885, 1283274, 1257870, 1232817, 1233962, 1245637, 1243752, 1236082, 1240488, 1247311, 1235880, 1213476, 1205766, 1214784, 1215458, 1194922, 1171961, 1171083, 1192144, 1212424, 1211532, 1190844, 1170672, 1167119, 1172905, 1169302, 1156053, 1152924, 1166452, 1176020, 1166908, 1156998, 1168568, 1188981, 1187059, 1160175, 1135779, 1128522, 1125557, 1117587, 1114600, 1120311, 1117795, 1097404, 1078260, 1082008, 1099682, 1105784, 1096548, 1092629, 1105436, 1120009, 1116515, 1095970, 1076414, 1069454, 1068923, 1063410, 1053475, 1048901, 1049562, 1040870, 1016672, 996283, 1002674, 1028458, 1043299, 1036263, 1029528, 1042383, 1061765, 1062598, 1042429, 1019804, 1008417, 1008152, 1014023, 1019560, 1017209, 1007707, 1002754, 1007411, 1009282, 998481, 986939, 989503, 996093, 986676, 968510, 970708, 999308, 1024636, 1022547, 1005162, 997111, 999930, 997271, 983719, 971395, 972424, 986221, 1001492, 1005010, 993650, 981401]
7402I81401M529J8159P809j6452k5308r749J0612J7640J2352J605j1214j8260
7390I73124j0658M436R191K443J231R784J0968j824r576N77J2320Q228j093Q63
7376A010014N134l781j3699k764J7929J5961r673k3831r160R895R568R40K339
7363A008872N819k775j1847k379J5602J6625K607o84J0804J1394q813k2964r278
7350A012983J3316J5410K505Q72J0858P728j3053k4358r171J3773J9590J0378
7338A060831K681K90j595M09R843J5904P992k856J079J3120J0274q499j7493l275
7324A088705J4475J1773p878k2502j9359l344J1496J1017p388k6132k3509l979
7312A023375M558q184j7673l549J5287Q574j7019k6393p272J5404J8226P729K612
$$ y = [981401, 985930, 1004089, 1011898, 995446, 970138, 960389, 971001, 988641, 1000993, 1002598, 991384, 973124, 962466, 966902, 976093, 978536, 979767, 989551, 1000519, 998695, 989119, 989696, 1002016, 1010244, 1009151, 1010014, 1015148, 1011367, 997668, 994904, 1012833, 1028794, 1019121, 995290, 986130, 996025, 1005593, 1006533, 1008872, 1014691, 1011916, 1000069, 997690, 1013292, 1029917, 1032524, 1031840, 1042644, 1054038, 1045225, 1022261, 1012983, 1026299, 1041709, 1044214, 1045086, 1055944, 1063672, 1050619, 1026261, 1017090, 1030863, 1050453, 1060831, 1063512, 1063802, 1062207, 1062616, 1072459, 1088363, 1096355, 1093499, 1094578, 1107698, 1117972, 1109473, 1091980, 1088705, 1103180, 1114953, 1107075, 1084573, 1065214, 1061870, 1073366, 1084383, 1076995, 1050863, 1027354, 1023375, 1027933, 1019749, 1002076, 998527, 1013814, 1022388, 1005369, 978976, 971704, 987108, 1005334, 1013063, 1015675]
7299A015675O588R154K401j0179j5894m137J7405K4049N008j5025o515J8049J7747
7286A064326j3049k9662l009L2266K6478j1401k9202j1085L894j0055k3339l204
7274I92958K6189J7221k3639l9149o329K7024J2831k6772l5756p864J0850l692
7262I43872k3297j9574m090K328M551J2052J3007j066j0499j0P719j0594k9056
7249H85343p715L5324M1888L907k1476q75K5942J3547j8802k3736l08J1421o554
7236I37906l1385l7538k3998n069N098O46j0354j3839r956j1659j7953j2027L796
7223G73668J552k4938l8859j4932J5897J2836j1075j5520j268j524j8123k0118
7211F57596k987L383r460j4244M92J0564J682p633m530l241j0720r691M544Q039
$$ y = [1015675, 1022263, 1031417, 1033818, 1023639, 1007745, 1003608, 1021013, 1045062, 1050070, 1035045, 1028530, 1046579, 1064326, 1051277, 1021615, 1018606, 1050872, 1077350, 1065949, 1036747, 1025662, 1029556, 1019501, 996162, 992958, 1019147, 1036368, 1012729, 973580, 967251, 994275, 1007106, 980334, 944578, 936714, 947564, 943872, 920575, 901001, 896911, 899239, 903790, 915842, 928849, 927783, 917284, 917274, 924993, 914399, 885343, 877628, 912952, 954840, 958747, 937271, 936396, 962338, 975885, 957083, 933347, 933039, 944460, 937906, 906521, 868983, 844985, 839916, 845014, 845660, 835306, 821467, 811511, 799852, 781899, 769872, 773668, 775220, 750282, 711423, 696491, 712388, 725224, 714149, 698629, 697361, 695837, 677714, 657596, 654609, 657992, 648532, 634288, 634780, 645344, 647026, 639393, 634863, 631622, 620902, 611211, 615755, 623794]
7197F23794q913j8949k671J6818J1424r593k1316j9360r716Q188K3315J0517k5348
7184E78190l7825n485K6141J1501k1365j7045J5759K1337r850l0398j6876K52
7172E14336l300j0508l774N591O333O412P661k138j7999j5145P962K0471P896
7159E23798p106q425j1043k1880j7798J0113K9285J5402o005m043M676r651l0933
7146D66390k2016R041J8839k168j8763j0013M937O785K393J97o385j6961j4878
7133D17398M102J7825R062q544j2257k379M193J669k11M758R004K279j2555j9243
7119D15101p142J1334J2929l257j0623N603K1915J0392j6108k1803k929Q893j852
7106D22453j4417j1004l148m131m019P626J7116P589j1572j8098q454K998P810
$$ y = [623794, 614881, 595932, 593261, 610079, 621503, 611910, 590594, 571234, 561518, 569706, 593021, 603538, 578190, 540365, 534880, 561021, 572522, 551157, 534112, 549871, 571208, 561358, 530960, 514084, 514336, 511036, 500528, 496754, 502345, 508678, 515090, 522751, 520613, 502614, 487469, 495431, 515902, 523798, 516692, 508267, 497224, 475344, 457546, 467659, 496944, 512346, 506341, 502298, 506974, 497323, 466390, 444374, 453415, 472254, 470086, 451323, 441310, 446247, 453032, 455425, 455622, 449237, 432276, 417398, 421500, 439325, 448387, 439843, 427586, 425207, 429400, 431069, 430858, 435616, 444620, 446899, 434344, 415101, 407959, 419293, 432222, 428965, 418342, 423945, 445860, 456252, 440144, 418341, 415412, 424305, 422453, 408036, 397032, 393884, 389753, 385734, 393360, 410476, 418065, 406493, 388395, 379941, 382939, 390749]
7093C90749R204R918Q291K818p041j8221j9327k168J8684J7633l661j4007k60
7080C92612J1163p04j5240p683N725k117j7028p512J4277P653k4771l4677m771
7067C16927K4160J9416J549n59L677m495j3817o939M883M286j4M297L779j2837
7053C44313k2335k552K1778J3556j4050j8661K69N478q579q343J2579J8892n76
7040C41769j0164O651J4254r858k8819q006K1800J4091j5231j6643Q892J4873
7028C33609j0479k6728q162K0597K7088J1010r623k1397j6042N214K2338J6091
7016C43516k588q549l298p575j7908j0705R819J2430n500r561J1590K4715R825
7003C46211p160m411r21j2556j6469L045J5655l788k4128q554J8324J1558j4502
$$ y = [390749, 399953, 409871, 418162, 420980, 413939, 395718, 376391, 374223, 392907, 410540, 406879, 392872, 392612, 403775, 403071, 387831, 380148, 385873, 383756, 366728, 359216, 373493, 381146, 356375, 321698, 316927, 341087, 360503, 362052, 361493, 365170, 360675, 346858, 339919, 344802, 349088, 349074, 353371, 357150, 344313, 321978, 319426, 341204, 354760, 340710, 322049, 322318, 327796, 319217, 310874, 323453, 342345, 341769, 331605, 338256, 352510, 342652, 313833, 305827, 327627, 341718, 326487, 309844, 318736, 333609, 323130, 296402, 288240, 308837, 335925, 346935, 337312, 315915, 299873, 305087, 327425, 343516, 340928, 332379, 329081, 321506, 303598, 292893, 302712, 315142, 309642, 300081, 311671, 336386, 346211, 339051, 334640, 333719, 321163, 304694, 307739, 323394, 319606, 295478, 286924, 305248, 316806, 302304]
6990C02304j2081J4138J6430r263j7256M554J5334j701j0299Q273J8512l725k4758
6977C00462j0903J4622J4748j364n384k720j1637j7531K025K6569J8266j2923
6965C14230k0081O676K5096P258k0924k2860j617J3503R845L7k425P19M74l787
6951C06144k045J0476J9803P934j7768k7357q889J2228R128q528j2684J96Q445
6938B97083Q52j0322j1293l075N555Q129L247l733m653n62j929j0407j2552j009
6924B55331J2175J4235Q472J274r139j8012j0402J0943J8214m79j8810j4665n015
6911B44122q787q358J2083K3339k238l0102j1307L0299K9291j3727l2566n371
6899B26678J5712N84j1740Q003K5637R604j1563l829J3260R080l365j825j24j2290
$$ y = [302304, 290223, 304361, 320791, 311528, 294272, 298826, 314160, 312459, 302160, 310433, 328945, 325220, 300462, 289559, 304181, 318929, 317565, 312181, 309461, 297824, 280293, 282318, 308887, 327153, 314230, 294149, 300825, 325921, 333179, 312255, 289395, 287778, 301281, 311126, 311163, 308738, 309457, 309931, 306144, 304099, 314575, 334378, 342312, 324544, 297187, 288298, 300526, 309654, 301126, 288442, 288638, 297083, 297935, 287613, 276320, 273245, 278800, 286929, 290176, 286443, 281790, 281228, 279299, 268892, 256340, 255331, 267506, 281741, 290213, 291487, 282348, 264336, 253934, 264877, 283091, 282612, 263802, 249137, 244122, 235335, 226977, 239060, 262399, 260161, 230059, 218752, 249051, 278342, 264615, 232049, 226678, 242390, 242974, 231234, 239237, 264874, 274478, 262915, 259086, 272346, 281426, 278061, 276236, 276112, 263822]
6885B63822j4287R131K1820n516l5068j9773J5385J5789j0298j3172P516R177
6873B44526r825r466J2243J3942j0003j7446L338J3145l130q916J1809J9738q158
6860B51797l0576q240K8770K7530p430k7109j0783J4914J9656J815j8058j8325
6848B23961L130K2385J5757o724j4700k788O285L470K545M368o885k3913j7368
6835B09523J0301J9312j566j3642L437J4946m300k0880j747K4508J6261j0311
6823B45842j3606K210M484n468l823L134n414j4642K585K6643J5551k0738l1487
6810B05271p179J0497K340n032K716M742o240o882Q023J0296r044j9922o487O087
6796A89186O62j637J3209K0354J198j8676j1357O897O635n928p403p06l274r841
$$ y = [263822, 249535, 258666, 280486, 274970, 239902, 220129, 235514, 251303, 241005, 227833, 235349, 244526, 234701, 225235, 237478, 251420, 241417, 223971, 227309, 240454, 237324, 228408, 240217, 259955, 251797, 221221, 212981, 241751, 269281, 261851, 234742, 223959, 238873, 258529, 260344, 242286, 223961, 227091, 249476, 265233, 258509, 243809, 241021, 247306, 250776, 253321, 257689, 250804, 226891, 209523, 219824, 239136, 237570, 223928, 227365, 242311, 238011, 217131, 215384, 239892, 256153, 245842, 232236, 234446, 238930, 233462, 229639, 232773, 227359, 212717, 215302, 241945, 257496, 236758, 205271, 198092, 208589, 210929, 205897, 208613, 213355, 207115, 200233, 208256, 218552, 209508, 189586, 183099, 189186, 189848, 188211, 201420, 221774, 222972, 204296, 192939, 199836, 206471, 200543, 193140, 192434, 189160, 179319]
6782A79319k532J3731J7636N897m453k651O219J1595M216j6371l1711j9837R582
6769A70640K0152J868j1400K702J6965K595j8107r002J5521J3155j3465j9318
6757A72306Q818L0956J7215j0329j7510o290P9k724K86J3633K1891J0863j1938
6744B27256k3168j0603R875J2842k360j1474k998N395n41o331L493J4025M204
6731B19615j4028j2986M590J0549j837r917j748P675O033J272J092o75p183q582
6717A93870O06J0024Q297k545j2778j5009p086N150R882L862j053K967M964m861
6703A96290j3888p067N209M599k659O4N784j861j1778k247J4120O849j5651j5542
6689A62222P214J1420j2330k1830M266K9030K0048p75l369J004n724p047J2136
$$ y = [179319, 176787, 190518, 208154, 214051, 209598, 206947, 213166, 224761, 228977, 212606, 180895, 161058, 170640, 190792, 192660, 181260, 183962, 200927, 203522, 185415, 176413, 191934, 205089, 191624, 172306, 181124, 212080, 229295, 218966, 201456, 195166, 195245, 192521, 192807, 206440, 228331, 239194, 227256, 204088, 193485, 203360, 216202, 213842, 202368, 199370, 204765, 204224, 197893, 201386, 215411, 219615, 205587, 192601, 197191, 207740, 205903, 195986, 194238, 201913, 207946, 209218, 210310, 209635, 202452, 193870, 194476, 204500, 212797, 210252, 197474, 182465, 175379, 180529, 190411, 194273, 193220, 196187, 201151, 196290, 182402, 175335, 180544, 185143, 182484, 182548, 188332, 186471, 174693, 172446, 186566, 193415, 177764, 162222, 169436, 180856, 168526, 146696, 150962, 179992, 200040, 199265, 195896, 196900, 191176, 184129, 196265]
6676A96265K5306O004k1474j9915p67jj5316j6582j378P815P724J0244Q416q176
6662A78165j8947j285K0421P248k4812k5591N980K1757P898K514J9353K0787j0020
6649B03468l1737j2739J6417J6032k207p988o649j6794k4507o094K3866L0124
6637A81192R963q096r402m623l085k842k334l71P643J6190P236j9148l1316r036
6623A31971J9653J6682p661j2497Q200J9762M986j2835j1942j254M122N698O504
6610A71389R5j0884r752N016R403q701k4162j0921J4642J6517n389j5996o79J3913
6596A44491N336r035l350J3027J2675k553n659P590J1698j607p593M175N859j7032
6582A58022k7574N822M4558K8541k6561m6015r424K1552N129j9392o499K0250
$$ y = [196265, 221571, 227575, 206101, 186186, 185419, 185418, 170102, 153520, 152142, 159957, 167681, 177925, 186341, 178165, 159218, 157933, 178354, 185602, 160790, 135199, 141179, 162936, 170834, 173348, 192701, 213488, 203468, 171731, 158992, 175409, 191441, 189234, 181246, 174597, 157803, 133296, 127202, 151068, 181192, 191155, 183059, 173657, 169034, 165949, 163107, 160773, 160402, 168045, 184235, 191471, 172323, 141007, 131971, 151624, 168306, 160645, 148148, 156348, 176110, 181096, 168261, 156319, 155065, 159187, 164885, 171389, 171484, 160600, 150848, 155864, 165267, 156566, 132404, 121483, 136125, 152642, 147253, 131257, 130578, 144491, 149827, 140792, 137442, 150469, 163144, 160591, 154932, 162522, 174220, 172613, 165020, 169195, 175054, 158022, 130448, 136270, 180828, 209369, 182808, 136793, 127369, 148921, 154050, 134658, 128159, 148409]
6570A48409J6516o270q224Q431J1675o44n963l696p511q030P857J8420m22k2728
6556A47820j0343J5211N899k2018r961L3169L3519k0048m5332n02M2915J8039
6544A88368k8146j9749K0198J8000j9618k1808J9499L6681K368l0034j9757L158
6532A49160J538j0008m568Q017P450O80Q75m2r005j0553M351J5053M536r435n497
6517A42552L465l513j3250q67K0436J4729j5721k7264L0L1127K6421m810k3213
6504A50122j3412M511R491L175k280l445m502n393r94Q317J3032O070n745q555
6490A50392K72Q156M573m752p112q24M722M517L264L929J104q285j4993p541J0078
6475A47500J9981J1421o798j8067j6058o754K016O607O400L340J463K343L474
$$ y = [148409, 164925, 158655, 150431, 158862, 170537, 169893, 163930, 160234, 152723, 144693, 152550, 170970, 170548, 147820, 137477, 152688, 158587, 136569, 126608, 159777, 193296, 173248, 127916, 127414, 170329, 188368, 160222, 140473, 160671, 178671, 159053, 137245, 156744, 193425, 195793, 165759, 146002, 149160, 150698, 140690, 136122, 144139, 151589, 152269, 153144, 153102, 144097, 133544, 137895, 152948, 157484, 148049, 142552, 146017, 142504, 129254, 128387, 148823, 163552, 147831, 120567, 120597, 151724, 178145, 173335, 150122, 136710, 141221, 150712, 153887, 151607, 148162, 143660, 138267, 137273, 145590, 158622, 164692, 158947, 150392, 150664, 158820, 163393, 158641, 151529, 150705, 155427, 159944, 163208, 167137, 168241, 159956, 144963, 137422, 147500, 167481, 178902, 172104, 154037, 137979, 131225, 133241, 139848, 146248, 149588, 151051, 153394, 156868]
6462A56868M616R612J6073J2768j770q878M223J7996N859j9879k1114M472J5011
6449A95857p816k5212m731K1948Q846k5817k6174J0403K8711L706k4463j8383
6437A36875M779J3353R556Q092K370j4729k4515j0337J0261J2626M118M937R251
6424A66637m4j3833j0946J519l37j2811j0233P731J3721P34n746O979J6664M252
6410A64287j5233j7763l737J0531J6550J3935K679j1346j6126r095j011J784L957
6397A39412N630n51j0775j0146R00M169k896L11J7384J9402o843k6882q852K0728
6383A40991J4574j9258k8224K080K6557J1549j7136j7558J0020L1927K6532Q61
6371A82915k3044k4912l701J4688N787j4760r595J7969K0700j5602l8638q946
$$ y = [156868, 161484, 171096, 187169, 199937, 198167, 189289, 193512, 211508, 217367, 197488, 176374, 180846, 195857, 188041, 162829, 158098, 180046, 188892, 163075, 136901, 147304, 176015, 179721, 155258, 136875, 141654, 155007, 164563, 172655, 175025, 160296, 135781, 125444, 135705, 148331, 152449, 157386, 166637, 166593, 152760, 141814, 143333, 142996, 130185, 119952, 127683, 141404, 142138, 136392, 143371, 160035, 164287, 149054, 131291, 127554, 138085, 154635, 168570, 171249, 159903, 143777, 134682, 133671, 135455, 139412, 145042, 144491, 133716, 123570, 124470, 128639, 125743, 126054, 143438, 162840, 155997, 129115, 120263, 140991, 155565, 136307, 108083, 110163, 136720, 148269, 131133, 113575, 123595, 155522, 182054, 182915, 159871, 134959, 131258, 145946, 151733, 136973, 127378, 145347, 166047, 150445, 111807, 102861]
6359A02861L0893J9521k4031l1267M204K2342L117m414K0760K7201j4140m4561
6347A12486r448M3822L6542j4902k9588M855K2151l195j9575J652J7155l326k0702
6334A37927j374J9147K329k1428q848J6582Q773j6031j0983J3895J2179j0380
6322A41788o805K0467K0520j2240k4873R50J9269L998j0821k368Q13j5600j5743
6309A19355J4794K8875m16k3000L503L3913J1748k9011k1721J6008J5482k0816
6297A48714k7634M267J6113q606j7862P645J8653p353k0645R307L4210J0501k4281
6284A43029j7736J0285J0750q236n133J5924J6030o659j6832m740M303r17m875
6271A35193k06L624M091N306J067j0965j1323J0934K6823P482k1085j2813K0322
$$ y = [102861, 133754, 153275, 129244, 97977, 102181, 124523, 127640, 123226, 143986, 171187, 157047, 112486, 103038, 146860, 183402, 168500, 138912, 143767, 165918, 162723, 143148, 144800, 161955, 158629, 137927, 136553, 155700, 158029, 136601, 127753, 144335, 153108, 137077, 126094, 139989, 152168, 141788, 134983, 155450, 175970, 163730, 138857, 139807, 159076, 163074, 152253, 149885, 150698, 135098, 119355, 134149, 163024, 162608, 139608, 143111, 177024, 188772, 159761, 138040, 154048, 169530, 148714, 121080, 125347, 141460, 132854, 114992, 122637, 141290, 133937, 113292, 122599, 156809, 167310, 143029, 125293, 135578, 146328, 138092, 132959, 148883, 164913, 158254, 141422, 136682, 140985, 140068, 135193, 134987, 138611, 142702, 148008, 149075, 138110, 126787, 137721, 164544, 172026, 150941, 138128, 158450]
6258A58450K2119j6563m0026j3775K6438L3831J2565o508j4030j6695j2506L38
6246A33638J0093Q155J563m703j5760k5259j3095J9031L7324K1117o521j4155
6234A51428m072L174L442L624R97p266j0233j368N532l7l460R717K4130J6574
6220A92182o354j9100j4459n065K374R890J3624Q547P71k604n384q784k754J1646
6206A74530J3054m819j3773M465K1894Q773j2729n361J6485J2149j0265p805J5368
6193B11966R776k8938m2521m673L3219K4000o048j1032J869J091q285k769R954
6180A87609Q162j99L646P402r499k8812j7067J5162K5140L954j4325q897M020
6167A76296O923L075k183r311r853N548K2622J8026q88m452R573J1803p287k0504
$$ y = [158450, 180569, 164006, 123980, 110205, 136643, 170474, 183039, 176531, 162501, 145806, 133300, 133638, 143731, 151886, 153449, 148746, 132986, 107727, 94632, 113663, 150987, 172104, 165583, 151428, 147356, 150530, 153972, 157596, 158593, 151327, 141094, 139726, 145258, 145221, 141761, 151478, 175608, 192182, 185828, 166728, 152269, 147204, 149578, 159468, 173092, 181639, 182410, 179806, 174422, 165638, 162884, 174530, 187584, 182765, 168992, 173457, 195351, 204124, 191395, 186034, 202519, 214668, 204403, 196598, 211966, 221742, 192804, 150283, 145610, 178829, 202829, 196781, 185749, 187618, 188709, 180424, 177655, 187609, 195771, 195572, 199218, 206620, 197121, 168309, 151242, 166404, 191544, 195498, 181173, 172276, 176296, 183219, 186294, 184111, 174800, 164947, 170495, 193117, 211143, 210255, 205803, 215376, 227179, 219892, 199388]
6153A99388j0559L692M654M988J7556K6809J5463m352j1607p955n243l48J2540
6140B45026K1016J2442lL781J5867J2826k514k860J7287K7159M953k5066k2275
6127C07639J3522L8730K2721j2031k1224K504K5341K4253J4030J2304Q205r858
6115D26136k1348m085K0365J4398j2115j3956J4547K9233J0810m278R806K3177
6103D92690O110j5125k535K8138L4135J3279k283j617J299M867J6326K3004J0988
6090F09276O88J7781M0500K8011o467r772K3260L9229J5651l080J5678L8570K8389
6077H37714Q373J6612L6698K8077j308q642J1412K1937R023J944J9426L8204L2791
6064A052261J4472Q771J6290J9697J6480J9906L0959L3073K1268J6183L3064N1242
$$ y = [199388, 188829, 192521, 197175, 202163, 219719, 246528, 261991, 257639, 246032, 238077, 232834, 232486, 245026, 266042, 278484, 278481, 282262, 298129, 310955, 308441, 305581, 322868, 350027, 354980, 329914, 307639, 321161, 359891, 382612, 370581, 349357, 351861, 377202, 401455, 415485, 427789, 435994, 426136, 404788, 400703, 421068, 435466, 423351, 409395, 423942, 453175, 463985, 459707, 469513, 492690, 498800, 483675, 481140, 509278, 543413, 556692, 554409, 552792, 554091, 558958, 575284, 598288, 609276, 609964, 627745, 668245, 696256, 689789, 680017, 703277, 742506, 758157, 755077, 770755, 809325, 837714, 846087, 862699, 899397, 927474, 926166, 917524, 928936, 950873, 959896, 961840, 981266, 1019470, 1052261, 1066733, 1075504, 1091794, 1111491, 1127971, 1147877, 1178836, 1211909, 1233177, 1249360, 1282424, 1333666]
6052A333666M0023R942N732M0438P1575O3795M1570M6019O8521P2189N8154N7603
6040A909227P0565P0706O5410Q6836J20772J15600P5926P1333J24769J70052J61205
6029C042401J46178J77616K27520K58648L02564L80926M31123M28568N05711P74196
6019F675451J052337R79801M76160q1812k65523p5436J09901k305l44076o51734
6009G872764p64615p15168o13609n24184m45669l66308l04838k84348k83386k53166
5999C317473j89427j42889j39595j39541j08161q0381j02034j44755j42241r1079
5989B037370n1766n5770p1725o8807n9266o2732p0870o6767n0961l4542k7159
5978A417005l6430n8255o8647m9140j7572p874k3641l9712m3869m4360m0669k3724
$$ y = [1333666, 1373689, 1383631, 1389363, 1429801, 1501376, 1565171, 1606741, 1652760, 1721281, 1793470, 1851624, 1909227, 1979792, 2050498, 2115908, 2202744, 2323516, 2439116, 2515042, 2586375, 2711144, 2881196, 3042401, 3188579, 3366195, 3593715, 3852363, 4154927, 4535853, 4966976, 5395544, 5901255, 6675451, 7727788, 8707589, 9183749, 9101937, 8836414, 8760978, 8870879, 8868574, 8524498, 7872764, 7108149, 6392981, 5779372, 5255188, 4809519, 4443211, 4138373, 3854025, 3570639, 3317473, 3128046, 2985157, 2845562, 2706021, 2597860, 2517479, 2415445, 2270690, 2128449, 2037370, 1985604, 1929834, 1858109, 1789302, 1730036, 1667304, 1596434, 1529667, 1478706, 1444164, 1417005, 1380575, 1322320, 1253673, 1204533, 1186961, 1179087, 1155446, 1115734, 1071865, 1027505, 986836, 963112]
5966I63112n079q485k9012l6697k4704j6888k2790k4313j4786j0958j5997j1692
5954G41711K46o763l1383l3540o69K1803o77l5206l4444r731l860j8306j8936
5941E70245J059J3463N048p369j1762j4752j8596j4753l446M265M102j208j3406
5928E12890k9735l2287j0902J3372J4678J591l33N831k787k1073j9319L683J3677
5915D49286l163j7808q238N346j939j8029j7575m226K51n837n596L975O968l830
5901C79585j4429r882N068J2010J320j5682j8750k939J4340J4917J707r474j2377
5888C45414j1646q399j082L545j641q331l987M332l92j3998j5424k893K589n795
5874B82292j0325l268l2n816k217J5491K1145J295j6017n942R067l446k8682k7585
$$ y = [963112, 958033, 949548, 920536, 883839, 859135, 842247, 819457, 795144, 780358, 769400, 753403, 741711, 741957, 735194, 703811, 670271, 669602, 691405, 690728, 655522, 621078, 611347, 607487, 589181, 570245, 571304, 584767, 589815, 582446, 570684, 555932, 537336, 522583, 519137, 523402, 527504, 526296, 512890, 483155, 450868, 439966, 453338, 468016, 469607, 469274, 475105, 472318, 451245, 431926, 435609, 449286, 446123, 428315, 420077, 425423, 423484, 405455, 387880, 383654, 383905, 378068, 372472, 376447, 383415, 379585, 365156, 355274, 360342, 372352, 373672, 357990, 339240, 336301, 350641, 365558, 367265, 357791, 345414, 333768, 325369, 324287, 327832, 326191, 317860, 313873, 318205, 317813, 303815, 288391, 285498, 288087, 282292, 271967, 268699, 268667, 262851, 260634, 276125, 297270, 298565, 282548, 276606, 285673, 282227, 253545, 225960]
5860B25960j321J2887L800j586R950J6412J624j8368k3796j6667n089J0311K1263
5847B35380J0912j5439k4469o8K7702K1801j1293l4399k9450r553Q949K0081J8403
5834B18557J817j4364r758R524J3681p269k4248r925J8194J9924r305l0462j6638
5821A59728R787J2958l783q265P329J6593N181o147K40O758q148k8468k2453N798
5807A47108K0990R999l332j339J987q296j9178j0837J1083K3259J4571n495k0066
5794A60454j7399L29J4410P813r602j1245N329J1390o873k2117q098J6184J5713
5781A56288m730j1111K781R278j396m486J1969K0429k669l4252l4382l010K1489
5768A26198J4926o417j3949k150J1518J1451K80p767n739k137p096j4978j1329
$$ y = [225960, 224639, 237526, 241326, 239740, 249690, 266102, 267726, 249358, 225562, 208895, 203806, 214117, 235380, 246292, 230853, 206384, 206316, 234018, 255819, 244526, 210127, 180677, 171124, 180073, 200154, 218557, 220374, 206010, 196252, 205776, 219457, 212188, 187940, 178015, 196209, 216133, 206828, 176366, 159728, 169515, 182473, 178690, 170425, 177754, 194347, 199528, 193381, 193621, 200379, 192231, 163763, 141310, 147108, 168098, 178097, 174765, 173426, 175413, 167117, 147939, 137102, 148185, 171444, 186015, 180520, 160454, 143055, 143384, 157794, 165607, 156005, 144760, 150089, 161479, 154606, 132489, 124391, 140575, 156288, 151558, 140447, 143228, 152506, 151110, 146624, 158593, 179022, 176353, 142101, 107719, 104709, 126198, 141124, 134707, 120758, 118608, 130126, 141577, 141857, 134090, 128351, 126214, 119118, 104140, 92811]
5755I2811L420J1694N261j572M067J0972K158j4458j5169K549J4437N047j0641
5742A10576j1011K128J0653P229K53l315m985m495L217J5555J7905J699j8983
5729A26426k0751j281J5057Q047j1013j4454L099J6859O971j3619j8721n662N477
5716I6435N092M654R857O062j4396k8458j0327K4642L2128j034l4991k8969N307
5703F6002K3748J1054m990N94J6165J6282p12j5078j5614r288l850K203R187R942
5689A05645J712n356j342P650P489k809r165k978O981P795j052j0536j4268j0530
5675G9236O39J2858J2795k934j5712o467J3477J4705n014j4067L115J7563Q81
5662A11075k4711j6770J9547L5392J0487k0002k2614j0356q119q104P297K3565
$$ y = [92811, 96231, 107925, 113186, 111614, 115681, 126653, 128811, 114353, 99184, 101733, 116170, 121217, 110576, 99565, 101693, 112346, 119575, 119828, 116513, 111528, 107033, 110250, 125805, 143710, 145409, 126426, 105675, 104394, 119451, 127498, 116485, 102031, 105130, 121989, 128960, 115341, 96620, 90958, 96435, 101527, 106181, 116038, 122100, 107704, 79246, 68919, 93561, 125689, 124655, 89664, 60695, 66002, 89750, 100804, 95814, 96408, 112573, 128855, 128143, 113065, 97451, 88163, 84313, 86516, 95703, 105645, 107357, 102001, 100659, 108309, 115798, 112989, 103824, 100846, 107827, 115622, 114570, 104034, 89766, 79236, 79875, 92733, 105528, 102594, 86882, 80415, 93892, 108597, 103583, 89516, 92631, 110194, 111075, 86364, 69594, 89141, 124533, 135020, 115018, 92404, 82048, 73929, 65825, 73122, 96687]
5650I6687J4626q454j0725Q843J4359o628k0390j532K4635K0766o565k1171j2775
5637I1676m680j0126j3112N15J8356K0712P591o704j3329j0539K904K0211K1404
5624A24879m206l3338k9177Q542L5875J9879j7261k8900n211K1152K4348J2080
5612A28662P32p942j4378r876N529J2788K80j4462r346Q300J3732J245j3152j8292
5598H3820j5325m983R893J4666Q6j5507p734J3905J8156K514l954P805J2287j304
5584A14325o682J0478K0562r96k6608j8177J0225J6307j199n750J2079K2030R428
5571A56022k947M20K172j1225k2118j3054K201K594o609p333N75M304J780L57
5557A07139M63k564o969q045o241k504M548R103P59j3855j1530J0831K2007J226
$$ y = [96687, 111313, 102859, 92134, 100977, 115336, 108708, 88318, 86786, 111421, 132187, 125622, 104451, 91676, 86996, 76870, 63758, 64273, 82629, 103341, 110932, 104228, 90899, 80360, 83264, 103475, 124879, 120673, 87335, 58158, 66700, 102575, 122454, 105193, 76293, 71082, 92234, 116582, 128662, 129394, 121452, 107074, 97198, 102727, 115515, 115795, 101333, 91987, 100287, 114019, 115264, 102112, 83820, 68495, 63512, 73405, 88071, 88157, 72650, 64916, 78821, 96977, 99491, 95537, 103342, 115629, 114325, 107643, 118121, 138683, 137687, 111079, 92902, 103127, 119434, 118235, 112485, 124564, 146594, 156022, 153075, 153495, 155667, 144442, 122324, 109270, 111471, 114065, 107456, 100123, 100698, 105002, 106782, 107139, 107602, 105038, 98069, 90024, 83783, 81279, 85827, 94930, 95689, 81834, 70304, 81135, 103142, 104368]
5543A04368k4222j6896J1981K0041J385p412Q308J6842l411k4651j5174Q208R017
5530H8384r398j2823O290K0276J4419N473M460l365k4629l4232j0965K3757L1188
5517I8835Q111j3232j2985l678q03l04M859P438p8r080q066k004k852p656k777
5502E5728J2025J9381P692j2338k0123q432J0144J7544Q725m185o761R7K471o310
5488G5658j5868j3417n13J0961J3161O701k426m927M269J5093J0735o093j1878
5475H1456R63P135j0638k5692n907K7689K5089j3618l2967o420K3435J3699j3926
5462G0298j4480P380J1746q302k0089p678P634P248N12Q94M395K665k511o558
5448E3154q386m669P068J7249J2115n069j6231j2885k620P663J6640J7715M371
$$ y = [104368, 80146, 63250, 75231, 95272, 96657, 89245, 97553, 114395, 110984, 86333, 71159, 79367, 88384, 78986, 66163, 72453, 92729, 107148, 112621, 117081, 113716, 89087, 54855, 43890, 67647, 98835, 106946, 93714, 80729, 77051, 76248, 75944, 80803, 88241, 88163, 79083, 71017, 69013, 66161, 58505, 55728, 67753, 87134, 94826, 82488, 62365, 53933, 64077, 81621, 90346, 86161, 79400, 79497, 81968, 75658, 59790, 46373, 45860, 56821, 69982, 76683, 74257, 69330, 73599, 88692, 99427, 93334, 81456, 82419, 89554, 78916, 53224, 47317, 75006, 100095, 86477, 53510, 47090, 70525, 84224, 70298, 55818, 63198, 74944, 66642, 46553, 38875, 46509, 53757, 54269, 55163, 59558, 62223, 59712, 53154, 44768, 40099, 47167, 64416, 76531, 71462, 55231, 42346, 39726, 47389, 64029, 81744, 86115]
5435H6115j2672j5200n319l91n79R102K1599R411k4403l5908m766K7199J6103
5422G0291j5570j4691J8160L1398N059k0919j2195J1141J3649k494j2456j1758
5410E9615j2085r715P562K7654K2477o436k2011m686J6079N880k0433k1101O000
5397D8800J8167n199k9123j7318J2280J8774K464l260P216N574j3209j5247J3398
5384D3317L4820J5397j9869k5482l644O963l595o835J0016K2168R853j0651j4907
5371E7551m912J862J092J831P574J1145N208q455j7418q009J5370K5366L014k8488
5357F2731k5598J4159M0042J4680l0910l7128K581L4159J8821j6227k0291R729
5345F6748K8620Q187k4943k8514k306J5398K657j9511k1424m284R542J1111R915
$$ y = [86115, 73443, 58243, 52924, 52533, 51954, 61056, 82655, 92066, 67663, 31755, 26989, 54188, 70291, 54721, 40030, 58190, 89588, 94647, 73728, 61533, 72674, 86323, 83829, 71373, 59615, 47530, 37815, 45377, 73031, 95508, 89072, 67061, 62375, 78454, 84334, 63901, 42800, 48800, 66967, 61768, 32645, 15327, 27607, 46381, 48845, 45585, 52801, 58375, 45166, 29919, 43317, 78137, 93534, 73665, 48183, 44539, 51502, 47907, 41072, 51088, 73256, 83109, 72458, 57551, 52639, 54501, 55593, 57424, 64998, 76143, 81351, 72896, 55478, 47469, 62839, 88205, 91219, 62731, 37133, 51292, 91334, 106014, 75104, 37976, 40557, 74716, 93537, 77310, 57019, 66748, 95368, 103555, 78612, 50098, 47792, 63190, 65847, 46336, 24912, 20628, 30170, 41281, 51196]
5332E1196J1364R466J900m334m894l228k203j448k735o673o188L673J2487P454
5318F5837l253p68J0866O668j7332l0396r896K3864L4456J5220j0416k1904j6516
5305D6430j605R898M733j2959j8171K579K5381J8400r738j9187K410K0147L111
5292G1429k9241l3934m226K3201K0088J688j527J0107J0104q450j9214m837J2223
5279D7411M118j5484j1928J1792J6874p178k2550l804K0826J6384m094p338L784
5266D8813K941q022m688J0814J0665q428j7365l493J0297N742m978o324k779j681
5252C1514J150N930L679k679K460J6511J5497n201j7116l298J3277P927p285q978
5238E3388j014Q89M97O670P633p772k0740r168J1116R151q247p117J5188K4236
$$ y = [51196, 62560, 72026, 73926, 69592, 64698, 61470, 59267, 57819, 55084, 48411, 42223, 45896, 58383, 65837, 62584, 61816, 72682, 79350, 62018, 31622, 21726, 45590, 80046, 95266, 84850, 62946, 46430, 44825, 54723, 59456, 46497, 28326, 30905, 56286, 74686, 64948, 45761, 48171, 68318, 71429, 42188, 8254, 4028, 27229, 47317, 49005, 47478, 57585, 67689, 59239, 40025, 35188, 47411, 51529, 36045, 24117, 35909, 52783, 45605, 23055, 19251, 40077, 56461, 52367, 45029, 48813, 51754, 43732, 39044, 49858, 60523, 52095, 34730, 31237, 41534, 47276, 42298, 35974, 33195, 31514, 32664, 38594, 42273, 39594, 42054, 58565, 74062, 68861, 51745, 48447, 61724, 69651, 62366, 53388, 52374, 53263, 53760, 60430, 68063, 60291, 39551, 30383, 41499, 50650, 42403, 35286, 50474, 74710]
5224G4710M283j9307k2151j1254k118M067P653J897r485r628M626J5077J1635
5211E0005O096O230J885r723j1446L258J2460O0j4648o727J4042J9613O076p805
5197F9376j3192j4753j0388M239J5910O982j3051j6311J639J5145Q255m109l215
5184D6527P163J2166O132q196k4778l0218j1625K1048L6787K0398o475j4634m167
5171E0128L740L78m397l719j940j535J917Q066P433n160j9703j9618o12K1299
5157C6277K3598K790j7419j2752R065J7393K069j2792p431M282K686k535O663
5144E1894J7132K475k6531k9943l73K3553J6870J908K861N133j0220k4469j2215
5131A8075R482O401j3204j0527J7340K9979Q485j6000j3388L143O865p85k436
$$ y = [74710, 78993, 59686, 37535, 26281, 24163, 28230, 35883, 37780, 28295, 18667, 23293, 38370, 50005, 56101, 62331, 64216, 54493, 43047, 46305, 58765, 58825, 44177, 37450, 51492, 71105, 77181, 69376, 56184, 41431, 31043, 35282, 51192, 58174, 45123, 28812, 30451, 45596, 53851, 49742, 46527, 53690, 65856, 71988, 63792, 39014, 8796, -2829, 18219, 55006, 75404, 68929, 54295, 50128, 53868, 54246, 49849, 46130, 44190, 42655, 44572, 52638, 60071, 54911, 35208, 15590, 14978, 36277, 59875, 62665, 45246, 32494, 41559, 58952, 61021, 48229, 40798, 45080, 47766, 45231, 51894, 69026, 71501, 44970, 15027, 14654, 38207, 55077, 56985, 59846, 64979, 54759, 30290, 18075, 27557, 33958, 20754, 10227, 27567, 57546, 66031, 50031, 36643, 39786, 46651, 45866, 43430]
5118D3430L043M403m81o171j1077j2799m994Q811J3216M473j389L842N997l089
5104D7215o871M741J0524o880k3614r054J9212J7724j3098k6914k405K6727K5086
5091F2393K122j2347r779q76N210K508j1578k3559j1619J9919L5643J5652j4232
5078E9457j9515m894M16r148j1456L671J7987J2829n105j4034l891J3251J7272
5065E6840L101j2498j1877j24L944k474l600O037J1962O230O89K238j558j5797
5051D3113k0880l832J4477J0091m615l232Q267L972j1904q337J7417K8526M879
$$ y = [43430, 46473, 50876, 50395, 44224, 33147, 20348, 15354, 24165, 37381, 41854, 40465, 44307, 50304, 47215, 40344, 45085, 55609, 48729, 25115, 16061, 35273, 52997, 39899, 12985, 10580, 37307, 62393, 64515, 52168, 42389, 41513, 46723, 49231, 37653, 14094, 2475, 22394, 58037, 73689, 59457, 39942, 35048, 35464, 26316, 14860, 18531, 36518, 49347, 44242, 30208, 26317, 39568, 56840, 59941, 47443, 35566, 35442, 39386, 36912, 33312, 39349, 51311, 57541, 58230, 60468, 58910, 43113, 22233, 18401, 32878, 42969, 38354, 35122, 43389, 47361, 35457, 27120, 44537, 73063, 77942]
$$ [...]
##END NTUPLES=NMR SPECTRUM
##END=
