##TITLE=1H ikalashn
EC-3334(1)
16.10.2024
##JCAMPDX= 6.0         $$ Bruker NMR JCAMP-DX V2.0
##DATA TYPE= NMR SPECTRUM
##DATA CLASS= NTUPLES
##ORIGIN= UXNMR, Bruker Analytische Messtechnik GmbH
##OWNER= root
$$ TOPSPIN		Version 1.3
$$ 2024-10-16 11:11:50.703 +0400  Irina@DPX200
$$ Compression mode = diff/dup
##.OBSERVE FREQUENCY= 200.131392401
##.OBSERVE NUCLEUS= ^1H
##.ACQUISITION MODE= SIMULTANEOUS
##.ACQUISITION SCHEME= undefined
##.AVERAGES= 16
##.DIGITISER RES= 18
##SPECTROMETER/DATA SYSTEM= spect
##.PULSE SEQUENCE= zg
##.SOLVENT NAME= D2O
##.SHIFT REFERENCE= INTERNAL, D2O, 1, 17.95386
##AUDIT TRAIL= $$ (NUMBER, WHEN, WHO, WHERE, WHAT)
$$ ##TITLE= Audit trail, TOPSPIN		Version 1.3
$$ ##JCAMPDX= 5.01
$$ ##ORIGIN= Bruker BioSpin GmbH
$$ ##OWNER= Irina
$$ $$ F:/spectra/data/iren/nmr/1H/4/pdata/1/auditp.txt
$$ ##AUDIT TRAIL=  $$ (NUMBER, WHEN, WHO, WHERE, VERSION, WHAT)
(   1,<2024-10-16 11:11:20.359 +0400>,<Irina>,<DPX200>,<TOPSPIN 1.3>,
      <created by zg
	started at 2024-10-16 11:10:12.390 +0400,
	POWCHK disabled, PULCHK disabled
       configuration hash MD5:
       BE 6D 3F 07 2A EA 11 49 91 17 2B D3 AF B3 58 0D
       data hash MD5: 16K
       14 D0 6C 59 BC 16 E6 59 9E 38 B1 B7 E8 84 74 9A>)
(   2,<2024-10-16 11:11:20.703 +0400>,<Irina>,<DPX200>,<TOPSPIN 1.3>,
      <Start of raw data processing
       efp BC_mod = 2 LB = 0.02 FT_mod = 6 PKNL = 1 PHC0 = 311.3183 PHC1 = 20.87425 SI = 32K 
       data hash MD5: 32K
       3B 53 22 53 DF 13 FE AB D3 CB EE C7 00 EA 08 EC>)
(   3,<2024-10-16 11:11:23.093 +0400>,<Irina>,<DPX200>,<TOPSPIN 1.3>,
      <apk 
       data hash MD5: 32K
       1B B4 57 BB 3E C4 33 D8 F8 22 86 05 DB 98 E3 1A>)
(   4,<2024-10-16 11:11:38.687 +0400>,<Irina>,<DPX200>,<TOPSPIN 1.3>,
      <pk fgphup PHC0 = -23.61133 PHC1 = 33.6 
       data hash MD5: 32K
       82 E9 88 2C 2B D1 03 22 01 39 04 28 36 F2 F1 CD>)
(   5,<2024-10-16 11:11:40.421 +0400>,<Irina>,<DPX200>,<TOPSPIN 1.3>,
      <abs n ABSG = 5 
       data hash MD5: 32K
       7E 5C 3E FF E9 2B EB 93 3A F1 3F B9 A6 AC 97 B1>)
$$ ##END=
$$ 
$$ $$ hash MD5
$$ $$ B1 5D A7 E6 28 7E AC 19 4A C3 7E C7 7E DD A5 3A
##$RELAX= 
##$RELAX= 
##$RELAX= 
##$RELAX= 
##$RELAX= 
##$RELAX= 
##$RELAX= 
##$RELAX= 
##$RELAX= 
$$ Bruker specific parameters
$$ --------------------------
##$DU= <F:/spectra>
##$EXPNO= 4
##$NAME= <1H>
##$PROCNO= 1
##$TYPE= <nmr>
##$USER= <iren>
##$AMP= (0..31)
100 100 100 100 100 100 100 100 100 100 100 100 100 100 100 100 100 100 
100 100 100 100 100 100 100 100 100 100 100 100 100 100 
##$ANAVPT= -1
##$AQSEQ= 0
##$AQ_mod= 1
##$AUNM= <au_zg>
##$AUTOPOS= <>
##$BF1= 200.13
##$BF2= 200.13
##$BF3= 200.13
##$BF4= 200.13
##$BF5= 200.13
##$BF6= 200.13
##$BF7= 200.13
##$BF8= 200.13
##$BYTORDA= 1
##$CFDGTYP= 0
##$CFRGTYP= 5
##$CHEMSTR= <none>
##$CNST= (0..63)
1 1 145 1 1 1 1 1 1 1 1 1 1 1 1 1 1 1 1 1 1 1 1 1 1 1 1 1 1 1 1 1 1 1 
1 1 1 1 1 1 1 1 1 1 1 1 1 1 1 1 1 1 1 1 1 1 1 1 1 1 1 1 1 1 
##$CPDPRG= <>
##$CPDPRG1= <>
##$CPDPRG2= <>
##$CPDPRG3= <>
$$ [...]
##$SW_h= 4401.40845070422
##$TD= 16384
##$TD0= 1
##$TE= 300
##$TE2= 300
##$TE3= 300
##$TEG= 300
##$TL= (0..7)
0 120 120 120 120 120 120 120 
##$TP= (0..7)
150 150 150 150 150 150 150 150 
##$TP07= 0
##$TPNAME0= <>
##$TPNAME1= <>
##$TPNAME2= <>
##$TPNAME3= <>
##$TPNAME4= <>
##$TPNAME5= <>
##$TPNAME6= <>
##$TPNAME7= <>
##$TPOAL= (0..7)
0.5 0.5 0.5 0.5 0.5 0.5 0.5 0.5 
##$TPOFFS= (0..7)
0 0 0 0 0 0 0 0 
##$TUNHIN= 0
##$TUNHOUT= 0
##$TUNXOUT= 0
##$USERA1= <user>
##$USERA2= <user>
##$USERA3= <user>
##$USERA4= <user>
##$USERA5= <user>
##$V9= 5
##$VALIST= <valist>
##$VCLIST= <CCCCCCCCCCCCCCC>
##$VD= 0
##$VDLIST= <DDDDDDDDDDDDDDD>
##$VPLIST= <PPPPPPPPPPPPPPP>
##$VTLIST= <TTTTTTTTTTTTTTT>
##$WBST= 1024
##$WBSW= 25
##$XGAIN= (0..3)
0 0 0 0 
##$XL= 0
##$YL= 0
##$YMAX_a= 943589
##$YMIN_a= -1187255
##$ZGOPTNS= <>
##$ZL1= 120
##$ZL2= 120
##$ZL3= 120
##$ZL4= 120
##$ABSF1= 17.95386
##$ABSF2= -4.038887
##$ABSG= 5
##$ABSL= 3
##$ALPHA= 0
##$AQORDER= 0
##$ASSFAC= 0
##$ASSFACI= 0
##$ASSFACX= 0
##$ASSWID= 0
##$AUNMP= <proc_1d>
##$AXLEFT= 0
##$AXRIGHT= 0
##$AXTYPE= 0
##$AXUNIT= <>
##$AZFE= 0.1
##$AZFW= 0.1
##$BCFW= 0
##$BC_mod= 2
##$BYTORDP= 0
##$COROFFS= 0
##$CY= 7568.61572265625
##$DATMOD= 1
##$DC= 0
##$DFILT= <>
##$DTYPP= 0
##$F1P= 17.9538593292236
##$F2P= -4.03888763876832
##$FCOR= 0.5
##$FTSIZE= 32768
##$FT_mod= 6
##$GAMMA= 0
##$GB= 0
##$INTBC= 0
##$INTSCL= 1.483618e-010
##$ISEN= 128
##$LB= 0.02
##$LEV0= 0
##$LPBIN= 0
##$MAXI= 945.577
##$MC2= 0
##$MEAN= 0
##$ME_mod= 0
##$MI= -402.1523
##$NCOEF= 0
##$NC_proc= -4
##$NLEV= 6
##$NOISF1= 8.587773
##$NOISF2= 6.764455
##$NSP= 0
##$NTH_PI= 0
##$NZP= 0
##$OFFSET= 17.95386
##$PC= 1
##$PHC0= 319.3098
##$PHC1= 2.079559
##$PH_mod= 1
##$PKNL= yes
##$PPARMOD= 0
##$PPDIAG= 0
##$PPIPTYP= 0
##$PPMPNUM= 100
##$PPRESOL= 1
##$PSCAL= 0
##$PSIGN= 0
##$REVERSE= no
##$SF= 200.13
##$SI= 32768
##$SIGF1= 16.12182
##$SIGF2= -4.496377
##$SINO= 3.521527
##$SIOLD= 32768
##$SREGLST= <1H.CDCl3>
##$SSB= 0
##$STSI= 32768
##$STSR= 0
##$SW_p= 4401.40845070423
##$SYMM= 0
##$S_DEV= 0
##$TDeff= 16384
##$TDoff= 0
##$TI= <>
##$TILT= no
##$TM1= 0
##$TM2= 0
##$TOPLEV= 0
##$USERP1= <user>
##$USERP2= <user>
##$USERP3= <user>
##$USERP4= <user>
##$USERP5= <user>
##$WDW= 1
##$XDIM= 32768
##$YMAX_p= 292492116
##$YMIN_p= -167249
$$ End of Bruker specific parameters
$$ ---------------------------------
##NTUPLES= NMR SPECTRUM
##VAR_NAME=  FREQUENCY,     SPECTRUM/REAL,   SPECTRUM/IMAG
##SYMBOL=    X,             R,               I
##VAR_TYPE=  INDEPENDENT,   DEPENDENT,       DEPENDENT
##VAR_FORM=  AFFN,          ASDF,            ASDF
##VAR_DIM=   32768,         32768,           32768
##UNITS=     HZ,            ARBITRARY UNITS, ARBITRARY UNITS
##FACTOR=    0.134324425510551, 1,           1
##FIRST=     4401.40845070423, -123168,      -974219
##LAST=      0,             16601,           -1025386
##MIN=       0,             -167249,         0
##MAX=       4401.40845070423, 292492116,    0
$$ Real data points
##PAGE= N=1
##DATA TABLE= (X++(R..R)), XYDATA
$$ [...]
11414I097465M9731O6841O8151P6752J16354J61509J67971J39014J20180J32325
$$ 9097465 9147196 9214037 9282188 9358940 9475294 9636803 9804774 9943788 10063968 10196293
11404A0196293J49550J47563J37329J37460J41835J33276J11567R0102P3780N2703
$$ 10196293 10345843 10493406 10630735 10768195 10910030 11043306 11154873 11244975 11318755 11371458
11394A1371458J4069m4214j06737j48175j57330j52496j61189j85968k04372k01010
$$ 11371458 11385527 11341313 11234576 11086401 10929071 10776575 10615386 10429418 10225046 10024036
11384A0024036j82682j62122j46652j44529j59848j75871j67592j39834j27653
$$ 10024036 9841354 9679232 9532580 9388051 9228203 9052332 8884740 8744906 8617253
11375H617253j45607j63012j49162j18128j02006j00790r2543p9781q7019j13372
$$ 8617253 8471646 8308634 8159472 8041344 7939338 7838548 7746005 7666224 7579205 7465833
11365G465833j24120r9365o3676n4017p6726j07232j17895r7738n8677l0531l6976
$$ 7465833 7341713 7242348 7178672 7124655 7047929 6940697 6822802 6725064 6666387 6635856 6598880
11354F598880o7863q6354p1283m1499k9619m1962n6432n4389m2070l8160m7217
$$ 6598880 6531017 6444663 6373380 6331881 6302262 6260300 6203868 6149479 6107409 6069249 6022032
11343F022032n2475l8059j3804o987k6883n0852n4333m0936k8964k1878j2578
$$ 6022032 5969557 5931498 5917694 5910707 5883824 5832972 5778639 5737703 5708739 5686861 5674283
11332E674283o510j5024l0071l1220j7467p801j0315j5560j9870k7287k8481j0675
$$ 5674283 5667773 5652749 5622678 5591458 5573991 5566190 5555875 5540315 5520445 5493158 5464677 5454002
11320E454002Q947k093l5779m5275j7362L407j2398l0936j7223J644j2579l4591
$$ 5454002 5462949 5460856 5425077 5379802 5362440 5365847 5353449 5322513 5305290 5306934 5294355 5259764
11308E259764j6900K0391J5116l1244n0390j7116J2654l256l0011k4453o171j0450
$$ 5259764 5242864 5263255 5278371 5247127 5196737 5179621 5192275 5189019 5159008 5134555 5128384 5117934
11296E117934j9511j30K4634P321l7349m4723k22L5041J6189k0797j8396J6743
$$ 5117934 5098423 5098293 5122927 5130248 5092899 5048176 5047954 5082995 5099184 5078387 5059991 5076734
11284E076734L0191L962k0276o135K5372K9415K590j4668J798K7296K9228J5946
$$ 5076734 5106925 5110887 5090611 5084476 5109848 5139263 5141853 5127185 5128983 5156279 5185507 5201453
11272E201453J7839L4157L4837J4387M730K1550L5039J8698m931j603J6810J4798
$$ 5201453 5219292 5253449 5288286 5302673 5307403 5328953 5363992 5382690 5377759 5376156 5392966 5407764
11260E407764k421K500K8852L1456j529j8024J8220O2199N0306n11j5412K5400
$$ 5407764 5405343 5407843 5436695 5468151 5466622 5448598 5466818 5529017 5579323 5578812 5563400 5588800
11248E588800N9147L9484M390R921M1900M6360K1760J8636N0731O9696M6825K3545
$$ 5588800 5647947 5687431 5691821 5701742 5743642 5790002 5811762 5830398 5881129 5950825 5997650 6021195
11236F021195M3477P8835P5785M4584M4297Q7078J19237J06727Q3168Q9048J10198
$$ 6021195 6064672 6143507 6219292 6263876 6308173 6395251 6514488 6621215 6704383 6793431 6903629
11225F903629J11026R3800Q4870Q4091O7987L2596j574k2452l5234m1945l8946
$$ 6903629 7014655 7108455 7193325 7277416 7345403 7377999 7376425 7353973 7318739 7276794 7237848
11214G237848l2704l3371l3471j6542J2636K9208K2601R787J0449K5207M1457
$$ 7237848 7205144 7171773 7138302 7121760 7134396 7163604 7186205 7195992 7206441 7231648 7273105
11203G273105M7241L9322K9341L6719O1488P4882N7835L6589M9270Q5108R6336
$$ 7273105 7320346 7359668 7389009 7425728 7487216 7562098 7619933 7656522 7705792 7790900 7887236
11192G887236P2348N8499Q6295J25583J31654J06300P9852N8782K9205l374j8026
$$ 7887236 7959584 8018083 8104378 8229961 8361615 8467915 8547767 8606549 8635754 8632380 8614354
11181H614354j8113l0829o3089q8658q8673p9638q7385j11737j31716j32635j14198
$$ 8614354 8596241 8565412 8502323 8413665 8324992 8245354 8157969 8046232 7914516 7781881 7667683
11170G667683q2748n1042l7983n0421o7514o1356l5215k1707l5362m8666l3256
$$ 7667683 7584935 7533893 7495910 7445489 7377975 7316619 7281404 7259697 7224335 7175669 7142413
11159G142413o202o117l2747m5800k5526K422J2828J4102J7470J1860k232P623
$$ 7142413 7136211 7130094 7097347 7051547 7026021 7028443 7041271 7055373 7072843 7084703 7082471 7090094
11147G090094N1331P4992K7182n6582r5555p6993o3029q7539j16281j20932j22657
$$ 7090094 7141425 7216417 7243599 7187017 7091462 7014469 6951440 6863901 6747620 6626688 6504031
11136F504031j36259j35028j06499q6708r8713j07761q1523m8246m7299o4679
$$ 6504031 6367772 6232744 6126245 6039537 5940824 5833063 5751540 5703294 5655995 5591316
11126E591316o7820o3803o9458o4133l2676j7072n5869j04472r2606l7168j5285
$$ 5591316 5523496 5459693 5390235 5326102 5293426 5276354 5220485 5116013 5023407 4986239 4970954
11115D970954m1239n8886n0378n7098q3971q0042l8309k1018m9342n9301j6701
$$ 4970954 4929715 4870829 4820451 4763353 4679382 4599340 4561031 4540013 4490671 4431370 4414669
11104D414669J2297k8249q1616o8373j6646j0546n1739o9395m4568k8510m1310
$$ 4414669 4426966 4398717 4317101 4248728 4232082 4221536 4169797 4100402 4055834 4027324 3986014
11093C986014m2695j6198k893k6614n1229m3106k3046k3312l5736l6417k9280
$$ 3986014 3943319 3927121 3924228 3897614 3846385 3803279 3780233 3756921 3721185 3684768 3655488
11082C655488l1793m0345l8993k7968k0486k1645k6691l1201l2129k7515k1206
$$ 3655488 3623695 3583350 3544357 3516389 3495903 3474258 3447567 3416366 3384237 3356722 3335516
11071C335516j8419j5972r763q522k1154l4792l0750j9331k6565m5155l8443m241
$$ 3335516 3317097 3301125 3291362 3282840 3261686 3226894 3196144 3176813 3150248 3105093 3066650 3062409
11059C062409R332k3317n7640m2903j915L233l1996m8149j4513K4853J8176k2509
$$ 3062409 3071741 3048424 2990784 2947881 2945966 2949199 2917203 2869054 2854541 2879394 2897570 2875061
11047B875061m8307m3974l4258l3698k9518j6024j0911k3844l5412k7071j2353
$$ 2875061 2826754 2782780 2748522 2714824 2685306 2669282 2658371 2634527 2599115 2572044 2559691
11036B559691j4407k6267k2239k916K783j6074l4417l0290j4432n255k73O360
$$ 2559691 2545284 2519017 2496778 2493862 2496645 2480571 2446154 2415864 2401432 2396177 2395904 2402264
11024B402264J712k2263m0966k6315O370J4853r713l2744k9412j4838j0780j1711
$$ 2402264 2403976 2381713 2340747 2314432 2320802 2335655 2325942 2293198 2263786 2248948 2238168 2226457
11012B226457k663R520N095j6581l2220k3456j231M985j6184l8419k7608R401
$$ 2226457 2223794 2233314 2238409 2221828 2189608 2166152 2164921 2169906 2153722 2115303 2087695 2097096
11000B097096K7759N354k5727k8217j2572r536j5247p590R63j8913m9296l9183
$$ 2097096 2124855 2130209 2104482 2076265 2063693 2054157 2038910 2031320 2032283 2013370 1964074 1924891
10988A924891R776L2916j057m1336l5449o109l599k3787k6212o201M408n802j7098
$$ 1924891 1934667 1967583 1966526 1925190 1889741 1883632 1880033 1856246 1830034 1823833 1828241 1822439 1805341
10975A805341j7412j2503m062P005L925k3340m7215l2653P197K5333R015q465
$$ 1805341 1787929 1775426 1771364 1778369 1782294 1758954 1711739 1679086 1686283 1711616 1720631 1712166
10963A712166p128o512j9374k2265J758K4059Q129l1818m4739j1933K6936K5830
$$ 1712166 1705038 1698526 1679152 1656887 1658645 1682704 1690833 1659015 1614276 1602343 1629279 1655109
10951A655109r349l1180j2651K1194L0094R897j0600j3657q753p167p331r051
$$ 1655109 1645760 1614580 1601929 1623123 1653217 1663114 1652514 1638857 1630104 1622937 1615606 1606555
10939A606555j5335j5076O107L1261K4862q816k2892k149R377j4822l2957p304
$$ 1606555 1591220 1576144 1582251 1613512 1638374 1629558 1606666 1604517 1613894 1599072 1566115 1558811
10927A558811K3676P920k7608k1210J6884K4470l589j3135P022R278j8105k7640
$$ 1558811 1582487 1590407 1562799 1541589 1558473 1582943 1579354 1566219 1573241 1582519 1564414 1536774
10915A536774l085J0499n945r944J5792K1759j7461m6525j9231K2481K1309l473
$$ 1536774 1533689 1544188 1538243 1528299 1544091 1565850 1548389 1501864 1482633 1505114 1526423 1522950
10903A522950l452J1991P021o096L615J7456M59k5846j5794J8542K7814Q640j756
$$ 1522950 1519498 1531489 1538510 1532414 1536029 1553485 1553944 1528098 1512304 1530846 1558660 1567300 1565544
10890A565544K665j954j0400J599J9963J1525j0426p420Q907n022l9597m1590
$$ 1565544 1568209 1566255 1555855 1557454 1577417 1588942 1578516 1571096 1580003 1574981 1535384 1493794
10878A493794o550J5377P411J924N037j2150l8902k7653J3983K2605j0204j9888
$$ 1493794 1487244 1502621 1510032 1511956 1516993 1504843 1465941 1438288 1452271 1474876 1464672 1444784
10866A444784J2069K1873j4737l0039R897L2656j1674m9921j0134M3130J3469
$$ 1444784 1456853 1478726 1463989 1433950 1443847 1476503 1464829 1414908 1404774 1447904 1461373
10855A461373n8263n9860L904K6322j8239m3506q877K0679K61k2480l942K0352
$$ 1461373 1403110 1343250 1347154 1373476 1355237 1311731 1302854 1323533 1323794 1301314 1297372 1317724
10843A317724P675k0373k7901k3411k2874j0720J7669K6428k311k7152j0902J6610
$$ 1317724 1325399 1305026 1277125 1253714 1230840 1220120 1237789 1264217 1261906 1234754 1223852 1240462
10831A240462Q126k3774l0761o019J2535M008j2620j4158j848N802o051k9681
$$ 1240462 1248588 1224814 1194053 1188034 1200569 1204577 1191957 1177799 1175951 1181753 1175702 1146021
10819A146021l4100j255L7802L4064r249l8428k9231j4981j7727j0070K0667K9883
$$ 1146021 1111921 1110666 1148468 1182532 1173283 1134855 1105624 1090643 1072916 1062846 1083513 1113396
10807A113396j1218n1002k9720K2634L2160k753j8482L669J4976q594k7748j3699
$$ 1113396 1102178 1051176 1021456 1044090 1076250 1073497 1055015 1058684 1073660 1065066 1037318 1023619
10795A023619M757k321j5501o787J0252P750q194j1269J435Q890l87j4726j5104
$$ 1023619 1028376 1026055 1010554 1003767 1014019 1021769 1013575 1002306 1003741 1012631 1012244 997518 982414
10782I82414L953K4177J7577j6239l7104j3168K7858L1773m081l0124k2279q954
$$ 982414 986367 1010544 1028121 1011882 974778 961610 989468 1021241 1017160 987036 964757 955803
10770I55803r655k725K1286K8265p71k6904j3321J3120R775q768k630J7418J0476
$$ 955803 946148 943423 964709 992974 992203 965299 951978 965098 974873 966105 963475 980893 991369
10757I91369j5950j6277J0411J7429m546r615J7881K8446p570m0507j6785L1707
$$ 991369 975419 959142 969553 986982 982436 972821 990702 1019148 1011578 971071 954286 985993
10745I85993L3614j2712l9283j2119K4164J9633r959j4758J3945L5060J8319j6296
$$ 985993 1019607 1006895 967612 955493 979657 999290 989331 974573 988518 1023578 1041897 1025601
10733A025601k9852j6033j160P10O069K5842L6769J4565j9699k0862J4896M1265
$$ 1025601 995749 979716 978556 979266 985335 1011177 1047946 1062511 1042812 1021950 1036846 1078111
10721A078111K6420o823k0636j1740N14R761J8858J9002K330j5191j0530J2470
$$ 1078111 1104531 1097708 1077072 1065332 1065846 1075607 1094465 1113467 1115797 1100606 1090076 1102546
10709A102546K8097K2310K651j6861k2181k724K9481L8137Q028k2018p028L3619
$$ 1102546 1130643 1152953 1155604 1138743 1116562 1113838 1143319 1181456 1189484 1167466 1160438 1194057
10697A194057L8663k289k9527l354L4824K5181k1427m0479m634M3609N1387J7138
$$ 1194057 1232720 1230431 1200904 1197550 1232374 1257555 1236128 1195649 1191015 1234624 1286011 1303149
10685A303149j7223j8399O103K3957J8428N324O029J5396J3692K834L545J5339
$$ 1303149 1285926 1267527 1273630 1297587 1316015 1321339 1327368 1342764 1356456 1359290 1362835 1378174
10673A378174J1818j2663k4223J111L6755M1841J7090m644o511L862J9069L2453
$$ 1378174 1389992 1377329 1353106 1354217 1390972 1432813 1449903 1445259 1438748 1442610 1461679 1494132
10661A494132K5736q148l6731k0074K9411N5666L2191p684k1769p547J2689K5511
$$ 1494132 1519868 1511720 1474989 1454915 1484326 1539992 1572183 1564499 1542730 1535183 1547872 1573383
10649A573383K8164J9769P589M872J0057N203j4434k7752j6338J1235L4057M1224
$$ 1573383 1601547 1621316 1628905 1633777 1643834 1649037 1634603 1606851 1590513 1601748 1635805 1677029
10637A677029L1127P640j3247j2774M201J2382M547K183J5600K2392N363j5549
$$ 1677029 1708156 1715796 1702549 1689775 1693976 1706358 1710905 1713088 1728688 1751080 1756443 1740894
10625A740894j4656l66M344N01J805L059o794j4746k081J8241J8667L523L67R649
$$ 1740894 1726238 1725872 1730216 1730717 1732522 1735581 1728787 1714041 1711960 1730201 1748868 1752391 1752758 1762407
10611A762407M748j5592j8411P440K6388R048k1488k3413M467K5249J6256n339
$$ 1762407 1767155 1751563 1733152 1740592 1766980 1776028 1754540 1731127 1735594 1760843 1777099 1771760
10599A771760r629Q398K4469J5788q386j6133L891K4390J8424o72k741R864R765
$$ 1771760 1762131 1770529 1794998 1810786 1802400 1786267 1790158 1814548 1832972 1832300 1829559 1839423 1849188
10586A849188n508r713M169J1844K224m911K97j605j7952k1571K610K3282R024
$$ 1849188 1843680 1833967 1838136 1849980 1852204 1847293 1847590 1845985 1828033 1806462 1809072 1832354 1841378
10573A841378j9874k3990o310J8j0377j2851j261L396n939j0037J194J1825Q062
$$ 1841378 1821504 1797514 1791204 1791222 1780845 1767994 1766733 1770129 1764190 1754153 1755347 1767172 1775234
10560A775234j230k043N030J0263P203k991r612O22K2372K8062L937k2502j6624
$$ 1775234 1774004 1771961 1776991 1787254 1794457 1791466 1781854 1782476 1804848 1832910 1836847 1814345 1797721
10547A797721J2132K4289R336m628r0P789M532k721p095j2059r999J3790M2356
$$ 1797721 1809853 1834142 1843478 1838850 1838760 1846549 1851081 1848360 1841265 1829206 1819207 1832997 1875353
10534A875353L1817k1799n8032k8084L3712N4013J6752k6231l1172q073J0775
$$ 1875353 1907170 1885371 1827339 1799255 1832967 1886980 1903732 1877501 1846329 1838256 1849031
10523A849031J2541M323l738m743J444O082L421K133J1053J8666O645j7916k6490
$$ 1849031 1861572 1865895 1862157 1857414 1858858 1864940 1868361 1870494 1881547 1900213 1906858 1888942 1862452
10510A862452r291J0250J0143j24J642J5172J9458N323j0189o883J0947J9679
$$ 1862452 1853161 1863411 1873554 1873430 1875072 1890244 1909702 1915025 1904836 1897953 1908900 1928579
10498A928579Q414m832K689K4849L2656J4365q462j2756m137q36k632L942J8108
$$ 1928579 1936993 1932161 1934850 1959699 1992355 2006720 1998258 1985502 1981365 1980529 1977897 1981839 1999947
10485A999947K4241J5914K242p333q094M773K5914L0635K804k9613j9399L2265
$$ 1999947 2024188 2040102 2042344 2035011 2026917 2031690 2057604 2088239 2091043 2061430 2042031 2074296
10473B074296O7078M5930K229q564J3351K2550K381j4730l141J9055K3735J3189
$$ 2074296 2141374 2187304 2189533 2180969 2194320 2216870 2219251 2204521 2201380 2220435 2244170 2257359
10461B257359O147N350K942L367J4876K6723K1808R363J6215M1101M8062K0217
$$ 2257359 2263506 2268856 2271798 2275165 2290041 2316764 2338572 2347935 2364150 2405251 2453313 2473530
10449B473530p717L943M0829N4885L3733J2852J7142K7315J8307o5l200R008J7261
$$ 2473530 2465813 2469756 2510585 2565470 2599203 2612055 2629197 2656512 2674819 2674754 2671554 2680562 2697823
10436B697823J4104Q388P466J2788K4550L5499L1396J3355M989J8083K8022Q966
$$ 2697823 2711927 2720315 2727781 2740569 2765119 2800618 2832014 2845369 2850358 2868441 2896463 2905429
10424B905429k2270k8991r358P075Q697Q528P068o587j6800M802L9606L2231j9707
$$ 2905429 2883159 2854168 2844810 2851885 2860582 2869110 2876178 2869591 2852791 2857593 2897199 2929430 2909723
10411B909723m4714j917M9393L6960j3571k1936K1687M9854K7861l155k994J3495
$$ 2909723 2865009 2863092 2912485 2949445 2935874 2913938 2935625 2985479 3013340 3010185 3007191 3020686
10399C020686K1490K9366M5931M9860K7226M642R603K6825L0076L1256N5526Q5683
$$ 3020686 3042176 3071542 3117473 3167333 3194559 3199201 3208804 3235629 3265705 3296961 3352487 3438170
10387C438170P8786L4727M270K0120N5306O4586M0159Q768o638k915J2958L0217
$$ 3438170 3516956 3551683 3555953 3576073 3631379 3695965 3736124 3744892 3738254 3735339 3748297 3778514
10375C778514L5492K2974L360o828m247O89O25o80K328R129J7471K6447L0267
$$ 3778514 3814006 3836980 3840340 3833512 3829265 3829954 3830579 3829899 3832227 3841356 3858827 3885274 3915541
10362C915541J9711p83q004J1888L7779L8554K0521J9705M1168M4037R974j1845
$$ 3915541 3935252 3934469 3926465 3938353 3976132 4014686 4035207 4054912 4096080 4140117 4150091 4138246
10350D138246K7841R1685R6303L4526q287K2324P2617O6338J7393n04L2601O4450
$$ 4138246 4166087 4257772 4354075 4388601 4380314 4402638 4475255 4541593 4558986 4558482 4591083 4655533
10338D655533N9719M6102N6766P5799O9448M0983K3548L2898N2736O2488O0756
$$ 4655533 4715252 4761354 4818120 4893919 4963367 5004350 5027898 5060796 5113532 5176020 5236776
10327E236776N8954O2036O2289N3234M4924N3951P5147Q0337N8414L9121N3885
$$ 5236776 5295730 5357766 5420055 5473289 5518213 5572164 5647311 5727648 5786062 5825183 5879068
10316E879068Q7003R6510P5874N8743O2356O5669N2799L9210L7512L3708K1042
$$ 5879068 5966071 6062581 6138455 6197198 6259554 6325223 6378022 6417232 6454744 6488452 6509494
10305F509494K3848N7196R0687Q7449N8325M2163M9677O3226P6603R4429J02864
$$ 6509494 6533342 6590538 6681225 6768674 6826999 6869162 6918839 6982065 7058668 7153097 7255961
10294G255961Q4424N7648N8473Q2818R2342P9668P8160R6533R7223O3024L4446
$$ 7255961 7340385 7398033 7456506 7539324 7631666 7711334 7789494 7886027 7983250 8046274 8080720
10283H080720M5600O6681N4233K3664K0824M5741N9415N3416N6989P6424Q0813
$$ 8080720 8126320 8193001 8247234 8270898 8291722 8337463 8396878 8450294 8507283 8583707 8664520
10272H664520N7531L5050L5176M2602L9483L3029K7833N553m1326q4547r7867
$$ 8664520 8722051 8757101 8792277 8834879 8874362 8907391 8935224 8940777 8899451 8814904 8717037
10261H717037r6604j10206j36020j51600j55668j61827j63667j43309j09858r2408
$$ 8717037 8620433 8510227 8374207 8222607 8066939 7905112 7741445 7598136 7488278 7395870
10251G395870r3213q3122n0344k0421j4875j9296r115J6895M6051P2075Q6689
$$ 7395870 7302657 7219535 7169191 7148770 7133895 7114599 7105484 7122379 7168430 7240505 7327194
10240G327194P2500K8810j2405k4063k5478n5779j12369j49959j43945j21264
$$ 7327194 7399694 7428504 7416099 7392036 7366558 7310779 7198410 7048451 6904506 6783242
10230F783242j15592j21124j12018q6560o5432n7278n2061m4765m1547m1289l3775
$$ 6783242 6667650 6546526 6434508 6347948 6282516 6225238 6173177 6128412 6086865 6045576 6011801
10219F011801k1678k2521l8540m5244k7000p208j9323n6326p6081n7846k7691
$$ 6011801 5990123 5967602 5929062 5883818 5856818 5849610 5830287 5773961 5697880 5640034 5612343
10208E612343j8517k7623l0960k3720k3581l7917m8771l6797q702P456p421m0939
$$ 5612343 5593826 5566203 5535243 5511523 5487942 5450025 5401254 5364457 5355755 5363211 5355790 5314851
10196E314851n9777m6286k0903j7351l7309m8772l5115k0486k7921l6922j5962
$$ 5314851 5255074 5208788 5187885 5170534 5133225 5084453 5049338 5028852 5000931 4964009 4948047
10185D948047J8597J9575j6291l7039j2097K3612K7560J2865J6365L2621K6799
$$ 4948047 4966644 4986219 4969928 4932889 4920792 4944404 4971964 4984829 5001194 5033815 5060614
10174E060614j333j5691n328l85j6632k7883j4691k655k0411m6840l9806m351
$$ 5060614 5059281 5043590 5038262 5037877 5021245 4993362 4978671 4976016 4955605 4908765 4868959 4864608
10162D864608R850j8414m9514m0072l426J3677j518j5806m273J5028J4192p82
$$ 4864608 4874458 4856044 4806530 4766458 4763032 4776709 4775191 4759385 4755112 4770140 4784332 4783550
10150D783550k823J2570K3826K0388J6536K3843L4359L9633M2960M1620K2386
$$ 4783550 4780727 4793297 4817123 4837511 4854047 4877890 4912249 4951882 4994842 5036462 5058848
10139E058848q197j5224J7276N2323M4832L978k3948k1992j2519r073l094J075
$$ 5058848 5050651 5035427 5052703 5105026 5149858 5153836 5129888 5107896 5095377 5086304 5083210 5084285
10127E084285j5040m1517m2477j6252o414l0020m2958j1693K4678J2795k7653
$$ 5084285 5069245 5027728 4985251 4968999 4962585 4932565 4889607 4877914 4902592 4915387 4887734
10116D887734l3053M238K5439m052m7618n5997l1117r652j1150k4733l1774k5154
$$ 4887734 4854681 4858919 4884358 4880306 4832688 4776691 4745574 4735922 4724772 4700039 4668265 4643111
10104D643111j3155j1115k3331l4983l1260j8642j3647j8278k3584k9146l8183
$$ 4643111 4629956 4618841 4595510 4560527 4529267 4510625 4496978 4478700 4455116 4425970 4387787
10093D387787m1210k8258j1034q188j4925j3828q157j2908j9616p180J4324J1275
$$ 4387787 4346577 4318319 4307285 4299097 4284172 4270344 4262187 4249279 4229663 4222483 4236807 4248082
10081D248082j8292l7636k7284q437j158O11J331o784j4367K66K2962J1415l0254
$$ 4248082 4229790 4192154 4164870 4156433 4155275 4155886 4157217 4150433 4136066 4136332 4159294 4170709 4140455
10068D140455m2717n729K1825j512k7923m325L1635J6604k4904k1863J8837K6441
$$ 4140455 4097738 4092009 4113834 4112322 4084399 4080074 4111709 4128313 4103409 4081546 4100383 4126824
10056D126824q066j9582J2865L2097P925j3577J166J7261O124J267K8503M7097
$$ 4126824 4118758 4099176 4112041 4144138 4152063 4138486 4139652 4156913 4163037 4164304 4192807 4239904
10044D239904J9501j6743j0798J4793P863j9573j4523K2326L7885J4824p564l104
$$ 4239904 4259405 4242662 4231864 4246657 4254520 4234947 4220424 4242750 4280635 4295459 4287895 4284791
10032D284791Q382P063L358Q969J5884J6848J7162J8343J5670J4549K3626L2134
$$ 4284791 4293173 4300236 4303594 4312563 4328447 4345295 4362457 4380800 4396470 4411019 4434645 4466779
10020D466779K1749N56l784J4401L1958L3107K5600J9235J3776R667Q295M044
$$ 4466779 4488528 4489084 4485300 4499701 4531659 4564766 4590366 4609601 4623377 4633044 4641339 4645383
10008D645383k327P870M2002O8809N6703K7269K6118M9134N1202K7201K2538N0128
$$ 4645383 4643056 4650926 4692928 4761737 4818440 4845709 4871827 4920961 4972163 4999364 5021902 5072030
9996E072030O0585K4223j3925j846M1430O0853M5046K6011K3687L2673M6147N6830
$$ 5072030 5132615 5156838 5142913 5141067 5182497 5243350 5288396 5314407 5338094 5370767 5416914 5473744
9984E473744N0874L2186L2616O5977R5612Q4169N1774M2695N6485O1129N6948
$$ 5473744 5524618 5556804 5589420 5655397 5751009 5835178 5886952 5929647 5986132 6047261 6104209
9973F104209P0828R4371Q7657N0110L1130N4364Q1606P5173N3254N4123P8238
$$ 6104209 6175037 6269408 6357065 6407175 6438305 6492669 6574275 6649448 6702702 6756825 6835063
9962F835063R6891R6172Q4912P4364P2428Q5810J09480J23525J13742Q6088N3346
$$ 6835063 6931954 7028126 7113038 7187402 7259830 7345640 7455120 7578645 7692387 7778475 7831821
9951G831821K1303m971j8608k3633l2204m0684k9435K105K3573J4459m427j465
$$ 7831821 7853124 7848153 7829545 7805912 7773708 7733024 7703589 7705694 7729267 7743726 7739299 7737834
9939G737834K1438L9025M2989M5070M8438M4175L5150L7778N5399P1091P4749
$$ 7737834 7759272 7798297 7841286 7886356 7934794 7978969 8014119 8051897 8107296 8178387 8253136
9928H253136P9511R9373J23078J26337J06020Q6261Q6076R4355Q9106P2536O6217
$$ 8253136 8332647 8432020 8555098 8681435 8787455 8873716 8959792 9054147 9143253 9215789 9282006
9917I282006P2008O3953L0428k273j0338j2061l5378o6641p4635p2390j01302
$$ 9282006 9354014 9417967 9448395 9446122 9435784 9423723 9388345 9321704 9247069 9174679 9073377
9906I073377j52977j66210j19343o9282o7379q7208p8058m6895l4485m1357l5705
$$ 9073377 8920400 8754190 8634847 8565565 8498186 8410978 8332920 8286025 8251540 8210183 8174478
9895H174478j6999j3430k2949j2973J8055L0549P045j8352j0535K1331M6293N1663
$$ 8174478 8157479 8144049 8121100 8108127 8126182 8156731 8163776 8145424 8134889 8156220 8202513 8254176
9883H254176M5168L8951M3110N7519O5210N2383L3387L0895L4816J4192k9253
$$ 8254176 8299344 8338295 8381405 8438924 8504134 8556517 8589904 8620799 8655615 8669807 8640554
9872H640554n8230n8550n9737q0463r3191o9880l1046j7429l3396m8007l9181
$$ 8640554 8582324 8523774 8464037 8383574 8290383 8220503 8189457 8172028 8138632 8090625 8051444
9861H051444j2559J3795K4719J6197J267p68J3198L1761N2441P9204R6673Q2388
$$ 8051444 8038885 8052680 8077399 8093596 8094863 8094095 8107293 8139054 8191495 8270699 8367372 8449760
9849H449760N2393N2802Q9348J11012R0141P0967R8650J44820J56459J43326J54972
$$ 8449760 8502153 8554955 8644303 8755315 8845456 8916423 9015073 9159893 9316352 9459678 9614650
9838I614650J94303K19268K18770K22271K37242K40933K38883K69253L36347L97860
$$ 9614650 9808953 10028221 10246991 10469262 10706504 10947437 11186320 11455573 11791920 12189780
9828A2189780M34689M77130N41272N96311O22573O45166O71252O44370N09290
$$ 12189780 12624469 13101599 13642871 14239182 14861755 15506921 16178173 16822543 17331833
9819A7331833K85251L1018k23230m57167o13201o41777n81755n27036n10344m81575
$$ 17331833 17617084 17648102 17424872 16967705 16354504 15712727 15130972 14603936 14093592 13612017
9809A3612017m10381l44167l32627l47881l28301k71954k34429k41569k52498
$$ 13612017 13201636 12857469 12524842 12176961 11848660 11576706 11342277 11100708 10848210
9800A0848210k22291j66693j37742j51070j68452j54968j25098j13746j21377
$$ 10848210 10625919 10459226 10321484 10170414 10001962 9846994 9721896 9608150 9486773
9791I486773j18637r9197r1666j09410j22723j03210o9068n6804o7036p2144o5790
$$ 9486773 9368136 9268939 9177273 9067863 8945140 8841930 8772862 8716058 8649022 8576878 8511088
9780H511088o7552q1392q6714p6657p1468q2250r1077q3363p4633q4709j04010
$$ 8511088 8443536 8362144 8275430 8198773 8127305 8045055 7953978 7870615 7795982 7711273 7607263
9769G607263j06976q7461o3036n2751o3768q9764j10810j07922q9727q7198j06301
$$ 7607263 7500287 7412826 7349790 7297039 7233271 7143507 7032697 6924775 6835048 6747850 6641549
9758F641549j09802p4013l9524o0166j13336j19508o0046j3613m2355r7806r6212
$$ 6641549 6531747 6457734 6418210 6358044 6244708 6125200 6065154 6051541 6009186 5911380 5815168
9747E815168m7240l2614p1885r3731n5976j4255k9387p0888p2245l6596j8656
$$ 5815168 5767928 5735314 5663429 5569698 5513722 5499467 5470080 5399192 5326947 5290351 5271695
9736E271695k9148l0632j7956k8654o5953q0507m9892j7231k2584m6554n2869
$$ 5271695 5242547 5211915 5193959 5165305 5099352 5018845 4968953 4951722 4929138 4882584 4829715
9725D829715m1510k7196q333P995o713n0920p1585l9196k055j2805m1994l0330
$$ 4829715 4788205 4761009 4752676 4760671 4753958 4703038 4631453 4592257 4590202 4577397 4535403 4505073
9713D505073P528R636k3665l2088l331P690k0778m0187k0289K71j3084l3227k6737
$$ 4505073 4512601 4522237 4498572 4466484 4463153 4470843 4450065 4409878 4389589 4389860 4376776 4343549 4316812
9700D316812r276m343m47Q737m342m2626n2066m239M0481J9440k8202k2966K3791
$$ 4316812 4307536 4303193 4302746 4311483 4307141 4264515 4212449 4208210 4248691 4268131 4239929 4216963 4240754
9687D240754L1026j4672l8203j103M0683L2289n29p315Q830J4039M645J350P706
$$ 4240754 4271780 4257108 4218905 4217802 4258485 4290774 4290245 4282930 4291760 4305799 4310444 4311794 4319500
9674D319500J0865P790L489l821j5546k2539j6678k113J1560J4240m727l9340
$$ 4319500 4330365 4338155 4341644 4337823 4322277 4299738 4283060 4280947 4292507 4306747 4302020 4262680
9662D262680n4407k3563K1563K2597j9675m0918j0269K3927J5840o060L869K7260
$$ 4262680 4208273 4184710 4206273 4228870 4209195 4168277 4158008 4181935 4197775 4191715 4195584 4222844
9650D222844J9123p419l938K3601K1587j5462k8414J0221M8760L6827N08m743
$$ 4222844 4241967 4234548 4230610 4254211 4275798 4260336 4231922 4242143 4290903 4327730 4328238 4323495
9638D323495K1496L4568J7567j486R66J5882K5895K8328K6206J7447K727r284
$$ 4323495 4344991 4379559 4397126 4395640 4396606 4412488 4438383 4466711 4492917 4510364 4513091 4503807
9626D503807j2480j0841j0974j4709k1783l1202l6357k8278j0494k064j5578l7334
$$ 4503807 4491327 4480486 4469512 4454803 4433020 4401818 4365461 4337183 4326689 4324625 4309047 4271713
9614D271713m1945k4970o807k078j369Q023J9057J7938Q375L697K544n798j6162
$$ 4271713 4229768 4204798 4197991 4195913 4194544 4202567 4221624 4239562 4247937 4251634 4254178 4248380 4232218
9601D232218j2271K679O053q408j9879j3473P61J0807J7823J7874l1k1841j0599
$$ 4232218 4219947 4222626 4228679 4220271 4200392 4186919 4187680 4198487 4216310 4234184 4234153 4212312 4201713
9588D201713L4147N6492K0642k7458k3210J9823L4958O656j7223j3636j3136k7899
$$ 4201713 4235860 4292352 4312994 4285536 4262326 4282149 4317107 4323763 4306540 4292904 4279768 4251869
9576D251869k2037J6266L6397K386m2568l9063M84K0352Q164l409j799l790q364
$$ 4251869 4229832 4246098 4282495 4284881 4242313 4203250 4203734 4224086 4232250 4228841 4227042 4223252 4214888
9563D214888M539K7525K8015L509j0444K687J7330J3306O866J5815K8443K9130
$$ 4214888 4219427 4246952 4274967 4278476 4268032 4270719 4288049 4301355 4308221 4324036 4352479 4381609
9551D381609K5492K7505K5821J4536J1321K8919M8061M7313M0386N1018O6572
$$ 4381609 4407101 4434606 4460427 4474963 4486284 4515203 4563264 4610577 4650963 4701981 4768553
9540D768553N6367K9398K9533O5767Q9324O1215R825q892J3161L5157L1289J8785
$$ 4768553 4824920 4854318 4883851 4949618 5038942 5100157 5109982 5101090 5114251 5149408 5180697 5199482
9528E199482J9210K5821K4176J9398K2131K5416J8965J3782K6420M5912M5360
$$ 5199482 5218692 5244513 5268689 5288087 5310218 5335634 5354599 5368381 5394801 5440713 5486073
9517E486073K5734J7601L2666M4376L1468J2392J3650K6659K4548O731l978j350
$$ 5486073 5511807 5529408 5562074 5606450 5637918 5650310 5663960 5690619 5715167 5721898 5717920 5716570
9505E716570k979j7609l0365k4783k338K1064K5755K456k9141k9290J1729M8125
$$ 5716570 5713591 5695982 5665617 5640834 5638496 5659560 5685315 5687771 5658630 5629340 5641069 5689194
9493E689194L5574r24J43M3228O8654M5295J3073J1621K1658J2264j507O586J9026
$$ 5689194 5724768 5723844 5723987 5767215 5835869 5881164 5894237 5905858 5927516 5939780 5938273 5944859 5963885
9480E963885M455k4182l1026j6811r048j0445o094n963k6978m4552j9618L1211
$$ 5963885 5968340 5944158 5913132 5896321 5887273 5876828 5870734 5864771 5837793 5793241 5773623 5804834
9468E804834N1207K9045Q458R080L542j5203j4512O500k623n5338q8293n7911
$$ 5804834 5856041 5885086 5893544 5902624 5906166 5890963 5876451 5882951 5880328 5824990 5736697 5678786
9456E678786j3966j7795m3788l3245L79J740k2936k0045R731J2188j9214k8819
$$ 5678786 5664820 5647025 5603237 5569992 5570371 5572111 5549175 5529130 5538861 5551049 5531835 5503016
9444E503016K347K3980O323j1803K188J8011J351k6481l1822k4757k7870k9368
$$ 5503016 5505363 5529343 5535666 5523863 5526051 5544062 5545413 5518932 5487110 5462353 5434483 5405115
9432E405115j2541K210j0531l4467l7679k1156n969J873J127j9098m9601n2981
$$ 5405115 5392574 5394784 5384253 5349786 5312107 5290951 5284982 5286855 5287982 5268884 5219283 5166302
9420E166302k3101j0696m3753p0103m0015K342j0545m8917l4849J3358K351o9461
$$ 5166302 5143201 5132505 5088752 5018649 4978634 4980976 4970431 4921514 4886665 4900023 4902374 4832913
9408D832913r0134j2748O0539L3995m0921n9503j9878N633j079q7J4739J0909
$$ 4832913 4742779 4730031 4790570 4824565 4783644 4724141 4704263 4709896 4708817 4708730 4723469 4734378
9396D734378r814j2528L050M565q264n390J0766P793j2190j3349N867Q410j1171
$$ 4734378 4724564 4712036 4715086 4719651 4711387 4705997 4716763 4724556 4712366 4699017 4704884 4713294 4702123
9383D702123j5704L252O467k1093l9923k3021J993O014J467K722m473k0597j2113
$$ 4702123 4686419 4689671 4696138 4675045 4635122 4612101 4614094 4620108 4621575 4624297 4619824 4599227 4587114
9370D587114K6867M3970O962l5244k4800J5451K7250J3766J8270L3785J6675k0222
$$ 4587114 4613981 4657951 4664913 4629669 4604869 4620320 4647570 4661336 4679606 4713391 4730066 4709844
9358D709844j3913M1274P3893M6286J1186K1523M9476M4380J8508J5995L1519
$$ 4709844 4695931 4737205 4811098 4857384 4868570 4890093 4939569 4983949 5002457 5018452 5049971
9347E049971K2558j3443l2037j0671K2784L6168K9833J8782R809O929J4367K4426
$$ 5049971 5072529 5059086 5027049 5016378 5039162 5075330 5105163 5123945 5133754 5140683 5155050 5179476
9335E179476K4018J9730L1933N5129N3244J3180k2902p925M3990P5581O3817M2637
$$ 5179476 5203494 5223224 5255157 5310286 5363530 5376710 5353808 5345883 5389873 5465454 5529271 5571908
9323E571908M4182N5550N2835M5566N5133O9503N8151K4350K952M371J642j5277
$$ 5571908 5616090 5671640 5724475 5770041 5825174 5894677 5952828 5977178 5980130 5984501 5986143 5970866
9311E970866j5347J7150M0933J4454l1827l1910J6989M8256K5781m849Q775M6128
$$ 5970866 5955519 5972669 6013602 6028056 5996229 5964319 5981308 6029564 6055345 6050496 6059271 6105399
9299F105399N1523K3378J4602M9849Q9544Q8949N7990L9650N0097O7391P2650
$$ 6105399 6156922 6180300 6194902 6244751 6334295 6423244 6481234 6520884 6570981 6638372 6711022
9288F711022P5956R3407J16147J19504R8952P9770Q4552J03499J09056R2191O7971
$$ 6711022 6786978 6880385 6996532 7116036 7214988 7294758 7379310 7482809 7591865 7684056 7752027
9277G752027M7853K6537K618o942J0858L8917M5401K3793J406M259K6434M1805
$$ 7752027 7799880 7826417 7829035 7822093 7832951 7871868 7917269 7941062 7942468 7946727 7973161 8014966
9265H014966L7452K5029K1744K9968L8470L7394K7276J6730J6039L0112N1858
$$ 8014966 8052418 8077447 8099191 8129159 8167629 8205023 8232299 8249029 8265068 8295180 8347038
9254H347038O5060O1627N3901N9477P5578Q3904Q2355R0373J12960J23774J05655
$$ 8347038 8412098 8473725 8527626 8587103 8662681 8746585 8828940 8919313 9032273 9156047 9261702
9243I261702Q7579J09750J63094J99879K02142K00659K18013K31461K11842J67333
$$ 9261702 9349281 9459031 9622125 9822004 10024146 10224805 10442818 10674279 10886121 11053454
9233A1053454J22068P5374J3097n4618r7259j01463q2100n9005m0966k9314k0449
$$ 11053454 11175522 11250896 11263993 11209375 11112116 11010653 10928553 10869548 10828582 10799268 10778819
9222A0778819o869J2161K6310L1121L8399N5485O7649O1109N1185O1752Q5001
$$ 10778819 10771950 10784111 10810421 10841542 10879941 10935426 11003075 11064184 11115369 11177121 11262122
9211A1262122R1550P8490P5531R7319J19714J17261R9986R4343J04490J13106
$$ 11262122 11353672 11432162 11507693 11605012 11724726 11841987 11941973 12036316 12140806 12253912
9201A2253912J11521J09158J14149J20096J17473J09790J10578J24728J40130
$$ 12253912 12365433 12474591 12588740 12708836 12826309 12936099 13046677 13171405 13311535
9192A3311535J43900J41975J50047J65128J63997J38956J18050J32286J72965
$$ 13311535 13455435 13597410 13747457 13912585 14076582 14215538 14333588 14465874 14638839
9183A4638839K00278J89913J56335J33307J43164J79926K12976K15496J96451
$$ 14638839 14839117 15029030 15185365 15318672 15461836 15641762 15854738 16070234 16266685
9174A6266685J89543K03432K09651J95966J96369K34537K71219K57044K13524
$$ 16266685 16456228 16659660 16869311 17065277 17261646 17496183 17767402 18024446 18237970
9165A8237970K03442K35709K64158K73848K95365L27483L24667K84671K71834
$$ 18237970 18441412 18677121 18941279 19215127 19510492 19837975 20162642 20447313 20719147
9156B0719147L16294L61951L61241L52117L81118M14717M02437L75797L98593
$$ 20719147 21035441 21397392 21758633 22110750 22491868 22906585 23309022 23684819 24083412
9147B4083412M55083M77184M59917M58914M85728M99215M99961N36800O05234
$$ 24083412 24538495 25015679 25475596 25934510 26420238 26919453 27419414 27956214 28561448
9138B8561448O34544O05558N92028O42599P04095P16304P08420P34405P74799
$$ 28561448 29195992 29801550 30393578 31036177 31740272 32456576 33164996 33899401 34674200
9129C4674200P80421P68127P90068Q35396Q45965Q19616Q18445Q67315R13814
$$ 34674200 35454621 36222748 37012816 37848212 38694177 39513793 40332238 41199553 42113367
9120D2113367R09895Q78878Q73708R06755R48760R73713R81820R88747J004657
$$ 42113367 43023262 43902140 44775848 45682603 46631363 47605076 48586896 49575643 50580300
9111E0580300J020918J021394J012333J023351J061484J087668J069242J033352
$$ 50580300 51601218 52622612 53634945 54658296 55719780 56807448 57876690 58910042
9103E8910042J025781J034728J010192R51815R13475R11365Q93603Q28431P62114
$$ 58910042 59935823 60970551 61980743 62932558 63846033 64757398 65651001 66479432 67241546
9094F7241546P46174P55834P34133O83101O52783O57936O63032O45826O24464
$$ 67241546 67987720 68743554 69477687 70160788 70813571 71471507 72134539 72780365 73404829
9085G3404829O15009O04353N77118N37661M94145M45921L94145L41969K79977
$$ 73404829 74019838 74624191 75201309 75738970 76233115 76679036 77073181 77415150 77695127
9076G7695127J95740J01025K2931l6192j00616j76860k40288k78135l11621l55397
$$ 77695127 77890867 77991892 78014823 77978631 77878015 77701155 77460867 77182732 76871111 76515714
9066G6515714l87482l87316l76891l91084m26221m52432m63945m82421n17173
$$ 76515714 76128232 75740916 75364025 74972941 74546720 74094288 73630343 73147922 72630749
9057G2630749n55243n89454o27523o73022p21479p73687q30957q83092r24088
$$ 72630749 72075506 71486052 70858529 70185507 69464028 68690341 67859384 66976292 66052204
9048F6052204r68182j021282j053280j040664j021794j052257j108906j107887
$$ 66052204 65084022 64062740 63009460 61968796 60947002 59894745 58785839 57677952
9040E7677952j032617r69426r80657j014066r94551r43852r33782r64045r72939
$$ 57677952 56645335 55675909 54695252 53681186 52686635 51742783 50809001 49844956 48872017
9031D8872017r48216r40034r65673r83342r72865r67826r85578r92171r66450
$$ 48872017 47923801 46983767 46018094 45034752 44061887 43094061 42108483 41116312 40149862
9022D0149862r39841r38209r35921r05460q67712q53284q52045q39820q20521
$$ 40149862 39210021 38271812 37335891 36430431 35562719 34709435 33857390 33017570 32197049
9013C2197049q03451p72311p17642o69690o56589o57059o37658o10131o04256
$$ 32197049 31393598 30621287 29903645 29233955 28577366 27920307 27282649 26672518 26068262
9004B6068262o07856n87420n51729n38740n47487n39676n08880m92158n02936
$$ 26068262 25460406 24872986 24321257 23782517 23235030 22695354 22186474 21694316 21191380
8995B1191380n03993m67086m18151l98209m07980m14782l96240l59069l25486
$$ 21191380 20687387 20220301 19802150 19403941 18995961 18581179 18184939 17825870 17500384
8986A7500384l11781l14169l14105l02191k87990k78174k63154k41242k32682
$$ 17500384 17188603 16874434 16560329 16258138 15970148 15691974 15428820 15187578 14954896
8977A4954896k44990k50246k30079k15444k37176k63342k43890j99272j95616
$$ 14954896 14709906 14459660 14229581 14014137 13776961 13513619 13269729 13070457 12874841
8968A2874841k36563k53801k15262j70236j64383j77285j75910j69015j70311
$$ 12874841 12638278 12384477 12169215 11998979 11834596 11657311 11481401 11312386 11142075
8959A1142075j61064j30735j09174j18059j31750j24517j14758j23069j28751
$$ 11142075 10981011 10850276 10741102 10623043 10491293 10366776 10252018 10128949 10000198
8950A0000198j10802r1927r6884j05744r4288q1515q8705r2006o9489n3846p6873
$$ 10000198 9889396 9797469 9700585 9594841 9500553 9419038 9330333 9238327 9168838 9114992 9038119
8939I038119j01211p7642l5825l9132p5900q1492n2256m6158p3447p9926n0022
$$ 9038119 8936908 8859266 8823441 8784309 8708409 8626917 8574661 8528503 8455056 8375130 8325108
8928H325108l6416o3126q1874n8232k7666k7954m1009m1225m1504n0915m4447
$$ 8325108 8288692 8225566 8143692 8085460 8057794 8029840 7988831 7947606 7906102 7855187 7810740
8917G810740j7831j6099n9100r2261o7359k4251k8430o5535o8811k8060N66j3595
$$ 7810740 7792909 7776810 7717710 7625449 7558090 7533839 7505409 7439874 7371063 7343003 7343569 7329974
8905G329974l9644m6634m5386n3299o0306n1345l5421l1908m1767m7079l5624
$$ 7329974 7290330 7243696 7198310 7145011 7084705 7033360 6997939 6966031 6924264 6877185 6841561
8894F841561j8411j7835l5973m5769k9152j0798k3965n2364n0598k1773j7944
$$ 6841561 6823150 6805315 6769342 6723573 6694421 6683623 6659658 6607294 6556696 6534923 6516979
8883F516979m9123n6463r995L0243M426m9225n4707j7308n246l3752m7874j9493
$$ 6516979 6467856 6411393 6401398 6431641 6436067 6386842 6332135 6314827 6309581 6275829 6227955 6208462
8871F208462J1926R124j1953k0192j2076J384J3577J5252O14j2381M95K8733L7201
$$ 6208462 6220388 6229512 6217559 6197367 6185291 6186675 6200252 6215504 6216118 6203737 6204232 6232965 6270166
8858F270166J9379M950J1481K4933L2195L6941L8242K7896J3153R739J2269M976
$$ 6270166 6289545 6294495 6305976 6330909 6363104 6400045 6438287 6466183 6479336 6489075 6501344 6506320
8846F506320l698L840J3182j004k1035r511J8054R504l1528m2230m253K4674Q535
$$ 6506320 6502622 6506462 6519644 6518640 6497605 6488094 6506148 6515652 6484124 6441894 6437641 6462315 6470850
8833F470850j3251o099O07j7645k3584J0952M0589J9212j8490j8741j246j3224
$$ 6470850 6457599 6451500 6452107 6434462 6410878 6421830 6462419 6481631 6463141 6444400 6443154 6429930
8821F429930l6402k4858J148r472l6690k0110K4296K0877l3300n7022k0628R005
$$ 6429930 6393528 6368670 6369818 6360346 6323656 6303546 6327842 6348719 6315419 6258397 6237769 6246774
8809F246774j0946l1105q009J7868J814k1765m042K9471K7007J627R35K0104J8937
$$ 6246774 6235828 6204723 6196714 6214582 6216396 6194631 6190589 6220060 6247067 6248694 6249629 6269733 6288670
8796F288670K600J1667M2908N0700K6975J4342L1782M7737M2025L8771N4854O4777
$$ 6288670 6291270 6302937 6345845 6396545 6423520 6437862 6469644 6517381 6559406 6598177 6653031 6717808
8784F717808M6744K3479K3400L3852K9727K2536L8987O6933O8256M2919L5256
$$ 6717808 6764552 6788031 6811431 6845283 6875010 6897546 6936533 7003466 7071722 7114641 7149897
8773G149897O5389R3791P8338L7739K4595N0022P2056N9354L1826K4572L8017
$$ 7149897 7215286 7309077 7387415 7425154 7449749 7499771 7571827 7631181 7663007 7687579 7725596
8762G725596M5385L3231J1733n641j0693M325L5893N6595L9958J450j2328J4449
$$ 7725596 7770981 7804212 7815945 7810304 7799611 7803936 7839829 7896424 7936382 7937832 7925504 7939953
8750G939953M1959L0012m437j2574J6273M2633L5663J2903P666J9810K2033M305
$$ 7939953 7981912 8011924 8007487 7994913 8011186 8053819 8089482 8102385 8110051 8129861 8151894 8156199
8738H156199j3945j6962j3872j6055j4143K371J6350J680l2145m3393j3366K7899
$$ 8156199 8142254 8125292 8111420 8095365 8081222 8083593 8099943 8101623 8069478 8026085 8012719 8040618
8726H040618M3702L4105K0427J0297K371O149K7261M5290L6860J3730Q648K7895
$$ 8040618 8084320 8118425 8138852 8149149 8151520 8157669 8184930 8230220 8267080 8280810 8289458 8317353
8714H317353M6748M9043M2728L7849L7278M7024O6648P3518N0409K4655L9049
$$ 8317353 8364101 8413144 8455872 8493721 8530999 8578023 8644671 8718189 8768598 8793253 8832302
8703H832302Q3229J00828P3272M6332N5569P6062P4942O6994P9681J00955J04323
$$ 8832302 8915531 9016359 9089631 9135963 9191532 9267594 9342536 9409530 9489211 9590166 9694489
8692I694489R6488R8565J04889J01163R9912J15216J23984R9045O3644O3285R4169
$$ 9694489 9790977 9889542 9994431 10095594 10195506 10310722 10434706 10533751 10597395 10660680 10754849
8681A0754849J10717J00073R7059J19521J37907J25546J01116R9759J25510J49723
$$ 10754849 10865566 10965639 11062698 11182219 11320126 11445672 11546788 11646547 11772057 11921780
8671A1921780J45173J15197R4517J13220J53379J64366J36617J23938J59464J91581
$$ 11921780 12066953 12182150 12276667 12389887 12543266 12707632 12844249 12968187 13127651 13319232
8661A3319232J60778J05647J13194J78549K05714J57957J14469J41655J91827
$$ 13319232 13480010 13585657 13698851 13877400 14083114 14241071 14355540 14497195 14689022
8652A4689022J87714J43074J28302J56030J73350J52566J28018J39665J81346
$$ 14689022 14876736 15019810 15148112 15304142 15477492 15630058 15758076 15897741 16079087
8643A6079087K13051K04387J65413J41018J62033K01153K04867J70570J49137
$$ 16079087 16292138 16496525 16661938 16802956 16964989 17166142 17371009 17541579 17690716
8634A7690716J60817J63358J29487R8225J07006J25655J11373Q3504Q2709R4499
$$ 17690716 17851533 18014891 18144378 18242603 18349609 18475264 18586637 18670141 18752850 18847349
8624A8847349Q0888N7322O6603R8688J09209J00496J09174J26305J10477P5040
$$ 18847349 18928237 18985559 19052162 19150850 19260059 19360555 19469729 19596034 19706511 19781551
8614A9781551P7345J16633J29411R9736Q4386J04084J03125N8633L8522Q9037
$$ 19781551 19858896 19975529 20104940 20204676 20289062 20393146 20496271 20554904 20593426 20682463
8604B0682463J43965J23326O1209M9845R8470J35306J26407J09186J15529J35675
$$ 20682463 20826428 20949754 21010963 21060808 21159278 21294584 21420991 21530177 21645706 21781381
8594B1781381J60640J96780K31667K40091K30575K37113K60530K67775K55410
$$ 21781381 21942021 22138801 22370468 22610559 22841134 23078247 23338777 23606552 23861962
8585B3861962K62354L06032L52634L68983L63994L61391L68297L87508M24349
$$ 23861962 24124316 24430348 24782982 25151965 25515959 25877350 26245647 26633155 27057504
8576B7057504M63581M75651M64737M72883N14289N46118N36004N18987N43477
$$ 27057504 27521085 27996736 28461473 28934356 29448645 29994763 30530767 31049754 31593231
8567C1593231N90716O01166N66155N38034N47962N64117N46910N06323M81366
$$ 31593231 32183947 32785113 33351268 33889302 34437264 35001381 35548291 36054614 36535980
8558C6535980M88345N11609N28888N27530N08648M90406M95793N24125N47461
$$ 36535980 37024325 37535934 38064822 38592352 39101000 39591406 40087199 40611324 41158785
8549D1158785N48587N45615N58419N67879N40986M89145M61105M69213M62795
$$ 41158785 41707372 42252987 42811406 43379285 43920271 44409416 44870521 45339734 45802529
8540D5802529M00153L15397K75309K86640K90718K49592J93840J69517J74013
$$ 45802529 46202682 46518079 46793388 47080028 47370746 47620338 47814178 47983695 48157708
8531D8157708J73105J59270J58899J86876K23711K45255K55362K74635L04238
$$ 48157708 48330813 48490083 48648982 48835858 49059569 49304824 49560186 49834821 50139059
8522E0139059L17987K98704K71938K81689L27742L54248L24115K80830K94483
$$ 50139059 50457046 50755750 51027688 51309377 51637119 51991367 52315482 52596312 52890795
8513E2890795L57837L92186L65575L43969L91604M75050N20132N25348N51778
$$ 52890795 53248632 53640818 54006393 54350362 54741966 55217016 55737148 56262496 56814274
8504E6814274O18889O81931P15638P53922Q26192R08626R68449J015384J076432
$$ 56814274 57433163 58115094 58830732 59584654 60410846 61319472 62287921 63303305 64379737
8495F4379737J149945J217810J282537J361487J455897J549728J632036J704029
$$ 64379737 65529682 66747492 68030029 69391516 70847413 72397141 74029177 75733206
8487G5733206J772034J845789J934457K033651K124413K191210K232846K256826
$$ 75733206 77505240 79351029 81285486 83319137 85443550 87634760 89867606 92124432
8479I2124432K276750K309861K355596K383149K369848K344559K352666K382626
$$ 92124432 94401182 96711043 99066639 101449788 103819636 106164195 108516861 110899487
8471A10899487K382371K355110K371425K458770K547925K577577K590366K659457
$$ 110899487 113281858 115636968 118008393 120467163 123015088 125592665 128183031 130842488
8463A30842488K768918K844868K872502K898234K932470K935088K896302K852687
$$ 130842488 133611406 136456274 139328776 142227010 145159480 148094568 150990870 153843557
8455A53843557K815026K753022K661624K570377K475330K339643K180958K073873
$$ 153843557 156658583 159411605 162073229 164643606 167118936 169458579 171639537 173713410
8447A73713410K031648J970139J838786J706076J647933J624027J549292J432848
$$ 173713410 175745058 177715197 179553983 181260059 182907992 184532019 186081311 187514159
8439A87514159J351214J318071J276302J201856J122607J039540R21080P85016
$$ 187514159 188865373 190183444 191459746 192661602 193784209 194823749 195744829 196529845
8431A96529845O99920O83308O74160O32188N90939N77744N51458M69690L63193
$$ 196529845 197229765 197913073 198587233 199219421 199810360 200388104 200939562 201409252 201772445
8422B01772445K88606K46065J96280J31113P8223N3267M6912M4136K6599k3113
$$ 201772445 202061051 202307116 202503396 202634509 202712732 202765999 202812911 202857047 202883646 202860533
8412B02860533r0149j24576j00001m7570L81O4758J72883K91599L68220M18576
$$ 202860533 202770384 202645808 202545807 202498237 202498618 202563376 202736259 203027858 203396078 203814654
8402B03814654N09608O61823Q33970J007699J223735J519797J889524K320801
$$ 203814654 204324262 204986085 205820055 206827754 208051489 209571286 211460810 213781611
8394B13781611K818605L363321L897761M389687M864043N336445N753671O042393
$$ 213781611 216600216 219963537 223861298 228250985 233115028 238451473 244205144 250247537
8386B50247537O185558O204020O084174N773059N239462M502931L607862K603281
$$ 250247537 256433095 262637115 268721289 274494348 279733810 284236741 287844603 290447884
8378B90447884J546685M97547m97168j394317k138888k679595k998122l109387
$$ 290447884 291994569 292492116 291994948 290600631 288461743 285782148 282784026 279674639
8370B79674639l043272k841049k553670k221656j866949j516433j209101r62349
$$ 279674639 276631367 273790318 271236648 269014992 267148043 265631610 264422509 263460160
8362B63460160p68009o56116p25360j058438j632186k363398l212639m170938
$$ 263460160 262692151 262036035 261310675 260252237 258620051 256256653 253044014 248873076
8354B48873076n166052o075543o841969p491232q022432q372430q524461q558542
$$ 248873076 243707024 237631481 230789512 223298280 215275848 206903418 198378957 189820415
8346A89820415q533449q394423q067672p583625p033044o458649n873093n333019
$$ 189820415 181286966 172892543 164824871 157241246 150208202 143749553 137876460 132543441
8338A32543441m895940m531405m169312l816646l532482l305568l064107k805690
$$ 132543441 127647501 123116096 118946784 115130138 111597656 108292088 105227981 102422291
8330A02422291k605246k477345k342955k167620k023606j961859j923003j843293
$$ 102422291 99817045 97339700 94996745 92829125 90805519 88843660 86920657 85077364
8322H5077364j758173j719656j690608j615242j530357j503832j510665j477420
$$ 85077364 83319191 81599535 79908927 78293685 76763328 75259496 73748831 72271411
8314G2271411j415600j397253j414600j381917j283519j206797j200661j202371
$$ 72271411 70855811 69458558 68043958 66662041 65378522 64171725 62971064 61768693
8306F1768693j147969j068735j024503j010993r90655r61036r36914r07778q65145
$$ 61768693 60620724 59551989 58527486 57516493 56525838 55564802 54627888 53720110 52854965
8297E2854965q36096q41783q54838q43481q26768q39051q66557q67306q33994
$$ 52854965 52018869 51177086 50322248 49478767 48651999 47812948 46946391 46079085 45245091
8288D5245091p93362p61782p41869p41917p56280p48692p01410o58188o64946
$$ 45245091 44451729 43689947 42948078 42206161 41449881 40701189 39999779 39341591 38676645
8279C8676645o88084o56238n73879n21545n35412n57369n29672m76697m53394
$$ 38676645 37988561 37332323 36758444 36236899 35701487 35144118 34614446 34137749 33684355
8270C3684355m60269m56533m28455l99644l87396l84369l77152l58604l28945
$$ 33684355 33224086 32767553 32339098 31939454 31552058 31167689 30790537 30431933 30102988
8261C0102988l02742l03000l29782l47675l25529k78079k46489k45730k54068
$$ 30102988 29800246 29497246 29167464 28819789 28494260 28216181 27969692 27723962 27469894
8252B7469894k50363k38415k31117k28785k21664k05104j85229j71008j63033
$$ 27469894 27219531 26981116 26749999 26521214 26299550 26094446 25909217 25738209 25575176
8243B5575176j52964j37200j25355j24558j21031r6471o2130n0967o7954p6390
$$ 25575176 25422212 25285012 25159657 25035099 24914068 24817597 24755467 24704500 24636546 24560156
8233B4560156n1420j9840j8354l4445k7376L702J8091L025j818L0778O6764O2849
$$ 24560156 24508736 24488896 24470542 24436097 24408721 24412423 24430514 24433539 24431721 24462499 24529263 24592112
8221B4592112L9931N6862J18686J62637J49824J24438J47525K05500K34721K22252
$$ 24592112 24632043 24688905 24807591 24970228 25120052 25244490 25392015 25597515 25832236 26054488
8211B6054488K22777K66229L07256K98200K63953K56328K68293K51410J99301
$$ 26054488 26277265 26543494 26850750 27148950 27412903 27669231 27937524 28188934 28388235
8202B8388235J51369J19216P3422R863l5307n4149q6818j45253j80009j63643
$$ 28388235 28539604 28658820 28732242 28742105 28706798 28652649 28565831 28420578 28240569 28076926
8192B8076926j47030j77955k16123j97394j42998j27120j58723j76227j53041
$$ 28076926 27929896 27751941 27535818 27338424 27195426 27068306 26909583 26733356 26580315
8183B6580315j30623j40323j63782j85733k21143k69657l01921l13981l41504
$$ 26580315 26449692 26309369 26145587 25959854 25738711 25469054 25167133 24853152 24511648
8174B4511648l97257m47252m71646m94010n23681n28125m97488m77564m94524
$$ 24511648 24114391 23667139 23195493 22701483 22177802 21649677 21152189 20674625 20180101
8165B0180101n02792m60321m03788l87519l93015l68803l24189l07678l16930
$$ 20180101 19677309 19216988 18813200 18425681 18032666 17663863 17339674 17031996 16715066
8156A6715066l07970k79144k67748k69838k43185j93456j77751k07865k26058
$$ 16715066 16407096 16127952 15860204 15590366 15347181 15153725 14975974 14768109 14542051
8147A4542051k00472j72458j77206j85431j65450j42617j47889j57973j40013
$$ 14542051 14341579 14169121 13991915 13806484 13641034 13498417 13350528 13192555 13052542
8138A3052542j14401j17983j37532j35498j16271j11251j17524j07646q7620q8468
$$ 13052542 12938141 12820158 12682626 12547128 12430857 12319606 12202082 12094436 12006816 11918348
8128A1918348j05508j01981p5566o6583q8902j04410q6878o5091p2061q8642p6614
$$ 11918348 11812840 11710859 11635293 11568710 11479808 11375398 11288520 11223429 11151368 11062726 10986112
8117A0986112m4089l4239n6198o9854m9139k4707l7815p3391p6648l5081l328
$$ 10986112 10942023 10907784 10851586 10781732 10732593 10707886 10670071 10596680 10520032 10484951 10481623
8106A0481623k5514o6621o1060j0615J7880p565m2216m1271k5241l1997m6571
$$ 10481623 10456109 10389488 10328428 10317813 10335693 10328128 10285912 10244641 10219400 10187403 10140832
8095A0140832k9648R934K5465M712j7646j8031r844q127q407p691j1680j4491
$$ 10140832 10111184 10121118 10146583 10151295 10133649 10115618 10105774 10097647 10089240 10081549 10069869 10055378
8083A0055378k978J4101J4079J291L322K0088J7602j2987l1039m800L9937N7387
$$ 10055378 10052400 10066501 10080580 10081871 10085193 10105281 10122883 10109896 10078857 10074057 10113994 10171381
8071A0171381M1241J8451N572N01K435J2446K2212K2555J6512J1302Q202R915
$$ 10171381 10212622 10231073 10236645 10237146 10239581 10252027 10274239 10296794 10313306 10324608 10332810 10342725
8059A0342725K1547L4256K8931Q718L661K6089M7250M0104J9871J5435K4315K7060
$$ 10342725 10364272 10398528 10427459 10436177 10439838 10465927 10513177 10553281 10573152 10588587 10612902 10639962
8047A0639962K5621L2906M0728L3659K1366K1340K3186R572J47K6759O9750P2208
$$ 10639962 10665583 10698489 10739217 10772876 10794242 10815582 10838768 10848340 10848487 10875246 10944996 11017204
8035A1017204K6111p319J6460O4153P8635N7684M2290N0383O1675N9013N0124
$$ 11017204 11043315 11035996 11052456 11116609 11195244 11252928 11295218 11345601 11407276 11466289 11516413
8024A1516413M6667M7773N1434O3399Q3464R3923P7231M5465L6552O8042J05098
$$ 11516413 11563080 11610853 11662287 11725686 11809150 11903073 11980304 12025769 12062321 12130363 12235461
8013A2235461R9318N9076M6683Q9721J32661J12882N5487M0189Q6764J32145J26419
$$ 12235461 12334779 12393855 12440538 12530259 12662920 12775802 12831289 12871478 12958242 13090387 13216806
8002A3216806R4344Q1918R2113J03625J13062J23640J22411J03197Q8549R7705
$$ 13216806 13311150 13393068 13485181 13588806 13701868 13825508 13947919 14051116 14139665 14237370
7992A4237370J14162J14768J08462J14527J24837J23603J24189J45620J68417
$$ 14237370 14351532 14466300 14574762 14689289 14814126 14937729 15061918 15207538 15375955
7983A5375955J58854J27988J19422J40370J52985J40619J34374J56394J79403
$$ 15375955 15534809 15662797 15782219 15922589 16075574 16216193 16350567 16506961 16686364
7974A6686364J70377J42744J33129J46242J54934J45985J36854J45547J64909
$$ 16686364 16856741 16999485 17132614 17278856 17433790 17579775 17716629 17862176 18027085
7965A8027085J74884J69591J62388J65032J70758J67082J61568J76317K09544
$$ 18027085 18201969 18371560 18533948 18698980 18869738 19036820 19198388 19374705 19584249
7956A9584249K24373J96764J57839J58529K00051K33356K28057K06576K00876
$$ 19584249 19808622 20005386 20163225 20321754 20521805 20755161 20983218 21189794 21390670
7947B1390670K09007K12802K11760K16254K25179K32128K40798K55113K64788
$$ 21390670 21599677 21812479 22024239 22240493 22465672 22697800 22938598 23193711 23458499
7938B3458499K59143K47432K48966K67942K90518L02457L00925K95023K99908
$$ 23458499 23717642 23965074 24214040 24481982 24772500 25074957 25375882 25670905 25970813
7929B5970813L20997L41139L39337L25991L36054L76845M10861M10310L99959
$$ 25970813 26291810 26632949 26972286 27298277 27634331 28011176 28422037 28832347 29232306
7920B9232306M15233M43173M46915M33166M45481M91804N28697N28877N18314
$$ 29232306 29647539 30090712 30537627 30970793 31416274 31908078 32436775 32965652 33483966
7911C3483966N25807N38378N37147N40790N72227O07150O03048N68286N54476
$$ 33483966 34009773 34548151 35085298 35626088 36198315 36805465 37408513 37976799 38531275
7902C8531275N78796N98898N77105N29172M87823M51866M01636L41617K93759
$$ 38531275 39110071 39708969 40286074 40815246 41303069 41754935 42156571 42498188 42791947
7893D2791947K60533K25414J83655J44657J08767O9747L6224J9922M448l8577
$$ 42791947 43052480 43277894 43461549 43606206 43714973 43784720 43820944 43840866 43845314 43806737
7883D3806737r8974j33097j28957j22210j28471j09349m2418K1083K2578j2779
$$ 43806737 43707763 43574666 43445709 43323499 43195028 43085679 43043261 43064344 43086922 43074143
7873D3074143j5045K0561L4376Q053p664J3501K6062o781m8055m8304k2032j1715
$$ 43074143 43059098 43079659 43114035 43122088 43114424 43127925 43153987 43147206 43099151 43050847 43028815 43017100
7861D3017100j5156m375J1974L082k4362l5887k8966l2196n0300n8758n1379m6411
$$ 43017100 43001944 42997569 43009543 43012625 42988263 42952376 42923410 42891214 42840914 42782156 42730777 42684366
7849D2684366m5079l0780j1917j6941m0016m2222k0003k0968o9457j25796j50706
$$ 42684366 42639287 42608507 42596590 42579649 42539633 42497411 42477408 42456440 42386983 42261187 42110481
7838D2110481j64866k02850k44429k43383k04978j82474j99994k24616k23020
$$ 42110481 41945615 41742765 41498336 41254953 41049975 40867501 40667507 40442891 40219871
7829D0219871k08342k12460k36168k50313k38286k18060k18805k48195k92857
$$ 40219871 40011529 39799069 39562901 39312588 39074302 38856242 38637437 38389242 38096385
7820C8096385l43716m01340m53290m71693m51689m29897m36018m45004m16017
$$ 38096385 37752669 37351329 36898039 36426346 35974657 35544760 35108742 34663738 34247721
7811C4247721l64940l47404l71433l84431l59433l35311l44448l57050l38390
$$ 34247721 33882781 33535377 33163944 32779513 32420080 32084769 31740321 31383271 31044881
7802C1044881l13239l22232l50610l54771l33217l17163l11705l00286k90392
$$ 31044881 30731642 30409410 30058800 29704029 29370812 29053649 28741944 28441658 28151266
7793B8151266k99542l10044k94682k74834k90093l18413k98813k37127k10852
$$ 28151266 27851724 27541680 27246998 26972164 26682071 26363658 26064845 25827718 25616866
7784B5616866k47803k76687k37935j76365j68322k07244k25918k03076j84961
$$ 25616866 25369063 25092376 24854441 24678076 24509754 24302510 24076592 23873516 23688555
7775B3688555k10597k67083l19710l47314l43616l13277k74727k50560k49683
$$ 23688555 23477958 23210875 22891165 22543851 22200235 21886958 21612231 21361671 21111988
7766B1111988k62362k67057k43674j97391j67673j85970k23863k22278j78941
$$ 21111988 20849626 20582569 20338895 20141504 19973831 19787861 19563998 19341720 19162779
7757A9162779j56059j81082j98819j61911j11144j06148j24788j07999p2104q7938
$$ 19162779 19006720 18825638 18626819 18464908 18353764 18247616 18122828 18014829 17942725 17854787
7747A7854787j58757k08333k00100j84547k04215k28010k17405j92725j87229
$$ 17854787 17696030 17487697 17287597 17103050 16898835 16670825 16453420 16260695 16073466
7738A6073466j86898j65309j38741j37325j51185j51038j39048j36835j42808
$$ 16073466 15886568 15721259 15582518 15445193 15294008 15142970 15003922 14867087 14724279
7729A4724279j41580j38941j48645j58538j47212j23539j14721j23823j30757
$$ 14724279 14582699 14443758 14295113 14136575 13989363 13865824 13751103 13627280 13496523
7720A3496523j26909j19371j10252r9386r6189j02540r9720q0352p1493r1062
$$ 13496523 13369614 13250243 13139991 13040605 12944416 12841876 12742156 12661804 12590311 12499249
7710A2499249j06022p9617l8083l4180n9815o0245l0661k7052p0995j14992j25247
$$ 12499249 12393227 12313610 12275527 12241347 12181532 12121287 12090626 12063574 11992579 11877587 11752340
7699A1752340j31004j57932j75952j57456j31915j31627j31645j00460o8302q0499
$$ 11752340 11621336 11463404 11287452 11129996 10998081 10866454 10734809 10634349 10566047 10485548
7689A0485548j14699j14035q2704p7115j09751j32108j17590r6528r5570j00127
$$ 10485548 10370849 10256814 10174110 10096995 9987244 9855136 9737546 9641018 9545448 9445321
7679I445321r5761r5286j02496r4908o7302n1738o8126r0817r0631p7287p3238
$$ 9445321 9349560 9254274 9151778 9056870 8989568 8937830 8869704 8778887 8688256 8610969 8537731
7668H537731p5550p2012o8545p2510p2109n9492n2321o5659q2928q1577o8378
$$ 8537731 8462181 8390169 8321624 8249114 8177005 8117513 8065192 7999533 7916605 7835028 7766650
7657G766650o2867o4101o0722n6834o1316o6626o2406n4806n1400m6677m2276
$$ 7766650 7703783 7639682 7578960 7522126 7460810 7394184 7331778 7276972 7225572 7178895 7136619
7646G136619n4557p8480p8132m5426k9292o1853r5048p0977k1980k4895p4911
$$ 7136619 7082062 7003582 6925450 6880024 6850732 6788879 6693831 6622854 6600874 6575979 6501068
7635F501068r0969m7054j0435k9432o4287o4156m2871l5510l8342l7168m5051
$$ 6501068 6410099 6363045 6352610 6323178 6258891 6194735 6151864 6116354 6078012 6040844 5995793
7624E995793o6588o9864l9205j3741k7338n0550m1037j3914j0558l1090m8949
$$ 5995793 5929205 5859341 5820136 5806395 5779057 5728507 5687470 5673556 5662998 5631908 5582959
7613E582959n9777o5106m4623j448N970n3479j07574p1750J2889L0015l6265q2364
$$ 5582959 5523182 5458076 5413453 5412005 5417975 5364496 5256922 5185172 5198061 5228076 5191811 5109447
7601E109447n0399n064j3566m6709n0231l3738k9671k8666j5098j2726l7176n1573
$$ 5109447 5059048 5053984 5040418 4993709 4943478 4909740 4880069 4851403 4836305 4823579 4786403 4734830
7589D734830k6863j176j9017n3127n1644k7043k7400m5428l1514J3501L0430q966
$$ 4734830 4707967 4706791 4687774 4634647 4583003 4555960 4528560 4483132 4451618 4465119 4495549 4486583
7577D486583o2385p6393m3812J965J8139j5109o4087o4015o289L0704j1249p2236
$$ 4486583 4424198 4347805 4303993 4305958 4324097 4308988 4244901 4180886 4174597 4205301 4194052 4121816
7565D121816n8201Q937K2555l7370p3639l0833K2576J4460k4404l4657k8125m0921
$$ 4121816 4063615 4072552 4095107 4057737 3984098 3953265 3975841 3990301 3965897 3931240 3903115 3862194
7553C862194n2265k8747L24q832l0539j4781J5497j458n3476o5071j9210J6201
$$ 3862194 3809929 3781182 3781506 3772674 3742135 3727354 3742851 3741393 3687917 3622846 3603636 3619837
7541C619837l620m1327m8800l1819j5452j194J0354J504k6259l8089j7415M370
$$ 3619837 3616217 3574890 3526090 3494271 3478819 3477625 3487979 3489483 3463224 3425135 3407720 3412090
7529C412090k344k0944k2815j3097j1485j6290j7959k1760k8420j9926N664J5483
$$ 3412090 3409746 3388802 3365987 3352890 3341405 3325115 3307156 3285396 3256976 3237050 3242714 3258197
7517C258197p831k8494j1847J3221k287m3811n2591j8409R011K542j0077q090
$$ 3258197 3250366 3221872 3210025 3223246 3220959 3177148 3124557 3106148 3115159 3117701 3107624 3099534
7505C099534j1355k9238l2190p840M463k2450m7855k3275K4129K8483j2190l4750
$$ 3099534 3088179 3058941 3026751 3018911 3023374 3000924 2953069 2929794 2953923 2982406 2970216 2935466
7493B935466j1275J3014j208k6941k1904K647O367j2668j9681l188P762q800l4376
$$ 2935466 2924191 2937205 2935997 2909056 2887152 2889799 2896166 2883498 2863817 2860629 2868391 2859591 2825215
7480B825215l6950j2197J5274K1417M042j9271k8369j8962n542k677o701m589
$$ 2825215 2788265 2776068 2791342 2812759 2816801 2797530 2769161 2750199 2744657 2741980 2735279 2730690
7468B730690K419j163j8542k9754j7153Q767K1642J1845n318j2169q223m843p977
$$ 2730690 2733109 2731946 2713404 2683650 2666497 2675264 2696906 2708751 2703433 2691264 2683041 2678198 2670221
7455B670221j0919l116J4717K6072J5014j1383k6165j4730N549R587k09j214J0998
$$ 2670221 2659302 2656186 2670903 2696975 2711989 2700606 2674441 2659711 2665260 2674847 2674638 2673424 2684422
7442B684422J5573K742p888o55O798p662k7526j6365K2908M2419J4114k9285l8485
$$ 2684422 2699995 2702737 2694849 2694194 2700992 2693330 2665804 2649439 2672347 2714766 2728880 2699595 2661110
7429B661110j1144J4602J6560Q936R700J6013J8426J7166J4370P120j614j24J2646
$$ 2661110 2649966 2664568 2681128 2690064 2699764 2715777 2734203 2751369 2765739 2772859 2771245 2771121 2783767
7416B783767J9125Q296l512N450K8297L7598K4624R734J0357J7994J7065J2033
$$ 2783767 2802892 2811188 2807676 2813126 2841423 2879021 2903645 2913379 2923736 2941730 2958795 2970828
7404B970828J9860M0570N1299L4600L849r199P909L2024L2441R701n803N634K8471
$$ 2970828 2990688 3031258 3082557 3117157 3121006 3111807 3119716 3151740 3184181 3193882 3188079 3193713 3222184
7391C222184L5379K2604Q989Q017J5825K3508K6978K4905J8446J3394J3987J6637
$$ 3222184 3257563 3280167 3289156 3297173 3312998 3336506 3363484 3388389 3406835 3420229 3434216 3450853
7379C450853J7432J9585K3310J8378K157n989R509K9747K4965L133p0J9630K6739
$$ 3450853 3468285 3487870 3511180 3529558 3531715 3525726 3535235 3564982 3589947 3593080 3593010 3612640 3639379
7366C639379P133m898J7104M7366N0314L4396K7630K7754J8357J2045L1188O0108
$$ 3639379 3646512 3641614 3658718 3706084 3756398 3790794 3818424 3846178 3864535 3876580 3907768 3967876
7354C967876O3863M6189M1216N2560N1300L5039L5165N6690O5219M9818M4610
$$ 3967876 4031739 4077928 4119144 4171704 4223004 4258043 4293208 4349898 4415117 4464935 4509545
7343D509545O4372P3569N2682M0619O4823P9464L4949k9393l6277O719J5930l6952
$$ 4509545 4573917 4647486 4700168 4740787 4805610 4885074 4920023 4890630 4854353 4861072 4877002 4840050
7331D840050q3290o9560l7389m8078q3968q3636m2286j4690k7593m5306l1380
$$ 4840050 4756760 4687200 4649811 4601733 4517765 4434129 4391843 4377153 4349560 4304254 4272874
7320D272874q64R913k396r550M142K1651J9218n9p572J5519N0754O0053L2911
$$ 4272874 4272010 4281923 4279527 4269977 4274119 4295770 4314988 4314929 4307357 4322876 4373630 4433683 4466594
7307D466594L256Q200M0462O0453N1312L7104M0396M8268L9456K4254K7421M1574
$$ 4466594 4469850 4478050 4518512 4578965 4630277 4667381 4707777 4756045 4795501 4819755 4847176 4888750
7295D888750L3510j51k0305m086J6864L565l0994m5361l5113l2817m8808n7250
$$ 4888750 4922260 4922109 4901804 4897718 4914582 4918147 4887153 4841792 4806679 4773862 4725054 4667804
7283D667804m7647m6509o9941r2168q6028o4174n2389m8407l8421l1716m3432
$$ 4667804 4620157 4573648 4503707 4411539 4325511 4261337 4208948 4160541 4122120 4090404 4046972
7272D046972n9000n2718l1080k1272k4281j7891k559k893j9974k3527k674J3989
$$ 4046972 3987972 3935254 3904174 3882902 3858621 3840730 3838171 3835278 3815304 3791777 3789103 3803092
7260C803092N748p944m289N026m94j1960q923K561O44j5001k6115k9791m0943
$$ 3803092 3808840 3800896 3796607 3801633 3801139 3789179 3780256 3782817 3783461 3768460 3742345 3712554 3671611
7247C671611o2063p6279p4128o5573o0421n6037n1456n5584p0201p9396p0464
$$ 3671611 3609548 3533269 3459141 3393568 3333147 3277110 3225654 3170070 3099869 3020473 2950009
7236B950009n5648n5906o7273o3739l7958j8544l1287n8613o2150l9052k5209
$$ 2950009 2894361 2838455 2771182 2707443 2669485 2650941 2619654 2561041 2498891 2459839 2434630
7225B434630l8254n0949l8207j9312k4456m3408m3921k5781j6669k1989k0460
$$ 2434630 2396376 2345427 2307220 2287908 2263452 2220044 2176123 2150342 2133673 2111684 2091224
7214B091224q602p811k1954k8163j8715j3334j9241j9026j1276k0311m7186n5223
$$ 2091224 2082622 2074811 2052857 2024694 2005979 1992645 1973404 1954378 1943102 1922791 1875605 1820382
7202A820382k8741k921o556j9060j7584j9971l8407l7941L296L4691J255o0533
$$ 1820382 1791641 1788720 1782164 1763104 1745520 1725549 1687142 1649201 1652497 1687188 1688443 1627910
7190A627910o9459k1976J0919p0j2584l621o029l2344m0305r522J4795k848k7237
$$ 1627910 1558451 1536475 1547394 1547324 1534740 1531119 1525090 1492746 1452441 1442919 1457714 1454866 1427629
7177A427629j4888J1349L757l0349m4748k7252p102l557r352j6377k2742k0888
$$ 1427629 1412741 1424090 1427847 1397498 1352750 1325498 1318396 1314839 1305487 1289110 1266368 1245480
7165A245480o126R927J4460J0190J970j3592k9229k4414j902M025j8530l1743
$$ 1245480 1239354 1249281 1263741 1273931 1275901 1262309 1233080 1208666 1206764 1210789 1192259 1160516
7153A160516q268J7159J134l4154l4072J800K3165Q518j4121k1784j9600j0173
$$ 1160516 1152248 1169407 1170541 1136387 1102315 1104115 1127280 1135798 1121677 1099893 1080293 1070120
7141A070120R800K1122J34l2546l2513m476J102k6519l7105m156K8783J8910j1569
$$ 1070120 1079920 1101042 1101176 1068630 1036117 1031641 1032743 1006224 969119 964963 993746 1012656 1001087
7128A001087k1286j4454j5386j6603j309J1497m935l1860k9056P11J7807Q385
$$ 1001087 979801 965347 949961 933358 932049 943546 938611 906751 877695 878406 896213 904598
7116I04598l724m535o137j3188j3003n278o070j4531r754R528J5720k974k0102
$$ 904598 900874 896339 890202 877014 864011 858733 852663 838132 828378 837906 853626 850652 830550
7103H30550j2320M355L284r861j0386L220Q815l095j7220j8145p630M497J0609
$$ 830550 818230 822585 825869 816008 805622 808842 817657 814562 797342 779197 771567 776064 786673
7090G86673M621j3225k7933k1955j166P643n998j8384o145J6014J4855j1043k7264
$$ 786673 791294 778069 750136 728181 727015 734658 728660 710276 704131 720145 735000 723957 696693
7077F96693j2980J1075J5275O43j0996j0925q124r009j0735r895m212P857J7350
$$ 696693 683713 694788 710063 710706 699710 688785 680661 671652 660917 651022 646810 654667 672017
7064F72017O541k2910l7923j4405K2099K7002P32j4569k505N465j2292k9089j4876
$$ 672017 678558 655648 617725 603320 625419 652421 653153 638584 636079 641544 629252 600163 585287
7051E85287J3039J7921M81q775k613m835k4026l3078q911K8254L5300J013l5889
$$ 585287 598326 616247 616728 607953 605340 600505 576479 543401 534490 562744 598044 599057 563168
7038E63168l1297R553L7286K1052j3641k4260q954K233m09l29L615p455k9027
$$ 563168 531871 541424 578710 599762 586121 561861 552907 555140 554731 554402 558017 550562 521535
7025E21535k8765n80J8703P387p330L4R702k291j6875o800J2197Q712j0416j6349
$$ 521535 492770 492190 510893 518280 510950 510984 520686 518395 501520 494720 506917 515629 505213 488864
7011D88864o779K445J1302K0417R095k5880m0156m791L2353J3530l0058k5473
$$ 488864 482085 484530 495832 516249 525344 499464 459308 454517 486870 500400 470342 444869
6999D44869J7718K3593j6534k9326Q896L0352j254k6267J379L1312Q850k8609
$$ 444869 462587 486180 469646 440320 449216 479568 478314 452047 453426 484738 493588 464979
6987D64979k2473N083R03k0309j1434J3460O514k1564j9861J0978K4359J2130
$$ 464979 442506 447589 448492 428183 416749 430209 436723 415159 395298 406276 430635 442765
6975D42765P791J4595M331j7500j7424j917p697k5842j0997L0177L8499J789k3705
$$ 442765 450556 465151 469482 451982 434558 432641 424944 399102 388105 418282 456781 458570 434865
6962D34865j0057L033q344r631J4410J7510k2188m5781n914M4699K9570l1502
$$ 434865 424808 427841 419497 409866 424276 441786 419598 373817 367903 412602 442172 410670
6950D10670n5152j8823K2337K9105J8647J2011J896j7126l1101k9967j7301M243
$$ 410670 355518 336695 359032 388137 406784 418795 420691 403565 372464 342497 325196 329439
6938C29439K8709L4511R239k0013j6775R729J7827j583j5140n294M717l359j0986
$$ 329439 358148 392659 401898 381885 365110 374839 392666 391083 375943 370649 375366 372007 361021
6925C61021K140K0534J4954j4865m0071l6899q685K0062K5535O881j2331j1680
$$ 361021 363161 383695 398649 383784 343713 306814 298129 318191 343726 350607 338276 326596
6913C26596J931Q988P181P401P445m198j9652j5554Q459K2388Q333j3560j6624
$$ 326596 328527 337515 344696 352097 359542 355344 335692 320138 328597 350985 359318 345758 329134
6900C29134m743Q38l254k361P593J1921M77j4779j4029L336J5646P195q455o530
$$ 329134 324391 325229 321975 319614 327207 339128 339605 324826 310797 314133 329779 336974 328519 321989
6886C21989J0433J3002r432k7289j3258J4946K0637J640j3145j0590l005L723
$$ 321989 332422 345424 335992 308703 295445 310391 331028 332668 319523 308933 305928 309651
6874C09651J5198K1820N088k2998k5119M036K2316J260l0255k8524M548L0305
$$ 309651 324849 346669 351757 328759 303640 307676 329992 331252 300997 272473 277021 307326
6862C07326K4851j769k4593k4292j676J6587M320k3757k4459R533L2661J4516
$$ 307326 332177 330408 305815 281523 279847 296434 300754 276997 252538 262071 294732 309248
6850C09248j3735j3241K22p277k1328o127K2780J7267j7766k4088J5121M3907
$$ 309248 295513 282272 282494 275217 253889 247762 270542 287809 270043 245955 261076 304983
6838C04983K0251k1490k8890o844O078K583L126Q794K466j1855j0368R114J8541
$$ 304983 325234 303744 274854 268010 274088 276671 279797 288591 291057 279202 268834 277948 296489
6825B96489q98l1803m0791j5067K3733L7816J1171k7312l2004J665K8486J6423
$$ 296489 295591 263788 222997 207930 231663 269479 280650 253338 221334 222999 251485 267908
6813B67908p644k191K2130K0661j1409l0866j6246J458l887q513J6114M4655K8834
$$ 267908 260264 258073 280203 300864 289455 258589 242343 243801 239914 231401 247515 292170 321004
6800C21004k5490n7274l2128J1922J8906j0662k7409m804K6603K4631o725k5713
$$ 321004 295514 238240 206112 218034 236940 226278 198869 194065 220668 245299 238574 212861
6788B12861j1561J0686J1502n22J219J4223J1504r256j6869J982J6332j064k7461
$$ 212861 201300 211986 223488 222966 224185 238408 249912 240656 223787 225769 242101 241037 213576
6775B13576k4278K198J3147kp177O253J8865J4954P315M350o827k5297k3351M759
$$ 213576 189298 191496 204643 204641 197464 203717 222582 237536 244851 249201 242374 217077 193726 198485
6761A98485J9286m588k8786j0008K5883K3361j0825k0868J958Q561j5876k3412
$$ 198485 217771 213183 184397 174389 200272 223633 212808 191940 193898 202459 186583 163171
6749A63171Q330L0071M405k6486j1382K2066J5565j9484k2711J2183K8819K241
$$ 163171 171501 201572 205977 179491 168109 190175 205740 186256 163545 175728 204547 206788
6737B06788k5965j9411L604J2335Q056L774j403o286o6J0452K76k7742l2221O326
$$ 206788 180823 161412 165016 177351 185407 189181 187778 181492 181426 191878 192154 164412 132191 138517
6723A38517M7605M4271N194k5221k7865j6620m370N091M505o817j1050K672J3945
$$ 138517 186122 230393 235587 210366 182501 165881 161511 166602 171107 164290 153240 155912 169857
6710A69857J427j6866q744J6969K0798l923j9848n475J2779N394j5160j7648O50
$$ 169857 171284 154418 145674 162643 183441 179518 159670 154195 166974 172368 157208 139560 140210
6697A40210J4526Q482o333j0091K779J8266J6690m646k4097k0050k42Q518J47
$$ 140210 154736 163218 156885 146794 149573 167839 184529 179883 155786 135736 135494 144012 144159
6684A44159j987J5677L0403J4643j9757l2923j0516J6509J3667j1662k2411l464
$$ 144159 142172 157849 188252 202895 183138 150215 139699 156208 169875 158213 135802 132338
6672A32338J7838J0428j5936k3116K012K8332K2384q788l0883k5353k199K0183
$$ 132338 150176 160604 144668 121552 123564 151896 174280 165492 134609 109256 107057 127240
6660A27240K8678J5608j2926l0716j5528J7619K8170J770k8714k4905R483L6596
$$ 127240 155918 171526 158600 127884 112356 129975 158145 159915 131201 106296 115779 152375
6648A52375L0857L380j7117j6370m592M37n336j1057q172k51N985Q664N264p615
$$ 152375 183232 186612 169495 153125 148533 148970 143634 132577 124405 124154 130139 138803 144067 136452
6634A36452k1031j6163P195K1685R929o809j561J4051J0118j0322j8026q219l481
$$ 136452 115421 99258 106453 128138 138067 131258 129697 143748 153866 143544 125518 117299 113818
6621A13818p866j830J3051J0451r196j0646J5082K8580N895k0410j5956J425M25
$$ 113818 105952 104122 117173 127624 118428 107782 122864 151444 157339 136929 120973 122398 122823
6608A22823q364P3J3164M054j6012j6294n5O545L648R082J4443q36k1468j4011
$$ 122823 114459 114532 127696 131750 115738 99444 99389 105934 109582 118664 133107 132271 110803 96792
6594I6792J2591J6965m656j2672N770J5811k042j9571j2629R12J37k445Q352J7120
$$ 96792 109383 126348 121692 109020 114790 130601 128559 108988 96359 97271 97408 94963 103315 120435
6580A20435N074j5519k1025j0565P90N135K644k517J643K0117K8733k84m5103
$$ 120435 125509 109990 88965 78400 79190 84325 86969 84452 86095 106212 134945 134661 89558
6567H9558m9350l986L3401K3898J527P960K2751P712j9498j5225J2647J7590p907
$$ 89558 40208 36222 69623 93521 95048 103008 125759 133471 113973 98748 111395 128985 121078
6554A21078k4406j1307J0078K0001K1429J4804o344k9123k7991m035J4322J2747
$$ 121078 96672 85365 95443 115444 136873 151677 145333 116210 88219 84184 98506 111253
6542A11253K529q030j9709k1460j122K2256J6492j0431j7468L297J4323j241j0585
$$ 111253 113782 105752 86043 64583 63461 85717 102209 91778 74310 77607 91930 90689 80104
6529H0104Q461K5179P892k0396j8672P957K2273J3392J80r978k4084l1705j2710
$$ 80104 88565 113744 121636 101240 82568 90525 112798 126190 126370 116392 92308 60603 47893
6516D7893K0198K6350l004k4426l435L1812K9568q195k6499J830L4806K2964j7842
$$ 47893 68091 94441 91437 67011 63576 95388 124956 116761 90262 92092 126898 149862 132020
6503A32020l2878j1295N221l830r003O587J0629j5847k8871J0638N7239L8326
$$ 132020 99142 87847 93068 89238 80235 86822 97451 81604 52733 63371 120610 158936
6491A58936k9752n8917j9158K5984K5171M850K651N283p174j3547N375K3080J2574
$$ 158936 129184 70267 51109 77093 102264 107114 109765 115048 107874 94327 99702 122782 135356
6478A35356n390l754R86j3066k4117p421J0641m171k7574j4490K1988L3200J6808
$$ 135356 129966 126212 127198 114132 90015 82594 93235 89064 61490 47000 68988 102188 118996
6465A18996R897J4921K722j7979p784K4471K4114j5944l6583q625K1162J0484
$$ 118996 128893 143814 146536 128557 120773 145244 169358 153414 116831 108206 129368 139852
6453A39852j5224j7426n905l258J720J8435J7106k0759n1934k8397K3120L8071
$$ 139852 124628 107202 101297 98039 99759 118194 135300 114541 62607 34210 57330 95401
6441I5401J1574l445J2036J8258p044k7169q135K3239J9973j3525l0277j0697
$$ 95401 106975 103530 115566 133824 126780 99611 91476 114715 134688 121163 90886 80189
6429H0189J3266R126j0718j2503P265J8676M268j6462j7031L92J3627J1452L60
$$ 80189 93455 102581 91863 79360 86625 105301 109569 93107 76076 76468 90095 101547 101907
6416A01907r481j0611o45R117J395j7712j8379N224J5401j0413l2749p411L6929
$$ 101907 92426 81815 81170 90287 91682 73970 55591 60815 76216 65803 33054 25643 62572
6403F2572L7296m514k8282j3218L508P057K3350M4646K2752l5825n4962r973K3518
$$ 62572 99868 95354 67072 53854 57362 64419 87769 132415 155167 119342 64380 54407 77925
6390G7925m738l3547j473M0740K0914k4367j7914J7600O930l1830j8728L3178
$$ 77925 73187 39640 38167 78907 99821 75454 57540 75140 82070 50240 31512 64690
6378F4690L1670k6611m1158J7302N3052J1194l1349o327K9998O029l6717k2063
$$ 64690 96360 69749 28591 45893 98945 110139 78790 72463 102461 108490 71773 49710
6366D9710K6974L4008k262k2015j0702j545J700J9542L3320P792l4797l8635m557
$$ 49710 76684 110692 108430 86415 75713 74168 75868 95410 128730 136522 101725 63090 58533
6353E8533J4826L972k859M773k35j7490j1593J7162K2110r668k9527o541K2497
$$ 58533 73359 77331 74472 79245 79010 61520 49927 67089 89199 79531 50004 43463 65960
6340F5960J6271o471n250J5641K0027k623k7115k8553n809K1797K8972P841j7411
$$ 65960 82231 75760 70510 86151 106178 103555 76440 47887 42078 63875 92847 100688 83277
6327H3277j6203O645J7944N581r081j1314j0536r936L267K3467K1132q752k8923
$$ 83277 67074 73719 91663 97244 88163 76849 66313 56377 59644 83111 104243 95491 66568
6314F6568j3340J5627K7130K3547J5761m618l3891l5274O545M2821K4177k0277
$$ 66568 53228 68855 95985 119532 135293 130675 96784 61510 68055 110876 135053 114776
6302A14776k5933N003J2259j7338k7738Q651M1063K1603k0107k7624j128J7806
$$ 114776 88843 93846 106105 88767 61029 69680 110743 132346 112239 84615 83487 101293
6290A01293J5794J2105J0892k068k0556k0042r80P807n169j8695j7091j1387j0443
$$ 101293 117087 129192 140084 138016 117460 97418 96438 104245 99076 80381 63290 51903 41460
6277D1460j863K0145L3929J9709q737k2939j6044j581R927J4265P300m996m276
$$ 41460 39597 59742 93671 113380 104643 81704 65660 64079 74006 88271 95571 90575 86299
6264H6299J2224J8252k477k2605r549J8610J7538j1921k4662m412J4377Q143k119
$$ 86299 98523 116775 114298 91693 82144 100754 118292 106371 81709 77297 91674 99817 97698
6251I7698K477O127k170k248J2970J1652k0108l8612p440L5904L3688k293j6358
$$ 97698 100175 106302 104132 101884 114854 126506 106398 67786 60346 96250 129938 127645 111287
6238A11287j164L239j0482r076R937R532j4539j9566Q271K6347P973j5405j2719
$$ 111287 110123 113362 102880 93804 103741 113273 98734 79168 87439 113786 121759 106354 93635
6225I3635j76K151R325L0449L5795O363k4865k3761r236j2339j8101J363K6805
$$ 93635 93459 95610 104935 135384 171179 177542 152677 128916 119680 107341 89240 90603 117408
6212A17408K0527o614j2599N207J1532k310q504K615P741k586o296Q420J9783
$$ 117408 137935 131321 118722 123929 135461 133151 124647 127262 135003 132417 126121 134541 154324
6199A54324P036j7782k7817j4441Q096K0564J6329N822J401j148j1640j7954J154
$$ 154324 161360 143578 115761 101320 109416 129980 146309 152131 153532 152384 140744 122790 123944
6186A23944L0403K6495j0668k4597Q489L1622j374l9877j4363M2156M1208j5287
$$ 123944 154347 180842 170174 145577 154066 185688 184314 144437 130074 172230 213438 198151
6174A98151l7443L953L4159M227l2102j6489J9927J9403p118j0644J3089L0443
$$ 198151 160708 164661 198820 203047 170945 154456 174383 193786 186668 176024 189113 219556
6162B19556K8654J7050m006k9694l1591K878L4548K0939j8627l1369q799J0509
$$ 219556 248210 265260 261254 231560 199969 202847 237395 258334 239707 208338 199539 210048
6150B10048O905J844J2317K3483J7697L228Q85J5767L0930K6012K188j4738o553
$$ 210048 216953 218797 231114 254597 272294 275522 276407 292174 323104 349116 351304 336566 330013
6137C30013Q800L170j2854k293L4106M9903K3643p520q799J928l088j0748L27
$$ 330013 338813 341983 329129 326836 360942 410845 434488 426968 418169 420097 417009 406261 406588
6124D06588J3073L689r793J620K3059K0456K18m174J0281J9093J7623J9663K0568
$$ 406588 419661 423350 413557 415177 438236 458692 458910 454736 465017 484110 501733 521396 541964
6111E41964O954p623j253J3122Q159o142R16K3237K8393J7635K0997L6056K8184
$$ 541964 548918 541295 540042 553164 561323 555181 556097 579334 607727 625362 646359 682415 710599
6098G10599m560k1554l698K1666K9665K6262J9650P888K244J8419L8755K9196
$$ 710599 706039 684485 680787 702453 732118 758380 778030 785918 788162 806581 845336 874532
6086H74532j078o495K1919M2908L3942J9504J7710J4772R252K3970N2088M9844
$$ 874532 873454 866959 888878 931786 965728 985232 1002942 1017714 1026966 1050936 1103024 1152868
6074A152868J0675j0985J6460N0004M4257K3181L1339N6801N6569K9351J2331
$$ 1152868 1163543 1152558 1169018 1219022 1263279 1286460 1317799 1374600 1431169 1460520 1472851
6063A472851K2782M3690N5319N1989M0194L8668O1598R0399R0400O5388N8443
$$ 1472851 1495633 1539323 1594642 1646631 1686825 1725493 1787091 1877490 1967890 2033278 2091721
6052B091721Q6157J14654J16474J05150R6390Q4867P7453R5051J23522J23772
$$ 2091721 2177878 2292532 2409006 2514156 2610546 2695413 2772866 2867917 2991439 3115211
6042C115211J07284J28415J82101J98691J70688J80031K53940L12901L28163L94418
$$ 3115211 3222495 3350910 3533011 3731702 3902390 4082421 4336361 4649262 4977425 5371843
6032E371843N46021O50719O38769O92847R83781J303548J228677O50860r4620
$$ 5371843 5917864 6568583 7207352 7900199 8883980 10187528 11416205 12067065 11972445
6023A1972445o59746j001190j197864j210337r98317p08016n40010n06251m71969
$$ 11972445 11312699 10311509 9113645 7903308 6904991 6196975 5656965 5150714 4678745
6014D678745l79508k90797k48512k25657j99367j74294j43275j02282q4114j08423
$$ 4678745 4299237 4008440 3759928 3534271 3334904 3160610 3017335 2915053 2830939 2722516
6004B722516j27962r4123m1971l7330p3554r6750r9608j09321j13070q2217m6979
$$ 2722516 2594554 2500431 2458460 2421130 2347576 2250826 2151218 2041897 1928827 1846610 1799631
5993A799631n8607r4534r0097n1587m4413p3901p5442l2094o081l0251n5755m1180
$$ 1799631 1741024 1646490 1556393 1504806 1460393 1386492 1311050 1278956 1272875 1242624 1186869 1145689
5981A145689j6918k0882l5113k9176j4178j2944j9046k0189k5073l7836m1270
$$ 1145689 1128771 1107889 1072776 1043600 1029422 1016478 997432 977243 952170 914334 873064
5970H73064k9735k2984k7063k1242l874n867l3075m3060j3255J3716l791l5468
$$ 873064 843329 820345 793282 772040 768166 762299 729224 686164 672909 686625 682834 647366
5958F47366k7592O453N544l9133o4045k5389L6380N0979R242l2879l2432q833
$$ 647366 619774 626227 631771 592638 528593 503204 539584 590563 599805 566926 534494 525661
5946E25661l617j6812j4940O054R030j9769l7811j1117K4298J3780k8538m1151
$$ 525661 522044 505232 490292 496346 505376 485607 447796 436679 460977 474757 446219 405068
5934D05068j1656J0795L14j1657j254P885n645k1364j6430l482k81J592R936Q632
$$ 405068 393412 404207 404521 392864 391610 399495 393850 372486 356056 352574 352293 353885 363821 372453
5920C72453j0269k3036j1329N918M456q727j5386j5072j1308J797J6616Q207k2188
$$ 372453 362184 339148 327819 333737 338193 329466 314080 299008 287700 289497 306113 314320 292132
5907B92132l4867j0625J4669O659j3582j0731M859L232q797n391O928L715r145
$$ 292132 257265 246640 261309 267968 254386 243655 248514 251746 242949 237558 244486 248201 239056
5894B39056p809L124Q72j1002j1084k182l591j1348o637N564N524k918j169P592
$$ 239056 231247 234371 235243 224241 213157 210975 207384 196036 189399 194963 200487 197569 196400 203992
5880B03992Q024N344R691N110k1571l9603j4502K5980K5327j1677k6716m423P323
$$ 203992 212016 217360 227051 232161 210590 170987 156485 182465 207792 196115 169399 164976 172299
5867A72299j5659l3187j0668K6203L5087J2145j9838m0565l3020N346L9348K6951
$$ 172299 156640 123453 112785 138988 174075 186220 166382 125817 92797 98143 137491 164442
5855A64442j5555k7790L117K2266j163k3662l431L0430K9618J156j6805j5990
$$ 164442 148887 121097 124214 146480 145317 121655 118224 148654 178272 179428 162623 146633
5843A46633j0144M06J3716P638k2909m1583k3016M204O917J056J0591J5313m860
$$ 146633 136489 136895 150611 158249 135340 93757 70741 74945 81862 82918 93509 108822 103962
5830A03962j5424J5653M3399P942n5415n7636M055M1727J6771j1611j11J0628
$$ 103962 88538 104191 147590 155532 100117 42481 46536 88263 105034 93423 93312 103940
5818A03940j5515l6774q853L1115K4374j2051j7974J0204K1993K58j8422r914
$$ 103940 88425 51651 42798 73913 98287 86236 68262 78466 100459 100717 82295 72381
5806G2381N650N921l131r075j1722j0897l312K536o018j9592j4892O868J8635
$$ 72381 78031 83952 80821 71746 60024 49127 45815 48351 42333 22741 7849 14717 33352
5793C3352J0900N107J1661Q169j7655l3478n925L9320M3000l662m1598k4473J7886
$$ 33352 44252 49359 61020 69189 51534 18056 12131 51451 94451 90789 49191 24718 42604
5780D2604K4481j0211l1894o243L3414L4425l789l2822k0814J1704K5442J0412
$$ 42604 67085 56874 24980 18737 52151 86576 82787 49965 29151 40855 66297 76709
5768G6709j2026k1662j7300o873L838R693N971l559o685J577R639M635q069j1986
$$ 76709 64683 43021 25721 18848 22686 32379 38350 34791 28106 29683 39322 43957 35888 23902
5754B3902l711L607K353J269P589J2188M209r391j2417k375P508O184n039j6208
$$ 23902 20191 23798 26151 27420 35009 47197 51406 42015 29598 27223 34731 40915 35876 19668
5740A9668j4742M817K7530K5899m378k8971j6614J4394J9511p691k8270j7933
$$ 19668 4926 9743 37273 63172 58794 29823 13209 27603 47114 39423 11153 -6780
5728f780J425L360l079K689J4363J1999j876o570L431J2400Q969J56j738M613
$$ -6780 -5355 -1995 -5074 -2385 11978 23977 22101 15531 18962 31362 40331 40487 38749 43362
5714D3362R037K103j1882j6764n232Q476P873j553m386k437o348q886K668J4907
$$ 43362 52399 54502 42620 25856 20624 29100 36973 35420 31034 28597 22249 13363 16031 30938
5700C0938O426p811L685K6492J3851l0078m4813j0571J8083O927k418K1881L4521
$$ 30938 37364 29553 33238 59730 73581 43503 -1310 -11881 6202 13129 10711 32592 67113
5687F7113l458m0622j5855L1654K4265k4590m0289j4602n52k133K0754M7758J5669
$$ 67113 63655 23033 7178 38832 63097 38507 -1782 -16384 -16936 -19069 1685 49443 65112
5674F5112n3336o0213J0937N7696K2137k4071j0942J9904P298j9905q204J8824
$$ 65112 11776 -48437 -37500 20196 42333 18262 7320 27224 34522 14617 6413 25237
5662B5237R755j9204j9113M535J2612L387j779p346j9645j4025J7425L0114j924
$$ 25237 34992 15788 -3325 1210 13822 17209 15430 8084 -11561 -25586 -8161 21953 20029
5649B0029k8467k285L4991K1108k0496k5814l86M530q265J547K2006R728j8941
$$ 20029 -8438 -10723 24268 45376 24880 -934 -1320 3210 -5055 -3508 18498 28226 9285
5636I285j1806J9018J5651j7965k4055K92L050j5650k040L8194L4774j9078m1887
$$ 9285 -2521 16497 32148 14183 -9872 -9580 -6530 -22180 -24220 13974 48748 29670 -12217
5623a2217J4L5768J2782k1480j3721P714R11j0652P613L0701K0090r718k4107
$$ -12217 -12203 23565 36347 14867 1146 8860 9771 -881 6732 37433 57523 47805 23698
5610B3698k2236j4772M469K7377K3920j574m922J7271J2146k9518m0516P385M2585
$$ 23698 1462 -13310 -8841 18536 42456 40882 35960 53231 65377 35859 -4657 2728 45313
5597D5313J1558k8682j3392J7285N01k8892n350M0508L4433q034j4809J1089Q181
$$ 45313 56871 28189 14797 32082 32583 3691 -1659 38849 73282 65248 50439 61528 69709
5584F9709k0403j6847J3231Q359k8247k9573J0771K6820K400o224J3792O583l4908
$$ 69709 49306 32459 45690 54049 25802 -3771 7000 33820 36220 29996 43788 50371 15463
5571A5463l9286J4240M5495O553l4860j1943K9941J7289k7743l2824N084K7522
$$ 15463 -23823 -9583 35912 42465 7605 -4338 25603 42892 15149 -17675 -12591 14931
5559A4931J1538j1165j4015l27J7395K3894N484k3549k6445J03J3471n467j7878
$$ 14931 26469 15304 1289 962 18357 42251 47735 24186 -2259 -2156 11315 5848 -12030
5546a2030L728K3437N056k1625j2905J2248Q519j6012j9200O91J1292Q355J2569
$$ -12030 -8302 15135 20191 -1434 -14339 -2091 6428 -9584 -28784 -28093 -16801 -8446 4123
5533D123J8274K873k2130k3909m871M987M216J5034K8201J0792k8028l6553L35
$$ 4123 22397 25270 3140 -20769 -25640 -20653 -16437 -1403 26798 37590 9562 -26991 -26656
5520b6656L2429J6114k5473l9514j2237K3433L2171J0764j3399j1730J1946K2796
$$ -26656 5773 21887 -3586 -43100 -55337 -31904 267 11031 -2368 -14098 -2152 20644
5508B0644J100k6021k0254J2011K8013Q652j8661k0358K625K0743R719k2864m0122
$$ 20644 21744 -4277 -24531 -12520 15493 24145 5484 -14874 -12249 8494 18213 -4651 -44773
5495d4773j4763L0446M2570Q510k4981j9813R34j4j1433k503J5656J1021p254
$$ -44773 -59536 -29090 13480 21990 -2991 -22804 -21870 -21884 -33317 -35820 -20164 -9143 -16397
5482a6397m683J3647J2272p683j0538O177P201j1783j2832J3235K4406j914k9694
$$ -16397 -21080 -7433 4839 -2844 -13382 -7205 -4 -11787 -24619 -11384 13022 11108 -18586
5469a8586k2569N037K2049K3824J5199q236l4190k8948J1039L9197K1879j2620
$$ -18586 -41155 -36118 -14069 9755 24954 16718 -17472 -46420 -35381 3816 25695 13075
5457A3075k0241l682O561M725N114O715o52j0281r898n222o218o117J582M428
$$ 13075 -7166 -10848 -4287 438 5552 12267 11615 1334 -8564 -13786 -20004 -26121 -24539 -20111
5443b0111m856o743J3045L0012J3846k0199k9598o415J4460Q520p754o308J3795
$$ -20111 -24967 -31710 -18665 11347 25193 4994 -24604 -31019 -16559 -8039 -15793 -22101 -8306
5430h306K7278J4566j2936k3623p000P151q962l1838j7106K4620L3557n588l2612
$$ -8306 18972 33538 20602 -3021 -10021 -2870 -11832 -43670 -60776 -36156 -2599 -8187 -40799
5417d0799m135L6987K9424j4003l5074j8138O201J9879K4554J1252k1300l6544
$$ -40799 -44934 -7947 21477 7474 -27600 -45738 -39537 -19658 4896 16148 -5152 -41696
5405d1696n817L2691K2596j8074k2720J3352K6511n066k6043j511K6248J4870
$$ -41696 -47513 -14822 7774 -10300 -33020 -19668 6843 1777 -24266 -25777 471 15341
5393A5341j0801j3353p192j7168k1761N125L3170J7619k2767l0260L361L0565
$$ 15341 4540 -8813 -16005 -33173 -54934 -49809 -16639 980 -21787 -52047 -48686 -18121
5381a8121K4817Q479J062p660k0172j4418J3069K6143Q74l0960k5083P598J6834
$$ -18121 6696 15175 16237 8577 -11595 -26013 -12944 13199 14073 -16887 -41970 -34372 -17538
5368a7538r368k5956j631L0823K4507q793j8284M840J6171n263k1018n31K2263
$$ -17538 -26906 -52862 -54493 -23670 837 -7956 -26240 -21400 -5229 -10492 -31510 -32041 -9778
5355i778M097l0434k4384J6771L0527j691k3539N986M7413M1656m079l3047j9186
$$ -9778 -5681 -36115 -60499 -43728 -13201 -14892 -38431 -32445 14968 56624 52545 19498 312
5342C12Q303J2208j0111l1074k4492N615K4563O524k6386k7380R473L7509K2997
$$ 312 8615 20823 10712 -20362 -44854 -39239 -14676 -8152 -34538 -61918 -52445 -14936 8061
5329H061j0261k2034j0458J313P089J3765J4565J52j5512j1928L169N248o349
$$ 8061 -2200 -24234 -34692 -33379 -26290 -12525 2040 2192 -13320 -25248 -22079 -16831 -23180
5316b3180q243P509K0321J2072q482j8709q476J0080J4961j048j8124j2447R181
$$ -23180 -31423 -23914 -3593 8479 -3 -18712 -27188 -17108 -2147 -3195 -21319 -33766 -24585
5303b4585J6995L084p652N3R152N490K776R876P039j5053k5485p09K7530J7148
$$ -24585 -7590 -4506 -12158 -12105 -2953 2537 5313 15189 22228 7175 -18310 -19019 8511 25659
5289B5659j5499k2766l335L428r402q900J1139J5502q891k7799j6028O545J4404
$$ 25659 10160 -12606 -15941 -12513 -21915 -30815 -19676 -4174 -13065 -40864 -56892 -50347 -35943
5276c5943J1217O815k328j1536m409J2189Q972j2466j1874K0800L7448P196k7308
$$ -35943 -24726 -17911 -20239 -31775 -36184 -23995 -15023 -27489 -39363 -18563 18885 26081 -1227
5263a227j5772J7484J4620k0074k9805Q89K5918J5410m100l029O472K631p644
$$ -1227 -16999 485 15105 -4969 -34774 -33885 -7967 7443 3343 314 6786 9417 1773
5250A773r741j0605j8428j6902Q259L3339K2211j7351l7237j4370J7339J5500
$$ 1773 -7968 -18573 -37001 -53903 -45644 -12305 9906 -7445 -44682 -59052 -41713 -26213
5238b6213j3122k6188n022K5012L2520J6450j939p506k286J971m307j6832j7011
$$ -26213 -39335 -65523 -70545 -45533 -13013 3437 1498 -6008 -8294 -6323 -10630 -27462 -44473
5225d4473M579K5972J6284j6661k9584o213J5537J873k2527j3811K0798L5095
$$ -44473 -39894 -13922 2362 -14299 -43883 -50096 -34559 -32686 -55213 -69024 -48226 -13131
5213a3131J4088j1236j5533n740L718O834j922j8224j6883J2930L3338O714l2622
$$ -13131 957 -10279 -25812 -31552 -27834 -21000 -22922 -41146 -58029 -45099 -11761 -5047 -37669
5200c7669j8600L7194N1524q40m4190k2028J8532J4590j1015m247K0286J2836
$$ -37669 -56269 -19075 32449 31609 -12581 -34609 -16077 -1487 -12502 -16749 3537 16373
5188A6373j6533j7553Q140J2403j2467k4634q237P769Q431J0450J7020J0531n416
$$ 16373 -160 -17713 -9573 2830 -9637 -34271 -42508 -34739 -26308 -15858 1162 11693 6277
5175F277r020o438k0425l4117q669L8416M2150o612l7314p889L1009K1250j3560
$$ 6277 -2743 -9181 -29606 -63723 -72392 -33976 8174 1562 -35752 -43641 -12632 8618 -4942
5162d942j7863M088P789r552r008J8497L4682J2143k8267m6952k8875Q125L3389
$$ -4942 -22805 -18717 -10928 -20480 -29488 -10991 23691 35834 7567 -39385 -68260 -60135 -26746
$$ [...]
##END NTUPLES=NMR SPECTRUM
##END=
