##TITLE=1H ikalashn
EC-3333(V-2)
22.10.2024
##JCAMPDX= 6.0         $$ Bruker NMR JCAMP-DX V2.0
##DATA TYPE= NMR SPECTRUM
##DATA CLASS= NTUPLES
##ORIGIN= UXNMR, Bruker Analytische Messtechnik GmbH
##OWNER= root
$$ TOPSPIN		Version 1.3
$$ 2024-10-22 10:16:19.937 +0400  Irina@DPX200
$$ Compression mode = diff/dup
##.OBSERVE FREQUENCY= 200.131300845
##.OBSERVE NUCLEUS= ^1H
##.ACQUISITION MODE= SIMULTANEOUS
##.ACQUISITION SCHEME= undefined
##.AVERAGES= 16
##.DIGITISER RES= 18
##SPECTROMETER/DATA SYSTEM= spect
##.PULSE SEQUENCE= zg
##.SOLVENT NAME= D2O
##.SHIFT REFERENCE= INTERNAL, D2O, 1, 17.49637
##AUDIT TRAIL= $$ (NUMBER, WHEN, WHO, WHERE, WHAT)
$$ ##TITLE= Audit trail, TOPSPIN		Version 1.3
$$ ##JCAMPDX= 5.01
$$ ##ORIGIN= Bruker BioSpin GmbH
$$ ##OWNER= Irina
$$ $$ F:/spectra/data/iren/nmr/1H/4/pdata/1/auditp.txt
$$ ##AUDIT TRAIL=  $$ (NUMBER, WHEN, WHO, WHERE, VERSION, WHAT)
(   1,<2024-10-22 10:15:34.718 +0400>,<Irina>,<DPX200>,<TOPSPIN 1.3>,
      <created by zg
	started at 2024-10-22 10:14:26.484 +0400,
	POWCHK disabled, PULCHK disabled
       configuration hash MD5:
       BE 6D 3F 07 2A EA 11 49 91 17 2B D3 AF B3 58 0D
       data hash MD5: 16K
       D9 BD E4 87 D5 A7 DE C8 C2 3F CC 57 FE F5 70 5B>)
(   2,<2024-10-22 10:16:05.625 +0400>,<Irina>,<DPX200>,<TOPSPIN 1.3>,
      <Start of raw data processing
       fp BC_mod = 2 FT_mod = 6 PKNL = 1 PHC0 = -40.87199 PHC1 = 5.966891 SI = 32K 
       data hash MD5: 32K
       BF 7E 7F C6 BA 32 02 0D 98 E7 55 F8 B0 8B 57 DF>)
(   3,<2024-10-22 10:16:11.781 +0400>,<Irina>,<DPX200>,<TOPSPIN 1.3>,
      <abs n ABSG = 5 
       data hash MD5: 32K
       1E 4B F8 43 EA 1F B2 91 D1 27 07 D3 9E 2C 09 FB>)
$$ ##END=
$$ 
$$ $$ hash MD5
$$ $$ 08 13 AA 33 72 2E 87 42 55 FB E5 B8 82 30 7C 90
##$RELAX= 
##$RELAX= 
##$RELAX= 
##$RELAX= 
##$RELAX= 
##$RELAX= 
##$RELAX= 
##$RELAX= 
##$RELAX= 
$$ Bruker specific parameters
$$ --------------------------
##$DU= <F:/spectra>
##$EXPNO= 4
##$NAME= <1H>
##$PROCNO= 1
##$TYPE= <nmr>
##$USER= <iren>
##$AMP= (0..31)
100 100 100 100 100 100 100 100 100 100 100 100 100 100 100 100 100 100 
100 100 100 100 100 100 100 100 100 100 100 100 100 100 
##$ANAVPT= -1
##$AQSEQ= 0
##$AQ_mod= 1
##$AUNM= <au_zg>
##$AUTOPOS= <>
##$BF1= 200.13
##$BF2= 200.13
##$BF3= 200.13
##$BF4= 200.13
##$BF5= 200.13
##$BF6= 200.13
##$BF7= 200.13
##$BF8= 200.13
##$BYTORDA= 1
##$CFDGTYP= 0
##$CFRGTYP= 5
##$CHEMSTR= <none>
##$CNST= (0..63)
1 1 145 1 1 1 1 1 1 1 1 1 1 1 1 1 1 1 1 1 1 1 1 1 1 1 1 1 1 1 1 1 1 1 
1 1 1 1 1 1 1 1 1 1 1 1 1 1 1 1 1 1 1 1 1 1 1 1 1 1 1 1 1 1 
##$CPDPRG= <>
##$CPDPRG1= <>
##$CPDPRG2= <>
##$CPDPRG3= <>
##$CPDPRG4= <mlev>
##$CPDPRG5= <mlev>
##$CPDPRG6= <mlev>
##$CPDPRG7= <mlev>
##$CPDPRG8= <mlev>
##$CPDPRGB= <>
##$CPDPRGT= <>
##$D= (0..63)
0 2 0 0 0 0 0 0 0 0.06 0 0.03 0 0 0 0 0.0002 0 0 0 0 0 0 0 0 0 0 0 0 0 
0 0 0 0 0 0 0 0 0 0 0 0 0 0 0 0 0 0 0 0 0 0 0 0 0 0 0 0 0 0 0 0 0 0 
##$DATE= 1729577731
##$DBL= (0..7)
120 120 120 120 120 120 120 120 
##$DBP= (0..7)
$$ [...]
##$SW_h= 4401.40845070422
##$TD= 16384
##$TD0= 1
##$TE= 300
##$TE2= 300
##$TE3= 300
##$TEG= 300
##$TL= (0..7)
0 120 120 120 120 120 120 120 
##$TP= (0..7)
150 150 150 150 150 150 150 150 
##$TP07= 0
##$TPNAME0= <>
##$TPNAME1= <>
##$TPNAME2= <>
##$TPNAME3= <>
##$TPNAME4= <>
##$TPNAME5= <>
##$TPNAME6= <>
##$TPNAME7= <>
##$TPOAL= (0..7)
0.5 0.5 0.5 0.5 0.5 0.5 0.5 0.5 
##$TPOFFS= (0..7)
0 0 0 0 0 0 0 0 
##$TUNHIN= 0
##$TUNHOUT= 0
##$TUNXOUT= 0
##$USERA1= <user>
##$USERA2= <user>
##$USERA3= <user>
##$USERA4= <user>
##$USERA5= <user>
##$V9= 5
##$VALIST= <valist>
##$VCLIST= <CCCCCCCCCCCCCCC>
##$VD= 0
##$VDLIST= <DDDDDDDDDDDDDDD>
##$VPLIST= <PPPPPPPPPPPPPPP>
##$VTLIST= <TTTTTTTTTTTTTTT>
##$WBST= 1024
##$WBSW= 25
##$XGAIN= (0..3)
0 0 0 0 
##$XL= 0
##$YL= 0
##$YMAX_a= 561096
##$YMIN_a= -924741
##$ZGOPTNS= <>
##$ZL1= 120
##$ZL2= 120
##$ZL3= 120
##$ZL4= 120
##$ABSF1= 17.49637
##$ABSF2= -4.496376
##$ABSG= 5
##$ABSL= 3
##$ALPHA= 0
##$AQORDER= 0
##$ASSFAC= 0
##$ASSFACI= 0
##$ASSFACX= 0
##$ASSWID= 0
##$AUNMP= <proc_1d>
##$AXLEFT= 0
##$AXRIGHT= 0
##$AXTYPE= 0
##$AXUNIT= <>
##$AZFE= 0.1
##$AZFW= 0.1
##$BCFW= 0
##$BC_mod= 2
##$BYTORDP= 0
##$COROFFS= 0
##$CY= 7568.61572265625
##$DATMOD= 1
##$DC= 0
##$DFILT= <>
##$DTYPP= 0
##$F1P= 17.9538593292236
##$F2P= -4.03888763876832
##$FCOR= 0.5
##$FTSIZE= 32768
##$FT_mod= 6
##$GAMMA= 0
##$GB= 0
##$INTBC= 0
##$INTSCL= 1.936888e-010
##$ISEN= 128
##$LB= 0
##$LEV0= 0
##$LPBIN= 0
##$MAXI= 945.577
##$MC2= 0
##$MEAN= 0
##$ME_mod= 0
##$MI= -402.1523
##$NCOEF= 0
##$NC_proc= -5
##$NLEV= 6
##$NOISF1= 8.587773
##$NOISF2= 6.764455
##$NSP= 0
##$NTH_PI= 0
##$NZP= 0
##$OFFSET= 17.49637
##$PC= 1
##$PHC0= -40.87199
##$PHC1= 5.966891
##$PH_mod= 1
##$PKNL= yes
##$PPARMOD= 0
##$PPDIAG= 0
##$PPIPTYP= 0
##$PPMPNUM= 100
##$PPRESOL= 1
##$PSCAL= 0
##$PSIGN= 0
##$REVERSE= no
##$SF= 200.13
##$SI= 32768
##$SIGF1= 16.12182
##$SIGF2= -4.496377
##$SINO= 3.521527
##$SIOLD= 32768
##$SREGLST= <1H.CDCl3>
##$SSB= 0
##$STSI= 32768
##$STSR= 0
##$SW_p= 4401.40845070422
##$SYMM= 0
##$S_DEV= 0
##$TDeff= 16384
##$TDoff= 0
##$TI= <>
##$TILT= no
##$TM1= 0
##$TM2= 0
##$TOPLEV= 0
##$USERP1= <user>
##$USERP2= <user>
##$USERP3= <user>
##$USERP4= <user>
##$USERP5= <user>
##$WDW= 0
##$XDIM= 32768
##$YMAX_p= 324998036
##$YMIN_p= -229537
$$ End of Bruker specific parameters
$$ ---------------------------------
##NTUPLES= NMR SPECTRUM
##VAR_NAME=  FREQUENCY,     SPECTRUM/REAL,   SPECTRUM/IMAG
##SYMBOL=    X,             R,               I
##VAR_TYPE=  INDEPENDENT,   DEPENDENT,       DEPENDENT
##VAR_FORM=  AFFN,          ASDF,            ASDF
##VAR_DIM=   32768,         32768,           32768
##UNITS=     HZ,            ARBITRARY UNITS, ARBITRARY UNITS
##FACTOR=    0.134324425510551, 1,           1
##FIRST=     4401.40845070422, 45271,        -581110
##LAST=      0,             -12313,          -703837
##MIN=       0,             -229537,         0
##MAX=       4401.40845070422, 324998036,    0
$$ Real data points
##PAGE= N=1
##DATA TABLE= (X++(R..R)), XYDATA
$$ [...]
13798c905l242L1233K3978J7031L1393R969n7695p4901M372P1001K5696n2007
13786B2923k9900N9704P4365j0858p5610m5363J9182L9549J9193l617j8352k2873
13774B8343m143K9102M0223J6269j0915j3006j227K121k226k974k150p139j1229
13761F1049O47K6577L9081J4225k8647l7331M686M3719K5863k0583k7683K165
13749A03768L636l2351l6604J5253N1486K5652k027K4474N0200P476n1079l3135
13737A26749K9124K4311m9537p3940K655Q8031Q9267L0377j5613k6396j5504J1060
13725B20584L6202K6679j4274l8662k4428j16J8910M9604P5068M3931k7245m3912
13713C22341J8059N1212j5712q4643l6307O7807P6644m027k4211N2997Q2710j9056
$$ plain form
13798 -3905 -7147 24086 48064 65095 96488 106457 48762 -26139 -21767 49234 74930 22923
13786 22923 -6977 52727 127092 116234 40624 -4739 14443 53992 73185 69568 51216 28343
13774 28343 24200 53302 93525 109794 98879 85873 84646 86767 84541 81567 79417 72278 61049
13761 61049 61696 88273 127354 141579 112932 75601 80287 124006 149869 129286 101603 103768
13749 103768 107404 75053 38449 53702 105188 130840 128813 153287 203487 210963 159884 126749
13737 126749 155873 180184 130647 56707 59362 147393 236660 267037 251424 225028 209524 220584
13725 220584 256786 283465 269191 230529 206101 205985 224895 274499 349567 393498 366253 322341
13713 322341 340400 391612 375900 291257 254950 322757 399401 395374 371163 424160 506870 487814
13701D87814j22051p4677O5523J23196N7553j1668k758L3754L1524R379J4658
13690F12247M1333N1855L3835l35l3461l9234J905N9837P1463K5723j5566j1872
13678G97730k978k8434m7239q013M7365L9359j5969k8121J7791L6230j2982n5230
13666G39509k3247L8078N0334J5734j3750k3864k5915p392L3252M8031J1440j3838
13654H28372L0174Q1814M5230l9447m1528M6009Q1467K291o3852P87J11582J09225
13642A192124J854n8389q278N4402M1705m115p021K0281J8503j2931k6417j2709
13630A199009q506k5091k9710p678P287j2152l9871l5392m529J4729J1146N638
13618A074880M210j1271l8946m5762j8195J1358J1851l505o630J930O598O906
$$ plain form
13701 487814 365763 291086 356609 479805 537358 525690 522932 556686 588210 597589 612247
13690 612247 653580 705435 739270 738935 705474 666240 668145 727982 799445 825168 809602 797730
13678 797730 794752 766318 719079 711066 758431 797790 781821 753700 771491 807721 794739 739509
13666 739509 716262 754340 804674 820408 806658 782794 756879 749487 782739 830770 842210 828372
13654 828372 858546 940360 985590 946143 904615 950624 1032091 1034382 970530 971317 1082899 1192124
13642 1192124 1193978 1135589 1127311 1181713 1223418 1219303 1212282 1232563 1251066 1238135 1211718 1199009
13630 1199009 1190503 1165412 1135702 1128024 1135311 1123159 1083288 1047896 1043367 1058096 1069242 1074880
13618 1074880 1079090 1067819 1028873 983111 964916 976274 988125 984620 977990 979920 986518 993424
13606I93424N220p991k7112k2172Q458J4975k7500o0671k4272M0167M5326o350
13594I31502l3182j0706J270k2543k8754Q697L2569R84l8060k7588R752K2535
13582H46476J2384N934m250l0951m7304k7123O999K4759L5673M8128L0842k7434
13570H74133o8400m1106J3213K2886m621r052J7169K8400J2431K456J0405J3282
13558H71196J475j2150k1925k4639o103K6230L1170j374k0126J829J3138j7799
13546H40922k7262K8931O6638M355p1989l3320O0713M3965o9460r6732P78M7245
13534G94784l8751r5099J726J12257O3519o1211o5749L8224P0585j5170p9784
13523G25331l9187K7900L7408J1919n033k3249m7427m0496Q786N2551N2119K3928
$$ plain form
13606 993424 998644 990653 963541 941369 949827 964802 937302 876631 852359 892526 937852 931502
13594 931502 898320 887614 888884 866341 837587 846284 878853 879837 841777 814189 823941 846476
13582 846476 858860 864794 860544 829593 782289 755166 762165 786924 822597 870725 901567 874133
13570 874133 805733 764627 777840 800726 796105 787053 804222 832622 845053 847509 857914 871196
13558 871196 872671 860521 838596 813957 807854 834084 865254 863880 843754 845583 858721 840922
13546 840922 813660 842591 909229 913584 841595 808275 868988 912953 843493 746761 747539 794784
13534 794784 756033 660934 662660 774917 838436 777225 711476 749700 820285 805115 725331
13523 725331 686144 714044 751452 763371 758338 735089 687662 647166 655952 708503 760622 784550
13511G84550q68j0720o61K3170K7519o031l3921o224M6690N4927K1438J0673L4182
13498I44724M0065J7904J5835L9344L3935n322r698L6908N0167j4963p1318k9051
13486A048530N7443O9836K920m2757k2467K529j5714l4669k329M9585N0945L156
13474A167008j5973L5379R2882O5236l7620j07875p9157p895J7679r86j124K6849
13462A154403L1346k139k4047o075J5317N955j3124r856Q523J7973J2122p465
13450A182933l7966n6528l6632K587R493k3390m6607l2487r705j513O692J4672
13438I71549o812m5183l7442K3622N4487R638l6730j2937K6679j516n8837m8844
13426H37674J2873K6080j7353k2303L6076O3708R775m5358k4802K6234L2384J3880
$$ plain form
13511 784550 783682 772962 772301 795471 822990 816959 783038 776814 823504 878431 899869 910542 944724
13498 944724 984789 1002693 1018528 1057872 1091807 1086485 1076787 1113695 1163862 1148899 1077581 1048530
13486 1048530 1105973 1175809 1178729 1135972 1113505 1116034 1100320 1065651 1063322 1112907 1163852 1167008
13474 1167008 1151035 1186414 1279296 1344532 1306912 1199037 1119880 1111985 1129664 1128678 1127554 1154403
13462 1154403 1185749 1183610 1159563 1153488 1168805 1174760 1161636 1151780 1160303 1178276 1190398 1182933
13450 1182933 1144967 1088439 1051807 1054394 1063887 1040497 993890 961403 951698 950185 956877 971549
13438 971549 964737 919554 882112 905734 960221 969859 933129 920192 946871 945355 886518 837674
13426 837674 850547 876627 859274 836971 873047 936755 946530 901172 876370 902604 934988 948868
13414I48868L0696O1780L8040l4430p5961n1364q176R547J7403M0829O3886N8909
13402A100027L2366J1077M112L308N885J3043J7057J2723J4120L4943N5196L7493
13390A341350j5432m9181k4010K9940N0786K3019j2955k0065n61K4291L8619L5427
13378A421228K4043L0620O0656P1902K8925k5136j2631O0300J01328O5717J4311
13367A841263L480R61k9882m2254J1986P4173N5459j5987l2889K1599N1817M692
13355A944418n5780n7404j6499J4362K6229L5772L6854J3184k9333o8110p9771
13344A763922m7682J2737M2945N182m8342l3298L9411O9762J6417m3983l8185
13333A738886K945J5581M552R359K2914J6009O183K9750O4743N0869j5526o4191
$$ plain form
13414 948868 979564 1041344 1079384 1044954 968993 917629 909453 919000 936403 977232 1041118 1100027
13402 1100027 1132393 1143470 1147582 1150890 1156775 1169818 1186875 1199598 1213718 1248661 1303857 1341350
13390 1341350 1325918 1276737 1252727 1282667 1333453 1356472 1343517 1323452 1322891 1347182 1385801 1421228
13378 1421228 1445271 1475891 1536547 1608449 1637374 1612238 1599607 1659907 1761235 1826952 1841263
13367 1841263 1844743 1845704 1815822 1773568 1785554 1859727 1915186 1899199 1866310 1887909 1939726 1944418
13355 1944418 1888638 1831234 1814735 1829097 1855326 1891098 1927952 1941136 1911803 1843693 1763922
13344 1763922 1716240 1728977 1771922 1777104 1728762 1695464 1734875 1804637 1821054 1777071 1738886
13333 1738886 1741831 1757412 1761964 1771323 1794237 1810246 1816429 1846179 1910922 1961791 1946265 1882074
13321A882074m0862K5299O1314L6084r976j7271K1755N7211M9852J8273k060j3561
13309B068132k9211k3718K5014O9329M5606j7238l2710K956J0994j8324K15P9010
13297B180055R7605o422j05429n6812P8902J27744N2476k4232j9367K1532L8567
13286B384619M3549O3005P9578O5058K3285j6236j8547L0685Q9683Q5994J7276
13275B847949k4805J3210N6250K3895k5618J0102R1410Q6045j4691p5200k2744
13264B965803N9628P8240M7147K0291R146J1475L3610M9289J9982k1318L23O9511
13252C343127Q6014K9547j548L9941O8766K2930k0851K3072J06678J33150R9477
13241C930303N9359K2657j1266M244Q2165J29540O7662l0119l5024M6607R7211
$$ plain form
13321 1882074 1841212 1866511 1927825 1963909 1953933 1936662 1958417 2015628 2065480 2083753 2081693 2068132
13309 2068132 2038921 2015203 2040217 2109546 2155152 2137914 2105204 2108160 2119154 2100830 2101045 2180055
13297 2180055 2277660 2271238 2165809 2108997 2187899 2315643 2368119 2343887 2324520 2346052 2384619
13286 2384619 2428168 2491173 2570751 2635809 2659094 2642858 2624311 2654996 2744679 2830673 2847949
13275 2847949 2823144 2836354 2892604 2916499 2890881 2900983 2992393 3078438 3063747 2988547 2965803
13264 2965803 3025431 3103671 3150818 3171109 3180255 3191730 3225340 3274629 3294611 3273293 3273616 3343127
13252 3343127 3429141 3458688 3457140 3497081 3565847 3588777 3567926 3590998 3697676 3830826 3930303
13241 3930303 3989662 4012319 4001053 4005297 4087462 4217002 4284664 4254545 4219521 4266128 4363339
13230D363339P1965L8306M2507N1604L8333K7576L7930N0212N0425M7777M4821
13219D864795L8825M7183Q3024J17369J13290Q1604N7638M6725L7874L9081N1135
13208E578543M6330K2244K3878N6914M9925k1421n5414K4151J17593Q8020j4318
13197E916445l0025M8767Q0572K7720R426P2017J02125L8835p442N1062J21229
13186F430731Q7453L659o628N2063Q4526P3191P8975J15564J38882J37334J35333
13175G331083J27339R3107N8444O3298Q9368R1836Q1784J03561J46089J49531
13165H335440R6642L7682K4088N9918J11125J29742Q8751K4106J1548O8657J21026
13154I108725J05769N9411N0198P3335Q0800P3305Q6482J14284J21674J14735
$$ plain form
13230 4363339 4435304 4473610 4516117 4567721 4606054 4633630 4671560 4721772 4772197 4819974 4864795
13219 4864795 4903620 4950803 5033827 5151196 5264486 5346090 5403728 5450453 5488327 5527408 5578543
13208 5578543 5624873 5647117 5670995 5727909 5777834 5756413 5700999 5725150 5842743 5930763 5916445
13197 5916445 5886420 5935187 6015759 6043479 6052905 6124922 6227047 6265882 6258440 6309502 6430731
13186 6430731 6518184 6521843 6515215 6567278 6651804 6724995 6803970 6919534 7058416 7195750 7331083
13175 7331083 7458422 7551529 7609973 7673271 7762639 7854475 7936259 8039820 8185909 8335440
13165 8335440 8432082 8469764 8493852 8553770 8664895 8794637 8883388 8907494 8919042 8987699 9108725
13154 9108725 9214494 9273905 9324103 9397438 9478238 9551543 9638025 9752309 9873983 9988718
13144I988718J27260J51141J47127J16845J04022J28471J67658J95551K00715
13135A1327508J83729J69792J92224K32445K27569J76710J67986K39813K99550
13126A3217326K68384K20560K57826L22274K87518J85180J65657K51004L08496
13117A5484225K82207K67599L14250L34767K82751K54349L13877L66113L20700
13108A8220838K57376K93478L87584M17855L81794L74123M15571M44769M53739
13099B1647127M97778N75192O15993O01382N94742O36144O89737P16476P29507
13090B7304078P55555P96409Q47866R15577R98676J085030J163194J221499J254614
13081C6342498J290179J372513J494332J597489J677996J817703K049492K274769
$$ plain form
13144 9988718 10115978 10267119 10414246 10531091 10635113 10763584 10931242 11126793 11327508
13135 11327508 11511237 11681029 11873253 12105698 12333267 12509977 12677963 12917776 13217326
13126 13217326 13485710 13706270 13964096 14286370 14573888 14759068 14924725 15175729 15484225
13117 15484225 15766432 16034031 16348281 16683048 16965799 17220148 17534025 17900138 18220838
13108 18220838 18478214 18771692 19159276 19577131 19958925 20333048 20748619 21193388 21647127
13099 21647127 22144905 22720097 23336090 23937472 24532214 25168358 25858095 26574571 27304078
13090 27304078 28059633 28856042 29703908 30619485 31618161 32703191 33866385 35087884 36342498
13081 36342498 37632677 39005190 40499522 42097011 43775007 45592710 47642202 49916971
13073D9916971K412880K548453K779895K970069K841019K346675J780074J433481
13065F9029517J286915J128371Q65115N82560L59115J68997k1302j58887j48203
13056G3092198M5937L58331O79315R57332J241728J587599J917004K043996J885343
13047H3808783J599056J451860J566934J844496K103680K248100K306340K367249
13039I9296498K484704K614587K645334K513083K272975K028245J809402J565558
13031A17230386J258190R04600N25796J17799k88265n86635o85743o38986o32242
13022A17204900q04116j098395j331234j393869j339452j265574j186616j077132
13014A07708512r75249r35062q90655o86390k76974K03790O29852J043125J536862
$$ plain form
13073 49916971 52329851 54878304 57658199 60628268 63469287 65815962 67596036 69029517
13065 69029517 70316432 71444803 72309918 72892478 73251593 73420590 73399288 73240401 73092198
13056 73092198 73138135 73496466 74175781 75133113 76374841 77962440 79879444 81923440 83808783
13047 83808783 85407839 86859699 88426633 90271129 92374809 94622909 96929249 99296498
13039 99296498 101781202 104395789 107041123 109554206 111827181 113855426 115664828 117230386
13031 117230386 118488576 119393176 119918972 120036771 119748506 119161871 118476128 117837142 117204900
13022 117204900 116400784 115302389 113971155 112577286 111237834 109972260 108785644 107708512
13014 107708512 106733263 105798201 104907546 104221156 103944182 104147972 104777824 105820949 107357811
13005A07357811K044759K356461K328386K007593J575827J243785J153613J271847
12997A21340082J386362J311996J097483R29366Q47636O99548L93046K8002k99658
12988A27733863o64281j152030j664048k047871k347694k735769l219566l603602
12980A10299002l765169l798511l825962l811917l655640l363518l032263k731099
12972H2314923k480484k284155k106292j876343j591721j356832j241288j160223
12964F8217585r87371p32040m99364l21971j51027J8331J48015K73992M80301
12955F6446451P38669R11686R51277R55584R71585Q84509O01656K25862q0668
12946G2606611l19413o06231r56930j267743j490334j688301j904550k086738
$$ plain form
13005 107357811 109402570 111759031 114087417 116095010 117670837 118914622 120068235 121340082
12997 121340082 122726444 124038440 125135923 126065289 126912925 127612473 128005519 128033521 127733863
12988 127733863 127069582 125917552 124253504 122205633 119857939 117122170 113902604 110299002
12980 110299002 106533833 102735322 98909360 95097443 91441803 88078285 85046022 82314923
12972 82314923 79834439 77550284 75443992 73567649 71975928 70619096 69377808 68217585
12964 68217585 67230214 66498174 65998810 65676839 65525812 65544143 65692158 65966150 66446451
12955 66446451 67185120 68096806 69048083 70003667 70975252 71859761 72461417 72687279 72606611
12946 72606611 72287198 71680967 70724037 69456294 67965960 66277659 64373109 62286371
12938F2286371k177963k194389k176357k129093k045880j939320j823410j703681
12930D6096278j597812j525899j473673j406453j320774j238995j158663j061063
12922C5312946r65997r15008q95296q45891p52715o73027o45197o36205o06148
12913B8377462n68298n51778n50144n38842n08856m62697m11659l86494m07544
12904B3991150m38583m22928l71379l51090l76155l82787l36605k88862k90360
12895B0732401l20139l39839l50440l51821l15506k47945k15255k51941l05790
12886A8033725l20905l07428k82423k26648j61198j70786k64953l11926k21786
12877A5765672j08032j29628k41375k63428j62965r2525j42071k17765k09748
$$ plain form
12938 62286371 60108408 57914019 55737662 53608569 51562689 49623369 47799959 46096278
12930 46096278 44498466 42972567 41498894 40092441 38771667 37532672 36374009 35312946
12922 35312946 34346949 33431941 32536645 31690754 30938039 30265012 29619815 28983610 28377462
12913 28377462 27809164 27257386 26707242 26168400 25659544 25196847 24785188 24398694 23991150
12904 23991150 23552567 23129639 22758260 22407170 22031015 21648228 21311623 21022761 20732401
12895 20732401 20412262 20072423 19721983 19370162 19054656 18806711 18591456 18339515 18033725
12886 18033725 17712820 17405392 17122969 16896321 16735123 16564337 16299384 15987458 15765672
12877 15765672 15657640 15528012 15286637 15023209 14860244 14767719 14625648 14407883 14198135
12868A4198135j42566r7623r3523j07710j34823j64806j64574j27022r0398q3348
12858A2991742r7747j23601j54386j59953j21837q7340j08708j42300j07431l3992
12848A1854447k9392r5383j17185n9667k5048o6324r5993n5171k3671o2108q5775
12837A1138730j8988N2737K7344k9237l762N4888K8665l8480n184J05223J20318
12826A1432254Q504n4122L5899J48766J37225N7956M9878J03965J03165L3476
12816A2056966N516O7182J20923P1223l1634o5038j0816K1683m3437j37948j51964
12805A1902656r7866q4932j41315j66123r4537j1846k6921j05264j26590o7279
12795A0979983k0103m0974p2677m1578L9497R6779Q7462M3711L5301Q8747J48747
$$ plain form
12868 14198135 14055569 13957946 13864423 13756713 13621890 13457084 13292510 13165488 13075090 12991742
12858 12991742 12893995 12770394 12616008 12456055 12334218 12246878 12138170 11995870 11888439 11854447
12848 11854447 11825055 11729672 11612487 11552820 11527772 11461448 11365455 11310284 11286613 11224505 11138730
12837 11138730 11119742 11172479 11199823 11170586 11166824 11221712 11250377 11211897 11206713 11311936 11432254
12826 11432254 11440758 11386636 11422535 11571301 11708526 11766482 11816360 11920325 12023490 12056966
12816 12056966 12062482 12129664 12250587 12321810 12290176 12225138 12214322 12236005 12192568 12054620 11902656
12805 11902656 11804790 11719858 11578543 11412420 11317883 11306037 11279116 11173852 11047262 10979983
12795 10979983 10959880 10918906 10846229 10804651 10844148 10940927 11028389 11072100 11107401 11196148 11344895
12784A1344895J48713J10765J14497J66813J95641J92009K35524L25453L30045
12775A3164355K04226J12748J89432L03855K54690Q8494M869J9980k5001j53870
12765A4163778k19554j90309k08843l15821l66552l00701k53619l01192l28239
12756A1678948k66977k33697k88985k93600j71605r1193j80342k73746j82578
12747I696225l0214m5124j67541j62414k4668L7779k4360m9639K1138O3473K7185
12736I341840J7832P3843R4910M8006L1614P6872Q5564K4463j3171J486k4057
12725I759202j05910j28921o7253o0115j70698k62193k28318j66372j91153k42587
12715H135682k20814j67282j65706j88804j82113j80830k09742j90102q7280k7074
$$ plain form
12784 11344895 11493608 11604373 11718870 11885683 12081324 12273333 12508857 12834310 13164355
12775 13164355 13368581 13481329 13670761 13974616 14229306 14317800 14322669 14342649 14317648 14163778
12765 14163778 13944224 13753915 13545072 13229251 12862699 12561998 12308379 12007187 11678948
12756 11678948 11411971 11178274 10889289 10595689 10424084 10332891 10152549 9878803 9696225
12747 9696225 9666011 9620887 9453346 9290932 9266264 9304043 9279683 9230044 9251182 9314655 9341840
12736 9341840 9359672 9433515 9528425 9576431 9608045 9684917 9770481 9794944 9781773 9783259 9759202
12725 9759202 9653292 9524371 9457118 9397003 9226305 8964112 8735794 8569422 8378269 8135682
12715 8135682 7914868 7747586 7581880 7393076 7210963 7030133 6820391 6630289 6543009 6515935
12705F515935j08043k13474j82700o9411m3716j15719j50403j06654p1087p9006
12695E375722p7671n8955p0814r9997q6107m6892n4297r4805q8370l8116k5694
12684D634004o2029p6259n1096l7621l8293r460K2487j1555p8592p4634j0077
12673D206875o874q5726j18225l8517N2108N5404Q495k4963n9618j01992q6907
12662C800060K522O0758Q211p7418p9158j1432K7626Q755k2240m0397n2359m8139
12650C576789j9459L755m380j9766j2965P50j124o753l829l656j243K5125M8989
12637C582233J3738n3120m7946L7630P2970p089p8784k1886P7996O3669m1795
12626C597616p9898o064O7665O5116L3879L0701M1861L8943K0876j0403m1872
$$ plain form
12705 6515935 6407892 6194418 6011718 5942307 5898591 5782872 5632469 5525815 5454728 5375722
12695 5375722 5298051 5239096 5168282 5068285 4982178 4935286 4880989 4786184 4697814 4659698 4634004
12684 4634004 4571975 4495716 4444620 4406999 4368706 4359246 4381733 4370178 4291586 4216952 4206875
12673 4206875 4200001 4114275 3996050 3957533 4009641 4065045 4073540 4048577 3988959 3886967 3800060
12662 3800060 3802582 3863340 3871551 3794133 3714975 3703543 3731169 3739924 3717684 3677287 3624928 3576789
12650 3576789 3557330 3561085 3556705 3536939 3523974 3524724 3523600 3516847 3513018 3509362 3508119 3533244 3582233
12637 3582233 3595971 3542851 3494905 3532535 3605505 3598416 3519632 3497746 3575742 3639411 3597616
12626 3597616 3517718 3511654 3579319 3644435 3678314 3709015 3750876 3789819 3810695 3800292 3758420
12615C758420l0109L3086O8771J8883l6207J1005J03202Q7868l2115q5298L960
12604C901466J02790Q3790M405j7085J5090K1289p451j6296J0216L7494M1221
12593D176929J9352k1225m8037j9691M3315O2030J2867k8990p246K9320J9902
12582D238526o295j808k745n5680r8250l7126P9058R8414q394q8570k6819Q3021
12570D173332P6786l8490r8780k5183O7179M7639l7668m6633L4871P4058N452
12559D232563o2247j7947P7714R3087K8127p781J9631M0794K7043K9103N6706
12548D516793M9362J42j3626L1149N1215J44m8099k5852K3336M0319M8730P6616
12536D750229P9389L1280j624K5866M9234J9351R644P6610J23674N6736k4993
$$ plain form
12615 3758420 3728311 3761397 3830168 3849051 3812844 3823849 3927051 4014919 3982804 3897506 3901466
12604 3901466 4004256 4088046 4092451 4075366 4090456 4111745 4104294 4087998 4098214 4135708 4176929
12593 4176929 4196281 4175056 4127019 4107328 4150643 4212673 4225540 4196550 4189304 4218624 4238526
12582 4238526 4232231 4230423 4227678 4171998 4073748 4036622 4115680 4214094 4205700 4117130 4090311 4173332
12570 4173332 4250118 4211628 4112848 4087665 4154844 4202483 4164815 4118182 4153053 4227111 4232563
12559 4232563 4170316 4152369 4230083 4323170 4351297 4343516 4363147 4403941 4430984 4460087 4516793
12548 4516793 4566155 4566297 4552671 4583820 4635035 4635179 4587080 4561228 4584564 4624883 4673613 4750229
12536 4750229 4829618 4860898 4859274 4885140 4934374 4953725 4963369 5039979 5163653 5220389 5195396
12525E195396K2984J31387J17340l421l6120O5651J29860O4570k592L3891Q5273
12514E804219N5090J7076O3611J22434Q2241q084k4886K4979L9770R402J4557
12503F200409O5434Q1076K9779k4833k9631l374J8634K7063J7306j2747l8622
12492F330494l2349o136R343J5439L0206M2847L1014M549j1385j3697l884L0365
12480F426806P3453P1100J7077o450N0341J03622N5410l5602l0012O8482J09587
12469F903814L2811l6466J3588J07237J00605l827o8591j6295Q0352J10479O1459
12458G285166J3418K7148P5054R2789P3059O6901R2856J03372P0987M7052P8745
12447H026547J22185J14221Q4708J02798J45859J34971Q5201R2944J63669J85797
$$ plain form
12525 5195396 5218380 5349767 5467107 5463686 5427566 5493217 5623077 5687647 5685055 5718946 5804219
12514 5804219 5859309 5876385 5939996 6062430 6144671 6136587 6111701 6136680 6176450 6185852 6200409
12503 6200409 6265843 6346919 6376698 6351865 6322234 6318860 6337494 6364557 6381863 6369116 6330494
12492 6330494 6298145 6292009 6301352 6316791 6346997 6389844 6420858 6425407 6414022 6400325 6396441 6426806
12480 6426806 6500259 6571359 6588436 6581986 6632327 6735949 6791359 6755757 6725745 6794227 6903814
12469 6903814 6936625 6900159 6913747 7020984 7121589 7117762 7049171 7032876 7113228 7223707 7285166
12458 7285166 7298584 7325732 7400786 7493575 7566634 7633535 7726391 7829763 7900750 7947802 8026547
12447 8026547 8148732 8262953 8347661 8450459 8596318 8731289 8816490 8909434 9073103 9258900
12437I258900J15017N6022R4982J64201J59395R9717P5073J02356J28728J29031
12427A0383422J15700R1777O6589P6893J27068J56685J32485J13363J48795J79858
12417A1592635J36938P4135R1241J67266J96523J61958J44211J72010J93117J92359
12407A3122393K08635K26974J88489J27708J58301K80467L42840K61522J48592
12398A5065921J41402K18554K77203K90453K86767K61924K16900K06520K48281
12389A7213925K60697J99161J66252K55028L64310L34233K09719J81827K86439
12380A9471591L59456L14313K68566L27835M17418M28027L88994L85218M13622
12371B2775040M34614M72229N49767O06718N93356N75769O32318P15999P44000
$$ plain form
12437 9258900 9373917 9429939 9524921 9689122 9848517 9948234 10023307 10125663 10254391 10383422
12427 10383422 10499122 10590899 10657488 10734381 10861449 11018134 11150619 11263982 11412777 11592635
12417 11592635 11729573 11803708 11894949 12062215 12258738 12420696 12564907 12736917 12930034 13122393
12407 13122393 13331028 13558002 13746491 13874199 14032500 14312967 14655807 14917329 15065921
12398 15065921 15207323 15425877 15703080 15993533 16280300 16542224 16759124 16965644 17213925
12389 17213925 17474622 17673783 17840035 18095063 18459373 18793606 19003325 19185152 19471591
12380 19471591 19831047 20145360 20413926 20741761 21159179 21587206 21976200 22361418 22775040
12371 22775040 23209654 23681883 24231650 24838368 25431724 26007493 26639811 27355810 28099810
12362B8099810P56508Q42750R62851J005969R95250J059681J206246J304049J319969
12353C7553083J379780J535505J663997J699225J782933K030563K293563K343373
12345E2282022K193204K032584J899820J643517J215887P90970N20975L38119
12337F2917098R0981k42607n73046q35326j011870j087156j071860j028727r98897
12328E6158590r39196p96445o03027m31406k91354j44194J1243J43214K59902
12319E3367327M04605N85005P71239R57642J163173J375705J563752J747190J987980
12310F3923618K295975K607264K876836L128590L374282L530613L466592L118708
12302H8322478K539246J855817J198275O26990R9612m70218j097675j694063k169597
$$ plain form
12362 28099810 28856318 29699068 30661919 31667888 32663138 33722819 34929065 36233114 37553083
12353 37553083 38932863 40468368 42132365 43831590 45614523 47645086 49938649 52282022
12345 52282022 54475226 56507810 58407630 60051147 61267034 62058004 62578979 62917098
12337 62917098 63008079 62765472 62192426 61357100 60345230 59258074 58186214 57157487 56158590
12328 56158590 55219394 54422949 53819922 53388516 53097162 52952968 52964211 53107425 53367327
12319 53367327 53771932 54356937 55128176 56085818 57248991 58624696 60188448 61935638 63923618
12310 63923618 66219593 68826857 71703693 74832283 78206565 81737178 85203770 88322478
12302 88322478 90861724 92717541 93915816 94542806 94642418 94172200 93074525 91380462 89210865
12293H9210865k532582k844223l099018l208681l115213k878822k627055k432730
12285F6472541k266049k066366j836848j642545j515313j396396j206668r57174
12277E3585182p42046o13540n09879l36482q9170J41425K79118L44558M24312
12268E2483478N74662P65168R17811R96151J033203J052521R92327P66811M03286
12259E9985418M9531j88402l59716n74893q49762j108732j308016j473556j621680
12250E2550192j719509j742410j711837j654136j570828j471217j386076j320726
12242C9973453j237561j118472j006995r49556r24243q70149p68554o55654n68226
12233C1874043n13824m84814m64533m24680l52660k80745k53596k64330k57497
$$ plain form
12293 89210865 86678283 83834060 80735042 77526361 74411148 71532326 68905271 66472541
12285 66472541 64206492 62140126 60303278 58660733 57145420 55749024 54542356 53585182
12277 53585182 52843136 52229596 51719717 51383235 51294065 51435490 51714608 52059166 52483478
12268 52483478 53058140 53823308 54741119 55737270 56770473 57822994 58815321 59582132 59985418
12259 59985418 60034949 59846547 59486831 58911938 58062176 56953444 55645428 54171872 52550192
12250 52550192 50830683 49088273 47376436 45722300 44151472 42680255 41294179 39973453
12242 39973453 38735892 37617420 36610425 35660869 34736626 33866477 33097923 32442269 31874043
12233 31874043 31360219 30875405 30410872 29986192 29633532 29352787 29099191 28834861 28577364
12224B8577364k03711j37754j07266j13313j24327j25389j23007j12151p3521
12215B7456925j1003L5399L5600J5623K8999P8616R9516M4397l9665o5138k5133
12204B7654136r22l5645o9682m5983j3819m8417j11513r7055n756M1582q129n1339
12192B7207458J1467J20940J53335J02009O4157Q8018J34338J67367J86954J81457
12182B8417500J42834J22477J76486K58815K72993K31510K42304L19697L49865
12173C0534481K93979K76457L79308M87265M67542L89647M07840N08773N55433
12164C4300725N33044N58830O56474P14832P00026P22360Q26566Q85222Q01185
12155D0699264O78455O73073P75541Q58940Q64762Q27232P75914P26341P22382
$$ plain form
12224 28577364 28373653 28235899 28128633 28015320 27890993 27765604 27642597 27530446 27456925
12215 27456925 27445922 27481321 27516921 27532544 27561543 27640159 27739675 27784072 27744407 27679269 27654136
12204 27654136 27653214 27617569 27547887 27501904 27488085 27439668 27328155 27231100 27225344 27266926 27258797 27207458
12192 27207458 27218925 27339865 27493200 27595209 27659366 27747384 27881722 28049089 28236043 28417500
12182 28417500 28560334 28682811 28859297 29118112 29391105 29622615 29864919 30184616 30534481
12173 30534481 30828460 31104917 31484225 31971490 32439032 32828679 33236519 33745292 34300725
12164 34300725 34833769 35392599 36049073 36763905 37463931 38186291 39012857 39898079 40699264
12155 40699264 41377719 42050792 42826333 43685273 44550035 45377267 46153181 46879522 47601904
12146D7601904P84886Q52726Q63866Q55014Q92533R51855R68351R67507J027999
12137E5766641J137781J206476J216817J248320J339806J436712J498546J561815
12129F6412914J664863J792569J926799K080217K253983K427144K606098K818741
12121H3983328L048703L248665L428797L649493L910694M135822M288379M416736
12113A14110617M558081M690179M806143M935370N053949N085117N036525N012984
12105A53288965N020757M890480M506067L999017L581380L275753K961809K619244
12097A84143472K343941K140264J865107J399279P45849m8116r24697j744163
12089A89920936k333238k680559k976658l383301l848591m218726m440723m557832
$$ plain form
12146 47601904 48386790 49239516 50103382 50958396 51850929 52802784 53771135 54738642 55766641
12137 55766641 56904422 58110898 59327715 60576035 61915841 63352553 64851099 66412914
12129 66412914 68077777 69870346 71797145 73877362 76131345 78558489 81164587 83983328
12121 83983328 87032031 90280696 93709493 97358986 101269680 105405502 109693881 114110617
12113 114110617 118668698 123358877 128165020 133100390 138154339 143239456 148275981 153288965
12105 153288965 158309722 163200202 167706269 171705286 175286666 178562419 181524228 184143472
12097 184143472 186487413 188627677 190492784 191892063 192637912 192589796 191665099 189920936
12089 189920936 187587698 184907139 181930481 178547180 174698589 170479863 166039140 161481308
12081A61481308m571658m426360m112474l690825l213078k704868k246292j981667
12073A34534086j978528k107915k138219j963468j690932j479205j344798j189378
12065A20641643r74964p65498n89295l83385j37463J2535o0898k96066n25647
12056A16920962o88181q35383r72391j041656j061194j124109j230264j264291
12048A08703493j196598j168640j292180j476079j553637j496248j397855j319135
12040I7803121j260420j242082j292546j363546j347656j187094r09791n70550
12032H8629436k12513J25740M14848O32736P22273N90612K12837k87494p24536
12023I0103939j011485j201043j396144j666588k016082k367760k604917k682594
$$ plain form
12081 161481308 156909650 152483290 148370816 144679991 141466913 138762045 136515753 134534086
12073 134534086 132555558 130447643 128309424 126345956 124655024 123175819 121831021 120641643
12065 120641643 119666679 118901181 118311886 117928501 117791038 117803573 117742675 117446609 116920962
12056 116920962 116232781 115397398 114425007 113383351 112322157 111198048 109967784 108703493
12048 108703493 107506895 106338255 105046075 103569996 102016359 100520111 99122256 97803121
12040 97803121 96542701 95300619 94008073 92644527 91296871 90109777 89199986 88629436
12032 88629436 88416923 88542663 88957511 89590247 90312520 90903132 91115969 90828475 90103939
12023 90103939 89092454 87891411 86495267 84828679 82812597 80444837 77839920 75157326
12015G5157326k674272k657660k598868k425467k175184j971346j859557j766120
12007E7028852j629417j483062j379957j307042j217060j099711r85520r01510
11999D7025573q41514p72314o75529n88181n65549n86325n55582m44474l52027
11990D1644078l55235l78164l19469k37596k61347l62538l93426l39713l44421
11981C8652169m51075n22008m85997m74520n91247p15014o91939n92878n95888
11972C3531603o98682p40526o68297n93892n89233n93012n48915m93777m64320
11963B8140949m33353l87663l70990l98014m08048l56936k88564k66476k89292
11954B4941613l15349l21765l02676k56568k09242k02479k27587k20402j59268
$$ plain form
12015 75157326 72483054 69825394 67226526 64801059 62625875 60654529 58794972 57028852
12007 57028852 55399435 53916373 52536416 51229374 50012314 48912603 47927083 47025573
11999 47025573 46184059 45411745 44736216 44148035 43582486 42996161 42440579 41996105 41644078
11990 41644078 41288843 40910679 40591210 40353614 40092267 39729729 39336303 38996590 38652169
11981 38652169 38201094 37679086 37193089 36718569 36127322 35412308 34720369 34127491 33531603
11972 33531603 32832921 32092395 31424098 30830206 30240973 29647961 29099046 28605269 28140949
11963 28140949 27707596 27319933 26948943 26550929 26142881 25785945 25497381 25230905 24941613
11954 24941613 24626264 24304499 24001823 23745255 23536013 23333534 23105947 22885545 22726277
11945B2726277j14932j51952k25394k39988j86229j49285j85778k54181k85460
11936B0933078k75386k72477k98245l20113l08272k87821l06219l58268l80165
11927A8126112l33511k64597k47597k85455l07537k65717j94692j62568j87798
11918A5876640k25274k23912j83458j52939j72829k21043k32839j83509j27459
11909A4153378j29808j79196k06555j81052j42688j34466j45649j43109j27137
11900A2763718j26298j49670j69331j53249j06215p1961q8015j37342j60080j25646
11890A1475911p6297p5026j20343j44775j03032l4380j8089p5654j38351j26248
11880A0563716n1645j0752n4518j10153q5531j7842k5670j15451j53033p1334
$$ plain form
11945 22726277 22611345 22459393 22233999 21994011 21807782 21658497 21472719 21218538 20933078
11936 20933078 20657692 20385215 20086970 19766857 19458585 19170764 18864545 18506277 18126112
11927 18126112 17792601 17528004 17280407 16994952 16687415 16421698 16227006 16064438 15876640
11918 15876640 15651366 15427454 15243996 15091057 14918228 14697185 14464346 14280837 14153378
11909 14153378 14023570 13844374 13637819 13456767 13314079 13179613 13033964 12890855 12763718
11900 12763718 12637420 12487750 12318419 12165170 12058955 11986994 11898979 11761637 11601557 11475911
11890 11475911 11399614 11324588 11204245 11059470 10956438 10922058 10903969 10828315 10689964 10563716
11880 10563716 10512071 10501319 10446801 10336648 10251117 10233275 10207605 10092154 9939121 9867787
11870I867787J2572k5425j24925j46773r2200p1342j00140q9658k7893j0410o5918
11859I125675j00314n9857j5345k5746m2018j5851Q779j0458l0852j4566n744
11848H813703l5474m4795P001M9276J4630m1400m3519l3564q0741j33893j05191
11837H366033l9475m6038j04527j01994m1050l8874j12260j35933n4947J8468
11827G709403j4077r1428j07320o4481l1405k7509l0970l9449n4143n1436k4117
11816G173068o557j8579l1990k5180j6926j6940l846J7978O990l6663n1823j3320
11804F976212K5140K5915K6624N6852P8445O6960O8737J07980J20878O5618K0202
11793G639563P4905J92942K76677L09957L28484L09249K13270R4776L9158K3315
$$ plain form
11870 9867787 9880359 9854934 9730009 9583236 9491036 9419694 9319554 9229896 9202003 9191593 9125675
11859 9125675 9025361 8965504 8950159 8924413 8882395 8866544 8875323 8864865 8834013 8819447 8813703
11848 8813703 8778229 8733434 8740435 8789711 8804341 8762941 8719422 8685858 8605117 8471224 8366033
11837 8366033 8326558 8280520 8175993 8073999 8032949 7994075 7881815 7745882 7690935 7709403
11827 7709403 7695326 7603898 7496578 7432097 7400692 7373183 7342213 7302764 7248621 7197185 7173068
11816 7173068 7166511 7147932 7115942 7090762 7073836 7056896 7053050 7071028 7078018 7041355 6989532 6976212
11804 6976212 7001352 7027267 7053891 7110743 7189188 7256148 7324885 7432865 7553743 7619361 7639563
11793 7639563 7714468 7907410 8184087 8494044 8822528 9131777 9345047 9439823 9478981 9502296
11783I502296l2390j03399j01004n8524j07561k46869l08491k15536j13064j46484
11773H068974k45572k50845j53489p6107p8921j13371j32827j35878j18767q1596
11763F681601o5510r6788j16081n6495K8617K3957o5509j07885m2692K8975M439
11752F216629p0014q5323l4267q60k4857o2618p1130o0482n7641o7556p8757p7452
11740E525672n7205l5503m4377p9811q8571m2804M540q053n2883n7567k6112k7577
11728E009749o7362p1636k2403r51m5661p0762q694N7437J4140r4719j28531o3513
11716D507094j0969k9084n2920l4134k0298m5902n8688k1531Q215k2838o6768
11705D152177n6161j5254n443j8346j1287m03k5781o1440n3690k0782k0521m1324
$$ plain form
11783 9502296 9469906 9366507 9265503 9206979 9099418 8852549 8544058 8328522 8215458 8068974
11773 8068974 7823402 7572557 7419068 7342961 7264040 7150669 7017842 6881964 6763197 6681601
11763 6681601 6616091 6519303 6403222 6346727 6375344 6399301 6333792 6225907 6183215 6212190 6216629
11752 6216629 6146615 6061292 6027025 6026165 6001308 5938690 5867560 5807078 5749437 5681881 5603124 5525672
11740 5525672 5468467 5432964 5388587 5308776 5220205 5177401 5181941 5173888 5121005 5063438 5037326 5009749
11728 5009749 4942387 4870751 4848348 4847397 4801736 4730974 4722280 4779717 4793857 4699138 4570607 4507094
11716 4507094 4496125 4467041 4414121 4379987 4359689 4313787 4255099 4233568 4241783 4218945 4152177
11705 4152177 4096016 4080762 4075319 4056973 4045686 4045283 4019502 3958062 3904372 3883590 3863069 3821745
11693C821745k3740K3461L1827l461j3834J6597K0529k7852n8704k4398J7871
11682C780041K774l7241l3853L674J2282j9898m2838k6426L356Q976j7197n6141
11670C577509q0093o9006k7788J4601L0637J2797k8550o6660o6043k0362K1877
11659C298919Q580m1604o2159l4354k774R321K9997O3386O0041L359m3325l0497
11647C258890l165k3732o5426n7440n29M0653L9873K7635J6435j6473o3831p2881
11635C080009j9940M4058M9387j2890q1533q5133j2612O8188P5951Q922n2645
11624C061762m9734j1546N526j082l108j901r559n258K6420M3806N443m5198l2131
11611B983440K9940N2162J1187j9680K991K6590K600k7184k643N4658P6746M6845
$$ plain form
11693 3821745 3798005 3821466 3853293 3849832 3835998 3852595 3873124 3845272 3786568 3762170 3780041
11682 3780041 3782815 3745574 3711721 3715395 3727677 3707779 3664941 3638515 3641871 3650847 3633650 3577509
11670 3577509 3497416 3428410 3400622 3415223 3445860 3458657 3430107 3363447 3297404 3277042 3298919
11659 3298919 3307499 3265895 3203736 3169382 3166608 3175929 3205926 3269312 3329353 3332712 3289387 3258890
11647 3258890 3255725 3231993 3166567 3109127 3108598 3149251 3189124 3216759 3233194 3216721 3152890 3080009
11635 3080009 3060069 3104127 3153514 3140624 3059091 2973958 2961346 3029534 3105485 3114407 3061762
11624 3061762 3012028 3000482 3006008 3004926 3001818 2999917 2990358 2985100 3011520 3055326 3060769 3015571 2983440
11611 2983440 3013380 3065542 3076729 3057049 3060040 3086630 3089230 3062046 3059403 3114061 3190807 3237652
11599C237652K908l0262n4861o0093k5757K9049M7209L210n7245p0825l3873Q62
11587B987974l93j5383j7392k3987n3936o8666k4188L3804J5866o0831p4021J0711
11575B709558O4601n370r4874o3785L3541M1042l5586m7349L1900O0240j7183
11564B676735o4317J3355J04948P7025j8632n0609j3518P871l99Q015K3886L173
11552B767533l4328l7216j8705k0980k3424J2653M9502K9718j2105o299K2266
11541B728615L606l3574n992N6692M0690n1576q4974n189P8867P4679K9696J1795
11529B843335k447l7941l8111K8312P5561K5660n2386m3079L3791O0987Q844l5284
11517B867242j4084K8484L5913J5512K421N787J2209O266j8710m2918k6477L1804
$$ plain form
11599 3237652 3240560 3210298 3155437 3095344 3069587 3098636 3145845 3149055 3091810 3020985 2987112 2987974
11587 2987974 2987581 2972198 2954806 2930819 2876883 2808217 2784029 2817833 2833699 2772868 2698847 2709558
11575 2709558 2774159 2768789 2673915 2610130 2643671 2684713 2649127 2601778 2633678 2693918 2676735
11564 2676735 2612418 2625773 2730721 2807746 2789114 2738505 2724987 2732858 2732459 2740474 2764360 2767533
11552 2767533 2733205 2695989 2677284 2656304 2632880 2645533 2695035 2724753 2712648 2706349 2728615
11541 2728615 2732221 2698647 2692655 2749347 2790037 2738461 2653487 2648298 2727165 2801844 2831540 2843335
11529 2843335 2840888 2802947 2764836 2793148 2868709 2894369 2841983 2798904 2832695 2893682 2902526 2867242
11517 2867242 2853158 2881642 2917555 2933067 2935488 2941275 2953484 2959750 2941040 2898122 2871645 2903449
11505B903449O6627K7448l6348l6833K0235M2773l726m3246j0414M9706N5151
11494C034822O709k8519k1545m652j342N678K8531M6229M1738K9737K6128K2219
11482C185733J4269K6797P0596J04142Q4846M2442M3331Q5170R4861M6937J0121
11471C809245L5473O7510L1851m2680p1170m6384l4503n4016n6117l0293l2456
11460C576460q1773j16890r4855n7137m9590m6550j3080J6447r416o8517r3924
11449B961175o8854l4419k0083j8273j6803j3266n732l83j2995l6798l4804N421
11437B704186L8938K0883l1423o8190o7480l2190L1419Q8003P3487j7483q5524
11426B654626m2084N9376R0249K6265l0605r975L9215M3256Q009j3085k972R373
$$ plain form
11505 2903449 2970076 2997524 2961176 2924343 2944578 2987351 2983625 2940379 2929965 2979671 3034822
11494 3034822 3041531 3013012 2991467 2986815 2985473 2991151 3019682 3065911 3107649 3137386 3163514 3185733
11482 3185733 3200002 3226799 3297395 3401537 3486383 3528825 3572156 3657326 3752187 3799124 3809245
11471 3809245 3844718 3912228 3944079 3901399 3830229 3783845 3749342 3695326 3639209 3608916 3576460
11460 3576460 3494687 3377797 3282942 3225805 3176215 3129665 3116585 3133032 3123616 3055099 2961175
11449 2961175 2892321 2857902 2837819 2819546 2802743 2789477 2783745 2783362 2770367 2733569 2698765 2704186
11437 2704186 2743124 2764007 2732584 2664394 2596914 2564724 2596143 2684146 2757633 2740150 2654626
11426 2654626 2612542 2671918 2762167 2788432 2757827 2747852 2787067 2830323 2838332 2825247 2822275 2831648
11414B831648l685l7049n4044j8140N3774Q5132K8108n7691p2849j5861J8162
11403B757505j6674n1892j7330N0658O6057J3513m2167m4580j081M0916M4767
11392B799692J5415r100k548J8039K3323J9845L2320M9548L6591j057j8714l837
11380B959517Q174m60n384M189N339k357J5529N4804N4197n000m4296N705R3463
11367C143420J11757M4795k1134k1776J6868L9869L7769L7680N2140O3758N5341
11356C560487L8300L7771N1161M6966J9925J2145M2988N8533J4534k7269K0038
11345C875579J11318J13323J4636m4994K130M4833n959n0576L2101J61163J63987
11334D417541M5416k7920J3107O8440O3932N2912Q1248R6782O1215L4248O6359
$$ plain form
11414 2831648 2827963 2790914 2736870 2718730 2772504 2857636 2885744 2828053 2755204 2739343 2757505
11403 2757505 2740831 2688939 2671609 2722267 2788324 2801837 2759670 2715090 2714009 2754925 2799692
11392 2799692 2815107 2806007 2803459 2821498 2844821 2864666 2896986 2946534 2983125 2982068 2963354 2959517
11380 2959517 2967691 2967231 2961847 2966036 2971375 2969018 2984547 3039351 3093548 3088548 3044252 3049957 3143420
11367 3143420 3255177 3299972 3278838 3257062 3273930 3313799 3351568 3389248 3441388 3505146 3560487
11356 3560487 3598787 3636558 3687719 3734685 3754610 3766755 3809743 3868276 3882810 3855541 3875579
11345 3875579 3986897 4100220 4114856 4069862 4071992 4116825 4110866 4060290 4092391 4253554 4417541
11334 4417541 4462957 4435037 4448144 4516584 4580516 4633428 4714676 4811458 4872673 4906921 4973280
11323D973280J01196P1012J7895K8706R4765J25712Q4977L4280L8370Q2737J07339
11312E760269R0761P2465R2850J33868J44238J17588J03432J27005J51203J52298
11302F945977J71683K30453K53850J75248P1397P5456J72589K13046J39323O3658
11292H512680P7839J19645J04523P4139J07958J69298J58849P9116L2781O7302
11282I504130J15144J00990L8654m801j661Q512k2479q0014r7300n2862k0992
11271I487321p2485j54591j52733o2288J475k2539o5688o0500l4565k1896N682
11260H847193M7701K8309o8513j24125n5948L4971J4717p3392r7165o1072p3427
11249H419249j32248j26552m4776n188n4456r5836o0270o440J960r346j1283l4446
$$ plain form
11323 4973280 5074476 5145488 5163383 5192089 5286854 5412566 5497543 5531823 5570193 5652930 5760269
11312 5760269 5851030 5923495 6016345 6150213 6294451 6412039 6515471 6642476 6793679 6945977
11302 6945977 7117660 7348113 7601963 7777211 7848608 7924064 8096653 8309699 8449022 8512680
11292 8512680 8590519 8710164 8814687 8888826 8996784 9166082 9324931 9404047 9436828 9504130
11282 9504130 9619274 9720264 9758918 9754117 9752456 9760968 9738489 9658475 9561175 9508313 9487321
11271 9487321 9414836 9260245 9107512 9045224 9046699 9024160 8958472 8897972 8863407 8841511 8847193
11260 8847193 8894894 8923203 8854690 8730565 8674617 8709588 8724305 8650913 8553748 8492676 8419249
11249 8419249 8287001 8160449 8115673 8110485 8056029 7960193 7899923 7893483 7895443 7886097 7874814 7840368
11237G840368q1671q2997p958O6741O8741L0272J5874K5190K7669K5645K7507
11226G955381K0423J2638L4950O6448M1785l2447o6957l8381l4117q7930r9803
11215G771990j2476O0687J2232o6920k9519P7231Q3264k4881q2440o369R2794
11204G875593R5409K9118j2226J248M0439P3852P7969N0896L3985O1684R3842
11193H421809P2177L0430N0254J14421J22073O1056L4515Q1073J02989L6287l3910
11182I093174j4904M5848N6335L2040L9018N7596K6643k3472o959P0384J14517
11171I490220Q7445M5547L2006K8363K6363N6515J15822J42244R9755L5994K0163
11160A0180437N9288J01666R9332N4424K0666N2847J33789J75028J26903N6589
$$ plain form
11237 7840368 7758697 7675700 7667742 7734483 7803224 7833496 7849370 7874560 7902229 7927874 7955381
11226 7955381 7975804 7988442 8023392 8089840 8131625 8099178 8032221 7993840 7959723 7871793 7771990
11215 7771990 7759514 7820201 7832433 7765513 7735994 7813225 7896489 7871608 7789168 7782799 7875593
11204 7875593 7971002 8000120 7987894 7989142 8029581 8103433 8181402 8232298 8266283 8327967 8421809
11193 8421809 8493986 8524416 8574670 8689091 8811164 8872220 8906735 8987808 9090797 9127084 9093174
11182 9093174 9078270 9124118 9180453 9212493 9251511 9309107 9335750 9312278 9305319 9375703 9490220
11171 9490220 9577665 9623212 9655218 9683581 9709944 9766459 9882281 10024525 10124280 10160274 10180437
11160 10180437 10239725 10341391 10440723 10495147 10515813 10568660 10702449 10877477 11004380 11060969
11150A1060969N9906J24977J60694J42615J35451J65757J74310J28331Q9476J17916
11140A2360402J81180K13862K07750J89639J67200J52006J79865K47900K85561
11131A4185365K53456K16160K41447K83057K59773K06835K30493L27658L76776
11122A6581020L25804K71197L04195L79481M03979L79641L78039M20234M61582
11113A9905172M75520M82956M98758N04054M87407M78199N12406N73476N94038
11104B4511986N38010M68016M83319N76957O19660N37599M39559M72576N98871
11095B9246553O47002N71968N11466N53165O06441N83685N60106O31071P28969
11086C4640426P30733O65380O57264P16249P44072P19054P13523P36122P17184
$$ plain form
11150 11060969 11120875 11245852 11406546 11549161 11684612 11850369 12024679 12153010 12242486 12360402
11140 12360402 12541582 12755444 12963194 13152833 13320033 13472039 13651904 13899804 14185365
11131 14185365 14438821 14654981 14896428 15179485 15439258 15646093 15876586 16204244 16581020
11122 16581020 16906824 17178021 17482216 17861697 18265676 18645317 19023356 19443590 19905172
11113 19905172 20380692 20863648 21362406 21866460 22353867 22832066 23344472 23917948 24511986
11104 24511986 25049996 25518012 26001331 26578288 27197948 27735547 28175106 28647682 29246553
11095 29246553 29893555 30465523 30976989 31530154 32136595 32720280 33280386 33911457 34640426
11086 34640426 35371159 36036539 36693803 37410052 38154124 38873178 39586701 40322823 41040007
11077D1040007O63371O70095P47521P83393P27318O70067O78349O90842O60106
11068D7331069O63582P63389Q67495Q61683Q01493Q36505R88852J137229J203537
11059E5454834J237996J311702J420646J521369J596791J659034J721214J781159
11051F7704745J820035J823425J808973J807950J815403J799711J767904J766159
11043H2114305J803011J835815J847005J856296J841428J746742J603970J530522
11035I6179094J552589J550418J454509J367711J388358J438805J405872J342111
11027A07679467J369164J468011J534084J572811J664806J787397J849739J870490
11019A20795969J942988K050287K094602K091030K144341K240025K251124K163211
$$ plain form
11077 41040007 41703378 42373473 43120994 43904387 44631705 45301772 45980121 46670963 47331069
11068 47331069 47994651 48758040 49625535 50487218 51288711 52125216 53114068 54251297 55454834
11059 55454834 56692830 58004532 59425178 60946547 62543338 64202372 65923586 67704745
11051 67704745 69524780 71348205 73157178 74965128 76780531 78580242 80348146 82114305
11043 82114305 83917316 85753131 87600136 89456432 91297860 93044602 94648572 96179094
11035 96179094 97731683 99282101 100736610 102104321 103492679 104931484 106337356 107679467
11027 107679467 109048631 110516642 112050726 113623537 115288343 117075740 118925479 120795969
11019 120795969 122738957 124789244 126883846 128974876 131119217 133359242 135610366 137773577
11011A37773577K103143K120917K123527K051838J949251J834363J682969J551759
11003A53191344J533769J580745J567288J527275J595256J718876J711181J609588
10995A66035322J657893J865063J935513J757526J589176J577837J471627J061622
10987A78951579N63478K59894P6984j63401l72670m25552m65174n96860n67300
10978A77260978j66966L37018O28090Q98308J465967K164795K720634L375519
10970A88684343M384978N288934N688230O391286Q405772J0914034J2068870J2197245
10962B54023692J3971763J7899339J9651266J4669749M782227k779478l617442
10955C18601116r79255j027374n358408j0373522j2894265j3637748j4785759
$$ plain form
11011 137773577 139876720 141997637 144121164 146173002 148122253 149956616 151639585 153191344
11003 153191344 154725113 156305858 157873146 159400421 160995677 162714553 164425734 166035322
10995 166035322 167693215 169558278 171493791 173251317 174840493 176418330 177889957 178951579
10987 178951579 179515057 179774951 179851935 179688534 179315864 178890312 178425138 177828278 177260978
10978 177260978 177094012 177431030 178059120 178957428 180423395 182588190 185308824 188684343
10970 188684343 193069321 198358255 204046485 210437771 218843543 229757577 241826447 254023692
10962 254023692 267995455 285894794 305546060 320215809 324998036 322218558 318601116
10955 318601116 317621861 316594487 311236079 300862557 287968292 274330544 259544785
10948B59544785j6397939j6721307j5022649j2554301j0796381r868753r024957
10941A69158498p988659p202728o994586p038639o765627o021821n133044m439672
10933A17573722l965324l539486l082395k674800k404873k239019k069937j865522
10925I5732366j725917j755261j894679j956858j849696j685674j619847j664380
10917H1580054j738205j808379j866796j841591j678011j467811j352293j321416
10909F8505552j255424j142032j083645j091411j055097r47900q82873r11328
10901F0135842r32443q72900p99524p73983p46432o84331o62856p23687p74764
10892E3164922p38574o78803o71365o70135o16327n62811n63103n49019m55228
$$ plain form
10948 259544785 243146846 226425539 211402890 198848589 188052208 178183455 169158498
10941 169158498 161169839 153967111 146972525 139933886 133168259 127146438 122013394 117573722
10933 117573722 113608398 110068912 106986517 104311717 101906844 99667825 97597888 95732366
10925 95732366 94006449 92251188 90356509 88399651 86549955 84864281 83244434 81580054
10917 81580054 79841849 78033470 76166674 74325083 72647072 71179261 69826968 68505552
10909 68505552 67250128 66108096 65024451 63933040 62877943 61930043 61047170 60135842
10901 60135842 59203399 58330499 57530975 56756992 56010560 55326229 54663373 53939686 53164922
10892 53164922 52426348 51747545 51076180 50406045 49789718 49226907 48663804 48114785 47659557
10883D7659557l61146l61370l87850l18198j84856j15821j25003j16961n4769
10874D5633583K2098J04166J97950K52388K36614K38727L44358M75857N08913
10865D8014654M86829N38837O39278O53848N93796N98716O65730O30215M55908
10856E3277811L16590L13841L21185K09741M5508n5759j14972k05820l09728l73610
10846E3424787m12431m54643m78242m81983n18580n82824n81273m91172m22833
10837D9000806m34826m25972l22702k30053k51608k91898k17828j16609j89447
10828D6519863m36943o45074o78556o24402o31896p44153r06183j035267j073503
10819C9743886j046925j051034j107138j096846r42964p74306p58263q33572p98673
$$ plain form
10883 47659557 47298411 46937041 46549191 46230993 46046137 45930316 45805313 45688352 45633583
10874 45633583 45655681 45759847 45957797 46210185 46446799 46685526 47029884 47505741 48014654
10865 48014654 48501483 49040320 49679598 50333446 50927242 51525958 52191688 52821903 53277811
10856 53277811 53594401 53908242 54229427 54439168 54484676 54428917 54313945 54108125 53798397 53424787
10846 53424787 53012356 52557713 52079471 51597488 51078908 50496084 49914811 49423639 49000806
10837 49000806 48565980 48140008 47817306 47587253 47335645 47043747 46825919 46709310 46519863
10828 46519863 46082920 45437846 44759290 44134888 43502992 42758839 41852656 40817389 39743886
10819 39743886 38696961 37645927 36538789 35441943 34498979 33724673 32966410 32132838 31334165
10810C1334165o35148n30985n67829o03803n31840m50104m64953m95681m19640
10801B6634182k89674k53461l28324l94485l74668l06922k58426k55334k86912
10792B3885976l16485l04162k60636k45848k78742k99681k65886k22723k23722
10783B1468091k43195k37363k30465k56870k72305k21443j55043j70620k51797
10774A9428990k76575j95788j04686j05581j77281k24451k04241j58954j47249
10765A7834184j74928j93071j62379j15402j24646j95877k43165k08211j47919
10756A6268586j40108j58313j32064q7339j08056j76171j84391j18590q6719j27894
10746A4948941j39319o6680k2850j00834j92969j51241l7752l2342j36727j71136
$$ plain form
10810 31334165 30699017 30168032 29600203 28996400 28464560 28014456 27549503 27053822 26634182
10801 26634182 26344508 26091047 25762723 25368238 24993570 24686648 24428222 24172888 23885976
10792 23885976 23569491 23265329 23004693 22758845 22480103 22180422 21914536 21691813 21468091
10783 21468091 21224896 20987533 20757068 20500198 20227893 20006450 19851407 19680787 19428990
10774 19428990 19152415 18956627 18851941 18746360 18569079 18344628 18140387 17981433 17834184
10765 17834184 17659256 17466185 17303806 17188404 17063758 16867881 16624716 16416505 16268586
10756 16268586 16128478 15970165 15838101 15750762 15642706 15466535 15282144 15163554 15076835 14948941
10746 14948941 14809622 14742942 14720092 14619258 14426289 14275048 14237296 14204954 14068227 13897091
10736A3897091p2483M471n5713j50704j43739p8030p2406j12701j03680n9952
10726A3052154p8835j50074j56765p7029l1888q8248j49881j16839m1155k8871
10716A2132569o9227p0515j9448M772l5890q5102q5514n3233l4438l7994l9983
10705A1605997k6264o584K231m299j3254j1231n661j2685k3044j1465J0784k897
10693A1501628n5043p5354j7406N8534O1044l729m7845k8858J1771L2873M1402
10682A1479017M5616K9664k141j2102J4416M4884N2597N1104N7492O2747N6858
10671A1880152M6819L7491L0380M3423Q7353J25322J13428P9027Q7727J31181
10661A2662303J36635J01307J08942J73840J88250R9918K6501Q1215J81115J73356
$$ plain form
10736 13897091 13824608 13829079 13773366 13622662 13478923 13400893 13328487 13215786 13112106 13052154
10726 13052154 12973319 12823245 12666480 12589451 12557563 12469315 12319434 12202595 12161440 12132569
10716 12132569 12063342 11992827 11973379 11978151 11942261 11857159 11771645 11718412 11683974 11645980 11605997
10705 11605997 11579733 11573149 11575380 11571081 11557827 11546596 11540935 11528250 11505206 11493741 11504525 11501628
10693 11501628 11446585 11371231 11353825 11412359 11473403 11469674 11421829 11392971 11404742 11437615 11479017
10682 11479017 11524633 11554297 11552156 11540054 11554470 11599354 11651951 11703055 11760547 11823294 11880152
10671 11880152 11926971 11964462 11994842 12038265 12125618 12250940 12364368 12443395 12531122 12662303
10661 12662303 12798938 12900245 13009187 13183027 13371277 13471195 13497696 13578911 13760026 13933382
10651A3933382Q6775Q6649J98316K57978J76942Q8289J39779K67539L00664K16751
10641A5753064J56889K06595K89143L04645K72625K70897K98308K87480K32462
10632A8072108K07791K40605K55021K01223J59947K23007L26223L29207K40029
10623B0255161K11714K96577L63847L23931K76078L25908L99472L83787L33911
10614B3170386L66795M40400M34122L85964M33414N47993N61910M69478M59713
10605B7270175N92574O83155O13421N35719O15294P61318P97527P48868P56256
10596C3374307Q18660Q31388Q06938Q45926R27005R30313Q61910Q61874R69971
10587D1228292J058828J041435R92510J009162J078465J141535J185204J219417
$$ plain form
10651 13933382 14020157 14106806 14305122 14563100 14740042 14828331 14968110 15235649 15536313 15753064
10641 15753064 15909953 16116548 16405691 16710336 16982961 17253858 17552166 17839646 18072108
10632 18072108 18279899 18520504 18775525 18976748 19136695 19359702 19685925 20015132 20255161
10623 20255161 20466875 20763452 21127299 21451230 21727308 22053216 22452688 22836475 23170386
10614 23170386 23537181 23977581 24411703 24797667 25231081 25779074 26340984 26810462 27270175
10605 27270175 27862749 28545904 29159325 29695044 30310338 31071656 31869183 32618051 33374307
10596 33374307 34192967 35024355 35831293 36677219 37604224 38534537 39396447 40258321 41228292
10587 41228292 42287120 43328555 44321065 45330227 46408692 47550227 48735431 49954848
10579D9954848J251151J315003J442842J582702J647542J664241J759123J964444
10571F2581896K164215K281564K392273K581756K811521L018732L239146L523901
10563H4595004L824311M074249M316682M635692N020998N408522N802878O256163
10555A23934499O783596P407023Q206752R192664J0198794J1075734J1898575
10548A88697637J2707444J3044197J2118690R682313O540356L901064K246010
10541B48937711J046149m49724k406985m439334o182211p595871q766017r626888
10533B10516830r983566r753138r112656q391201p822360p412024p049664o707772
10525A44284449o464811o332529o159597n783782n232047m682076m244506l875065
$$ plain form
10579 49954848 51205999 52521002 53963844 55546546 57194088 58858329 60617452 62581896
10571 62581896 64746111 67027675 69419948 72001704 74813225 77831957 81071103 84595004
10563 84595004 88419315 92493564 96810246 101445938 106466936 111875458 117678336 123934499
10555 123934499 130718095 138125118 146331870 155524534 165723328 176799062 188697637
10548 188697637 201405081 214449278 226567968 236250281 242790637 246691701 248937711
10541 248937711 249983860 249534136 247127151 242687817 236505606 228909735 220143718 210516830
10533 210516830 200533264 190780126 181667470 173276269 165453909 158041885 150992221 144284449
10525 144284449 137819638 131487109 125327512 119543730 114311683 109629607 105385101 101510036
10517A01510036l504002l148527k853297k604723k373121k181921k060918j971522
10509H0812005j854768j724730j635750j579787j506167j433601j437805j507916
10501F8131481j519779j403765j252542j191537j209913j204064j141027j081681
10493E8127173j059255j032239r73961r30351r51874j018632j070800j081096
10485E0008965j063926j036575j006476r86568r90682j009391j011815r81184
10477D1922348r35682r02402q79989q44641p89622p34915o92250o48837o00714
10468C4893296n69592n59906n35778m82954m54703m91527n28915m75987l70376
10459C0423558l41910m09702m42295l66926k87687l08635l60221l27022k52049
$$ plain form
10517 101510036 98006034 94857507 92004210 89399487 87026366 84844445 82783527 80812005
10509 80812005 78957237 77232507 75596757 74016970 72510803 71077202 69639397 68131481
10501 68131481 66611702 65207937 63955395 62763858 61553945 60349881 59208854 58127173
10493 58127173 57067918 56035679 55061718 54131367 53179493 52160861 51090061 50008965
10485 50008965 48945039 47908464 46901988 45915420 44924738 43915347 42903532 41922348
10477 41922348 40986666 40084264 39204275 38359634 37570012 36835097 36142847 35494010 34893296
10468 34893296 34323704 33763798 33228020 32745066 32290363 31798836 31269921 30793934 30423558
10459 30423558 30081648 29671946 29229651 28862725 28575038 28266403 27906182 27579160 27327111
10450B7327111k58505l29147l35202k61213k24195k57706k53230j64317j02983
10441B5140613j50343k15596j91967j34761j56418k32204k50625k05126j94981
10432B3408592k51326k89937k52088j91472j88975k48024l03356k94072k17926
10423B1171416j41615j45679k27560k87982k57171j93036j88061k22390k05718
10414A9302204j40224j23871j83333k24339j87950j44387j65335k00470j72192
10405A7760103j19569j37560k12572k34374j67448j02867j14575j56180j50301
10396A6364657j10812j07813j49891j74641j49104j15150j18506j41265j36507
10387A5160968j01544p9781r7975j32390j42049j16903q5576q2363j07846j22342
$$ plain form
10450 27327111 27068606 26739459 26404257 26143044 25918849 25661143 25407913 25243596 25140613
10441 25140613 24990270 24774674 24582707 24447946 24291528 24059324 23808699 23603573 23408592
10432 23408592 23157266 22867329 22615241 22423769 22234794 21986770 21683414 21389342 21171416
10423 21171416 21029801 20884122 20656562 20368580 20111409 19918373 19730312 19507922 19302204
10414 19302204 19161980 19038109 18854776 18630437 18442487 18298100 18132765 17932295 17760103
10405 17760103 17640534 17502974 17290402 17056028 16888580 16785713 16671138 16514958 16364657
10396 16364657 16253845 16146032 15996141 15821500 15672396 15557246 15438740 15297475 15160968
10387 15160968 15059424 14979643 14881668 14749278 14607229 14490326 14404750 14322387 14214541 14092199
10377A4092199r1782m4031m9943j24816j83059j41284m4418j7978r3175j60486
10367A3141227j27851m7832k9385q2667j26169j13300p6134n7384o3994q3782
10357A2332729r8047q7080o3935p6232j26907j37088o0256J3493k8646j35266
10347A1532765j48013m3314K8550k1177r3496q0925l4897m9205r1096p8650m2347
10336A0878195o7094j27176j23921o0340l7032q0339j09708q7424p2454r7682
10326A0015025j11830q3474n6679n8534n1668k7479m5030j15532j47630q7105
10316I230064k1600n0658j26086j31253o4928k7565n4552q2782p6747p3425q7084
10305H433384p3974k4499j298m0915q9868q8326n8556n6179p8600p9713m9402
$$ plain form
10377 14092199 14000417 13956386 13906443 13781627 13598568 13457284 13412866 13394888 13301713 13141227
10367 13141227 13013376 12965544 12936159 12853492 12727323 12614023 12537889 12480505 12416511 12332729
10357 12332729 12234682 12147602 12083667 12007435 11880528 11743440 11683184 11696677 11668031 11532765
10347 11532765 11384752 11341438 11369988 11348811 11255315 11174390 11139493 11090288 10999192 10920542 10878195
10336 10878195 10811101 10683925 10560004 10499664 10462632 10382293 10272585 10185161 10112707 10015025
10326 10015025 9903195 9819721 9763042 9704508 9652840 9625361 9580331 9464799 9317169 9230064
10316 9230064 9208464 9157806 9031720 8900467 8835539 8807974 8753422 8670640 8593893 8520468 8433384
10305 8433384 8359410 8334911 8333613 8292698 8202830 8114504 8055948 7999769 7921169 7841456 7792054
10294G792054k6047l9276p6574j02346r0431m8841k2395m7053r2019q5999k1439
10283G139634J6768l1008r9761q5497k136L1658l4571j08815r1283j3388J9528
10272F741129j8198n1632k9448N070p098m6252m8543r459N577l9985r5666r4753
10260F310742m8031k1746l9037n6970m5131l2241n0237p7881p7383n2689l0126
10249E779270j1086Q914L099m4091p8960l8857L5047L2424o1394j26450p8036
10238E419880R713J9873l7564o3800l4007j7850n0424q2389p1557m1101k3077
10227E027697j2781m651j2771l0360k6381p061k0971p3591r9273n7829l0J1026
10215D693024j0066j4724o154j8130m3669m8758l2905j9646r982L046J563k2313
$$ plain form
10294 7792054 7766007 7726731 7650157 7547811 7457380 7408539 7386144 7339091 7247072 7161073 7139634
10283 7139634 7156402 7125394 7025633 6940136 6938000 6969658 6935087 6826272 6734989 6721601 6741129
10272 6741129 6722931 6671299 6641851 6646921 6639823 6593571 6545028 6535569 6541146 6501161 6405495 6310742
10260 6310742 6262711 6240965 6201928 6144958 6099827 6067586 6017349 5939468 5862085 5809396 5779270
10249 5779270 5768184 5777098 5780197 5736106 5657146 5618289 5653336 5685760 5624366 5497916 5419880
10238 5419880 5429593 5449466 5411902 5348102 5314095 5296245 5245821 5163432 5091875 5050774 5027697
10227 5027697 5014916 5010265 4997494 4967134 4940753 4933692 4912721 4839130 4739857 4682028 4681998 4693024
10215 4693024 4682958 4668234 4662080 4643950 4600281 4551523 4518618 4498972 4488990 4492036 4493599 4471286
10203D471286l2780r955j881m4912p8019l1230L9645K6199m5878m4365M6670Q5729
10191D380509L328p8580m3042L9740M3261j1458k1523R895N477j8005K2052R6912
10179D428566Q6518p770l6615N9050J38012P7188k9890j6710J03212J68739J15976
10168E086276N2225Q0485J65205K07144J69658Q8400J1742k8964k8579j8907m0568
10157E744117q5746j06177r5590j12220j82214k33906j91729r9571o9006j16291
10147D451667j42600r4234m7595q0276j38347j19540l8657n510n2690r1357n6180
10136C584681J762Q297k6916n2164o0388p1565p4199m7681j0848P819J8013L3275
10124C310086K6325j8888m8228p967N3346M1729l6715q0428m4161Q318J8509O101
$$ plain form
10203 4471286 4438506 4428551 4426670 4381758 4303739 4272509 4312154 4338353 4292475 4248110 4294780 4380509
10191 4380509 4383837 4305257 4262215 4301955 4345216 4333758 4312235 4322130 4327607 4309602 4331654 4428566
10179 4428566 4515084 4507314 4470699 4529749 4667761 4744949 4715059 4698349 4801561 4970300 5086276
10168 5086276 5138501 5218986 5384191 5591335 5760993 5849393 5861135 5832171 5803592 5784685 5744117
10157 5744117 5658371 5552194 5456604 5344384 5162170 4928264 4736535 4636964 4567958 4451667
10147 4451667 4309067 4214833 4167238 4086962 3948615 3829075 3790418 3784908 3732218 3640861 3584681
10136 3584681 3586443 3594740 3567824 3515660 3455272 3383707 3309508 3261827 3250979 3258798 3276811 3310086
10124 3310086 3336411 3317523 3269295 3261328 3314674 3356403 3319688 3239260 3195099 3203417 3221926 3228027
10112C228027k030k4337o1316o2884j5202J2961k6085p4517n9302q992J121k4577
10100B882867k0914J8858L4773O233j7144j481K4314K6087J2736N386K005o205
10088B967515j4607j5913p832J3302M1384M6660N569n5687q0221m6581J1397M9857
10076B914843N2392K5509j2935m0011m6133m3275l7324j1941L3089N6474L1544
10065B922232P8J3389M3154K3040l2016l3319M2596J05809P7731l933m6927j7699
10053C094135M8232J03565J16346P8335K4316J0584M4079O8111M4169L822j1658
10042C624036j3395k4750k7601k185J9272k236m3591n5161m1392m4512o5217o3917
10030C259351l5239j9238l2880m4524k9745q403r131k9003m4662m3350l3011l1622
$$ plain form
10112 3228027 3225997 3201660 3140344 3077460 3062258 3075219 3049134 2974617 2915315 2906323 2907444 2882867
10100 2882867 2861953 2880811 2915584 2921817 2904673 2903192 2927506 2953593 2966329 2971715 2973720 2967515
10088 2967515 2952908 2936995 2929163 2942465 2983849 3030509 3036078 2980391 2900170 2853589 2864986 2914843
10076 2914843 2967235 2992744 2979809 2939798 2893665 2850390 2813066 2801125 2834214 2890688 2922232
10065 2922232 2922310 2935699 2978853 3001893 2969877 2936558 2979154 3084963 3162694 3158761 3111834 3094135
10053 3094135 3142367 3245932 3362278 3440613 3464929 3475513 3519592 3587703 3631872 3635694 3624036
10042 3624036 3610641 3585891 3558290 3556105 3575377 3573141 3529550 3474389 3432997 3388485 3323268 3259351
10030 3259351 3224112 3204874 3171994 3127470 3097725 3089322 3080191 3051188 3006526 2963176 2930165 2898543
10018B898543m4373m6518r010M6938N5888j863n4248k9966L3014L6117l4795q4218
10006B765509l9784M9469P8594J5539o5963p0781J4578J02841R7428O048o3271
9995B890207l4631M4960P9369M7598M406j0591l614J3324L2663L3841Q869j0195
9983C096206K727K3259L0277N5701J07643J05851K997q6937k8146J06688J24383
9972C540649K1235m864J10260J80001Q5634j2878N1515J65255J32755J3516J0420
9961D293498J14830J31613K4176l2113L8996R8587M8961j6166q177N825l9487
9950D660543o9667j7842L2061j4948r8779j13057p9324p6110q4295m8002j4657
9939D075923o1085j34843j24984n3607l9058q9384r6110l6329j5723p7821j24949
$$ plain form
10018 2898543 2854170 2807652 2798642 2845580 2901468 2899605 2845357 2815391 2848405 2884522 2849727 2765509
10006 2765509 2725725 2775194 2853788 2869327 2803364 2732583 2747161 2850002 2947430 2953478 2890207
9995 2890207 2855576 2900536 2979905 3027503 3031909 3021318 3017704 3031028 3063691 3097532 3106401 3096206
9983 3096206 3098933 3122192 3152469 3208170 3315813 3421664 3424661 3337724 3309578 3416266 3540649
9972 3540649 3561884 3557020 3667280 3847281 3932915 3920037 3971552 4136807 4269562 4283078 4293498
9961 4293498 4408328 4539941 4564117 4532004 4571000 4669587 4718548 4702382 4694205 4700030 4660543
9950 4660543 4590876 4573034 4605095 4590147 4491368 4378311 4298987 4222877 4138582 4090580 4075923
9939 4075923 4014838 3879995 3755011 3701404 3662346 3572962 3476852 3440523 3424800 3346979 3222030
9928C222030q7181l3715m0937o7912n1938k7720m9887p6019l8196K2588Q302p5948
9916B703467j22520q0410j7215m700k4638k3955k813j027k8471n1934m4693k2176
9904B278915k0208m4652n6010k0343L0715K6443m3300r7471o7573O468L6335J1363
9892B040682m592J1126R509l2124o2587m3247j2254j3005j9880J819J4825l0897
9880A859375r2712q0995Q31N4628L3554k218r27J872l1192n7598k9943J1191K834
9867A668700k7950j0286L8930L1677m2738q5521l2892M9879O3609L485n6610o5308
9855A534975l2615N157K0697J1414J202R754J6382j0737m7686l3252K9350N5525
9843A560166Q16o4727n7106K442L3121J3585j5725l2736m1232k6729J7171M0640
$$ plain form
9928 3222030 3134849 3101134 3060197 2992285 2940347 2912627 2862740 2786721 2748525 2771113 2779415 2703467
9916 2703467 2580947 2500537 2483322 2478622 2453984 2430029 2427216 2426189 2397718 2345784 2301091 2278915
9904 2278915 2258707 2214055 2158045 2137702 2168417 2194860 2151560 2054089 1986516 1992984 2029319 2040682
9892 2040682 2036090 2047216 2056725 2024601 1962014 1918767 1906513 1893508 1873628 1875447 1890272 1859375
9880 1859375 1766663 1685668 1686499 1741127 1774681 1772463 1771536 1773408 1742216 1684618 1654675 1665866 1668700
9867 1668700 1640750 1630464 1669394 1701071 1658333 1572812 1539920 1589799 1653408 1656893 1600283 1534975
9855 1534975 1502360 1507517 1528214 1539628 1540830 1550584 1566966 1556229 1508543 1475291 1504641 1560166
9843 1560166 1560982 1496255 1439149 1441591 1474712 1488297 1472572 1439836 1398604 1371875 1389046 1429686
9831A429686k769o4915n7574J2076N2400L0602M722L966j2668m9676m0501K7213
9819A332562N8443k508o6178l1665N1162O1332o281n0322k9359j903n986r186
9807A300111O313O152k0245k7951N113L6562K9512K054k3879n7027q2672m5617
9795A128426N4066J11472M3113p8585j07639k3588M8741K7274j9652n31M9783
9784A232880L2419m9672q8464l1423M6611O0534K5251q81j5511m2074m8905P312
9772A128077P7962O6026j8713n3792J0951O6965J3297q2487q8937j1774K9494
9761A137069l484k3751K0921O2099K9289l6443m8803K242N2823N2191L648n2016
9749A195785o2904r202N4942M6184l1721p0302k149R0120Q2189j2763o3990j3825
$$ plain form
9831 1429686 1426917 1362002 1304428 1316504 1368904 1399506 1404228 1408194 1395526 1345850 1305349 1332562
9819 1332562 1391005 1388497 1322319 1290654 1341816 1403148 1396867 1346545 1317186 1315283 1309297 1300111
9807 1300111 1306424 1312576 1292331 1264380 1269493 1306055 1335567 1337621 1313742 1256715 1174043 1128426
9795 1128426 1182492 1293964 1337077 1258492 1150853 1127265 1176006 1203280 1183628 1183097 1232880
9784 1232880 1265299 1215627 1127163 1095740 1142351 1202885 1228136 1227255 1211744 1169670 1120765 1128077
9772 1128077 1206039 1272065 1253352 1199560 1210511 1277476 1290773 1208286 1119349 1107575 1137069
9761 1137069 1133585 1109834 1130755 1192854 1222143 1185700 1136897 1139139 1191962 1244153 1247801 1195785
9749 1195785 1132881 1123679 1178621 1224805 1193084 1122782 1120633 1210753 1292942 1280179 1216189 1202364
9737A202364M8492L1218k7849l6060N229J2134l8219o5528j4051N1901M0347k7463
9725A182515m9893l574K3237k3818p7368n9624l285J7820J6474M9128Q6910N0479
9713A209001l8028o6126j0720K1819k2780n3211O249P7760N5627k1783m4913j1837
9701A101058o743m0145m0384Q778M1993K7520L362r190k8340l8575K886O7036
9689A089256O2927k0891q1661n1454R804K1206m424j4521j0282j5356j1510K1139
9677I94233M6029K1978k3343l4837j1888Q775J7386K0735M300l3057m2786O366
9665I73891N8594M3620j0759k3931L060j854m3288m2953J5080L6443l0428r1342
9653H86133m2356O1144P7644j0239p1928k5136M8802L7021l6402n7968l255L0516
$$ plain form
9737 1202364 1250856 1282074 1254225 1218165 1223394 1235528 1197309 1131781 1117730 1169631 1209978 1182515
9725 1182515 1132622 1129048 1152285 1128467 1051099 991475 988190 1006010 1022484 1071612 1158522 1209001
9713 1209001 1170973 1104847 1094127 1115946 1093166 1039955 1046204 1123964 1179591 1157808 1112895 1101058
9701 1101058 1094315 1054170 1013786 1022564 1064557 1092077 1095439 1086249 1057909 1019334 1022220 1089256
9689 1089256 1152183 1131292 1049631 998177 1007981 1029187 1024763 1010242 999960 984604 973094 994233
9677 994233 1040262 1062240 1038897 1004060 992172 1000947 1018333 1039068 1043368 1010311 967525 973891
9665 973891 1032485 1076105 1065346 1041415 1044475 1042621 999333 956380 971460 1007903 977475 886133
9653 886133 843777 904921 982565 972326 900398 875262 924064 961085 924683 866715 863460 893976
9641H93976j8827p9267n4469L0322O8397K6157k6356l4708k4707k7972k2308J1190
9629G41428L5041J2895k5945l1451m815K1344L5303L1404j0765p5105q6138r897
9617F33299O7923N1436j8426l0730J2974J2305m1691l9057M9336R3074N797r8457
9605F97783p0099M5244P9210m226p0781l0345M2970M3583j4090l9779k062M5951
9593G23359M9612J0588l2537m7964l1382j861J5072N985k1325m2476l4203J242
9581E94110L0031K1017j1915k3350J550K5794J6464p675j1274p91j0167l8374
9569E85420m0743Q937P3400Q5618K2588o2855r0801l9430K8728M0682k42l0736
9557E80566j9679J715M153O98M921J590j2220p341K0614K5851j1677l6944m208
$$ plain form
9641 893976 875149 795882 741413 771735 840132 866289 839933 805225 780518 752546 730238 741428
9629 741428 776469 789364 763419 731968 727153 748497 783800 815204 804439 729334 643196 633299
9617 633299 701222 752658 734232 703502 716476 728781 687090 648033 697369 790443 796240 697783
9605 697783 627684 672928 752138 747912 677131 646786 689756 733339 719249 679470 677408 723359
9593 723359 772971 783559 751022 703058 671676 669815 684887 690872 669547 627071 592868 594110
9581 594110 624141 645158 633243 609893 611443 637237 653701 646026 634752 633961 623794 585420
9569 585420 544677 553614 627014 712632 735220 672365 581564 542134 570862 611544 611302 580566
9557 580566 560887 562602 566755 567453 572374 573964 561744 554403 575017 600868 589191 552247 548039
9544E48039L6828J2218n4032p1781k1365K6000K3076K046L037J7833K5464K6490
9532E73853K1729M685j1523n643O995p510l4950k5439J7002K5904k1862n8917
9520D84324k6100L7457N2559R872k7726j2731L5383N9203K6015l2350m6626L052
9508E62332M6609J3853n5660o1848L256L9064q968o7432n0315J9764O0112L9564
9496E40331j0002m6309l9931P619M0500L429n7350l2939P2780J13503J2919j03977
9484E00573r1471M485M0489J874j2838J7899K0510k0465l7752j0967R524J1158
9472D33019K6506L2341k4751r5585o6685M5373Q8718Q171o8893m2023J6976J6396
9460C69563M95L6549O6956J2729o5111n4333J8954L6249j4256l1454J4043L1034
$$ plain form
9544 548039 584867 597085 543053 471272 449907 475907 498983 501029 504066 521899 547363 573853
9532 573853 595582 600267 588744 583101 590096 582586 547636 522197 539199 565103 543241 484324
9520 484324 458224 495681 548240 558112 530386 517655 553038 612241 638256 605906 559280 562332
9508 562332 608941 622794 567134 505286 508542 547606 538638 471206 420891 440655 500767 540331
9496 540331 530329 484020 444089 451708 492208 495637 438287 405348 478128 591631 604550 500573
9484 500573 409102 413587 454076 455950 443112 461011 481521 461056 423304 412337 421861 433019
9472 433019 459525 491866 467115 371530 304845 350218 438936 447107 378214 336191 353167 369563
9460 369563 370058 406607 473563 486292 421181 366848 385802 422051 407795 376341 390384 421418
9448D21418l0465q8658n4466L7399Q3136M6342j6195m2934l4484k7205k9691j4966
9436B49231K2214L8282N311l0008j0801L0534J9099k8288k2085L6673L8582m5218
9424C03526r0032j3976P8055N7744k6911m7302j806J8898O633J9623L8548l37
9412C42663n6656l3051M1967M3266l5738o4794K564N5318J7826l7180l1215N57
9400B45527L234l919K483o499l3944k5331K5693M4207K983k5376k093J1370j6145
9387B22190j7815L1601M4555j7301m9547J2445N7477j4488j00869n9896M5657
9376A54009N6343j7383l6245J7556L4849o052j8736P497m234m2907j2853O9253
9364B01097P0315k9275q5857k6801M1330K7888o874L212Q558l1401m4528J8353
$$ plain form
9448 421418 390953 302295 247829 285228 368364 414706 398511 355577 321093 293888 264197 249231
9436 249231 271445 309727 315038 285030 274229 304763 323862 295574 273489 310162 348744 303526
9424 303526 213494 199518 277573 335317 308406 261104 259298 278196 284829 304452 343000 342663
9412 342663 286007 252956 294923 338189 302451 237657 240221 295539 313365 276185 244970 245527
9400 245527 248761 244842 247325 240826 206882 181551 207244 251451 254434 229058 226965 238335 222190
9387 222190 204375 235976 280531 263230 213683 226128 283605 269117 168248 108352 154009
9376 154009 210352 192969 156724 174280 209129 203077 184341 191838 187604 144697 131844 201097
9364 201097 271412 242137 156280 129479 170809 198697 191823 195035 203593 172192 127664 146017
9352A46017O8271K0612n3376m3716J9300L2796l307r365K5082L9141J7417Q06
9340B59678n89j3548l5282l6669j7384J004J3745J8643K092j9321l71M5762L9821
9327B57581k7092m6916L0921Q4460Q15j21245j06057K6572R7529M4470j7976j3524
9315B09538j088k3534k4150K5427N3013J4015k4233j041L4652J6284l0358m4839
9303B03686k8274j1428R419L8135L9340j217l0155l917L6048K7837j5841l9158
9291B24475l0375j6177k572J8237K8069O752k2156j8089J7214M4677L8260K833
9279B91148l9351n8104l4943R029L0422J7001q759l4854n6535l8548L9224R9921
9267B15651M1064r0412j20464J996J11187O7322l9339n0539J3398K7518r534m397
$$ plain form
9352 146017 214288 234900 181524 137808 157108 189904 186597 177232 202314 241455 258872 259678
9340 259678 259089 245541 210259 173590 156206 157210 170955 189598 191690 172369 171998 217760 257581
9327 257581 230489 183573 214494 298954 299769 178524 72467 99039 196568 241038 223062 209538
9315 209538 208450 184916 160766 186193 239206 253221 228988 227947 262599 278883 248525 203686
9303 203686 175412 163984 173403 211538 250878 249661 219506 215589 251637 279474 263633 224475
9291 224475 194100 177923 175351 193588 221657 228409 206253 188164 205378 250055 288315 291148
9279 291148 251797 193693 158750 167779 198201 215202 206443 171589 115054 76506 115730 215651
9267 215651 256715 166303 45839 47835 159022 226344 187005 136466 149864 177382 167848 163451
9255A63451L1724O996n3311l0847O0964P4734j7912o9037q371M0933q573n0807
9243A39944J4400Q8639M2157n6287n6146K1753L7422k1009l4460K2592L9940k9087
9231B09858q9827o8327j3567J1549K1863L8224L0022j1223l2046p645J2787M149
9219A05817J6528O4840O6123k3495r8135m3970P2832R1675l676p1036l2341K8320
9207A73482K2450j2521o546J8346M014k8138j1619M6065O5541J2391n7149p6418
9195A49898m2948K65K0047J4688M356R505K6104K6881J025k3331j9369l337k129
9182A61655j306K6024N4457L3274k3035m1380l516J9026k1795p0264n3508P645
9170H7277M1040L4595K9632K9800Q54m4274m4410R213M5396J7521k6264k0611
$$ plain form
9255 163451 195175 202171 148860 118013 178977 253711 235799 166762 158391 199324 190751 139944
9243 139944 154344 242983 285140 228853 172707 194460 231882 210873 176413 199005 238945 209858
9231 209858 120031 51704 38137 49686 71549 109773 139795 128572 96526 88881 101668 105817
9219 105817 122345 187185 253308 229813 131678 87708 160540 252215 248539 177503 145162 173482
9207 173482 195932 183411 176865 195211 199225 171087 159468 205533 271074 283465 226316 149898
9195 149898 106950 107215 127262 141950 146306 155811 181915 208796 209821 186490 167121 163784 161655
9182 161655 160349 186373 240830 274104 251069 209689 206173 225199 203404 133140 79632 87277
9170 87277 128317 162912 192544 222344 223198 178924 134514 143727 189123 206644 180380 159769
9158A59769J7693K2361j6900l9190l363N0919N5545O331k8929l298L7055J2824
9146B70817o4486r1210k0293N6776L9657k7270k6783M1256O3266K914m5266k6497
9134A72881j3145n1939n6549L6911J20588O7459m8371n5343L7003N4821m4426
9123B19890r5201p81J01029O0350m8641o0762J8857N1886K921l0945o955P252
9111B18900k1154l2065L611K6972P249M37L2010L1869l5161p8030k0457N6352
9099A90533L5997l7932l4425M0084N4239j6567m5397K1773O6916N443o2651k4060
9087A93953N3231M2378k2763j8771L9619K7773n5178p1525J5414O9640Q993o2328
9075B20436l6475K6867K4235j5525q153K4157O232l8215k7157K7292M0914P701
$$ plain form
9158 159769 177462 199823 182923 143733 140370 191289 246834 253165 224236 220938 257993 270817
9146 270817 206331 115121 94828 151604 191261 163991 137208 178464 241730 244644 199378 172881
9134 172881 159736 107797 51248 88159 208747 276206 227835 172492 209495 264316 219890
9123 219890 124689 123908 224937 285287 236646 175884 194741 246627 249548 218603 211648 218900
9111 218900 197746 165681 169292 196264 203513 203950 235960 267829 232668 154638 134181 190533
9099 190533 226530 188598 154173 194257 248496 231929 186532 208305 275221 280664 218013 193953
9087 193953 247184 289562 266799 248028 287647 315420 260242 188717 204131 273771 282764 220436
9075 220436 183961 210828 235063 219538 211385 235542 241774 203559 176402 203694 244608 252309
9063B52309j593K1214J3308k7061k8953J3986K0360l2339n7871o711M8887L7408
9051B52944j908l956J1768l215k8359j7081J2091R303j7551k2000M85J7654K1276
9038B31451K2471J2288j4431k4317L821K4581p107m3516n060P9369R0903n037
9026C65416r5331p2908J8834N6649P058m5219k7294K7150L6140j4673n5834l1663
9014A68325K5922M8436K8156J5059K3919R305m5188p7713l7411K7272L5300m639
9002B16743j4402K3996M0649o349n9884m6779J7345N3199K4292k5265l7085r061
8990A77399J5626J3120M508J0709J3171q976k7129j939L7534K5165k5343k3336
8978B10509M6481P4406l402q1706m0457N5832N2011m9738r4873k4785M3133K0199
$$ plain form
9063 252309 250716 271930 285238 258177 229224 243210 263570 231231 173360 166649 215536 252944
9051 252944 251036 247080 258848 255633 227274 210193 222284 231587 214036 192036 192521 210175 231451
9038 231451 253922 266210 251779 227462 231283 255864 248757 205241 200181 279550 370453 365416
9026 365416 270085 197177 216011 272660 279718 234499 207205 234355 270495 255822 199988 168325
9014 168325 194247 242683 270839 285898 309817 319122 273934 196221 158810 186082 221382 216743
9002 216743 202341 226337 266986 260637 200753 153974 171319 224518 248810 223545 186460 177399
8990 177399 193025 206145 210653 221362 234533 225557 198428 196489 234023 259188 233845 210509
8978 210509 256990 331396 327994 246288 205831 261663 313674 263936 169063 144278 187411 207610
8966B07610k2142O40L7836N057o0677o2260j507L3220J0269j1847J1204N0071
8954A97474N6265K3447j7041l1964j5263L937o609l5876m1736j5012Q805J1566
8942A37993J5278K6502J7160j3303j9885R864K5410J105j6069M590J6890j2051
8930A93484k9669O162L6331L11m5116j9287L2817J5221m2242l0218M0706M7526
8918B06026l0706o7714J99O9222M1129k7402l4950Q279K8004J1786l867j3741
8906A86265k8294k4270J5474N2048M2930M886k7762n6351p4422l5735N9289J08044
8894B22102L3624p7962p8723K7951R1895L4863n1598n7246m29L1038J2723q887
8882A79351r41K1439K8698P899k8629m6284j8345L2866N1110J8637j7708j5307
$$ plain form
8966 207610 185468 186108 223944 229001 168324 106064 104557 137777 148046 136199 147403 197474
8954 197474 253739 277186 260145 228181 212918 216855 210246 174370 132634 117622 126427 137993
8942 137993 153271 179773 196933 183630 163745 173609 199019 200124 184055 188645 205535 193484
8930 193484 163815 169977 206308 206619 161503 142216 175033 190254 148012 117794 158500 206026
8918 206026 175320 107606 107805 177027 218156 190754 155804 164083 192087 203873 200006 186265
8906 186265 157971 133701 149175 201223 244153 249039 221277 164926 90504 54769 114058 222102
8894 222102 255726 177764 99041 126992 218887 253750 202152 144906 144477 175515 188238 179351
8882 179351 178410 199849 228547 236446 207817 161533 143188 176054 227164 245801 228093 212786
8870B12786L510m984l0622k7453N698J9267m938k0799N124L1713P173l7554k5735
8857A33186M1782P4407K4567l7925l1685J5537K1516j6820l1253o224O48k8853
8845A58883l4672J3708N5083L5053m081J810L0836J9861k1762k8381Q860K8729
8833B63927L127k2428j1091P878j787j7281L588M4910M5905j0256o3507n2398
8821A90587L943L3065J0333j1219J2151M4722L0778j2328k3797j625P89k3725
8809B53674k2644J4565L0381M712n005K5441L0372k6677o9163k8867L2169K4266
8797B63224j7664l650M8116N0644R632L098K4343l197o0675m4254M1685O6441
8785C77743q147n3781Q190P3028L5539l3577k2126K7965P651n9149o0573N433
$$ plain form
8870 212786 216296 211312 180690 153237 158935 178202 173264 152465 157589 189302 196475 158921 133186
8857 133186 174968 249375 273942 236017 204332 219869 241385 224565 193312 187088 187736 158883
8845 158883 124211 137919 193002 228055 223974 225784 256620 276481 254719 226338 235198 263927
8833 263927 267054 244626 233535 241413 239626 222345 225933 270843 316748 306492 242985 190587
8821 190587 194530 227595 237928 226709 238860 283582 314360 302032 278235 276610 277399 253674
8809 253674 231030 245595 275976 280688 275683 301124 331496 304819 235656 206789 238958 263224
8797 263224 245560 241910 290026 340670 350302 353400 377743 374546 313871 269617 311302 377743
8785 377743 369596 315815 324005 397033 432572 398995 376869 404834 412485 353336 292763 298196
8773B98196L3883l356k2015J7332M7794K2454r590J457K4474J3936j0052l385
8761D11128K6602L7008J2781k2377l9128k2675K0258N6715N1007R652j8291k906
8749E19774K5192J6759k8218o0607m5377Q47M0417N7818N4860K6436k1765m3277
8737E42859N332Q0188P6959k0855r2583m6267L7393K9657l6801k5653O2807Q2104
8725F95140p757n9413J7942J03422O5940k5918l6756J3253J8877j1263K054L5468
8713H10989J0443l4374J78P5047N8995l5893n7880K9252Q6501L6123k6301j7962
8701I35118P267k41J3879P0511P3707k1048r2953l8223N4321M9578j5015j0263
8689A026638O1635Q4864K9317j6737N77L9803N3329L8011L311k8540j0886N7905
$$ plain form
8773 298196 332079 328723 306708 324040 371834 394288 384698 386155 410629 424565 414513 411128
8761 411128 437730 474738 487519 465142 426014 403339 423597 480312 531319 540971 522680 519774
8749 519774 544966 561725 533507 472900 427523 428370 468787 526605 581465 607901 586136 542859
8737 542859 548191 628379 705338 684483 591900 545633 583026 612683 575882 550229 613036 695140
8725 695140 687383 627970 645912 749334 815274 789356 752600 765853 784730 773467 775521 810989
8713 810989 821432 787058 787236 862283 921278 885385 827505 856757 943258 979381 953080 935118
8701 935118 942385 942144 956023 1026534 1100241 1079193 986240 948017 1002338 1051916 1036901 1026638
8689 1026638 1088273 1173137 1202454 1185717 1186294 1226097 1279426 1317437 1320748 1292208 1281322 1339227
8677A339227Q6201M470j02002q5048N4313J57083J18468Q373m5179j0519M6164
8666A571551N8706K5358k470J5395N2815N2525J9759J9588N9314O1444M350j4149
8654A924186O0170J18141N4616l9711j1876J00418J32749O7377M1676R3313J07381
8643B648440M5988K2924Q5604J17011M8207o649N6081J51235J50570Q3439N7053
8632C459903P6297P7273O1624O9861Q3374O7055N1844P1771Q0807L3379j8542
8621D114646j2419J1181q459l0947j82K3818l7853j16927q8864J3766M6054j6697
8609C897117o2088m6464m0801o0713l0620M6258N5686l1629r1792m7506J2993
8598C600441O65l1064o519L4610K8706P003J1925j145o0234p6482J6661J14009
$$ plain form
8677 1339227 1425428 1429898 1327896 1242848 1297161 1454244 1572712 1581085 1535906 1525387 1571551
8666 1571551 1630257 1655615 1653145 1668540 1721355 1773880 1793639 1813227 1872541 1933985 1938335 1924186
8654 1924186 1984356 2102497 2157113 2117402 2105526 2205944 2338693 2406070 2447746 2541059 2648440
8643 2648440 2694428 2717352 2802956 2919967 2968174 2961525 3017606 3168841 3319411 3402850 3459903
8632 3459903 3536200 3613473 3675097 3744958 3828332 3895387 3947231 4019002 4099809 4133188 4114646
8621 4114646 4102227 4113408 4104949 4074002 4073820 4097638 4059785 3942858 3853994 3867760 3913814 3897117
8609 3897117 3835029 3788565 3747764 3687051 3656431 3702689 3758375 3726746 3634954 3587448 3600441
8598 3600441 3601106 3570042 3563523 3598133 3626839 3633842 3645767 3644622 3584388 3507906 3524567 3638576
8586C638576Q3002j4432j6929O7465Q0544n474k8780R3427K19910K00348Q9202
8575D406859K9210L3064J5174l2178l9606r753k7944j11899j68944j42128j00657
8564C851198j23676j71654j56670r1289o7692j02144j05463l4431K3961j7702
8554C004438j05856j21075n1434O469K440j4133m384o29k2273k3654K0213N3665
8542B743787K9748p215K260L4725L9535L7454P3118J12323Q8079K4469J2978P5758
8530C267019J48080J89817K18134K35711K29780K37762K95785L20844J88845m0807
8520E290970j41133l0789Q7836J7028j56409k25391j85400j93304k73729k90676
8510C899003k06801j53438j93615k10944j24622m6535r7002j93786j77204o2523
$$ plain form
8586 3638576 3721578 3707146 3690217 3757682 3838226 3832752 3803972 3897399 4117309 4317657 4406859
8575 4406859 4436069 4469133 4484307 4452129 4412523 4402770 4374826 4262927 4093983 3951855 3851198
8564 3851198 3727522 3555868 3399198 3307909 3240217 3138073 3032610 2998179 3022140 3004438
8554 3004438 2898582 2777507 2726073 2732542 2734982 2720849 2716465 2715836 2693563 2669909 2690122 2743787
8542 2743787 2773535 2766320 2768580 2803305 2842840 2880294 2953412 3065735 3153814 3178283 3191261 3267019
8530 3267019 3415099 3604916 3823050 4058761 4288541 4526303 4822088 5142932 5331777 5290970
8520 5290970 5149837 5119048 5206884 5223912 5067503 4842112 4656712 4463408 4189679 3899003
8510 3899003 3692202 3538764 3345149 3134205 3009583 2963048 2866046 2672260 2495056 2432533
8500B432533n597n3407q8777l5089K6647Q82o8324p0922j135L7565j1731p8084
8488B084561o7533M510M4106K1010L468L1716L9494l0810j00953n3124P7678J37722
8476B191845Q6527N2719J14948J74826J36280P2977Q5878J09709K9605r0558r2236
8465B872520K855J0550j13989k01269j48216p6159j10701j77042j48270o2783
8455A847496m2143q6159j00868o7577m3347l7931k0884j5343n9851j07542q6411
8444A179440l1233k7895n3581j5771O2308N4025n6556j30458q6205r117J1284
8433H96241J0637L4944K9668m6471j04312m7815N9339P8255j968o7060n5218j6307
8421G69933k244k649J408L836O600J9423K0665j8389o7618o2574l877L2674M133
$$ plain form
8500 2432533 2426936 2373529 2284752 2249663 2276310 2277192 2208868 2137946 2136811 2174376 2162645 2084561
8488 2084561 2017028 2021538 2065644 2086654 2090122 2121838 2161332 2130522 2029569 1976445 2054123 2191845
8476 2191845 2278372 2331091 2446039 2620865 2757145 2830122 2916000 3025709 3055314 2964756 2872520
8465 2872520 2875375 2885925 2771936 2570667 2422451 2346292 2235591 2058549 1910279 1847496
8455 1847496 1805353 1719194 1618326 1550749 1507402 1469471 1448587 1433244 1373393 1265851 1179440
8444 1179440 1148207 1120312 1066731 1050960 1113268 1167293 1110737 980279 894074 884957 896241
8433 896241 906878 941822 971490 925019 820707 772892 832231 910486 908518 841458 786240 769933
8421 769933 767689 765040 766448 770284 776884 796307 816972 798583 730965 668391 664514 697188 701321
8408G01321l9694l3441J1187K6979j4915o3517m5934L7509R1362K9379r9514j44923
8396D55799m2740R1993J14067L1473l9092n0710n2957o2692l1908L8546O8572
8385E20351K6413j1267J5380M9809J6802n0501o6263k6090L461P09L939J9087
8373E01830J599n2066p1772j3418O1174N7160k4146q1663m3363M3969P9024L4559
8361D92887j9721k1725M228J653k4921k4412J0292K8400L311k9696l6998l3412
8349C49886l5092j7491L2940O5449K4804n3173o9436P358Q9470P5650k3000r6869
8337C50496p0432J1087M5268M650l3443p27O0840N6572k4571r1957p5221o163
8325B26399M0609L8299J0930j1828j1066J5599L7163J2836m2964o1573j5497L5646
$$ plain form
8408 701321 661627 628186 639373 666352 651437 587920 541986 579495 670857 700236 600722 455799
8396 455799 413059 505052 619119 650592 611500 560790 507833 445141 413233 451779 520351
8385 520351 546764 535497 550877 600686 617488 566987 500724 474634 478095 478804 482743 501830
8373 501830 503429 451363 379591 366173 427347 484507 460361 378698 335335 379304 458328 492887
8361 492887 473166 451441 455669 457322 432401 407989 418281 446681 449992 420296 383298 349886
8349 349886 314794 297303 330243 395692 420496 367323 297887 305245 394715 470365 447365 350496
8337 350496 280064 291151 336419 341069 307626 306899 367739 424311 399740 307783 232562 226399
8325 226399 267008 305307 316237 304409 293343 308942 346105 358941 315977 254404 238907 274553
8313B74553L4330Q629J2261K9261R226l6017m8746k0893J443m47l795n702k3990
8300B30113l6976j211O0372O7685L296n2301l7200R610K1770j751k3016k8870
8288B11521k0076J4013O0153O6041J2398m2175m2018j6104j7979k9603l583L3746
8276B26334J6174l9633m6163J1606M5417O897l4468j0585L2337J6767l3752l7057
8264A53874J0537L7108K0904J4507L4607K5389l2947o6795j9159N0789N0948q437
8252B71325m1934k1262L550L366N477K3126K7650R775q33J270j5767m6222l6301
8239A83220J3850K2248m0871p5676J054J02169Q0143m7529j13464l9346O6940
8228A52738Q3054K7532j2736j8739k7263m1806l3194j760K1819K5278K2520K2173
$$ plain form
8313 274553 308883 317512 329773 359034 368260 332243 283497 262604 264047 263600 259805 254103 230113
8300 230113 193137 191926 252298 319983 323279 270978 233778 243388 265158 263407 240391 211521
8288 211521 191445 205458 265611 331652 344050 301875 259857 243753 225774 196171 192588 226334
8276 226334 242508 202875 156712 168318 213735 220632 186164 175579 207916 224683 190931 153874
8264 153874 164411 201519 222423 236930 271537 296926 263979 197184 178025 228814 279762 271325
8252 271325 229391 208129 211679 215045 220522 243648 271298 281073 280240 281510 265743 219521 183220
8239 183220 197070 219318 178447 102771 103825 205994 286137 238608 125144 85798 152738
8228 152738 235792 263324 250588 231849 204586 162780 129586 127826 149645 174923 197443 219616
8216B19616J7091k602l7816o6617m6176L4192J05279Q1105j9292q0202m3807J7228
8204A77999K2004k738N881L0228J5059k2360k1930Q169P203k5208k8517O771K1780
8191A94341l038j4680J2321K9246M377j8880l609J2856p997k8103M99M0510K2935
8178B40778l4256m7507J265M0105K4716R95J7820M4704K7141k1721m2970k0792
8166B30278O736J5437K0171L0227K8642Q505j0261j4833j4342r470J1230L0425
8154C32745Q927m1267m9796M359M0670l989o3683l8034M7685Q3130M4729Q025
8142C73501P22k3516n6148k4409N3800N7183l3162o8644L1140J27113P4970m3843
8130D68707o6023q934k075m0163j3472O1948O1129j4092k9075M0099O6606J0505
$$ plain form
8216 219616 236707 234105 196289 129672 83496 117688 222967 304072 284780 204578 160771 177999
8204 177999 200003 197265 203146 233374 248433 226073 204143 212312 219515 194307 165790 172561 194341
8191 194341 191303 176623 188944 218190 222567 203687 200078 212934 204937 176834 177333 217843 240778
8178 240778 206522 159015 160280 200385 225101 226096 243916 288620 315761 294040 251070 230278
8166 230278 237014 252451 272622 302849 331491 339996 329735 314902 300560 291090 302320 332745
8154 332745 341672 300405 250609 254968 295638 291649 227966 189932 237617 320747 365476 373501
8142 373501 374223 350707 294559 270150 323950 381133 347971 279327 310467 437580 512550 468707
8130 468707 402684 393750 391675 351512 338040 399988 461117 447025 417950 458049 524655 535160
8118E35160j4547L0657K9795n5170q1115K3337J02469K7891p2138k7129Q3968
8107E83178P3918l2715n7719J8561M3771k7024o6900j1827M4502L4030J2959K2358
8095F37092J3332k4463j1714O6068R3088M753q8190o2338L3196O8232K8602J155
8083G58813J3933J2431k2979m0242l774N3520P8493N2339m082m5440l1774K6198
8071H47436O6448M7806R77k0537j1274K99P055J9826L0662K5237J5641J6708O324
8058A052608m0494q9115p5507l484M5943K3139k3288k3710J0204J4125j9259k7170
8046H43992J5852M4802L223n6567m4449K3746M4684p365l6158J6983P0282L4138
8034I53163l7666l3906L4637O0868J5137k9450l3277k7995j7424L0386P7299L7659
$$ plain form
8118 535160 520613 551270 581065 525895 444780 468117 570586 598477 526339 499210 583178
8107 583178 657096 624381 566662 585223 628994 601970 535070 523243 567745 601775 614734 637092
8095 637092 650424 625961 614247 680315 773403 778156 689966 627628 660824 729056 757658 758813
8083 758813 772746 785177 762198 721956 718182 771702 850195 902534 898452 853012 821238 847436
8071 847436 913884 961690 962667 942130 930856 931155 938210 958036 988698 1013935 1029576 1046284 1052608
8058 1052608 1012114 922999 847492 844008 889951 913090 889802 866092 876296 890421 871162 843992
8046 843992 859844 904646 907869 851302 806853 830599 875283 867918 831760 848743 919025 953163
8034 953163 915497 881591 916228 977096 992233 962783 929506 901511 884087 914473 991772 1029431
8022A029431o0217p7515J5706P2808M489o9683k3697N8912L1400o1819o6781J1188
8010H64222K5824m5851o7207Q139N2284o643n4761K945O5357J778j19834j30918
7998E95335k0664O5413N6878K9658L6644J9900n3409r5765l2113O0738N7519k3686
7986F96448n1883J0678N7347J6174l9288k3558J6651q612o9940o7326m615J8671
7974E50747j5616j6409M0111N0042l6239j04190m9089M8096M5347l8217o6302
7963D08281o255L9880J3533k7684l0247j9412k3763k2732l790P273J819M759J5790
7950C57452L214k8182l3445n012J6987J9874K6376K3655k3501p8546n7633K7635
7938B48874O3353P617m3898k0800J2438j3729m8007k1323K2052J0511j8003J0542
$$ plain form
8022 1029431 969214 891699 907405 980213 984702 915019 891322 950234 981634 919815 853034 864222
8010 864222 890046 844195 776988 785127 837411 830768 776007 778952 844309 846087 726253 595335
7998 595335 574671 640084 696962 726620 763264 783164 729755 633990 601877 662615 720134 696448
7986 696448 644565 655243 712590 728764 689476 665918 682569 673957 604017 536691 532076 550747
7974 550747 535131 518722 558833 608875 572636 468446 419357 467453 512800 474583 408281
7963 408281 402026 441906 455439 427755 397508 378096 354333 331601 327811 335084 336903 341662 357452
7950 357452 360666 332484 299039 294027 311014 330888 357264 380919 357418 278872 221239 248874
7938 248874 312227 319844 275946 255146 267584 253855 205848 184525 206577 217088 199085 209627
7926B09627N7325K7767n9276q9679k7636M5160O0496K9918j8012o6701p5546j2551
7914H0892O8313P4109P407l6599j7951J220j9178k8029J5259N7285L2306l4106
7902B00928o5762m0256l42J1850p348l0583k1268K8532P1301N1204j2999m1062
7890A44195m557K9902L640m3449l7456J3658L2294j3261o3561n0001J6371O2951
7878I0726M8217P900l010R107n868m6917m7650J1505M4858j5106r1430o1959M4702
7865a4925P7673n622p1760k1434O0258N0551j7714k6833K8342M5773m950l7177
7853F2182L920N4674L8360k0715m5238j9668J960j4881l9237k6136J6859L7823
$$ plain form
7926 209627 266952 294719 235443 145764 118128 163288 223784 253702 235690 168989 93443 80892
7914 80892 149205 223314 230721 194122 176171 177391 158213 130184 145443 202728 235034 200928
7902 200928 135166 94910 94568 106418 99070 68487 47219 75751 147052 198256 185257 144195
7890 144195 139638 169540 173180 129731 92275 105933 138227 124966 61405 11404 27775 90726
7878 90726 138943 146843 143833 152940 147072 100155 52505 64010 108868 93762 2332 -59627 -14925
7865 -14925 62748 57126 -14634 -36068 24190 74741 57027 30194 58536 104309 99359 62182
7853 62182 66102 120776 159136 138421 93183 73515 75475 60594 21357 -4779 12080 49903
$$ [...]
##END NTUPLES=NMR SPECTRUM
##END=
