##TITLE=1H ikalashn
EC-3332(3)
27.9.2024
##JCAMPDX= 6.0         $$ Bruker NMR JCAMP-DX V2.0
##DATA TYPE= NMR SPECTRUM
##DATA CLASS= NTUPLES
##ORIGIN= UXNMR, Bruker Analytische Messtechnik GmbH
##OWNER= root
$$ TOPSPIN		Version 1.3
$$ 2024-09-27 10:25:34.093 +0400  Irina@DPX200
$$ Compression mode = diff/dup
##.OBSERVE FREQUENCY= 200.131392401
##.OBSERVE NUCLEUS= ^1H
##.ACQUISITION MODE= SIMULTANEOUS
##.ACQUISITION SCHEME= undefined
##.AVERAGES= 16
##.DIGITISER RES= 18
##SPECTROMETER/DATA SYSTEM= spect
##.PULSE SEQUENCE= zg
##.SOLVENT NAME= CDCl3
##.SHIFT REFERENCE= INTERNAL, CDCl3, 1, 17.95386
##AUDIT TRAIL= $$ (NUMBER, WHEN, WHO, WHERE, WHAT)
$$ ##TITLE= Audit trail, TOPSPIN		Version 1.3
$$ ##JCAMPDX= 5.01
$$ ##ORIGIN= Bruker BioSpin GmbH
$$ ##OWNER= Irina
$$ $$ F:/spectra/data/iren/nmr/1H/4/pdata/1/auditp.txt
$$ ##AUDIT TRAIL=  $$ (NUMBER, WHEN, WHO, WHERE, VERSION, WHAT)
(   1,<2024-09-27 10:25:00.187 +0400>,<Irina>,<DPX200>,<TOPSPIN 1.3>,
      <created by zg
	started at 2024-09-27 10:23:52.015 +0400,
	POWCHK disabled, PULCHK disabled
       configuration hash MD5:
       BE 6D 3F 07 2A EA 11 49 91 17 2B D3 AF B3 58 0D
       data hash MD5: 16K
       24 10 93 CC C5 94 D4 19 B7 7B B4 EC 7E 44 58 ED>)
(   2,<2024-09-27 10:25:00.203 +0400>,<Irina>,<DPX200>,<TOPSPIN 1.3>,
      <Start of raw data processing
       efp BC_mod = 2 LB = 0.02 FT_mod = 6 PKNL = 1 PHC0 = 292.0821 PHC1 = 28.00898 SI = 32K 
       data hash MD5: 32K
       4E FF 16 E3 81 64 64 19 4C B0 26 30 1D 66 1E C8>)
(   3,<2024-09-27 10:25:02.796 +0400>,<Irina>,<DPX200>,<TOPSPIN 1.3>,
      <apk 
       data hash MD5: 32K
       E0 26 67 CA BA 3E 72 CE 32 11 6E DE DA CB FA 6A>)
(   4,<2024-09-27 10:25:05.125 +0400>,<Irina>,<DPX200>,<TOPSPIN 1.3>,
      <abs n ABSG = 5 
       data hash MD5: 32K
       41 40 48 8B 92 BB 2C 53 1C C7 E9 DE 18 76 6F 63>)
(   5,<2024-09-27 10:25:22.750 +0400>,<Irina>,<DPX200>,<TOPSPIN 1.3>,
      <pk fgphup PHC0 = 14.64912 PHC1 = -22.4 
       data hash MD5: 32K
       CF A5 91 F5 35 A2 38 77 93 70 E9 80 7A A6 81 3E>)
(   6,<2024-09-27 10:25:24.203 +0400>,<Irina>,<DPX200>,<TOPSPIN 1.3>,
      <abs n ABSG = 5 
       data hash MD5: 32K
       74 FA 58 C4 B7 8E 3D 32 BD 7A AB F2 B5 F8 B0 FF>)
$$ ##END=
$$ 
$$ $$ hash MD5
$$ $$ 27 7A C1 B9 F4 16 F4 29 6D 00 42 BA D6 2D 8A 83
##$RELAX= 
##$RELAX= 
##$RELAX= 
##$RELAX= 
##$RELAX= 
##$RELAX= 
##$RELAX= 
##$RELAX= 
##$RELAX= 
$$ Bruker specific parameters
$$ --------------------------
##$DU= <F:/spectra>
##$EXPNO= 4
##$NAME= <1H>
##$PROCNO= 1
##$TYPE= <nmr>
##$USER= <iren>
##$AMP= (0..31)
100 100 100 100 100 100 100 100 100 100 100 100 100 100 100 100 100 100 
100 100 100 100 100 100 100 100 100 100 100 100 100 100 
##$ANAVPT= -1
##$AQSEQ= 0
##$AQ_mod= 1
##$AUNM= <au_zg>
##$AUTOPOS= <>
##$BF1= 200.13
##$BF2= 200.13
##$BF3= 200.13
##$BF4= 200.13
##$BF5= 200.13
##$BF6= 200.13
##$BF7= 200.13
##$BF8= 200.13
##$BYTORDA= 1
##$CFDGTYP= 0
##$CFRGTYP= 5
##$CHEMSTR= <none>
##$CNST= (0..63)
$$ [...]
##$SW_h= 4401.40845070422
##$TD= 16384
##$TD0= 1
##$TE= 300
##$TE2= 300
##$TE3= 300
##$TEG= 300
##$TL= (0..7)
0 120 120 120 120 120 120 120 
##$TP= (0..7)
150 150 150 150 150 150 150 150 
##$TP07= 0
##$TPNAME0= <>
##$TPNAME1= <>
##$TPNAME2= <>
##$TPNAME3= <>
##$TPNAME4= <>
##$TPNAME5= <>
##$TPNAME6= <>
##$TPNAME7= <>
##$TPOAL= (0..7)
0.5 0.5 0.5 0.5 0.5 0.5 0.5 0.5 
##$TPOFFS= (0..7)
0 0 0 0 0 0 0 0 
##$TUNHIN= 0
##$TUNHOUT= 0
##$TUNXOUT= 0
##$USERA1= <user>
##$USERA2= <user>
##$USERA3= <user>
##$USERA4= <user>
##$USERA5= <user>
##$V9= 5
##$VALIST= <valist>
##$VCLIST= <CCCCCCCCCCCCCCC>
##$VD= 0
##$VDLIST= <DDDDDDDDDDDDDDD>
##$VPLIST= <PPPPPPPPPPPPPPP>
##$VTLIST= <TTTTTTTTTTTTTTT>
##$WBST= 1024
##$WBSW= 25
##$XGAIN= (0..3)
0 0 0 0 
##$XL= 0
##$YL= 0
##$YMAX_a= 390351
##$YMIN_a= -748826
##$ZGOPTNS= <>
##$ZL1= 120
##$ZL2= 120
##$ZL3= 120
##$ZL4= 120
##$ABSF1= 17.95386
##$ABSF2= -4.038887
##$ABSG= 5
##$ABSL= 3
##$ALPHA= 0
##$AQORDER= 0
##$ASSFAC= 0
##$ASSFACI= 0
##$ASSFACX= 0
##$ASSWID= 0
##$AUNMP= <proc_1d>
##$AXLEFT= 0
##$AXRIGHT= 0
##$AXTYPE= 0
##$AXUNIT= <>
##$AZFE= 0.1
##$AZFW= 0.1
##$BCFW= 0
##$BC_mod= 2
##$BYTORDP= 0
##$COROFFS= 0
##$CY= 7568.61572265625
##$DATMOD= 1
##$DC= 0
##$DFILT= <>
##$DTYPP= 0
##$F1P= 17.9538593292236
##$F2P= -4.03888763876832
##$FCOR= 0.5
##$FTSIZE= 32768
##$FT_mod= 6
##$GAMMA= 0
##$GB= 0
##$INTBC= 0
##$INTSCL= 1.483618e-010
##$ISEN= 128
##$LB= 0.02
##$LEV0= 0
##$LPBIN= 0
##$MAXI= 945.577
##$MC2= 0
##$MEAN= 0
##$ME_mod= 0
##$MI= -402.1523
##$NCOEF= 0
##$NC_proc= -5
##$NLEV= 6
##$NOISF1= 8.587773
##$NOISF2= 6.764455
##$NSP= 0
##$NTH_PI= 0
##$NZP= 0
##$OFFSET= 17.95386
##$PC= 1
##$PHC0= 310.8521
##$PHC1= 2.69257
##$PH_mod= 1
##$PKNL= yes
##$PPARMOD= 0
##$PPDIAG= 0
##$PPIPTYP= 0
##$PPMPNUM= 100
##$PPRESOL= 1
##$PSCAL= 0
##$PSIGN= 0
##$REVERSE= no
##$SF= 200.13
##$SI= 32768
##$SIGF1= 16.12182
##$SIGF2= -4.496377
##$SINO= 3.521527
##$SIOLD= 32768
##$SREGLST= <1H.CDCl3>
##$SSB= 0
##$STSI= 32768
##$STSR= 0
##$SW_p= 4401.40845070423
##$SYMM= 0
##$S_DEV= 0
##$TDeff= 16384
##$TDoff= 0
##$TI= <>
##$TILT= no
##$TM1= 0
##$TM2= 0
##$TOPLEV= 0
##$USERP1= <user>
##$USERP2= <user>
##$USERP3= <user>
##$USERP4= <user>
##$USERP5= <user>
##$WDW= 1
##$XDIM= 32768
##$YMAX_p= 362403773
##$YMIN_p= -214591
$$ End of Bruker specific parameters
$$ ---------------------------------
##NTUPLES= NMR SPECTRUM
##VAR_NAME=  FREQUENCY,     SPECTRUM/REAL,   SPECTRUM/IMAG
##SYMBOL=    X,             R,               I
##VAR_TYPE=  INDEPENDENT,   DEPENDENT,       DEPENDENT
##VAR_FORM=  AFFN,          ASDF,            ASDF
##VAR_DIM=   32768,         32768,           32768
##UNITS=     HZ,            ARBITRARY UNITS, ARBITRARY UNITS
##FACTOR=    0.134324425510551, 1,           1
##FIRST=     4401.40845070423, 9337,         -502793
##LAST=      0,             -127729,         -792722
##MIN=       0,             -214591,         0
##MAX=       4401.40845070423, 362403773,    0
$$ Real data points
##PAGE= N=1
##DATA TABLE= (X++(R..R)), XYDATA
$$ [...]
$$ plain form
13596 63960 96713 167689 197151 182413 181564 211639 225825 196511 162700 167887 193628 192095
13584 192095 157379 124807 115163 118847 128376 147674 167870 170870 165155 182869 226074 249715
13572 249715 223211 181539 180974 221127 249301 235525 202777 178875 160311 142184 146537 187503
13560 187503 231329 230520 190499 165972 188613 230423 248033 235172 215619 206030 205404 207770 206750
13547 206750 195369 176124 164700 171451 186715 196601 203538 214929 220025 200823 166067 151890
13535 151890 178791 222363 239213 215393 179485 171027 203427 255480 291165 287385 251137 215137
13523 215137 210691 235921 253547 231746 186688 167837 195020 230261 227488 190960 160209 154216
13511 154216 164883 193900 248540 297535 284616 210119 153075 174614 234958 251867 215412
$$ packed form
13596F3960L2753P0976K9462j4738q49L0075J4186k9314l3811N187K5741j533
13584A92095l4716l2572r644L684R529J9298K0196L000n715J7714M3205K3641
13572B49715k6504m1672n65M0153K8174j3776l2748k3902j8564j8127M353M0966
13560A87503M3826q09m0021k4527K2641M1810J7610j2861j9553r589o26K366j020
13547B06750j1381j9245j1424O751J5264R886O937J1391N096j9202l4756j4177
13535A51890K6901M3572J6850k3820l5908q458L2400N2053L5685l780l6248l6000
13523B15137m446K5230J7626k1801m5058j8851K7183L5241k773l6528l0751n993
13511A54216J0667K9017N4640M8995j2919p4497n7044K1539O0344J6909l6455
$$ plain form
13500 215412 189951 212076 244288 240712 211210 196234 209605 233611 253085 268159 278010 272709
13488 272709 248670 224754 231254 275010 322025 331319 305743 287338 297903 313477 311525 309077
13476 309077 326187 342829 331875 311803 320234 349042 355262 331443 315717 328687 346244 343453
13464 343453 324837 302613 282811 279179 301335 324109 312617 283638 290659 335444 352518 307935
13452 307935 257098 264426 312675 339953 330807 318981 323226 330450 330601 326159 313714 290030 270424
13439 270424 273493 295154 319834 344309 368148 377342 363711 345926 345659 356216 358233 351159 346060
13426 346060 344166 346139 363544 394877 409034 381710 333526 305705 311654 334182 352418 350750
13414 350750 324216 297000 308256 355827 386666 370944 347252 358781 386343 390890 382554 391718
$$ packed form
13500B15412k5461K2125L2212l576k9502j4976J3371K4006J9474J5074R851n301
13488B72709k4039k3916O500M3756M7015R294k5576j8405J0565J5574j952k448
13476C09077J7110J6642j0954k0072Q431K8808O220k3819j5726J2970J7557k791
13464C43453j8616k2224j9802l632K2156K2774j1492k8979P021M4785J7074m4583
13452C07935n0837P328M8249K7278r146j1826M245P224J51m442j2445k3684j9606
13439B70424L069K1661K4680K4475K3839R194j3631j7785k67J0557K017p074n099
13426C46060j894J973J7405L1333J4157k7324m8184k7821N949K2528J8236j668
13414C50750k6534k7216J1256M7571L0839j5722k3692J1529K7562M547q336R164
$$ plain form
13402 391718 405704 395527 377767 387064 411362 417774 417887 439798 460593 442075 411394 423621
13390 423621 462412 468318 452575 480866 545096 560637 506696 461276 469410 483636 472141 477032
13378 477032 513937 520711 472505 447042 495272 540542 502080 437593 452232 526530 554169 514361
13366 514361 487447 510656 528049 494542 441118 416668 430279 466321 504714 517877 491656
13355 491656 452322 437369 448129 464190 482628 502792 501426 472188 458208 488499 516285 488772
13343 488772 445000 461234 522203 540437 496225 461351 475237 492960 481013 476937 514586 561625
13331 561625 574922 563426 558028 564530 577012 595910 608880 595305 567997 565803 590322 600512
13319 600512 585014 582281 607781 622279 602969 587575 609175 638854 635733 610811 599166 605233
$$ packed form
13402C91718J3986j0177j7760R297K4298O412J13K1911K0795j8518l0681J2227
13390D23621L8791N906j5743K8291O4230J5541n3941m5420Q134J4226j1495M891
13378D77032L6905O774m8206k5463M8230M5270l8462o4487J4639P4298K7639l9808
13366E14361k6914K3209J7393l3507n3424k4450J3611L6042L8393J3163k6221
13355D91656l9334j4953J0760J6061J8438K0164j366k9238j3980L0291K7786k7513
13343D88772m3772J6234O0969J8234m4212l4874J3886J7723j1947m076L7649M7039
13331E61625J3297j1496n398O502J2482J8898J2970j3575k7308k194K4519J0190
13319F00512j5498k733K5500J4498j9310j5394K1600K9679l121k4922j1645O067
$$ plain form
13307 605233 614439 626897 644744 654798 651757 649780 651658 642751 630410 641298 662143 643923
13295 643923 593060 588679 662746 731440 710590 641197 622134 661829 685295 665540 656807 693669
13283 693669 735502 734378 703626 690426 711100 736996 733865 705200 692825 724699 770481 779545
13271 779545 758253 759872 792672 803987 777714 771758 815657 848558 821956 790148 817034 859074
13259 859074 840689 794002 809220 877350 902445 859853 824388 835756 849711 841967 852405 893680
13247 893680 913592 887834 863754 872577 880300 866168 867717 900920 914474 877477 841091 856642
13235 856642 898550 924751 946715 977847 980106 936080 913765 974284 1061246 1072412 1010657 972911
13223 972911 1004783 1054130 1068848 1061108 1060408 1066194 1067422 1065638 1064969 1069473 1090225 1126120 1148707
$$ packed form
13307F05233R206J2458J7847J0054l041j977J878q907j2341J0888K0845j8220
13295F43923n0863m381P4067O8694k0850o9393j9063L9695K3466j9755q733L6862
13283F93669M1833j124l0752j3200K0674K5896l131k8665j2375L1874M5782R064
13271G79545k1292J619L2800J1315k6273n956M3899L2901k6602l1808K6886M2040
13259H59074j8385m6687J5218O8130K5095m2592l5465J1368J3955p744J0438M1275
13247H93680J9912k5758k4080Q823P723j4132J549L3203J3554l6997l6386J5551
13235H56642M1908K6201K1964L1132K259m4026k2315O0519Q6962J1166o1755l7746
13223I72911L1872M9347J4718p740p00N786J228j784o69M504K0752L5895K2587
$$ plain form
13210 1148707 1139872 1127837 1145520 1173401 1173304 1159775 1177234 1216977 1224815 1193186 1176738 1201478
13198 1201478 1223574 1204915 1172983 1171667 1198769 1228439 1257212 1290059 1312096 1313253 1317498 1348891
13186 1348891 1385175 1383624 1345004 1315957 1326980 1358397 1376336 1379777 1395909 1437249 1479098 1486381
13174 1486381 1457977 1432126 1441884 1477368 1506263 1520979 1541023 1570510 1583499 1565135 1544536
13163 1544536 1564196 1626193 1689708 1721266 1730578 1750689 1794191 1841603 1871632 1889259 1914230
13152 1914230 1950785 1986255 2018333 2061583 2117460 2157514 2154676 2121284 2099495 2118370 2169871
13141 2169871 2219176 2230688 2195871 2144444 2114246 2103461 2075535 2021757 1984574 1992451 2006520
13130 2006520 1975762 1920156 1904164 1938465 1967765 1960775 1953099 1979704 2015421 2015922 1982611 1951701
$$ packed form
13210A148707q835j2035J7683K7881r7j3529J7459L9743P838l1629j6448K4740
13198A201478K2096j8659l1932j316K7102K9670K8773L2847K2037J157M245L1393
13186A348891L6284j551l8620k9047J1023L1417J7939L441J6132M1340M1849P283
13174A486381k8404k5851R758L5484K8895J4716K0044K9487J2989j8364k0599
13163A544536J9660O1997O3515L1558R312K0111M3502M7412L0029J7627K4971
13152A914230L6555L5470L2078M3250N5877M0054k838l3392k1789J8875N1501
13141B169871M9305J1512l4817n1427l0198j0785k7926n3778l7183P877J4069
13130B006520l0758n5606j5992L4301K9300o990p676K6605L5717N01l3311l0910
$$ plain form
13118 1951701 1942216 1947599 1963569 1992695 2026242 2045779 2045006 2037222 2039720 2055549 2069477 2063077 2038013
13105 2038013 2016959 2011769 2003989 1976538 1950084 1956888 1987955 2004866 2000884 2005147 2021333 2013450
13093 2013450 1971198 1939752 1953501 1982118 1979930 1953769 1940169 1944182 1946442 1949189 1967267 1987424
13081 1987424 1984979 1974409 1996096 2051923 2097907 2106260 2093973 2081243 2062237 2033177 2012824 2012157
13069 2012157 2011765 1993237 1969828 1960417 1952441 1921046 1874430 1848445 1856124 1870568 1865456 1848789
13057 1848789 1841936 1843388 1835232 1817276 1810001 1821170 1832568 1830202 1826923 1837325 1847562 1835792
13045 1835792 1812341 1808554 1827130 1836469 1821995 1810439 1825574 1847648 1843054 1816042 1801529 1813808
13033 1813808 1829461 1823299 1801611 1792359 1811843 1847214 1871192 1872887 1868693 1876172 1885932 1877000 1855261
$$ packed form
13118A951701r485N383J5970K9126L3547J9537p73p784K498J5829J3928o400k5064
13105B038013k1054n190p780k7451k6454O804L1067J6911l982M263J6186p883
13093B013450m2252l1446J3749K8617k188k6161j3600M013K260K747J8078K0157
13081A987424k445j0570K1687N5827M5984Q353j2287j2730j9006k9060k0353o67
13069B012157l92j8528k3409r411p976l1395m6616k5985P679J4444n112j6667
13057A848789o853J452q156j7956p275J1169J1398k366l279J0402J0237j1770
13045A835792k3451l787J8576R339j4474j1556J5135K2074m594k7012j4513J2279
13033A813808J5653o162k1688r252J9484L5371K3978J695m194P479R760q932k1739
$$ plain form
13020 1855261 1851096 1875794 1906954 1924221 1930592 1928087 1906391 1874166 1865672 1887817 1895444 1858097
13008 1858097 1820351 1843410 1905394 1921207 1862629 1799063 1799933 1847083 1876934 1872870 1872058 1895878
12996 1895878 1917897 1909105 1883852 1878160 1895089 1899571 1872831 1845003 1851069 1874526 1872325 1848169
12984 1848169 1852813 1901459 1941159 1927655 1890127 1881389 1901551 1917099 1923647 1935386 1935783 1899621
12972 1899621 1852766 1849047 1888913 1917891 1908810 1889950 1885047 1882085 1875219 1883030 1905472 1912265 1895414
12959 1895414 1886422 1899967 1908690 1898252 1896545 1916445 1920346 1883584 1848032 1862192 1903872 1917740
12947 1917740 1903139 1904163 1925934 1923966 1883728 1857003 1894194 1971838 2016123 1990341 1939349 1938450
12935 1938450 2001366 2055999 2029211 1942781 1890958 1923271 1991300 2024309 2013936 1997547 1996028
$$ packed form
13020A855261m165K4698L1160J7267O371k505k1696l2225q494K2145P627l7347
13008A858097l7746K3059O1984J5813n8578o3566Q70M7150K9851m064q12K3820
12996A895878K2019q792k5253n692J6929M482k6740k7828O066K3457k201k4156
12984A848169M644M8646L9700j3504l7528q738K0162J5548O548J1739L97l6162
12972A899621m6855l719L9866K8978r081j8860m903k962o866P811K2442O793j6851
12959A895414q992J3545Q723j0438j707J9900L901l6762l5552J4160M1680J3868
12947A917740j4601J024K1771j968m0238k6725L7191P7644M4285k5782n0992q99
12935A938450O2916N4633k6788q6430n1823L2313O8029L3009j0373j6389j519
$$ plain form
12924 1996028 2004179 2016132 2025358 2019283 2002103 2000714 2022599 2037399 2030360 2037993 2088026 2137945
12912 2137945 2128802 2077211 2052735 2074909 2094798 2079435 2055274 2055885 2076634 2098420 2116053 2126306
12900 2126306 2121405 2108896 2109045 2121618 2122694 2102735 2080076 2068871 2061311 2050025 2042643 2046059 2058048
12887 2058048 2077654 2102195 2115503 2103847 2079269 2060314 2039610 2005594 1984293 2011375 2066516
12876 2066516 2089528 2066978 2047589 2060247 2074570 2062811 2043219 2034372 2022524 2007896 2026449
12865 2026449 2082402 2113974 2080572 2034791 2043406 2079594 2071210 2026952 2025420 2085385 2136629 2135380
12853 2135380 2126648 2157802 2199862 2203711 2182886 2184277 2209828 2223895 2219889 2224130 2237991 2228933
12841 2228933 2190490 2167755 2198549 2255984 2277657 2241127 2187276 2170428 2202228 2248799 2272946
$$ packed form
12924A996028Q151J1953R226o075j7180j389K1885J4800p039P633N0033M9919
12912B137945r143n1591k4476K2174J9889j5363k4161O11K0749K1786J7633J0253
12900B126306m901j2509J49J2573J076j9959k2659j1205p560j1286p382L416J1989
12887B058048J9606K4541J3308j1656k4578j8955k0704l4016k1301K7082N5141
12876B066516K3012k2550j9389J2658J4323j1759j9592q847j1848j4628J8553
12865B026449N5953L1572l3402m5781Q615L6188q384m4258j532N9965N1244j249
12853B135380q732L1154M2060L849k0825J391K5551J4067m006M241J3861r058
12841B228933l8443k2735L0794N7435K1673l6530n3851j6848L1800M6571K4147
$$ plain form
12830 2272946 2271071 2268213 2281807 2300299 2304921 2302630 2316777 2344504 2349870 2313951 2269007 2258997
12818 2258997 2282526 2303091 2303261 2295610 2288293 2278384 2277204 2300050 2326862 2318126 2279158 2260235 2278102
12805 2278102 2290657 2271897 2252742 2254402 2246098 2217125 2222400 2286937 2329888 2276396 2193481 2202476
12793 2202476 2289199 2329213 2292475 2281745 2344008 2386675 2342439 2290071 2320561 2384167 2378430
12782 2378430 2316632 2294703 2333437 2364207 2354140 2346543 2373719 2407733 2410104 2377491 2335029 2323435
12770 2323435 2377933 2476010 2529537 2483253 2399270 2382875 2443599 2499406 2507263 2510586 2548243 2589950
12758 2589950 2590170 2554556 2524450 2528919 2569381 2623392 2654680 2646055 2625475 2633928 2672206 2708668
12746 2708668 2730331 2750769 2775613 2798155 2822829 2856092 2881773 2882130 2873193 2882396 2905589 2924856
$$ packed form
12830B272946j875k858J3594J8492M622k291J4147K7727N366l5919m4944j0010
12818B258997K3529K0565J70p651p317r909j180K2846K6812q736l8968j8923J7867
12805B278102J2555j8760j9155J660q304k8973N275O4537M2951n3492q2915Q995
12793B202476Q6723M0014l6738j0730O2263M2667m4236n2368L0490O3606n737
12782B378430o1798k1929L8734L0770j0067p597K7176L4014K371l2613m2462j1594
12770B323435N4498R8077N3527m6284q3983j6395O0724N5807P857L323L7657M1707
12758B589950K20l5614l0106M469M0462N4011L1288q625k0580Q453L8278L6462
12746B708668K1663K0438K4844K2542K4674L3263K5681L57q937R203K3193J9267
$$ plain form
12734 2924856 2948602 2989006 3023664 3031957 3043220 3087634 3127640 3112661 3077054 3095224 3154844
12723 3154844 3174152 3142710 3137617 3186603 3226107 3226403 3248768 3328879 3403730 3417131 3410956 3443904
12711 3443904 3496893 3529917 3562484 3622541 3677267 3692077 3705508 3768410 3854486 3906221 3928752
12700 3928752 3965328 4018531 4068389 4131135 4225333 4314039 4356729 4387535 4464235 4568613 4639745
12689 4639745 4682949 4758854 4876623 4983230 5056009 5126530 5210404 5287673 5358611 5449252 5552888
12678 5552888 5631392 5685431 5762960 5884921 6015851 6119697 6198127 6267904 6345646 6455894
12668 6455894 6608509 6770775 6907866 7041167 7213179 7407275 7567510 7692829 7840733
12659 7840733 8032775 8227597 8401632 8588027 8811533 9043881 9252875 9450314 9665736
$$ packed form
12734B924856K3746M0404L4658Q293J1263M4414M0006j4979l5607J8170N9620
12723C154844J9308l1442n093M8986L9504K96K2365Q0111P4851J3401o175L2948
12711C443904N2989L3024L2567O0057N4726J4810J3431O2902Q6076N1735K2531
12700C928752L6576N3203M9858O2746R4198Q8706M2690L0806P6700J04378P1132
12689D639745M3204P5905J17769J06607P2779P0521Q3874P7269P0938R0641J03636
12678E552888P8504N4039P7529J21961J30930J03846P8430O9777P7742J10248
12668F455894J52615J62266J37091J33301J72012J94096J60235J25319J47904
12659G840733J92042J94822J74035J86395K23506K32348K08994J97439K15422
$$ plain form
12650 9665736 9906706 10159689 10400407 10601576 10764166 10934928 11155396 11407700 11653643
12641 11653643 11900883 12171273 12434516 12653643 12873561 13168755 13513091 13807296 14039466
12632 14039466 14305325 14649056 15001294 15314935 15647320 16045589 16452545 16804541 17142177
12623 17142177 17542031 17999791 18458914 18908950 19384722 19899614 20435476 20977151 21526094
12614 21526094 22106133 22762047 23505222 24267695 24984413 25712525 26567899 27547358 28545135
12605 28545135 29555900 30698024 31995640 33326649 34670305 36208339 38054543 40086408
12597 40086408 42219529 44647586 47571377 50871518 54367383 58268981 62937760 68126758
12589 68126758 72817881 76010771 77495025 77750621 77331642 76535579 75485458 74241445
$$ packed form
12650I665736K40970K52983K40718K01169J62590J70762K20468K52304K45943
12641A1653643K47240K70390K63243K19127K19918K95194L44336K94205K32170
12632A4039466K65859L43731L52238L13641L32385L98269M06956L51996L37636
12623A7142177L99854M57760M59123M50036M75772N14892N35862N41675N48943
12614B1526094N80039O55914P43175P62473P16718P28112Q55374R79459R97777
12605B8545135J010765J142124J297616J331009J343656J538034J846204K031865
12597D0086408K133121K428057K923791L300141L495865L901598M668779N188998
12589F8126758M691123L192890J484254K55596m18979p96063j050121j244013
$$ plain form
12581 74241445 72802509 71151130 69376612 67745047 66620978 66251441 66568991 67290388
12573 67290388 68324379 69968398 72464192 75400794 77873843 79338365 80059112 80621501
12565 80621501 81295405 82074680 83041489 84336920 85910648 87640624 89631917 92042921
12557 92042921 94583249 96507651 97248535 96864886 95780745 94298962 92527618 90604299
12549 90604299 88733947 87003591 85347573 83801791 82715578 82541537 83297763 84294649
12541 84294649 84582003 83755013 82215598 80596968 79130770 77718282 76365792 75200653
12533 75200653 74170253 73143797 72351663 72319234 73220606 74681294 76458093 78918768 82388811
12524 82388811 86208218 88954030 89670765 88550721 86369444 83643521 80507436 77041318
$$ packed form
12581G4241445j438936j651379j774518j631565j124069l69537L17550P21397
12573F7290388J033991J644019K495794K936602K473049J464522P20747N62389
12565H0621501O73904P79275R66809J295431J573728J729976J991293K411004
12557I2042921K540328J924402P40884l83649j084141j481783j771344j923319
12549I0604299j870352j730356j656018j545782j086213j74041P56226R96886
12541H4294649K87354q26990j539415j618630j466198j412488j352490j165139
12533G5200653j030400j026456p92134l2429R01372J460688J776799K460675L470043
12524H2388811L819407K745812P16735j120044k181277k725923l136085l466118
$$ plain form
12516 77041318 73336430 69347016 65003546 60507692 56306855 52710788 49660348 46918412
12508 46918412 44367436 42047044 39995829 38173235 36525019 35042806 33733582 32568886
12500 32568886 31490080 30451346 29443746 28484352 27591330 26764415 25980741 25212986 24458716
12491 24458716 23746379 23101689 22513276 21946455 21387871 20857448 20375759 19941649 19546176
12482 19546176 19182854 18833456 18470346 18090047 17720083 17372600 17016930 16624778 16218697
12473 16218697 15842883 15505560 15186971 14886419 14616747 14362565 14093334 13817423 13574391
12464 13574391 13368145 13157700 12926708 12710181 12529196 12349412 12139268 11925629 11747750
12455 11747750 11591264 11418749 11239777 11092784 10970171 10821877 10635914 10458347 10318610
$$ packed form
12516G7041318l704888l989414m343470m495854m200837l596067l050440k741936
12508D6918412k550976k320392k051215j822594j648216j482213j309224j164696
12500C2568886j078806j038734j007600r59394q93022q26915p83674p67755p54270
12491B4458716p12337o44690n88413n66821n58584n30423m81689m34110l95473
12482A9546176l63322l49398l63110l80299l69964l47483l55670l92152m06081
12473A6218697l75814l37323l18589l00552k69672k54182k69231k75911k43032
12464A3574391k06246k10445k30992k16527j80985j79784k10144k13639j77879
12455A1747750j56486j72515j78972j46993j22613j48294j85963j77567j39737
$$ plain form
12446 10318610 10186289 10027840 9863557 9733498 9636488 9538990 9424619 9300375 9168872 9030937
12436 9030937 8907941 8823812 8762589 8677208 8548896 8410192 8299273 8218603 8152805 8099492
12426 8099492 8057576 8005244 7921942 7825666 7758087 7730018 7707703 7660485 7597311 7541259 7489000
12415 7489000 7419728 7334365 7259053 7207942 7165509 7114564 7062731 7026560 7003220 6976575 6943114
12404 6943114 6910928 6876352 6826443 6769799 6739958 6752371 6775742 6766156 6719289 6669804 6646831
12393 6646831 6650261 6665591 6679369 6679701 6663237 6646070 6649115 6667313 6670893 6644277 6608692 6599372
12381 6599372 6632821 6698385 6764517 6790554 6756023 6689298 6647307 6655014 6683555 6697807 6699646 6706550
12369 6706550 6714501 6710519 6701852 6699217 6683914 6628909 6549836 6498284 6495678 6502971 6470813 6399896
$$ packed form
12446A0318610j32321j58449j64283j30059r7010r7498j14371j24244j31503j37935
12436I030937j22996q4129o1223q5381j28312j38704j10919q0670o5798n3313
12426H099492m1916n2332q3302r6276o7579k8069k2315m7218o3174n6052n2259
12415G489000o9272q5363p5312n1111m2433n0945n1833l6171k3340k6645l3461
12404F943114l2186l4576m9909n6644k9841J2413K3371r586m6867m9485k2973
12393F646831L430J5330J3778L32j6464j7167L045J8198L580k6616l5585r320
12381F599372L3449O5564O6132K6037l4531o6725m1991P707K8541J4252J839O904
12369F706550P951l982q667k635j5303n5005p9073n1552k606P293l2158p0917
$$ plain form
12357 6399896 6334722 6309066 6315684 6329331 6343177 6366377 6386974 6363212 6277189 6182846 6159164
12346 6159164 6209652 6249619 6211257 6122265 6054784 6036402 6047841 6071423 6095000 6097871 6084242
12335 6084242 6104249 6184508 6263175 6263934 6217756 6228530 6318067 6395322 6400800 6391449 6435104 6497042
12323 6497042 6498875 6440197 6390163 6382545 6381052 6341431 6261409 6168255 6085533 6012242 5924205 5808805
12311 5808805 5699429 5643035 5627530 5588065 5503185 5429829 5409675 5397584 5334698 5244684 5192592
12300 5192592 5180518 5153252 5091804 5037815 5029547 5064507 5119170 5161233 5156090 5110565 5095240 5167204
12288 5167204 5280843 5335175 5304388 5257245 5244233 5233779 5179023 5086984 4991555 4904790 4826571
12277 4826571 4766164 4722005 4663791 4560934 4416393 4260781 4127307 4035158 3977159 3921243
$$ packed form
12357F399896o5174k5656O618J3647J3846K3200K0597k3762q6023r4343k3682
12346F159164N0488L9967l8362q8992o7481j8382J1439K3582K3577K871j3629
12335F084242K0007Q0259P8667P59m6178J0774Q9537P7255N478r351M3655O1938
12323F497042J833n8678n0034p618j493l9621q0022r3154q2722p3291q8037j15400
12311E808805j09376n6394j5505l9465q4880p3356k0154j2091o2886r0014n2092
12300E192592j2074k7266o1448n3989q268L4960N4663M2063n143m5525j5325P1964
12288E167204J13639N4332l0787m7143j3012j0454n4756r2039r5429q6765p8219
12277D826571o0407m4159n8214j02857j44541j55612j33474r2149n7999n5916
$$ plain form
12267 3921243 3843168 3755305 3683899 3629127 3574562 3521993 3481615 3440207 3379532 3316764 3284670
12256 3284670 3280823 3278535 3273874 3272977 3251288 3187341 3122974 3118429 3155305 3162658 3135824 3138214 3177427
12243 3177427 3182471 3132330 3103074 3139335 3177183 3157128 3122226 3127885 3136799 3092324 3027187 3003311
12231 3003311 3000258 2963738 2918650 2927185 2966769 2959231 2905054 2881777 2912458 2937928 2926130 2911385
12219 2911385 2909899 2889970 2851079 2844852 2883197 2904405 2871028 2831582 2840593 2879649 2906509 2927874
12207 2927874 2968550 3010491 3019744 3007181 3010594 3032513 3040947 3023333 3001196 2992552 2990420 2983849
12195 2983849 2979441 2990810 3011847 3011289 2966537 2903168 2877175 2903002 2927149 2902723 2861027 2862315
12183 2862315 2897693 2902867 2863181 2835247 2851922 2873790 2862952 2844448 2854632 2877361 2877267 2859580
$$ packed form
12267C921243p8075q7863p1406n4772n4565n2569m0378m1408o0675o2768l2094
12256C284670l847k288m661q97k1689o3947o4367m545L6876P353k6834K390L9213
12243C177427N044n0141k9256L6261L7848k0055l4902N659Q914m4475o5137k3876
12231C003311l053l6520m5088Q535L9584p538n4177k3277L0681K5470j1798j4745
12219B911385j486j9929l8891o227L8345K1208l3377l9446R011L9056K6860K1365
12207B927874M0676M1941R253j2563L413K1919Q434j7614k2137q644k132o571
12195B983849m408J1369K1037n58m4752o3369k5993K5827K4147k4426m1696J288
12183B862315L5378N174l9686k7934J6675K1868j0838j8504J0184K2729r4j7687
$$ plain form
12171 2859580 2850356 2844163 2817437 2776296 2747964 2733605 2707772 2663516 2626965 2621047 2633329 2627429
12159 2627429 2582221 2519370 2487043 2506311 2541654 2543718 2512063 2486080 2480425 2469271 2437230 2402840
12147 2402840 2380823 2363094 2351705 2366798 2401324 2411505 2379666 2347160 2354238 2382775 2390666 2370271
12135 2370271 2340202 2310795 2291464 2301778 2339064 2362498 2345169 2315752 2313270 2328037 2325604 2302709
12123 2302709 2278510 2254745 2227964 2219469 2246644 2279765 2271822 2221237 2167396 2136612 2127676 2134078
12111 2134078 2143017 2129666 2090116 2060368 2064737 2071937 2048426 2025801 2055535 2118349 2144976 2114746
12099 2114746 2066381 2019967 1962467 1911183 1911618 1954709 1969573 1925512 1875702 1868759 1879738 1867071
12087 1867071 1840152 1824088 1806632 1772225 1749947 1772563 1815003 1827290 1810674 1809043 1834148
$$ packed form
12171B859580r224o193k6726m1141k8332j4359k5833m4256l6551n918J2282n900
12159B627429m5208o2851l2327J9268L5343K064l1655k5983n655j1154l2041l4390
12147B402840k2017j7729j1389J5093L4526J0181l1839l2506P078K8537P891k0395
12135B370271l0069k9407j9331J0314L7286K3434j7329k9417k482J4767k433k2895
12123B302709k4199k3765k6781q495K7175L3121p943n0585n3841l0784q936O402
12111B134078Q939j3351l9550k9748M369P200k3511k2625K9734O2814K6627l0230
12099B114746m8365m6414n7500n1284M35M3091J4864m4061m9810o943J0979j2667
12087A867071k6919j6064j7456l4407k2278K2616M2440J2287j6616j631K5105
$$ plain form
12076 1834148 1850231 1834688 1808703 1795591 1785486 1762338 1741206 1751287 1789414 1815469 1801279
12065 1801279 1767515 1756874 1780035 1809493 1823503 1827472 1826227 1810055 1786899 1792871 1839706 1882919
12053 1882919 1881290 1860390 1870832 1908082 1929067 1929722 1941605 1959802 1944196 1898065 1877866 1909241
12041 1909241 1953985 1977883 1992177 2008461 2013141 2011241 2036481 2090214 2128198 2135631 2153322 2197806
12029 2197806 2224458 2213248 2221032 2290652 2370955 2394231 2378618 2381690 2402004 2406171 2410760 2448769
12017 2448769 2486177 2466453 2420581 2435519 2515743 2573111 2568207 2568395 2632096 2715896 2746746 2729690
12005 2729690 2729357 2775681 2834013 2857842 2843343 2832334 2865946 2931854 2972520 2961813 2945496 2971134
11993 2971134 3010056 3005127 2970695 2970445 3005083 3007163 2958797 2927853 2955728 2990047 2978330 2959756
$$ packed form
12076A834148J6083j5543k5985j3112j0105k3148k1132J0081L8127K6055j4190
12065A801279l3764j0641K3161K9458J4010L969j245j6172k3156N972M6835M3213
12053A882919j629k0900J0442L7250K0985O55J1883J8197j5606m6131k0199L1375
12041A909241M4744K3898J4294J6284M680j900K5240N3733L7984P433J7691M4484
12029B197806K6652j1210P784O9620Q0303K3276j5613L072K0314M167M589L8009
12017B448769L7408j9724m5872J4938Q0224N7368m904J88O3701Q3800L0850j7056
12005B729690l33M6324N8332K3829j4499j1009L3612O5908M0666j0707j6317K5638
11993B971134L8922m929l4432k50L4638K080m8366l0944K7875L4319j1717j8574
$$ plain form
11981 2959756 2999841 3082676 3135847 3133424 3112635 3105079 3106361 3107601 3112642 3123943 3140500 3164300
11969 3164300 3188014 3191657 3173778 3165763 3190268 3228672 3257341 3287835 3334347 3368782 3356120 3315947
11957 3315947 3296771 3299061 3278323 3224064 3180151 3175324 3184169 3176666 3161345 3152673 3135289 3095747
11945 3095747 3060188 3060505 3080764 3078025 3048924 3034620 3054971 3075744 3059676 3022961 3014066 3048733
11933 3048733 3092148 3104191 3081326 3050335 3038410 3055786 3091541 3115935 3100259 3048240 2999288
11922 2999288 2987637 3005317 3018121 3009728 2993021 2983191 2980245 2980430 2987537 3005028 3025603 3034222 3020042
11909 3020042 2989157 2968005 2982077 3021800 3044070 3023992 2990413 2987726 3016596 3042780 3054530
11898 3054530 3072051 3099668 3111198 3097334 3091031 3121792 3170367 3194890 3186373 3174683 3187278 3219880
$$ packed form
11981B959756M0085Q2835N3171k423k0789p556J282J240N041J1301J6557K3800
11969C164300K3714L643j7879q015K4505L8404K8669L0494M6512L4435j2662m0173
11957C315947j9176K290k0738n4259m3913m827Q845p503j5321q672j7384l9542
11945C095747l5559L17K0259k739k9101j4304K0351K0773j6068l6715q895L4667
11933C048733M3415J2043k2865l0991j1925J7376L5755K4394j5676n2019m8952
11922B999288j1651J7680J2804q393j6707r830k946J85P107J7491K0575Q619j4180
11909C020042l0885k1152J4072L9723K2270k0078l3579k687K8870K6184J1750
11898C054530J7521K7617J1530j3864o303L0761M8575K4523q517j1690J2595L2602
$$ plain form
11886 3219880 3245223 3241838 3217927 3208723 3241589 3303936 3357778 3383736 3394416 3407250 3425959 3449737
11874 3449737 3478372 3504520 3519795 3528508 3536997 3537388 3527727 3535655 3583774 3641399 3659977 3652708 3679855
11861 3679855 3749605 3802483 3814845 3843511 3926576 4010345 4035103 4035634 4083214 4169603 4228513 4246430
11849 4246430 4269145 4306924 4314975 4279178 4251601 4277310 4337809 4391036 4426672 4459001 4496366
11838 4496366 4538493 4582741 4620490 4644397 4663702 4695570 4743212 4800617 4870660 4955179 5036709
11827 5036709 5096317 5140364 5185394 5232827 5286624 5370861 5488820 5590436 5635203 5667498 5763152
11816 5763152 5911445 6026326 6079731 6142605 6268985 6415991 6521399 6597518 6695721 6823907
11806 6823907 6950985 7058725 7142318 7190430 7211195 7251580 7344968 7461710 7555997 7638786 7753982
$$ packed form
11886C219880K5343l385k3911r204L2866O2347N3842K5958J0680J2834J8709K3778
11874C449737K8635K6148J5275Q713Q489L91r661P928M8119N7625J8578p269K7147
11861C679855O9750N2878J2362K8666Q3065Q3769K4758N31M7580Q6389N8910J7917
11849D246430K2715L7779Q051l5797k7577K5709O0499N3227L5636L2329L7365
11838D496366M2127M4248L7749K3907J9305L1868M7642N7405P0043Q4519Q1530
11827E036709N9608M4047M5030M7433N3797Q4237J17959J01616M4767L2295R5654
11816E763152J48293J14881N3405O2874J26380J47006J05408P6119R8203J28186
11806F823907J27078J07740Q3593M8112K0765M0385R3388J16742R4287Q2789J15196
$$ plain form
11795 7753982 7900238 8034156 8146666 8278070 8447039 8616601 8753424 8879778 9035436
11786 9035436 9215745 9383372 9529159 9686972 9886015 10114825 10342848 10558937 10773790
11777 10773790 10997219 11232338 11485534 11759037 12032545 12276013 12488597 12703392 12944326
11768 12944326 13202277 13466130 13747986 14055564 14368154 14669611 14979401 15316602 15658963
11759 15658963 15979762 16301327 16660113 17036179 17377725 17689012 18030335 18426596 18838591
11750 18838591 19237418 19646231 20088005 20548446 21014798 21498920 21998784 22493400 23003086
11741 23003086 23591777 24268771 24950755 25578247 26215319 26962411 27811167 28670636 29518967
11732 29518967 30438394 31489304 32632171 33810328 35046083 36402428 37893231 39496368
$$ packed form
11795G753982J46256J33918J12510J31404J68969J69562J36823J26354J55658
11786I035436J80309J67627J45787J57813J99043K28810K28023K16089K14853
11777A0773790K23429K35119K53196K73503K73508K43468K12584K14795K40934
11768A2944326K57951K63853K81856L07578L12590L01457L09790L37201L42361
11759A5658963L20799L21565L58786L76066L41546L11287L41323L96261M11995
11750A8838591L98827M08813M41774M60441M66352M84122M99864M94616N09686
11741B3003086N88691O76994O81984O27492O37072P47092Q48756Q59469Q48331
11732B9518967R19427J050910J142867J178157J235755J356345J490803J603137
$$ plain form
11724 39496368 41236431 43185209 45380605 47823334 50575917 53768944 57444907 61505825
11716 61505825 65945225 71001038 76768119 82601330 87232572 89756688 90379241 89994912
11708 89994912 89206967 88052122 86505610 84748330 82861716 80733042 78509739 76783797
11700 76783797 76002953 75972506 76304525 77128804 78867930 81353948 83663256 84986661 85338797
11691 85338797 85259720 85133361 85044976 85070975 85353779 85908407 86617440 87505598 88876998 91051662
11681 91051662 93959445 97031026 99513938 100918462 101197446 100587636 99394961 97924266
11673 97924266 96422158 94938029 93352209 91711718 90431668 89900508 89885009 89594146 88435838
11664 88435838 86528012 84387019 82339821 80407537 78570718 76874521 75306519 73799780
$$ packed form
11724C9496368J740063J948778K195396K442729K752583L193027L675963M060918
11716F1505825M439400N055813N767081N833211M631242K524116O22553l84329
11708H9994912p87945j154845j546512j757280j886614k128674k223303j725942
11700G6783797p80844l0447L32019Q24279J739126K486018K309308J323405L52136
11691H5338797p9077j26359q8385K5999K82804N54628P09033Q88158J371400K174664
11681I1051662K907783L071581K482912J404524K78984o09810j192675j470695
11673I7924266j502108j484129j585820j640491j280050n31160j5499k90863j158308
11664H8435838j907826k140993k047198j932284j836819j696197j568002j506739
$$ plain form
11656 73799780 72426293 71464667 71187849 71614506 72533964 73806536 75591032 78128327 81192627
11647 81192627 83876799 85157753 84712912 83031953 80751169 78123023 75165517 71976306
11639 71976306 68649824 65104343 61293303 57494606 54125886 51308020 48827987 46500524
11631 46500524 44347872 42427788 40702737 39129486 37718827 36460515 35308778 34258343
11623 34258343 33319704 32425555 31492874 30568694 29768332 29071527 28339128 27543534 26812042
11614 26812042 26205428 25624179 24997986 24410049 23945467 23548704 23128246 22695108 22302057
11605 22302057 21934860 21557679 21197048 20896733 20641212 20388388 20129760 19871305 19609154
11596 19609154 19361550 19163598 18999461 18809635 18591948 18412643 18288526 18153669 17981340
$$ packed form
11656G3799780j373487r61626k76818M26657R19458J272572J784496K537295L064300
11647H1192627K684172J280954m44841j680959k280784k628146k957506l189211
11639G1976306l326482l545481l811040l798697l368720k817866k480033k327463
11631D6500524k152652j920084j725051j573251j410659j258312j151737j050435
11623C4258343r38639q94149r32681r24180q00362o96805p32399p95594p31492
11614B6812042o06614n81249o26193n87937m64582l96763m20458m33138l93051
11605B2302057l67197l77181l60631l00315k55521k52824k58628k58455k62151
11596A9609154k47604j97952j64137j89826k17687j79305j24117j34857j72329
$$ plain form
11587 17981340 17834661 17744562 17646416 17506269 17402378 17393732 17402505 17324809 17176752 17029707
11577 17029707 16875431 16667020 16434770 16244570 16078415 15864935 15604839 15367174 15175869
11568 15175869 14988198 14776851 14556690 14336396 14107640 13874048 13640900 13395592 13141896
11559 13141896 12918057 12731575 12521578 12246601 11962913 11745738 11577374 11391344 11187327
11550 11187327 11016931 10885897 10757040 10629098 10530491 10451638 10360676 10270007 10213937 10179249
11540 10179249 10130652 10082183 10067254 10063097 10027293 9985514 9995086 10043529 10078088 10116842 10223440
11529 10223440 10375466 10466474 10449246 10376594 10288558 10164920 10012668 9892551 9815298 9705133
11519 9705133 9518751 9322077 9195026 9127162 9061955 8987273 8927063 8886508 8854016 8826736 8801241
$$ packed form
11587A7981340j46679r0099r8146j40147j03891q646Q773p7696j48057j47045
11577A7029707j54276k08411k32250j90200j66155k13480k60096k37665j91305
11568A5175869j87671k11347k20161k20294k28756k33592k33148k45308k53696
11559A3141896k23839j86482k09997k74977k83688k17175j68364j86030k04017
11550A1187327j70396j31034j28857j27942r8607p8853r0962r0669n6070l4688
11540A0179249m8597m8469j4929m157l5804m1779R572M8443L4559L8754J06598
11529A0223440J52026R1008j7228p2652q8036j23638j52252j20117p7253j10165
11519I705133j86382j96674j27051o7864o5207p4682o0210m0555l2492k7280k5495
$$ plain form
11508 8801241 8770524 8751582 8775860 8832259 8865128 8851760 8835138 8854453 8890293 8908000 8910518
11497 8910518 8915129 8917112 8910770 8913848 8937568 8957445 8943468 8902486 8870265 8873584 8908164 8941036
11485 8941036 8937664 8902869 8879662 8884219 8871643 8808067 8741964 8738707 8768970 8741232 8634184 8512675
11473 8512675 8413542 8305436 8172963 8049311 7941018 7806407 7640443 7500075 7409644 7318853
11463 7318853 7194090 7076268 7003430 6946166 6867724 6784676 6720405 6656140 6572783 6488755 6419720
11452 6419720 6353608 6291017 6247027 6193303 6079967 5940721 5878275 5903727 5897621 5791782 5679747
11441 5679747 5662821 5690943 5663007 5596611 5575156 5590988 5568600 5503330 5457434 5443118 5416793
11430 5416793 5371561 5339241 5316763 5277161 5233137 5208498 5175343 5103962 5039680 5036432 5049456
$$ packed form
11508H801241l0717j8942K4278N6399L2869j3368j6622J9315L5840J7707K518
11497H910518M611J983o342L078K3720J9877j3977m0982l2221L319L4580L2872
11485H941036l372l4795k3207M557j2576o3576o6103l257L0263k7738j07048j21509
11473H512675r9133j08106j32473j23652j08293j34611j65964j40368r0431r0791
11463G318853j24763j17822p2838n7264p8442q3048o4271o4265q3357q4028o9035
11452F419720o6112o2591m3990n3724j13336j39246o2446K5452o106j05839j12035
11441E679747j6926K8122k7936o6396k1455J5832k2388o5270m5896j4316k6325
11430E416793m5232l2320k2478l9602m4024k4639l3155p1381o4282l248J3024
$$ plain form
11419 5049456 4998630 4907949 4867828 4880341 4864975 4810115 4789689 4818089 4816008 4752075 4702037
11408 4702037 4719749 4748704 4718487 4650655 4611463 4617755 4639200 4650542 4643931 4622323 4603772 4605559
11396 4605559 4619583 4632030 4653762 4692125 4718718 4717462 4730046 4786003 4829473 4805280 4777056
11385 4777056 4843738 4964438 5001258 4932868 4881540 4909062 4934640 4900043 4869783 4894663 4906605
11374 4906605 4842260 4764095 4757659 4793185 4790213 4753294 4746076 4779314 4811818 4826069 4831319 4825764
11362 4825764 4814637 4828699 4874892 4911891 4918093 4930673 4973720 5011212 5022296 5055186 5145340
11351 5145340 5244030 5291081 5296308 5288476 5254593 5198477 5182944 5230298 5252998 5176986 5067313
11340 5067313 5028297 5039170 5003091 4911667 4838958 4802430 4750795 4674992 4617863 4579328 4516014
$$ packed form
11419E049456n0826r0681m0121J2513j5366n4860k0426K8400k081o3933n0038
11408D702037J7712K8955l0217o7832l9192O292K1445J1342o611k1608j8551J787
11396D605559J4024J2447K1732L8363K6593j256J2584N5957M3470k4193k8224
11385D777056O6682J20700L6820o8390n1328K7522K5578l4597l0260K4880J1942
11374D906605o4345p8165o436L5526k972l6919p218L3238L2504J4251N250n555
11362D825764j1127J4062M6193L6999O202J2580M3047L7492J1084L2890R0154
11351E145340R8690M7051N227p832l3883n6116j5533M7354K2700p6012j09673
11340E067313l9016J0873l6079r1424p2709l6528n1635p5803n7129l8535o3314
$$ plain form
11329 4516014 4431923 4372145 4331614 4266410 4189093 4153251 4148486 4115482 4064237 4064858 4110860 4108355
11317 4108355 4027036 3949134 3930200 3918904 3865404 3807983 3786917 3759912 3680079 3590825 3563152
11306 3563152 3583616 3577777 3516898 3440769 3393141 3382247 3391443 3393883 3370227 3334549 3323297 3343508
11294 3343508 3360955 3354744 3347092 3357983 3368466 3356822 3337602 3334071 3339012 3332769 3319077 3316791
11282 3316791 3332304 3359458 3390562 3413125 3413402 3395033 3376932 3365979 3351712 3331557 3317023 3311102
11270 3311102 3304970 3299595 3303869 3310251 3300909 3277769 3256696 3236108 3206549 3185884 3201817 3240263
11258 3240263 3257353 3245655 3239866 3250301 3243437 3204229 3168374 3169836 3196628 3220058 3232625 3238723
11246 3238723 3240270 3246300 3266400 3286302 3283663 3272365 3290911 3340154 3375397 3370304 3348044 3340299
$$ packed form
11329D516014q4091n9778m0531o5204p7317l5842m765l3004n1245O21M6002k505
11317D108355q1319p7902j8934j1296n3500n7421k1066k7005p9833q9254k7673
11306C563152K0464n839o0879p6129m7628j0894R196K440k3656l5678j1252K0211
11294C343508J7447o211p652J0891J0483j1644j9220l531M941o243j3692k286
11282C316791J5513K7154L1104K2563K77j8369j8101j0953j4267k0155j4534n921
11270C311102o132n375M274O382r342k3140k1073k0588k9559k0665J5933L8446
11258C240263J7090j1698n789J0435o864l9208l5855J462K6792K3430J2567O098
11246C238723J547O030K0100J9902k639j1298J8546M9243L5243n093k2260p745
$$ plain form
11234 3340299 3355073 3389967 3434911 3459881 3445955 3427294 3450294 3495991 3506420 3485694 3498854
11223 3498854 3562501 3619231 3640172 3667045 3720404 3751294 3729906 3705861 3728363 3774252 3806881
11212 3806881 3840252 3890004 3925940 3933698 3962167 4043336 4121298 4133933 4119267 4164824 4284046
11201 4284046 4415394 4523615 4638178 4799841 5011547 5229166 5375770 5395162 5314766 5217676
11191 5217676 5137792 5040363 4920380 4832020 4779683 4677461 4487181 4308124 4241580 4242827 4205588
11180 4205588 4125971 4073592 4053877 4015351 3958419 3925069 3904216 3851027 3779823 3739566 3718317
11169 3718317 3669179 3607323 3580084 3564475 3503010 3422505 3402986 3439665 3452303 3425585 3419218
11158 3419218 3438300 3421984 3374181 3374545 3431765 3455368 3414923 3400541 3467059 3536633 3531009 3498232
$$ packed form
11234C340299J4774L4894M4944K4970j3926j8661K3000M5697J0429k0726J3160
11223C498854O3647N6730K0941K6873N3359L0890k1388k4045K2502M5889L2629
11212C806881L3371M9752L5936P758K8469Q1169P7962J2635j4666M5557J19222
11201D284046J31348J08221J14563J61663K11706K17619J46604J9392q0396r7090
11191E217676p9884r7429j19983q8360n2337j02222j90280j79057o6544J247l7239
11180D205588p9617n2379j9715l8526n6932l3350k0853n3189p1204m0257k1249
11169C718317m9138o1856k7239j5609o1465q0505j9519L6679J2638k6718o367
11158C419218J9082j6316m7803L64N7220K3603m0445j4382O6518O9574n624l2777
$$ plain form
11146 3498232 3522681 3591848 3640548 3663510 3697884 3739991 3757676 3754388 3758152 3773997 3798402 3850666
11134 3850666 3940656 4032664 4088489 4125533 4191472 4298356 4417708 4530692 4655120 4821850
11124 4821850 5029737 5221177 5319382 5311166 5269005 5257508 5250286 5190243 5094599 5024286 4976178
11113 4976178 4897493 4795518 4734988 4725340 4710057 4676976 4676837 4715716 4734326 4719387 4728672 4772415
11101 4772415 4779093 4722381 4673821 4676954 4675186 4624228 4570456 4548013 4501178 4389967 4277310
11090 4277310 4222305 4174151 4067101 3941972 3871937 3834090 3757819 3647652 3559608 3499352 3435183
11079 3435183 3373127 3334410 3294761 3223832 3148520 3106928 3080267 3035965 2989546 2957964 2908609
11068 2908609 2826522 2770528 2782495 2802272 2759287 2688528 2662983 2669002 2648295 2611648 2606672 2615631
$$ packed form
11146C498232K4449O9167M8700K2962L4374M2107J7685l288L764J5845K4405N2264
11134C850666Q9990R2008N5825L7044O5939J06884J19352J12984J24428J66730
11124D821850K07887J91440R8205q216m2161j1497p222o0043r5644p0313m8108
11113D976178p8685j01975o0530r648j5283l3081j39L8879J8610j4939R285M3743
11101D772415O678n6712m8560L133j768n0958n3772k2443m6835j11211j12657
11090D277310n5005m8154j07050j25129p0035l7847p6271j10167q8044o0256o4169
11079C435183o2056l8717l9649p0929p5312m1592k6661m4302m6419l1582m9355
11068B908609q2087n5994J1967J9777m2985p0759k5545O019k0707l6647m976Q959
$$ plain form
11056 2615631 2587248 2532945 2496936 2470530 2427205 2395795 2404797 2406554 2356046 2306807 2320780 2346398
11044 2346398 2308459 2255668 2279174 2339512 2327925 2257711 2233289 2259201 2248200 2201843 2208320
11033 2208320 2261448 2257688 2188228 2161161 2205493 2224271 2182675 2173021 2235184 2273757 2228292 2181198
11021 2181198 2212589 2273011 2284377 2258517 2237347 2213225 2179698 2171615 2194786 2202985 2191372 2216237
11009 2216237 2279648 2302305 2258245 2223267 2237836 2241428 2203469 2195380 2257691 2314369 2303566 2282260
10997 2282260 2311588 2344141 2321783 2289443 2311348 2357045 2366448 2353517 2357002 2360304 2342605 2337637
10985 2337637 2365231 2379445 2356736 2353598 2403703 2445861 2431089 2409219 2428287 2444658 2420967
10974 2420967 2412775 2459460 2488888 2439829 2384276 2410270 2470916 2473676 2439749 2446427 2481315 2482242
$$ packed form
11056B615631k8383n4303l6009k6406m3325l1410R002J757n0508m9239J3973K5618
11044B346398l7939n2791K3506O0338j1587p0214k4422K5912j1001m6357O477
11033B208320N3128l760o9460k7067M4332J8778m1596r654O2163L8573m5465m7094
11021B181198L1391O0422J1366k5860k1170k4122l3527q083K3171Q199j1613K4865
11009B216237O3411K2657m4060l4978J4569L592l7959q089O2311N6678j0803k1306
10997B282260K9328L2553k2358l2340K1905M5697R403j2931L485L302j7699m968
10985B337637K7594J4214k2709l138N0105M2158j4772k1870J9068J6371k3691
10974B420967q192M6685K9428m9059n5553K5994O0646K760l3927O678L4888R27
$$ plain form
10962 2482242 2460646 2461329 2458093 2410476 2365738 2383226 2415806 2389765 2344817 2366641 2432625 2454143
10950 2454143 2427016 2414502 2422932 2414400 2400587 2410808 2416072 2393429 2401815 2478881 2539801 2508229
10938 2508229 2462929 2506144 2575269 2558752 2515936 2580081 2703913 2720857 2627723 2585475 2646537
10927 2646537 2698207 2687551 2690499 2729128 2722770 2663292 2651506 2712564 2751515 2736606 2751239 2816123
10915 2816123 2836639 2784490 2760199 2809893 2844126 2808681 2778525 2807744 2835928 2820623 2821594 2876684
10903 2876684 2925822 2929698 2936428 2966877 2964513 2920829 2917354 2981491 3034575 3041284 3069629 3142237
10891 3142237 3177051 3145262 3138664 3203481 3255215 3240506 3237674 3309179 3393937 3432064 3460057 3502421
10879 3502421 3510852 3488353 3523045 3620764 3666133 3631782 3647757 3766528 3850069 3810061 3766788
$$ packed form
10962B482242k1596O83l236m7617m4738J7488L2580k6041m4948K1824O5984K1518
10950B454143k7127j2514Q430q532j3813J0221N264k2643Q386P7066O0920l1572
10938B508229m5300M3215O9125j6517m2816O4145J23832J6944r3134m2248O1062
10927B646537N1670j0656K948L8629o358n9478j1786O1058L8951j4909J4633O4884
10915B816123K0516n2149k4291M9694L4233l5445l0156K9219K8184j5305R71N5090
10903B876684M9138L876O730L0449k364m3684l475O4137N3084O709K8345P2608
10891C142237L4814l1789o598O4817N1734j4709k832P1505Q4758L8127K7993M2364
10879C502421Q431k2499L4692R7719M5369l4351J5975J18771Q3541m0008m3273
$$ plain form
10868 3766788 3827012 3894589 3867088 3839045 3922578 4030225 4037711 4017277 4098156 4220308 4242317
10857 4242317 4191250 4195484 4257161 4291806 4312763 4381860 4453891 4458805 4461445 4553551 4667570 4688287
10845 4688287 4668813 4737435 4865779 4933880 4956210 5032985 5137553 5166480 5152429 5215197 5340922
10834 5340922 5416912 5448187 5532679 5655767 5718160 5740001 5830550 5978664 6077000 6130675 6236803
10823 6236803 6378655 6448548 6459686 6529764 6667918 6779751 6864882 7003393 7167710 7261168
10813 7261168 7321746 7467029 7659321 7758736 7791937 7921829 8157085 8346792 8468167 8656879
10803 8656879 8933442 9167263 9345966 9612108 9985370 10315233 10567992 10895422 11348461
10794 11348461 11784390 12137788 12526281 13000242 13440236 13795294 14174247 14605232 14951973
$$ packed form
10868C766788O0224O7577k7501k8043Q3533J07647P486k0434Q0879J22152K2009
10857D242317n1067M234O1677L4645K0957O9097P2031M914K640R2106J14019K0717
10845D688287j9474O8622J28344O8101K2330P6775J04568K8927j4051O2768J25725
10834E340922P5990L1275Q4492J23088O2393K1841R0549J48114R8336N3675J06128
10823F236803J41852O9893J1138P0078J38154J11833Q5131J38511J64317R3458
10813G261168O0578J45283J92292R9415L3201J29892K35256J89707J21375J88712
10803H656879K76563K33821J78703K66142L73262L29863K52759L27430M53039
10794A1348461M35929L53398L88493M73961M39994L55058L78953M30985L46741
$$ plain form
10785 14951973 15166673 15379406 15639778 15822905 15890514 15979969 16123939 16156911 16028540 15934106
10775 15934106 15990596 16057894 16036298 16063355 16241846 16446179 16586848 16797159 17154976 17485520
10765 17485520 17660609 17837196 18165670 18508137 18691104 18801239 18975797 19126531 19136358 19114713
10755 19114713 19185579 19224663 19081391 18867950 18754396 18671231 18495665 18336200 18333398 18364326
10745 18364326 18256348 18121504 18159932 18295703 18339102 18360229 18557342 18879979 19127021 19315729
10735 19315729 19620497 20037944 20435333 20841870 21376175 21974649 22503742 23048238 23776068
10726 23776068 24615765 25384017 26125724 26996014 27911568 28668454 29312708 30040856 30819699
10717 30819699 31459836 31978016 32522904 33031375 33337245 33536377 33854873 34239098 34481023
$$ packed form
10785A4951973K14700K12733K60372J83127O7609Q9455J43970L2972j28371r4434
10775A5934106N6490O7298k1596K7057J78491K04333J40669K10311L57817L30544
10765A7485520J75089J76587L28474L42467J82967J10135J74558J50734R827k1645
10755A9114713P0866L9084j43272k13441j13554q3165j75566j59465k802L0928
10745A8364326j07978j34844L8428J35771M3399K1127J97113L22637K47042J88708
10735A9315729L04768M17447L97389M06537N34305N98474N29093N44496P27830
10726B3776068Q39697P68252P41707Q70290R15554P56886O44254P28148P78843
10717C0819699O40137N18180N44888N08471L05870J99132L18496L84225K41925
$$ plain form
10708 34481023 34664871 35054878 35606898 36043864 36366425 36818565 37373919 37742449 37893125
10699 37893125 38089362 38382691 38548866 38559026 38631557 38768117 38719230 38467964 38269781 38156396
10689 38156396 37888634 37460903 37149845 36994853 36744752 36390733 36216819 36241995 36172297 36000780
10679 36000780 36067434 36405757 36641441 36687125 36909805 37436324 37941244 38324444 38924591 39817148
10669 39817148 40589717 41102064 41776330 42808787 43793269 44490673 45269757 46380240 47485059
10660 47485059 48346204 49276508 50451907 51482039 52154128 52889747 53945915 54893889 55442573
10651 55442573 56025184 56970347 57862367 58370303 58921572 59855040 60718353 61162414 61695980
10642 61695980 62727797 63722392 64211252 64759348 65938601 67247566 68137005 69179059 71013504
$$ packed form
10708C4481023J83848L90007N52020M36966L22561M52140N55354L68530J50676
10699C7893125J96237K93329J66175J0160P2531J36560m8887k51266j98183j13385
10689C8156396k67762m27731l11058j54992k50101l54019j73914K5176o9698j71517
10679C6000780O6654L38323K35684M5684K22680N26519N04920L83200O00147Q92557
10669C9817148P72569N12347O74266J032457R84482O97404P79084J110483J104819
10660D7485059Q61145R30304J175399J030132O72089P35619J056168R47974N48684
10651E5442573N82611R45163Q92020N07936N51269R33468Q63313M44061N33566
10642F1695980J031817R94595M88860N48096J179253J308965Q89439J042054J834445
$$ plain form
10633 71013504 73067601 74641153 76318518 78866519 81706652 84074939 86695898 90521542
10625 90521542 94823258 98528449 102418784 107765426 113866652 119528463 125880175 134676469
10617 134676469 144930630 154944151 166634128 183132635 202710600 221214035 241236672
10610 241236672 271212469 311340036 346954916 362403773 357735371 345436947 333894381
10603 333894381 321458858 305078994 286081488 265783528 242591053 216888623 193749392
10596 193749392 177130024 164943805 153098368 141309247 131634646 123917653 116364154
10589 116364154 109019819 103288478 98924542 94391916 89581287 85633330 82526283 79151908
10581 79151908 75476587 72494700 70199158 67554056 64438865 61830548 60005240 58190917
$$ packed form
10633G1013504K054097J573552J677365K548001K840133K368287K620959L825644
10625I0521542M301716L705191L890335N346642O101226N661811O351712Q796294
10617A34676469J0254161J0013521J1689977J6498507J9577965J8503435K0022637
10610B41236672K9975797M0127567L5614880J5448857m668402j2298424j1542566
10603C33894381j2435523j6379864j8997506k0297960k3192475k5702430k3139231
10596A93749392j6619368j2186219j1845437j1789121r674601p716993p553499
10589A16364154p344335n731341m363936m532626m810629l947957l107047l374375
10581G9151908l675321k981887k295542k645102l115191k608317j825308j814323
$$ plain form
10573 58190917 56117506 54406363 53240057 52013608 50530525 49313186 48496542 47545771
10565 47545771 46307079 45293134 44685503 44013663 43047507 42108828 41293276 40252510 38961017
10556 38961017 37875002 37115309 36267707 35188531 34249386 33587479 32857358 31934464 31147354
10547 31147354 30600399 29963660 29149638 28514321 28162767 27726311 27063733 26523387 26259345
10538 26259345 25936488 25385165 24916198 24696571 24427586 23950513 23571541 23454492 23272360
10529 23272360 22819563 22414988 22314195 22243219 21918334 21543679 21377614 21252542 20948248
10520 20948248 20633126 20512038 20408522 20110055 19781702 19633463 19506738 19193041 18851846
10511 18851846 18709818 18635210 18409457 18148612 18057615 18020550 17832231 17603451 17543525 17553476
$$ packed form
10573E8190917k073411j711143j166306j226449j483083j217339q16644r50771
10565D7545771j238692j013945o07631o71840r66156r38679q15552j040766j291493
10556C8961017j086015p59693q47602j079176r39145o61907p30121r22894p87110
10547C1147354n46955o36739q14022o35317l51554m36456o62578n40346k64042
10538B6259345l22857n51323m68967k19627k68985m77073l78972j17049j82132
10529B3272360m52797m04575j00793p0976l24885l74655j66065j25072l04294
10520B0948248l15122j21088j03516k98467l28353j48239j26725l13697l41195
10511A8851846j42028p4608k25753k60845r0997l7065j88319k28780n9926R951
$$ plain form
10501 17553476 17418854 17207676 17102288 17027566 16819089 16578105 16485337 16433646 16221918 15954050
10491 15954050 15862426 15876287 15752433 15517333 15395110 15389923 15315751 15167796 15099162 15084738
10481 15084738 14962926 14772840 14710063 14771274 14764361 14654018 14589864 14605224 14587135 14539815 14589681
10470 14589681 14725051 14802494 14817765 14913481 15112605 15291140 15424457 15633117 15979046 16415962
10460 16415962 16912205 17416558 17757994 17814483 17733819 17749705 17835555 17792012 17609645 17454768
10450 17454768 17340741 17125181 16822618 16607317 16487533 16278394 15932836 15608370 15360458
10441 15360458 15056153 14651670 14279015 13986979 13661141 13275440 12963770 12760732 12524533
10432 12524533 12205161 11941603 11797967 11644508 11403714 11182205 11051318 10922094 10748026
$$ packed form
10501A7553476j34622k11178j05388p4722k08477k40984r2768n1691k11728k67868
10491A5954050r1624J3861j23854k35100j22223n187p4172j47955o8634j4424
10481A5084738j21812j90086o2777O1211o913j10343o4154J5360j8089m7320M9866
10470A4589681J35370P7443J5271R5716J99124J78535J33317K08660L45929M36916
10460A6415962M96243N04353L41436N6489q0664J5886Q5850m3543j82367j54877
10450A7454768j14027k15560l02563k15301j19784k09139l45558l24466k47912
10441A5360458l04305m04483l72655k92036l25838l85701l11670k03038k36199
10432A2524533l19372k63558j43636j53459k40794k21509j30887j29224j74068
$$ plain form
10423 10748026 10629542 10599573 10522401 10332410 10167391 10133327 10132967 10062001 9986906 9987978 10000418
10412 10000418 9950948 9892370 9873960 9835474 9750518 9714004 9766689 9795790 9730452 9668766 9686022
10401 9686022 9689080 9597062 9496936 9474835 9457721 9372777 9300332 9308981 9300160 9189110 9086165
10390 9086165 9111137 9167725 9101837 8965587 8920830 8975346 9011404 8999919 9001214 9015595 9001266
10379 9001266 8984205 9002867 9009290 8960984 8928747 8974245 9015980 8969281 8919694 8987290 9111087
10368 9111087 9151243 9126052 9157691 9248041 9300992 9317226 9377305 9468643 9510474 9519048 9574038
10357 9574038 9652051 9666028 9640487 9674572 9757293 9793805 9792516 9848186 9953621 10007105 10003180
10346 10003180 10042268 10148419 10245883 10320376 10435707 10583021 10682591 10748878 10884863 11091948
$$ packed form
10423A0748026j18484k9969p7172j89991j65019l4064l60p0966p5095J072J2440
10412A0000418m9470n8578j8410l8486q4956l6514N2685K9101o5338o1686J7256
10401I686022L058r2018j00126k2101j7114q4944p2445Q649q821j11050j02945
10390I086165K4972N6588o5888j36250m4757N4516L6058j1485J295J4381j4329
10379I001266j7061J8662O423m8306l2237M5498M1735m6699m9587O7596J23797
10368I111087M0156k5191L1639R0350N2951J6234O0079R1338M1831Q574N4990
10357I574038P8013J3977k5541L4085Q2721L6512j289N5670J05435N3484l925
10346A0003180L9088J06151R7464P4493J15331J47314R9570O6287J35985K07085
$$ plain form
10336 11091948 11255007 11347069 11481293 11714358 11955388 12125195 12263944 12423598 12583342
10327 12583342 12729551 12903190 13113611 13307540 13465217 13631030 13822396 14008723 14197558
10318 14197558 14433396 14697967 14926585 15133990 15402467 15736701 16061695 16373642 16749371
10309 16749371 17190610 17613243 18018073 18511519 19117123 19730681 20315113 20973667 21761880
10300 21761880 22591445 23403162 24273263 25246629 26216555 27089986 27939823 28863602 29800862
10291 29800862 30621107 31304019 31908361 32434600 32832336 33085542 33195056 33134395 32904357
10282 32904357 32568116 32159779 31631630 30962753 30234725 29519375 28778676 27965254 27137565
10273 27137565 26377277 25668558 24961369 24287946 23713224 23223108 22757199 22307846 21906074
$$ packed form
10336A1091948J63059R2062J34224K33065K41030J69807J38749J59654J59744
10327A2583342J46209J73639K10421J93929J57677J65813J91366J86327J88835
10318A4197558K35838K64571K28618K07405K68477L34234L24994L11947L75729
10309A6749371M41239M22633M04830M93446O05604O13558N84432O58554P88213
10300B1761880Q29565Q11717Q70101R73366R69926Q73431Q49837R23779R37260
10291B9800862Q20245O82912O04342N26239L97736K53206J09514o0661k30038
10282C2904357l36241m08337n28149o68877p28028p15350p40699q13422q27689
10273B7137565p60288p08719p07189o73423n74722m90116m65909m49353m01772
$$ plain form
10264 21906074 21556193 21254074 21015760 20825282 20620700 20394683 20231011 20174466 20153742 20109463
10254 20109463 20099011 20180326 20292345 20363371 20445678 20617238 20832939 21010921 21197828 21502177
10244 21502177 21912780 22330261 22750680 23278804 23966437 24751786 25550287 26306406 26972142
10235 26972142 27533516 28054232 28621641 29267269 29988900 30793977 31659656 32525719 33402133
10226 33402133 34395862 35545730 36734703 37866914 39007114 40210958 41349975 42279649
10218 42279649 43059983 43805324 44427833 44772669 44918530 45061120 45139869 44880059 44212159
10209 44212159 43347434 42389621 41178872 39628030 37930558 36278900 34614928 32836640
10201 32836640 31049965 29419854 27929432 26482416 25122700 23963223 22985433 22080424
$$ packed form
10264B1906074l49881l02119k38314j90478k04582k26017j63672n6545k0724m4279
10254B0109463j0452Q1315J12019P1026Q2307J71560K15701J77982J86907L04349
10244B1502177M10603M17481M20419N28124O87633P85349P98501P56119O65736
10235B6972142N61374N20716N67409O45628P21631Q05077Q65679Q66063Q76414
10226C3402133R93729J149868J188973J132211J140200J203844J139017R29674
10218D2279649P80334P45341O22509L44836J45861J42590P8749k59810o67900
10209D4212159q64725r57813j210749j550842j697472j651658j663972j778288
10201C2836640j786675j630111j490422j447016j359716j159477r77790r05009
$$ plain form
10193 22080424 21221188 20444462 19724706 19008163 18321620 17721447 17182203 16647852 16139958
10184 16139958 15704811 15308025 14892441 14488068 14153153 13855873 13527765 13191161 12920138
10175 12920138 12709800 12493299 12259314 12049225 11863909 11672138 11487271 11341676 11209843
10166 11209843 11048129 10884617 10777488 10709393 10615755 10495007 10399089 10337047 10281343 10248151
10156 10248151 10272692 10317734 10303678 10224654 10145653 10091221 10025724 9937729 9853235 9767077 9650667
10145 9650667 9528025 9454064 9414508 9339913 9227022 9148869 9123645 9070394 8933859 8770289
10135 8770289 8660207 8601054 8537298 8448001 8355242 8277325 8213889 8159201 8104954 8043600 7981066
10124 7981066 7932576 7903194 7886129 7873349 7852749 7811974 7765049 7750094 7774361 7792930 7774823
$$ packed form
10193B2080424q59236p76726p19756p16543o86543o00173n39244n34351n07894
10184A6139958m35147l96786m15584m04373l34915k97280l28108l36604k71023
10175A2920138k10338k16501k33985k10089j85316j91771j84867j45595j31833
10166A1209843j61714j63512j07129o8095r3638j20748r5918o2042n5704l3192
10156A0248151K4541M5042j4056p9024p9001n4432o5497q7995q4494q6158j16410
10145I650667j22642p3961l9556p4595j12891p8153k5224n3251j36535j63570
10135H770289j10082n9153o3756q9297r2759p7917o3436n4688n4247o1354o2534
10124G981066m8490k9382j7065j2780k0600m0775m6925j4955K4267J8569j8107
$$ plain form
10113 7774823 7753081 7767813 7800385 7814871 7821488 7837603 7829475 7766322 7693246 7668186 7661596 7609958
10101 7609958 7537053 7516203 7531637 7495172 7402420 7354752 7404217 7484123 7526594 7553548 7613625
10090 7613625 7713129 7843755 7997887 8124502 8152451 8092353 8034615 8013173 7958613 7826863
10080 7826863 7681597 7591182 7527121 7432174 7319777 7237566 7189636 7156533 7138665 7125466 7080674
10069 7080674 7013239 6996222 7049804 7073990 6979130 6824568 6734867 6723251 6698547 6619529 6537233
10058 6537233 6487344 6438168 6365033 6299064 6271239 6261490 6232942 6181828 6131209 6098283 6082592
10047 6082592 6072677 6058007 6040637 6030723 6027762 6021151 6011312 6006622 5999025 5978550 5973927 6026580 6109780
10034 6109780 6135278 6072257 5999541 5996170 6038426 6059660 6055873 6063091 6076122 6068975 6065279 6107471
$$ packed form
10113G774823k1742J4732L2572J4486O617J6115q128o3153p3076k5060o590n1638
10101G609958p2905k0850J5434l6465r2752m7668M9465P9906M2471K6954O0077
10090G613625R9504J30626J54132J26615K7949o0098n7738k1442n4560j31750
10080G826863j45266r0415o4061r4947j12397q2211m7930l3103j7868j3199m4792
10069G080674o7435j7017N3582K4186r4860j54562q9701j1616k4704p9018q2296
10058F537233m9889m9176p3135o5969k7825r749k8548n1114n0619l2926j5691
10047F082592r915j4670j7370r914k961o611r839m690p597k0475m623N2653Q3200
10034F109780K5498o3021p2716l371M2256K1234l787P218J3031p147l696M2192
$$ plain form
10022 6107471 6173090 6198889 6180047 6173297 6205055 6246304 6279991 6324303 6378877 6410942 6411272 6410900
10010 6410900 6426680 6438116 6432959 6431334 6449232 6476960 6505840 6539486 6570535 6584918 6596399 6634970
9998 6634970 6691593 6720429 6713081 6725055 6799847 6902543 6963825 6968232 6965402 7003499 7079839 7158209
9986 7158209 7214773 7256510 7301114 7352277 7403144 7454919 7513924 7573706 7624416 7680522 7767740
9975 7767740 7875454 7958901 8003076 8045075 8113108 8187654 8251687 8331937 8449483 8572886 8668101
9964 8668101 8755300 8864858 8977497 9067771 9168232 9320589 9494770 9632889 9749307 9905143
9954 9905143 10099193 10270431 10405151 10556543 10751594 10957277 11149483 11341994 11537309 11721378
9944 11721378 11916452 12165162 12452319 12719010 12963597 13246209 13583230 13932581 14302023
$$ packed form
10022F107471O5619K5799j8842o750L1758M1249L3687M4312N4574L2065L30l72
10010F410900J5780J1436n157j625J7898K7728K8880L3646L1049J4383J1481L8571
9998F634970N6623K8836p348J1974P4792J02696O1282M407k830L8097P6340P8370
9986G158209N6564M1737M4604N1163N0867N1775N9005N9782N0710N6106Q7218
9975G767740J07714Q3447M4175M1999O8033P4546O4033Q0250J17546J23403R5215
9964H668101Q7199J09558J12639R0274J00461J52357J74181J38119J16418J55836
9954I905143J94050J71238J34720J51392J95051K05683J92206J92511J95315J84069
9944A1721378J95074K48710K87157K66691K44587K82612L37021L49351L69442
$$ plain form
9935 14302023 14760748 15298086 15779298 16111713 16363472 16639469 16924893 17148003 17329828
9926 17329828 17558285 17847638 18130636 18382548 18662987 19026496 19461352 19931948 20433394
9917 20433394 20991088 21634506 22371847 23174389 24004490 24876095 25853116 26961803 28148547
9908 28148547 29363861 30640735 32032597 33510277 34984616 36404163 37761397 39015445
9900 39015445 40076232 40868229 41361068 41541446 41404333 40972857 40286898 39375720 38276298
9891 38276298 37063686 35817947 34568170 33308585 32058504 30864304 29753095 28726403
9883 28726403 27788344 26938837 26153256 25412775 24739828 24158461 23639497 23138338 22668047
9874 22668047 22272204 21938305 21608380 21274089 20989826 20781795 20611877 20449680 20317513
$$ packed form
9935A4302023M58725N37338M81212L32415K51759K75997K85424K23110J81825
9926A7329828K28457K89353K82998K51912K80439L63509M34856M70596N01446
9917B0433394N57694O43418P37341Q02542Q30101Q71605R77021J108687J186744
9908B8148547J215314J276874J391862J477680J474339J419547J357234J254048
9900C9015445J060787P91997M92839J80378j37113m31476o85959r11178j099422
9891C8276298j212612j245739j249777j259585j250081j194200j111209j026692
9883B8726403r38059q49507p85581p40481o72947n81367n18964n01159m70291
9874B2668047l95843l33899l29925l34291k84263k08031j69918j62197j32167
$$ plain form
9865 20317513 20237894 20190250 20149894 20128492 20149762 20217517 20323593 20454831 20585080 20699810
9855 20699810 20833188 21033895 21289352 21539430 21774281 22052189 22399045 22763804 23116258
9846 23116258 23520625 24049206 24674246 25318726 25982156 26737269 27611077 28542958 29471740
9837 29471740 30403047 31364948 32342476 33291300 34190549 35045212 35841351 36526569 37041690
9828 37041690 37357001 37470703 37386244 37107316 36650143 36043459 35316515 34503391 33655426 32820569
9818 32820569 32004685 31187010 30388157 29682977 29117311 28649318 28213066 27807186 27472195
9809 27472195 27209302 26980807 26772334 26591713 26416318 26205739 25963105 25720010 25461704
9800 25461704 25134808 24733568 24309428 23887643 23448183 23001150 22598727 22247254 21890245
$$ packed form
9865B0317513p9619m7644m0356k1402K1270O7755J06076J31238J30249J14730
9855B0699810J33378K00707K55457K50078K34851K77908L46856L64759L52454
9846B3116258M04367N28581O25040O44480O63430P55113Q73808R31881R28782
9837B9471740R31307R61901R77528R48824Q99249Q54663P96139O85218N15121
9828C7041690L15311J13702q4459k78928m57173o06684p26944q13124q47965q34857
9818C2820569q15884q17675p98853p05180n65666m67993m36252m05880l34991
9809B7472195k62893k28495k08473j80621j75395k10579k42634k43095k58306
9800B5461704l26896m01240m24140m21785m39460m47033m02423l51473l57009
$$ plain form
9791 21890245 21513191 21180874 20924605 20677956 20386816 20102901 19890518 19711865 19498208
9782 19498208 19280071 19142964 19086109 19027878 18936988 18861189 18827505 18806029 18784769 18799028 18865152
9771 18865152 18951677 19036795 19136843 19261390 19396630 19550418 19757830 20020649 20291940 20541961
9761 20541961 20791850 21063449 21348435 21652452 22015754 22452944 22917564 23368670 23834431
9752 23834431 24363405 24943561 25522142 26087522 26675912 27297922 27907913 28460347 28961205
9743 28961205 29443366 29911676 30329721 30647576 30828544 30862139 30771791 30606551 30404530 30158777
9733 30158777 29834380 29425479 28977175 28538654 28116158 27697559 27305505 26986179 26747588
9724 26747588 26551022 26373646 26240804 26179533 26176507 26205345 26264674 26365471 26510097 26706524
$$ packed form
9791B1890245l77054l32317k56269k46649k91140k83915k12383j78653k13657
9782A9498208k18137j37107n6855n8231r0890p5799l3684k1476k1260J4259O6124
9771A8865152Q6525Q5118J00048J24547J35240J53788K07412K62819K71291K50021
9761B0541961K49889K71599K84986L04017L63302M37190M64620M51106M65761
9752B3834431N28974N80156N78581N65380N88390O22010O09991N52434N00858
9743B8961205M82161M68310M18045L17855J80968L3595r0348j65240k02021k45753
9733C0158777l24397m08901m48304m38521m22496m18599l92054l19326k38591
9724B6747588j96566j77376j32842o1271l026K8838N9329J00797J44626J96427
$$ plain form
9714 26706524 26970045 27284553 27599045 27895164 28217776 28595917 28974982 29285540 29546595
9705 29546595 29831572 30152307 30452890 30713996 30986339 31308179 31659128 32019237 32414313
9696 32414313 32872776 33386518 33945877 34571548 35278681 36043048 36836492 37671232 38577156
9687 38577156 39549180 40540765 41502652 42417342 43303636 44188046 45059735 45863063 46556505
9678 46556505 47163617 47729684 48242119 48645195 48931260 49158487 49365804 49527380 49614631 49650855
9668 49650855 49672514 49681195 49670430 49663975 49690119 49745182 49815188 49910376 50051131 50243718 50493884
9657 50493884 50817490 51213610 51657091 52144185 52713427 53389560 54138698 54918226 55745438
9648 55745438 56674152 57722845 58871624 60121185 61510998 63077097 64825992 66755542
$$ packed form
9714B6706524K63521L14508L14492K96119L22612L78141L79065L10558K61055
9705B9546595K84977L20735L00583K61106K72343L21840L50949L60109L95076
9696C2414313M58463N13742N59359O25671P07133P64367P93444Q34740R05924
9687C8577156R72024R91585R61887R14690Q86294Q84410Q71689Q03328O93442
9678D6556505O07112N66067N12435M03076K86065K27227K07317J61576Q7251L6224
9668D9650855K1659Q681j0765o455K6144N5063P0006R5188J40755J92587K50166
9657E0493884L23606L96120M43481M87094N69242O76133P49138P79528Q27212
9648E5745438R28714J048693J148779J249561J389813J566099J748895J929550
$$ plain form
9640 66755542 68875223 71198671 73734754 76493273 79489755 82741506 86263500 90068249
9632 90068249 94172087 98609949 103442411 108736595 114540742 120887123 127812363 135358711
9624 135358711 143559725 152433775 161978906 172173149 183006851 194469710 206323551
9617 206323551 217738381 227264166 233455726 235700637 234423554 230512238 224673139 217304659
9609 217304659 208687212 199058493 188612949 177646137 166674843 156245587 146619660
9602 146619660 137762827 129610128 122185649 115467919 109318266 103617921 98369411 93601435
9594 93601435 89259283 85246452 81507288 78018595 74752995 71691151 68829177 66150994
9586 66150994 63633496 61284396 59122680 57121853 55235888 53478178 51896456 50467291
$$ packed form
9640F6755542K119681K323448K536083K758519K996482L251751L521994L804749
9632I0068249M103838M437862M832462N294184N804147O346381O925240P546348
9624A35358711Q201014Q874050R545131J0194243J0833702J1462859J1853841
9617B06323551J1414830R525785O191560K244911j277083l911316n839099p368480
9609B17304659q617447r628719j0445544j0966812j0971294j0429256r625927
9602A46619660q856833q152699p424479o717730o149653n700345n248510m767976
9594I3601435m342152m012831l739164l488693l265600l061844k861974k678183
9586F6150994k517498k349100k161716k000827j885965j757710j581722j429165
$$ plain form
9578 50467291 49107292 47803132 46628645 45600600 44623119 43631159 42692528 41892175 41193235
9569 41193235 40497567 39787163 39121950 38537560 38022645 37570191 37184063 36853762 36574662
9560 36574662 36370417 36251203 36178369 36110382 36046244 35981826 35870627 35682954 35462025 35264006
9550 35264006 35084835 34908487 34781371 34760083 34819384 34897712 35014046 35253202 35641540 36117594
9540 36117594 36625118 37155330 37687554 38162981 38536683 38792383 38887619 38748391 38350459 37761942
9530 37761942 37080176 36360813 35620427 34864281 34091750 33311854 32570586 31928208 31396670
9521 31396670 30937733 30537443 30241070 30091818 30071891 30133192 30259744 30469957 30769630 31119714
9511 31119714 31438432 31627513 31616495 31396261 31002135 30467412 29811861 29068010 28283291 27486467
$$ packed form
9578E0467291j359999j304160j174487j028045r77481r91960r38631q00353o98940
9569D1193235o95668p10404o65213n84390n14915m52454l86128l30301k79100
9560C6574662k04245j19214p2834o7987o4138o4418j11199j87673k20929j98019
9550C5264006j79171j76348j27116k1288N9301P8328J16334K39156L88338M76054
9540C6117594N07524N30212N32224M75427L73702K55700R5236j39228l97932n88517
9530C7761942o81766p19363p40386p56146p72531p79896p41268o42378n31538
9521C1396670m58937m00290k96373j49252j9927O1301J26552K10213K99673L50084
9511C1119714L18718J89081j1018k20234l94126n34723o55551p43851p84719p96824
$$ plain form
9501 27486467 26677215 25856673 25045976 24271203 23554021 22916708 22366045 21871176 21392805
9492 21392805 20939019 20553088 20238377 19942641 19637183 19363763 19167144 19020177 18862844
9483 18862844 18691587 18560320 18503159 18503421 18539009 18613441 18731024 18881474 19070792 19334954
9473 19334954 19690928 20092729 20469998 20799174 21095741 21335763 21436957 21347966 21119787 20846282
9463 20846282 20557894 20223270 19837699 19443479 19058666 18655472 18234995 17860113 17574405
9454 17574405 17344599 17133932 16981355 16942469 16990957 17055420 17132424 17280458 17502068 17709497
9444 17709497 17823841 17842786 17785712 17630820 17346481 16949433 16495301 16027582 15555843 15069213
9434 15069213 14557632 14029863 13514533 13035070 12591516 12179030 11805924 11473385 11162077
$$ packed form
9501B7486467q09252q20542q10697p74773p17182o37313n50663m94869m78371
9492B1392805m53786l85931l14711k95736l05458k73420j96619j46967j57333
9483A8862844j71257j31267n7161K62L5588P4432J17583J50450J89318K64162
9473A9334954L55974M01801L77269L29176K96567K40022J01194q8991k28179k73505
9463B0846282k88388l34624l85571l94220l84813m03194m20477l74882k85708
9454A7574405k29806k10667j52577l8886M8488O4463P7004J48034K21610K07429
9444A7709497J14344J8945n7074j54892k84339l97048m54132m67719m71739m86630
9434A5069213n11581n27769n15330m79463m43554m12486l73106l32539l11308
$$ plain form
9425 11162077 10866624 10612755 10403660 10188280 9937288 9711451 9579823 9499411 9366444 9172982
9415 9172982 9012188 8925162 8848591 8737646 8636269 8582231 8535651 8456055 8369648 8303301 8226189
9404 8226189 8116244 8012444 7935822 7827144 7637386 7420853 7260175 7149330 7030810 6903418
9394 6903418 6806840 6731279 6628227 6494426 6372409 6281627 6210164 6153454 6101948 6018629 5892276
9383 5892276 5780970 5732510 5696070 5594485 5453321 5363338 5333965 5287730 5198042 5126407 5105230
9372 5105230 5083485 5023523 4965231 4947853 4937998 4886858 4807789 4748185 4719432 4695367 4656395 4604809
9360 4604809 4551588 4504751 4459773 4401828 4332846 4281695 4261393 4238931 4185506 4129344 4107941
9349 4107941 4096783 4050922 3992247 3976381 3989436 3967132 3910957 3888348 3910058 3908385 3858605 3821042
$$ packed form
9425A1162077k95453k53869k09095k15380k50992k25837j31628q0412j32967j93462
9415I172982j60794q7026p6571j10945j01377n4038m6580p9596q6407o6347p7112
9404H226189j09945j03800p6622j08678j89758k16533j60678j10845j18520j27392
9394F903418r6578p5561j03052j33801j22017r0782p1463n6710n1506q3319j26353
9383E892276j11306m8460l6440j01585j41164q9983k9373m6235q9688p1635k1177
9372E105230k1745n9962n8292j7378r855n1140p9069n9604k8753k4065l8972n1586
9360D604809n3221m6837m4978n7945o8982n1151k0302k2462n3425n6162k1403
9349D107941j1158m5861n8675j5866J3055k2304n6175k2609K1710j673m9780l7563
$$ plain form
9337 3821042 3828629 3831369 3797479 3774210 3792153 3799307 3756209 3713691 3722306 3740327 3713261 3676836
9325 3676836 3691113 3727727 3716490 3662343 3624445 3612521 3593747 3574832 3586115 3603945 3579792
9314 3579792 3534174 3530658 3561249 3550927 3484317 3436485 3453652 3484529 3466718 3415366 3383920 3386812
9302 3386812 3402945 3419667 3434452 3435807 3413173 3373364 3331240 3297562 3282727 3292312 3311681 3315520
9290 3315520 3300169 3288057 3294611 3308851 3312210 3301257 3287152 3283354 3294011 3306947 3304287 3286417
9278 3286417 3271459 3262695 3239097 3193943 3156767 3152694 3164189 3161350 3146486 3136406 3123791 3094317
9266 3094317 3063800 3058594 3073004 3083736 3092145 3112941 3134747 3133936 3118396 3116961 3131815 3138113 3124138
9253 3124138 3099215 3072573 3055053 3064220 3094552 3105546 3077322 3050067 3063808 3091745 3089085 3075264
$$ packed form
9337C821042P587K740l3890k3269J7943P154m3098m2518Q615J8021k7066l6425
9325C676836J4277L6614j1237n4147l7898j1924j8774j8915J1283J7830k4153
9314C579792m5618l516L0591j0322o6610m7832J7167L0877j7811n1352l1446K892
9302C386812J6133J6722J4785J355k2634l9809m2124l3678j4835R585J9369L839
9290C315520j5351j2112O554J4240L359j0953j4105l798J0657J2936k660j7870
9278C286417j4958q764k3598m5154l7176m073J1495k839j4864j0080j2615k9474
9266C094317l0517n206J4410J0732Q409K0796K1806q11j5540j435J4854O298j3975
9253C124138k4923k6642j7520R167L0332J0994k8224k7255J3741K7937k660j3821
$$ plain form
9241 3075264 3098715 3146063 3164369 3156327 3169586 3200160 3195554 3156827 3147723 3187688 3220985 3213221
9229 3213221 3197878 3202915 3209851 3212492 3238117 3280066 3286198 3246672 3216550 3219475 3212037 3180218 3178939
9216 3178939 3224944 3245094 3199054 3163685 3211936 3287698 3297057 3257580 3252379 3287977 3308617 3315964
9204 3315964 3360404 3429293 3453549 3427432 3424110 3479138 3542683 3565374 3559937 3560022 3579715 3627870
9192 3627870 3705623 3778949 3808080 3811262 3844189 3911801 3962653 3981371 4020986 4119120 4239345
9181 4239345 4327989 4385207 4448149 4536801 4643433 4749818 4834222 4883361 4912569 4954899 5021251
9170 5021251 5089271 5134180 5151228 5149664 5144532 5147386 5144870 5102675 5017437 4941208 4916995 4916082 4888939
9157 4888939 4852404 4859997 4900088 4901043 4842782 4789458 4793428 4832197 4862967 4879846 4891579 4897576
$$ packed form
9241C075264K3451M7348J8306q042J3259L0574m606l8727r104L9965L3297p764
9229C213221j5343N037O936K641K5625M1949O132l9526l0122K925p438l1819j279
9216C178939M6005K0150m6040l5369M8251P5762R359l9477n201L5598K0640P347
9204C315964M4440O8889K4256k6117l322N5028O3545K2691n437Q5J9693M8155
9192C627870P7753P3326K9131L182L2927O7612N0852J8718L9615R8134J20225
9181D239345Q8644N7218O2942Q8652J06632J06385Q4404M9139K9208M2330O6352
9170E021251O8020M4909J7048j564n132K854k516m2195q5238p6229k4213r13k7143
9157D888939l6535P593M0091R55n8261n3324L970L8769L0770J6879J1733N997
$$ plain form
9145 4897576 4912586 4964638 5043687 5101349 5123236 5149593 5203950 5261452 5313671 5396616 5515050
9134 5515050 5608158 5645592 5695254 5826984 5999386 6121258 6191608 6295843 6478423 6698559
9124 6698559 6911681 7122342 7344398 7571614 7809373 8085619 8405721 8736325 9058655 9402053
9114 9402053 9793423 10201163 10570530 10905686 11274001 11715391 12178901 12577114 12884108 13140562
9104 13140562 13370289 13547255 13660180 13745035 13806992 13769415 13576245 13303301 13072391 12877883
9094 12877883 12611640 12259904 11944182 11728584 11517845 11222542 10910204 10689543 10540904
9085 10540904 10386334 10253461 10223798 10259794 10238801 10154481 10135513 10240418 10372619 10448474
9075 10448474 10525399 10690132 10920119 11143494 11365045 11643718 11992940 12385443 12823812 13330437
$$ packed form
9145D897576J5010N2052P9049N7662K1887K6357N4357N7502N2219Q2945J18434
9134E515050R3108L7434M9662J31730J72402J21872P0350J04235J82580K20136
9124F698559K13122K10661K22056K27216K37759K76246L20102L30604L22330L43398
9114I402053L91370M07740L69367L35156L68315M41390M63510L98213L06994K56454
9104A3140562K29727J76966J12925Q4855O1957l7577j93170k72944k30910j94508
9094A2877883k66243l51736l15722k15598k10739k95303l12338k20661j48639
9085A0540904j54570j32873k9663L5996k0993q4320j8968J04905J32201P5855
9075A0448474P6925J64733K29987K23375K21551K78673L49222L92503M38369N06625
$$ plain form
9065 13330437 13889821 14471574 15097968 15823627 16651866 17526931 18405788 19281087 20129114
9056 20129114 20892190 21533534 22068626 22519817 22869612 23078295 23122487 22997495 22704350 22257092
9046 22257092 21688544 21030282 20299544 19522192 18750575 18029891 17354303 16688273 16034540
9037 16034540 15449265 14975863 14591830 14245195 13923868 13659406 13474000 13356787 13290252 13268798
9027 13268798 13288192 13345748 13456763 13642937 13896433 14179698 14464079 14739355 14984947 15175131
9017 15175131 15325542 15488947 15681011 15849729 15941979 15957773 15913443 15804177 15643543 15488316
9007 15488316 15371837 15259976 15131381 15050477 15084612 15191604 15279968 15349604 15470869 15641590
8997 15641590 15778894 15857524 15940261 16046127 16101525 16064887 15991146 15911848 15753342 15456370
$$ packed form
9065A3330437N59384N81753O26394P25659Q28239Q75065Q78857Q75299Q48027
9056B0129114P63076O41344N35092M51191L49795K08683M4192j24992k93145m47258
9046B2257092n68548o58262p30738p77352p71617p20684o75588o66030o53733
9037A6034540n85275m73402l84033l46635l21327k64462j85406j17213o6535k1454
9027A3268798J9394N7556J11015J86174K53496K83265K84381K75276K45592J90184
9017A5175131J50411J63405J92064J68718R2250J5794m4330j09266j60634j55227
9007A5488316j16479j11861j28595q0904L4135J06992Q8364O9636J21265J70721
8997A5641590J37304P8630Q2737J05866N5398l6638p3741p9298j58506k96972
$$ plain form
8987 15456370 15093818 14775719 14500325 14196723 13866128 13576288 13343178 13122001 12910465
8978 12910465 12769000 12728597 12753599 12808598 12897787 13024518 13168873 13320393 13485945 13656135
8968 13656135 13809020 13951785 14111299 14279694 14420454 14534093 14661166 14805889 14912391
8959 14912391 14938233 14900436 14825662 14708402 14549829 14384718 14225381 14022534 13731500 13379829
8949 13379829 13013767 12612801 12131206 11607936 11148366 10780838 10411153 9961015 9486026
8940 9486026 9094665 8797445 8514974 8212950 7939798 7722932 7516973 7293119 7102478 6988977
8930 6988977 6899069 6755147 6577181 6444320 6361800 6264643 6147081 6079639 6076993 6057959 5984838
8919 5984838 5941378 5998888 6090720 6113355 6087636 6112353 6198608 6266557 6295267 6362367 6516946
$$ packed form
8987A5456370l62552l18099k75394l03602l30595k89840k33110k21177k11536
8978A2910465j41465m0403K5002N4999Q9189J26731J44355J51520J65552J70190
8968A3656135J52885J42765J59514J68395J40760J13639J27073J44723J06502
8959A4912391K5842l7797p4774j17260j58573j65111j59337k02847k91034l51671
8949A3379829l66062m00966m81595n23270m59570l67528l69685m50138m74989
8940I486026l91361k97220k82471l02024k73152k16866k05959k23854j90641j13501
8930F988977q9908j43922j77966j32861q2520r7157j17562o7442k646j9034p3121
8919E984838m3460N7510R1832K2635k5719K4717Q6255O7949K8710O7100J54579
$$ plain form
8908 6516946 6708940 6878979 7042966 7247120 7495273 7757747 8008047 8220068 8368807 8462626
8898 8462626 8541442 8620317 8666951 8651883 8583405 8473084 8306080 8072281 7793943 7496199
8888 7496199 7178884 6841561 6508408 6203554 5925934 5668805 5436611 5221230 4992901 4744676
8878 4744676 4520590 4365523 4262608 4151539 4000030 3830986 3684460 3575149 3487496 3398717
8868 3398717 3303963 3219360 3155012 3091837 3003397 2897443 2810909 2760720 2724636 2676184 2613663
8857 2613663 2547670 2484375 2428955 2384292 2342335 2297737 2266094 2259541 2250365 2198548 2114665 2050819
8845 2050819 2025948 2009185 1983737 1969889 1967659 1937292 1867823 1810767 1807158 1826655 1818013 1778915
8833 1778915 1737284 1702501 1673945 1661249 1659740 1642505 1608297 1592526 1598897 1577659 1514633 1476013
$$ packed form
8908F516946J91994J70039J63987K04154K48153K62474K50300K12021J48739R3819
8898H462626P8816P8875M6634j5068o8478j10321j67004k33799k78338k97744
8888G496199l17315l37323l33153l04854k77620k57129k32194k15381k28329k48225
8878D744676k24086j55067j02915j11069j51509j69044j46526j09311q7653q8779
8868C398717r4754q4603o4348o3175q8440j05954q6534n0189l6084m8452o2521
8857B613663o5993o3295n5420m4663m1957m4598l1643o553r176n1817q3883o3846
8845B050819k4871j6763k5448j3848k230l0367o9469n7056l609J9497q642l9098
8833A778915m1631l4783k8556j2696j509j7235l4208j5771O371k1238o3026l8620
$$ plain form
8821 1476013 1504158 1535239 1500334 1448083 1466300 1525745 1518273 1431909 1368315 1379819 1402485 1377361
8809 1377361 1335424 1319824 1311263 1283106 1260694 1270740 1285723 1270811 1243405 1238051 1246212 1234985
8797 1234985 1200844 1168876 1157007 1164331 1174399 1156853 1095448 1026358 1011282 1056955 1101866 1100651
8785 1100651 1076097 1063736 1055065 1032908 1018137 1032855 1048641 1022189 964847 930849 944357 975725
8773 975725 986940 970347 941972 918749 906197 899557 896774 905720 925379 929830 899969 865369
8761 865369 873485 914382 924768 880977 836729 842399 875346 886285 872409 861706 858340 849134
8749 849134 840529 846955 859383 859640 848848 834434 813133 793629 803083 836701 837778 773790 699166
8736 699166 687615 728466 751629 736880 729158 748870 757899 731108 702012 707973 731650 729011
$$ packed form
8821A476013K8145L1081l4905n2251J8217N9445p472q6364o3594J1504K2666k5124
8809A377361m1937j5600q561k8157k2412J0046J4983j4912k7406n354Q161j1227
8797A234985l4141l1968j1869P324J0068j7546o1405o9090j5076M5673M4911j215
8785A100651k4554j2361q671k2157j4771J4718J5786k6452n7342l3998J3508L1368
8773I75725J1215j6593k8375k3223j2552o640k783Q946J9659M451k9861l4600
8761H65369Q116M0897J0386m3791m4248N670L2947J0939j3876j0703l366r206
8749H49134q605O426J2428K57j0792j4414k1301j9504R454L3618J077o3988p4624
8736F99166j1551M0851K3163j4749p722J9712R029k6791k9096N961K3677k639
$$ plain form
8724 729011 690913 649645 636209 649547 664780 663794 654972 656708 663785 651239 618789 602981 626373
8711 626373 662262 673936 661375 642723 622630 612886 645738 717783 756124 704276 617759 602132
8699 602132 667192 719062 698995 650980 632795 634779 623365 604945 601316 604393 598756 597575 616041
8686 616041 633009 617572 579274 558143 570827 592793 594283 575995 562446 565381 564216 536094
8674 536094 500939 506072 554312 586279 563131 525867 527141 545568 532918 512009 541743 600814
8662 600814 604307 543668 511556 559561 623999 636625 623899 638113 662029 650147 611468 585429
8650 585429 575569 563931 554639 553127 540622 515747 517505 559018 588274 568870 546094 569465
8638 569465 605111 601108 587139 618888 666966 663013 625752 632015 678877 688658 649431 633705
$$ packed form
8724G29011l8098m1268j3436J3338J5233r86q822J736P077j2546l2450j5808K3392
8711F26373L5889J1674j2561j8652k0093r744L2852P2045L8341n1848q6517j5627
8699F02132O5060N1870k0067m8015j8185J984j1414j8420l629L077n637j181J8466
8686F16041J6968j5437l8298k1131J2684K1966J490j8288j3549K935j165k8122
8674E36094l5155N133M8240L1967k3148l7264J274J8427j2650k0909K9734N9071
8662F00814L493o0639l2112M8005O4438J2626j2726J4214K3916j1882l8679k6039
8650E85429r860j1638r292j512j2505k4875J758M1513K9256j9404k2776K3371
8638E69465L5646m003j3969L1749M8078l953l7261O263M6862R781l9227j5726
$$ plain form
8626 633705 662414 667415 622959 602629 653235 712198 716156 704846 740287 794127 800363 768290
8614 768290 757975 778296 789259 782682 786070 798925 791912 763783 742888 738386 740470 757707 799828
8601 799828 833984 818215 774728 767542 804149 824851 803087 789070 824442 873924 884102 862146
8589 862146 847861 845526 837757 839735 879180 933626 947244 913160 885138 895800 914512 908590
8577 908590 898466 916175 945688 949905 935656 944974 989387 1036181 1061253 1076907 1099488 1123219
8565 1123219 1138913 1152293 1170937 1193339 1218637 1246808 1265697 1262526 1250899 1256736 1274433 1274033
8553 1274033 1259210 1272870 1326590 1371083 1366035 1336201 1322817 1321366 1310878 1306084 1328411 1356352
8541 1356352 1359171 1352990 1367067 1381510 1362386 1334437 1345410 1375574 1365462 1325982 1328888 1379583
$$ packed form
8626F33705K8709N001m4456k0330N0606N8963L958j1310L5441N3840O236l2073
8614G68290j0315K0321J0963o577L388J2855p013k8129k0895m502K084J7237M2121
8601G99828L4156j5769m3487p186L6607K0702k1764j4017L5372M9482J0178k1956
8589H62146j4285k335p769J978L9445N4446J3618l4084k8022J0662J8712n922
8577I08590j0124J7709K9513M217j4249R318M4413M6794K5072J5654K2581K3731
8565A123219J5694J3380J8644K2402K5298K8171J8889l171j1627N837J7697m00
8553A274033j4823J3660N3720M4493n048k9834j3384j451j0488m794K2327K7941
8541A356352K819o181J4077J4443j9124k7949J0973L0164j0112l9480K906N0695
$$ plain form
8529 1379583 1396775 1347172 1306138 1337089 1395561 1414648 1410922 1430195 1449440 1422056 1381600 1405487
8517 1405487 1487797 1535847 1502253 1447123 1446172 1493843 1530116 1526965 1513215 1526957 1568281 1602503
8505 1602503 1603287 1584321 1578696 1592924 1604533 1606145 1618074 1643374 1647220 1608782 1563417 1558616 1588804
8492 1588804 1607827 1590488 1550543 1511972 1492463 1502639 1533292 1554336 1549410 1535812 1528338 1507184
8480 1507184 1452671 1390773 1367932 1392544 1430886 1448952 1435037 1399313 1373092 1383790 1409355
8469 1409355 1393040 1329785 1289877 1316070 1352281 1336021 1308638 1348414 1430643 1454382 1396482
8458 1396482 1340025 1344261 1379364 1406032 1430416 1453345 1447732 1421135 1426857 1475317 1502780 1468350
8446 1468350 1418196 1410609 1435938 1453919 1454428 1437901 1391636 1331855 1313966 1350392 1372354 1328408
$$ packed form
8529A379583J7192m9603m1034L0951N8472J9087l726J9273J9245k7384m0456K3887
8517A405487Q2310M8050l3594n5130r51M7671L6273l151j3750J3742M1324L4222
8505A602503P84j8966n625J4228J1609J612J1929K5300L846l8438m5365m801L0188
8492A588804J9023j7339l9945l8571j9509J0176L0653K1044m926j3598p474k1154
8480A507184n4513o1898k2841K4612L8342J8066j3915l5724k6221J0698K5565
8469A409355j6315o3255l9908K6193L6211j6260k7383L9776Q2229K3739n7900
8458A396482n6457M236L5103K6668K4384K2929n613k6597N722M8460K7463l4430
8446A468350n0154p587K5329J7981N09j6527m6265n9781j7889L6426K1962m3946
$$ plain form
8434 1328408 1267427 1260181 1288929 1290160 1267104 1273609 1305948 1297710 1226836 1155638 1145526 1182265
8422 1182265 1205787 1181826 1128932 1091274 1090096 1100234 1088981 1073705 1099172 1151173 1155736 1093874
8410 1093874 1046790 1073518 1112249 1078894 1004687 982079 1017335 1041132 1036832 1045638 1057185 1015354
8398 1015354 941181 929878 996852 1040155 999828 946815 953621 976677 946976 895673 896175 937407
8386 937407 947792 911014 873630 859297 850820 843745 850045 856163 835979 799291 776928 768333 753561
8373 753561 742937 759407 782598 769742 728275 708548 722898 730670 710081 685632 670965 644488
8361 644488 605109 595162 632674 668492 653638 612788 603800 630506 647225 637484 634673 657906
8349 657906 673328 643446 587432 561777 588932 631915 645398 631144 625035 639858 648419 630161
$$ packed form
8434A328408o0981p246K8748J231k3056O505L2339q238p0874p1198j0112L6739
8422A182265K3522k3961n2894l7658j178J0138j1253j5276K5467N2001M563o1862
8410A093874m7084K6728L8731l3355p4207k2608L5256K3797m300Q806J1547m1831
8398A015354p4173j1303O6974M3303m0327n3013O806K3056k9701n1303N02M1232
8386I37407J0385l6778l7384j4333q477p075O300O118k0184l6688k2363q595j4772
8373G53561j0624J6470K3191j2856m1467j9727J4350P772k0589k4449j4667k6477
8361F44488l9379r947L7512L5818j4854m0850q988K6706J6719r741k811K3233
8349F57906J5422k9882n6014k5655K7155M2983J3483j4254o109J4823Q561j8258
$$ plain form
8337 630161 608072 616227 645525 651830 616942 573645 561948 581817 601243 595841 568095 538118
8325 538118 526873 541938 571027 592936 597708 591195 582469 578582 589485 619257 648337 644783 603677
8312 603677 558420 541064 547590 555648 558922 565142 574466 581379 587579 592499 582767 555260 538644
8299 538644 560496 599358 605665 571186 540034 543672 564340 576663 583743 588694 572489 535219
8287 535219 521419 558164 598661 582781 531454 516232 546374 560450 535839 526213 561284 585874
8275 585874 551177 504402 518089 571562 580900 528738 486932 506217 550765 562048 535713 508151
8263 508151 502283 512945 524639 525124 514530 508395 518852 534656 537535 531169 529694 527118 510992
8250 510992 498766 519699 561050 576051 551973 527366 530964 545734 547304 536231 516102 482368
$$ packed form
8337F30161k2089Q155K9298O305l4888m3297j1697J9869J9426n402k7746k9977
8325E38118j1245J5065K9089K1909M772o513q726l887J0903K9772K9080l554m1106
8312F03677m5257j7356O526Q058L274O220R324O913O200M920r732k7507j6616
8299E38644K1852L8862O307l4479l1152L638K0668J2323P080M951j6205l7270
8287E35219j3800L6745M0497j5880n1327j5222L0142J4076k4611r626L5071K4590
8275E85874l4697m6775J3687N3473R338n2162m1806J9285M4548J1283k6335k7562
8263E08151n868J0662J1694M85j0594o135J0457J5804K879o366j475k576j6126
8250E10992j2226K0933M1351J5001k4078k4607L598J4770J570j1073k0129l3734
$$ plain form
8238 482368 451502 456968 493637 511645 491950 479838 509433 544273 538180 511367 511953 536373
8226 536373 545555 534305 526739 522388 504989 490850 510535 550175 565515 548926 530457 519450
8214 519450 501569 489674 515760 566929 590014 572272 560091 580797 602487 595172 578665 578863
8202 578863 581978 566756 546059 543586 558426 579579 606428 630871 631489 611560 609730 643509 674813
8189 674813 665477 636649 634404 661536 685118 692594 697018 698816 685600 666121 665105 682249 690031
8176 690031 677572 668310 686116 725399 762002 777731 770080 751666 742731 753148 772144 785145
8164 785145 794820 811275 827703 826155 808647 802540 825747 859497 868707 845640 821387 829557 866662
8151 866662 899694 910585 915438 932377 950372 949203 935691 934687 952073 972239 985481 991137
$$ packed form
8238D82368l0866N466L6669J8008j9695j2112K9595L4840o093k6813N86K4420
8226E36373R182j1250p566m351j7399j4139J9685L9640J5340j6589j8469j1007
8214E19450j7881j1895K6086N1169K3085j7742j2181K0706K1690p315j6507J98
8202E78863L115j5222k0697k473J4840K1153K6849K4443O18j9929j830L3779L1304
8189F74813r336k8828k245K7132K3582P476M424J798j3216j9479j016J7144P782
8176F90031j2459r262J7806L9283L6603J5729p651j8414q935J0417J8996J3001
8164G85145R675J6455J6428j548j7508o107K3207L3750R210k3067k4253Q170L7105
8151H66662L3032J0891M853J6939J7995j169j3512j004J7386K0166J3242N656
$$ plain form
8139 991137 982268 960429 957798 1002611 1064222 1080837 1049092 1034583 1076010 1130389 1141839 1119396
8127 1119396 1111787 1141167 1194894 1250202 1278112 1259248 1225412 1243594 1323607 1387519 1374755 1330056
8115 1330056 1331312 1375066 1403492 1410213 1438386 1490769 1522954 1524847 1535941 1573489 1610664 1633935
8103 1633935 1661455 1696299 1719654 1737130 1771709 1804188 1787442 1733465 1716193 1764056 1819050
8092 1819050 1835903 1853587 1919104 1996936 2016141 1974548 1939531 1960852 2024816 2084446 2105260
8081 2105260 2091157 2083419 2119590 2184686 2228959 2239779 2256285 2300114 2340737 2355820 2376908 2436288
8069 2436288 2509761 2556276 2580432 2609645 2638396 2644994 2643425 2669108 2723822 2777176 2814851 2848186
8057 2848186 2883668 2918407 2960732 3023080 3096539 3158374 3202950 3246024 3302785 3374447 3447535
$$ packed form
8139I91137q869k1839k631M4813O1611J6615l1745j4509M1427N4379J1450k2443
8127A119396p609K9380N3727N5308K7910j8864l3836J8182Q0013O3912j2764m4699
8115A330056J256M3754K8426O721K8173N2383L2185J893J1094L7548L7175K3271
8103A633935K7520L4844K3355J7476L4579L2479j6746n3977j7272M7863N4994
8092A819050J6853J7684O5517P7832J9205m1593l5017K1321O3964N9630K0814
8081B105260j4103p738L6171O5096M4273J0820J6506M3829M0623J5083K1088N9380
8069B436288P3473M6515K4156K9213K8751O598j569K5683N4714N3354L7675L3335
8057B848186L5482L4739M2325O2348P3459O1835M4576M3074N6761P1662P3088
$$ plain form
8046 3447535 3500088 3526576 3559743 3637538 3743210 3820221 3857915 3908560 3996075 4070764 4097114
8035 4097114 4123949 4205644 4306634 4359220 4377038 4429400 4528466 4624693 4698640 4772732 4836777
8024 4836777 4847736 4815431 4813738 4886468 5000659 5105480 5180902 5220438 5226837 5236638 5290617 5369355
8012 5369355 5416327 5430819 5470418 5550850 5619746 5653237 5701319 5799109 5902614 5961074 5996683
8001 5996683 6062172 6163359 6269351 6362198 6437367 6490243 6535904 6607319 6706469 6795504 6858076
7990 6858076 6922037 6999225 7060284 7097622 7149563 7225925 7278354 7289084 7314807 7385066 7435358
7979 7435358 7417653 7403281 7479336 7602638 7666591 7670134 7701712 7780690 7839589 7861035 7908673
7968 7908673 8002181 8075195 8094372 8121266 8208478 8318168 8396298 8458282 8546579 8658773 8768461
$$ packed form
8046C447535N2553K6488L3167P7795J05672P7011L7694N0645Q7515P4689K6350
8035D097114K6835Q1695J00990N2586J7818N2362R9066R6227P3947P4092O4045
8024D836777J0959l2305j693P2730J14191J04821P5422L9536O399R801N3979P8738
8012E369355M6972J4492L9599Q0432O8896L3491M8082R7790J03505N8460L5609
8001E996683O5489J01187J05992R2847P5169N2876M5661P1415R9150Q9035O2572
7990F858076O3961P7188O1059L7338N1941P6362N2429J0730K5723P0259N0292
7979G435358j7705j4372P6055J23302O3953L543L1578P8978N8899K1446M7638
7968G908673R3508P3014J9177K6894Q7212J09690P8130O1984Q8297J12194J09688
$$ plain form
7957 8768461 8872494 8974550 9063555 9145485 9254322 9397078 9533319 9644821 9776656 9965895
7947 9965895 10175601 10349652 10494042 10651299 10827479 10999486 11169061 11355122 11552440 11750196
7937 11750196 11973594 12253018 12565833 12865816 13162002 13505324 13891079 14236524 14479087
7928 14479087 14649549 14819849 15017228 15223926 15431463 15652117 15888127 16129735 16386189
7919 16386189 16685430 17032505 17398228 17769879 18187370 18694020 19265340 19833425 20386198
7910 20386198 20991426 21699225 22471031 23247726 24044499 24916526 25859186 26815967 27774266
7901 27774266 28772270 29799597 30766973 31600745 32301573 32877543 33279772 33442256 33334598
7892 33334598 32945219 32273055 31374803 30358060 29281356 28122996 26895083 25707159 24642772
$$ packed form
7957H768461J04033J02056Q9005Q1930J08837J42756J36241J11502J31835J89239
7947I965895K09706J74051J44390J57257J76180J72007J69575J86061J97318J97756
7937A1750196K23398K79424L12815K99983K96186L43322L85755L45445K42563
7928A4479087J70462J70300J97379K06698K07537K20654K36010K41608K56454
7919A6386189K99241L47075L65723L71651M17491N06650N71320N68085N52773
7910B0386198O05228P07799P71806P76695P96773Q72027R42660R56781R58299
7901B7774266R98004J027327R67376Q33772P00828N75970M02229J62484j07658
7892C3334598l89379o72164q98252j016743j076704j158360j227913j187924j064387
$$ plain form
7883 24642772 23653484 22678224 21797928 21134259 20627291 20062330 19327735 18515792 17745160
7874 17745160 17014192 16278959 15555894 14869781 14188651 13489275 12820647 12232319 11699692
7865 11699692 11186045 10717185 10322351 9958849 9576439 9208856 8915969 8674234 8414172
7856 8414172 8136280 7895391 7690139 7468259 7236286 7060761 6946488 6811428 6612582 6409144
7846 6409144 6260236 6139617 6003075 5870300 5776564 5697213 5589069 5469870 5388807 5342432
7836 5342432 5285588 5212589 5163313 5149820 5136942 5107787 5098341 5145842 5238330 5334307 5401994 5419531
7824 5419531 5365858 5241705 5085948 4943837 4821542 4689779 4529101 4353950 4190872 4049506
7814 4049506 3922102 3799926 3679778 3561377 3450532 3361546 3301330 3249079 3169522 3057545
$$ packed form
7883B4642772r89288r75260q80296o63669n06968n64961p34595q11943p70632
7874A7745160p30968p35233p23065o86113o81130o99376o68628n88328n32627
7865A1699692n13647m68860l94834l63502l82410l67583k92887k41735k60062
7856H414172k77892k40889k05252k21880k31973j75525j14273j35060j98846k03438
7846F409144j48908j20619j36542j32775r3736p9351j08144j19199q1063m6375
7836E342432n6844p2999m9276j3493j2878k9155r446M7501R2488R5977O7687J7537
7824E419531n3673j24153j55757j42111j22295j31763j60678j75151j63078j41366
7814D049506j27404j22176j20148j18401j10845q8986o0216n2251p9557j11977
$$ plain form
7804 3057545 2954631 2902686 2890876 2870172 2815720 2748671 2694210 2647057 2591468 2531337 2481042
7793 2481042 2442173 2407102 2372342 2332200 2274887 2205416 2156910 2151429 2158795 2126267 2048986 1979572
7781 1979572 1959824 1971310 1969577 1944501 1921780 1913348 1892552 1828926 1736978 1673207 1674543 1707568
7769 1707568 1700422 1631263 1560051 1551401 1587884 1595720 1545914 1485101 1460778 1461925 1455411 1441341
7757 1441341 1436934 1431860 1400987 1350350 1312140 1295575 1276778 1242842 1215653 1217748 1235064 1231819
7745 1231819 1194410 1146204 1118225 1113435 1107420 1085127 1064813 1070033 1085552 1069787 1016435 970405
7733 970405 964125 971319 954899 929930 933567 952499 936078 878480 832613 832482 851451 854133 843375
7720 843375 833015 816895 793918 787260 806798 822905 808242 777270 755581 741499 729473 735935
$$ packed form
7804C057545j02914n1945j1810k0704n4452o7049n4461m7153n5589o0131n0295
7793B481042l8869l5071l4760m0142n7313o9471m8506n481P366l2528p7281o9414
7781A979572j9748J1486j733k5076k2721q432k0796o3626r1948o3771J336L3025
7769A707568p146o9159p1212q650L6483P836m9806o0813k4323J147o514j4070
7757A441341m407n074l0873n0637l8210j6565j8797l3936k7189K095J7316l245
7745A231819l7409m8206k7979m790o015k2293k0314N220J5519j5765n3352m6030
7733I70405o280P194j6420k4969L637J8932j6421n7598m5867j31J8969K682j0758
7720H43375j0360j6120k2977o658J9538J6107j4663l0972k1689j4082j2026O462
$$ plain form
7708 735935 762308 768169 729855 692049 703050 729852 709319 660988 661526 711570 725588 675043
7696 675043 643509 690832 749330 727513 651464 616705 641318 659078 640348 627603 644170 650348
$$ packed form
7708G35935K6373N861l8314l7806J1001K6802k0533m8331N38N0044J4018n0545
7696F75043l1534M7323N8498k1817p6049l4759K4613J7760j8730j2745J6567O178
$$ [...]
##END NTUPLES=NMR SPECTRUM
##END=
