##TITLE=1H ikalashn
EC-3332(2)
27.9.2024
##JCAMPDX= 6.0         $$ Bruker NMR JCAMP-DX V2.0
##DATA TYPE= NMR SPECTRUM
##DATA CLASS= NTUPLES
##ORIGIN= UXNMR, Bruker Analytische Messtechnik GmbH
##OWNER= root
$$ TOPSPIN		Version 1.3
$$ 2024-09-27 10:31:21.765 +0400  Irina@DPX200
$$ Compression mode = diff/dup
##.OBSERVE FREQUENCY= 200.131392401
##.OBSERVE NUCLEUS= ^1H
##.ACQUISITION MODE= SIMULTANEOUS
##.ACQUISITION SCHEME= undefined
##.AVERAGES= 8
##.DIGITISER RES= 18
##SPECTROMETER/DATA SYSTEM= spect
##.PULSE SEQUENCE= zg
##.SOLVENT NAME= CDCl3
##.SHIFT REFERENCE= INTERNAL, CDCl3, 1, 17.95386
##AUDIT TRAIL= $$ (NUMBER, WHEN, WHO, WHERE, WHAT)
$$ ##TITLE= Audit trail, TOPSPIN		Version 1.3
$$ ##JCAMPDX= 5.01
$$ ##ORIGIN= Bruker BioSpin GmbH
$$ ##OWNER= Irina
$$ $$ F:/spectra/data/iren/nmr/1H/4/pdata/1/auditp.txt
$$ ##AUDIT TRAIL=  $$ (NUMBER, WHEN, WHO, WHERE, VERSION, WHAT)
(   1,<2024-09-27 10:30:31.515 +0400>,<Irina>,<DPX200>,<TOPSPIN 1.3>,
      <acquisition in progress>)
(   2,<2024-09-27 10:31:08.078 +0400>,<Irina>,<DPX200>,<TOPSPIN 1.3>,
      <Start of raw data processing
       efp BC_mod = 2 LB = 0.02 FT_mod = 6 PKNL = 1 PHC0 = 310.8521 PHC1 = 2.69257 SI = 32K 
       data hash MD5: 32K
       C7 92 B5 6E 36 CA B2 76 4B AE 9A CC FD FB 63 85>)
(   3,<2024-09-27 10:31:10.890 +0400>,<Irina>,<DPX200>,<TOPSPIN 1.3>,
      <apk 
       data hash MD5: 32K
       36 9E A8 34 DC 79 F8 54 FE A9 B8 99 1F 21 B9 26>)
(   4,<2024-09-27 10:31:13.250 +0400>,<Irina>,<DPX200>,<TOPSPIN 1.3>,
      <abs n ABSG = 5 
       data hash MD5: 32K
       16 6D 77 85 2F AC E0 E2 98 3A 94 4F 4F 92 1B 9C>)
$$ ##END=
$$ 
$$ $$ hash MD5
$$ $$ 1D EB AD 99 42 61 9C EC 36 B1 AE 97 DA 8E 39 02
##$RELAX= 
##$RELAX= 
##$RELAX= 
##$RELAX= 
##$RELAX= 
##$RELAX= 
##$RELAX= 
##$RELAX= 
##$RELAX= 
$$ Bruker specific parameters
$$ --------------------------
##$DU= <F:/spectra>
##$EXPNO= 4
##$NAME= <1H>
##$PROCNO= 1
##$TYPE= <nmr>
##$USER= <iren>
##$AMP= (0..31)
100 100 100 100 100 100 100 100 100 100 100 100 100 100 100 100 100 100 
100 100 100 100 100 100 100 100 100 100 100 100 100 100 
##$ANAVPT= -1
##$AQSEQ= 0
##$AQ_mod= 1
##$AUNM= <au_zg>
##$AUTOPOS= <>
##$BF1= 200.13
##$BF2= 200.13
##$BF3= 200.13
##$BF4= 200.13
##$BF5= 200.13
##$BF6= 200.13
##$BF7= 200.13
##$BF8= 200.13
##$BYTORDA= 1
##$CFDGTYP= 0
##$CFRGTYP= 5
##$CHEMSTR= <none>
##$CNST= (0..63)
1 1 145 1 1 1 1 1 1 1 1 1 1 1 1 1 1 1 1 1 1 1 1 1 1 1 1 1 1 1 1 1 1 1 
1 1 1 1 1 1 1 1 1 1 1 1 1 1 1 1 1 1 1 1 1 1 1 1 1 1 1 1 1 1 
##$CPDPRG= <>
##$CPDPRG1= <>
##$CPDPRG2= <>
##$CPDPRG3= <>
##$CPDPRG4= <mlev>
##$CPDPRG5= <mlev>
##$CPDPRG6= <mlev>
##$CPDPRG7= <mlev>
##$CPDPRG8= <mlev>
##$CPDPRGB= <>
##$CPDPRGT= <>
##$D= (0..63)
0 2 0 0 0 0 0 0 0 0.06 0 0.03 0 0 0 0 0.0002 0 0 0 0 0 0 0 0 0 0 0 0 0 
0 0 0 0 0 0 0 0 0 0 0 0 0 0 0 0 0 0 0 0 0 0 0 0 0 0 0 0 0 0 0 0 0 0 
##$DATE= 1727418665
##$DBL= (0..7)
120 120 120 120 120 120 120 120 
##$DBP= (0..7)
150 150 150 150 150 150 150 150 
##$DBP07= 0
##$DBPNAM0= <>
##$DBPNAM1= <>
$$ [...]
##$SW_h= 4401.40845070422
##$TD= 16384
##$TD0= 1
##$TE= 300
##$TE2= 300
##$TE3= 300
##$TEG= 300
##$TL= (0..7)
0 120 120 120 120 120 120 120 
##$TP= (0..7)
150 150 150 150 150 150 150 150 
##$TP07= 0
##$TPNAME0= <>
##$TPNAME1= <>
##$TPNAME2= <>
##$TPNAME3= <>
##$TPNAME4= <>
##$TPNAME5= <>
##$TPNAME6= <>
##$TPNAME7= <>
##$TPOAL= (0..7)
0.5 0.5 0.5 0.5 0.5 0.5 0.5 0.5 
##$TPOFFS= (0..7)
0 0 0 0 0 0 0 0 
##$TUNHIN= 0
##$TUNHOUT= 0
##$TUNXOUT= 0
##$USERA1= <user>
##$USERA2= <user>
##$USERA3= <user>
##$USERA4= <user>
##$USERA5= <user>
##$V9= 5
##$VALIST= <valist>
##$VCLIST= <CCCCCCCCCCCCCCC>
##$VD= 0
##$VDLIST= <DDDDDDDDDDDDDDD>
##$VPLIST= <PPPPPPPPPPPPPPP>
##$VTLIST= <TTTTTTTTTTTTTTT>
##$WBST= 1024
##$WBSW= 25
##$XGAIN= (0..3)
0 0 0 0 
##$XL= 0
##$YL= 0
##$YMAX_a= 268128
##$YMIN_a= -369819
##$ZGOPTNS= <>
##$ZL1= 120
##$ZL2= 120
##$ZL3= 120
##$ZL4= 120
##$ABSF1= 17.95386
##$ABSF2= -4.038887
##$ABSG= 5
##$ABSL= 3
##$ALPHA= 0
##$AQORDER= 0
##$ASSFAC= 0
##$ASSFACI= 0
##$ASSFACX= 0
##$ASSWID= 0
##$AUNMP= <proc_1d>
##$AXLEFT= 0
##$AXRIGHT= 0
##$AXTYPE= 0
##$AXUNIT= <>
##$AZFE= 0.1
##$AZFW= 0.1
##$BCFW= 0
##$BC_mod= 2
##$BYTORDP= 0
##$COROFFS= 0
##$CY= 7568.61572265625
##$DATMOD= 1
##$DC= 0
##$DFILT= <>
##$DTYPP= 0
##$F1P= 17.9538593292236
##$F2P= -4.03888763876832
##$FCOR= 0.5
##$FTSIZE= 32768
##$FT_mod= 6
##$GAMMA= 0
##$GB= 0
##$INTBC= 0
##$INTSCL= 1.483618e-010
##$ISEN= 128
##$LB= 0.02
##$LEV0= 0
##$LPBIN= 0
##$MAXI= 945.577
##$MC2= 0
##$MEAN= 0
##$ME_mod= 0
##$MI= -402.1523
##$NCOEF= 0
##$NC_proc= -5
##$NLEV= 6
##$NOISF1= 8.587773
##$NOISF2= 6.764455
##$NSP= 0
##$NTH_PI= 0
##$NZP= 0
##$OFFSET= 17.95386
##$PC= 1
##$PHC0= 314.4531
##$PHC1= -3.227462
##$PH_mod= 1
##$PKNL= yes
##$PPARMOD= 0
##$PPDIAG= 0
##$PPIPTYP= 0
##$PPMPNUM= 100
##$PPRESOL= 1
##$PSCAL= 0
##$PSIGN= 0
##$REVERSE= no
##$SF= 200.13
##$SI= 32768
##$SIGF1= 16.12182
##$SIGF2= -4.496377
##$SINO= 3.521527
##$SIOLD= 32768
##$SREGLST= <1H.CDCl3>
##$SSB= 0
##$STSI= 32768
##$STSR= 0
##$SW_p= 4401.40845070423
##$SYMM= 0
##$S_DEV= 0
##$TDeff= 16384
##$TDoff= 0
##$TI= <>
##$TILT= no
##$TM1= 0
##$TM2= 0
##$TOPLEV= 0
##$USERP1= <user>
##$USERP2= <user>
##$USERP3= <user>
##$USERP4= <user>
##$USERP5= <user>
##$WDW= 1
##$XDIM= 32768
##$YMAX_p= 447284833
##$YMIN_p= -164612
$$ End of Bruker specific parameters
$$ ---------------------------------
##NTUPLES= NMR SPECTRUM
##VAR_NAME=  FREQUENCY,     SPECTRUM/REAL,   SPECTRUM/IMAG
##SYMBOL=    X,             R,               I
##VAR_TYPE=  INDEPENDENT,   DEPENDENT,       DEPENDENT
##VAR_FORM=  AFFN,          ASDF,            ASDF
##VAR_DIM=   32768,         32768,           32768
##UNITS=     HZ,            ARBITRARY UNITS, ARBITRARY UNITS
##FACTOR=    0.134324425510551, 1,           1
##FIRST=     4401.40845070423, 21078,        -328158
##LAST=      0,             763,             -337827
##MIN=       0,             -164612,         0
##MAX=       4401.40845070423, 447284833,    0
$$ Real data points
##PAGE= N=1
##DATA TABLE= (X++(R..R)), XYDATA
$$ [...]
13649e8593k574O128r71l727M381L913p797o093J2938J8341j557j4947j234J3803
13635c7989P302N47J4352K4251M558j8556r022J2897K783k9053l1257L859K8819
13622b6509J7173m206j0142j2789k2708j9889P728L1831K2585l335o548J6370
13610a0439K9614J0819j9780k9913j6611l579n179r025J603K0904K8551J7904
13598A4869J070j1082j6582j2232K929J3712L430j4894j1582J0632J6584k032
13586e178j0685N483J1692j2158k7233j673K6228R498k3523j7275J1497M492k8387
13573e7222k2166K3945L7449k124k5113P686L6882P899l6692l2741J224P405j0445
13560f4013m951K4875L3385O445j9656j5660P351K0687O258k8331m5575j3767
$$ plain form
13649 -58593 -61167 -55039 -56010 -59737 -55356 -51443 -59240 -65333 -52395 -34054 -35611 -50558 -51792 -37989
13635 -37989 -30687 -30140 -15788 8463 13021 -5535 -14557 -1660 1123 -27930 -59187 -55328 -26509
13622 -26509 -9336 -13542 -23684 -36473 -59181 -79070 -71342 -39511 -16926 -20261 -26809 -10439
13610 -10439 19175 29994 10214 -19699 -36310 -39889 -45068 -54093 -52490 -31586 -3035 14869
13598 14869 15939 4857 -11725 -23957 -21028 -7316 -3886 -18780 -30362 -19730 -3146 -5178
13586 -5178 -15863 -10380 1312 -10846 -38079 -39752 -13524 -4026 -27549 -44824 -33327 -28835 -57222
13573 -57222 -79388 -55443 -17994 -20118 -45231 -37545 -663 7236 -29456 -62197 -60973 -53568 -64013
13560 -64013 -68964 -44089 -10704 -4259 -23915 -39575 -32224 -11537 -5279 -33610 -79185 -92952
13548i2952L7305L8898j4028l9973O394N3469K2940l8951l4001K5580L8740j5227
13536a1806m6208o077L8378K3175j7228k4055o371p74j352J0081J3992p728k4286
13523f0259m805K1788J3084j2907j0715J1938J1020j2737j6220P039J5408n404
13511d2770j5551J0603L9639L0615n903k9701k4590l225J9465L0532J5004k2740
13499A378m5915k4891J6161K5075n218k5933o677J8043N594k3489j7107K1978
13487f1001L7217Q463j6696k103K1156J3348p848p248K200r284k3130l665K7619
13474b0972K0370j4424j8824J0242J5272j6499k7686N145K6757J284k4897q630
13462e2862J5512O109p384J2803L2483O122l2006k1181K0169K8479L950k905J0211
$$ plain form
13548 -92952 -55647 -16749 -30777 -70750 -64356 -10887 12053 -26898 -60899 -35319 3421 -11806
13536 -11806 -58014 -64091 -25713 -2538 -19766 -43821 -50192 -50966 -52318 -42237 -28245 -35973 -60259
13523 -60259 -65064 -43276 -30192 -43099 -53814 -41876 -30856 -43593 -59813 -52774 -37366 -42770
13511 -42770 -58321 -47718 -8079 22536 16633 -13068 -37658 -40883 -21418 9114 24118 1378
13499 1378 -44537 -69428 -53267 -28192 -33410 -59343 -66020 -47977 -42383 -65872 -82979 -61001
13487 -61001 -23784 -15321 -32017 -34120 -12964 384 -7464 -14712 -12512 -21796 -44926 -48591 -20972
13474 -20972 -602 -15026 -33850 -23608 -8336 -24835 -52521 -47376 -20619 -19335 -44232 -52862
13462 -52862 -37350 -31241 -38625 -25822 6661 12783 -19223 -40404 -20235 8244 12194 9289 19500
13449A9500L836j4634l773J8734m556n5883n1021J9151N9672J9162l1484j8997
13437d0293K1030J7727k0091l4665j5657K804Q103J2858J6364R984J307j680o501
13424b8710j1072K574K5748J9943j5377k6052Q766L2295L130l0243j2035K3499
13412g534J6121j1033J031L0401R926m2265l9889K3904N6112J1517m0579l3502
13400b5790K297R901l951m798K068l829r808K719J6764R880l692j87J1073P815
13386A0462o083j2285p063M816K0307K4476n14l5070l2302R356L1675N097k1554
13373h682k097L0204K3400l704k028J5502O36l4951l4188L932J9756n296k1138
13360a8654K79K0188O494j2761n112J1185P054o345n889R9n196j1006k255P188
$$ plain form
13449 19500 23336 8702 4929 23663 19107 -36776 -87797 -68646 -8974 10188 -21296 -40293
13437 -40293 -19263 -1536 -21627 -56292 -71949 -69145 -61042 -48184 -31820 -21836 -20529 -22209 -28710
13424 -28710 -39782 -37208 -11460 8483 -6894 -32946 -24180 8115 11245 -18998 -31033 -7534
13412 -7534 8587 -2446 -1415 28986 38912 -3353 -43242 -19338 36774 48291 7712 -25790
13400 -25790 -23493 -13592 -17543 -22341 -20273 -24102 -33910 -31191 -14427 -4547 -8239 -8426 2647 10462
13386 10462 4379 -7906 -14969 -10153 10154 34630 34116 -954 -33256 -23900 7775 12872 -8682
13373 -8682 -10779 19425 42825 39121 37093 52595 53231 18280 -15908 -11976 7780 2484 -18654
13360 -18654 -18375 1813 8307 -4454 -9566 1619 8673 2328 -3561 -3462 -8658 -19664 -21919 -14731
13346a4731l21j0520r78J8799K3539J1771q62j1050k0874j8504K498J9921J1740
13333A0428n732k838J3351J2559m382p658O466P266j5636l0691j4748J0050J2531
13320i034j119l311J0461J9277J0872l903r785n560j429m498q944k140J6017K5639
13306C2543R921j8484l0219j7528j040L847N716J4668K2552J8988R656L684k361
13293E1943j2342j6254n666P548O208o706j4965j3855j0473o161K684J1261J2074
13280E296R646J1639J1174j108j3085n411J1913P586k0431l3527o741L2213L9664
13267D8828J2368j6122k1965j0399K959P449j597j6782j6808Q825L5275K6080
13255E8111j4730l8984j5933K3414K5928j0810l4102q773L3283L7093J262k2248
$$ plain form
13346 -14731 -15052 -25572 -26550 -7751 15788 27559 26697 15647 -5227 -23731 -21233 -1312 10428
13333 10428 4696 1858 15209 27768 23386 15728 22194 29460 13824 -16867 -31615 -21565 -9034
13320 -9034 -10153 -13464 -3003 16274 27146 23243 13458 7898 6469 1971 -6973 -9113 6904 32543
13306 32543 42464 23980 -6239 -23767 -24807 -20960 -15244 -576 21976 40964 50620 54304 51943
13293 51943 39601 23347 17681 25229 31437 24731 9766 -4089 -14562 -20723 -18039 -6778 5296
13280 5296 14942 26581 37755 36647 23562 18151 30064 37650 17219 -16308 -23049 9164 48828
13267 48828 61196 45074 23109 12710 15669 23118 21521 4739 -12069 -3244 32031 58111
13255 58111 43381 4397 -11536 11878 37806 26996 -7106 -15879 17404 54497 55759 33511
13243C3511n153J7912P464j6440p720K6196L0498r104l8613j7289K1115K4262
13231F6639p92j1707l942n269j3429J354L2966L6667J233k8582k0865k69J924
13218E5928k764O599J5692L309j4070p774J2932J6750K618l349N255Q996J1q065
13204I2068p031k041N544J6124J7145o00j6884m981K2253K5335j281j9421n709
13191A20521J7127K0905J0318L170J250j71J889N650K04j1439r029R789J7444
13178A87628j305k1463j5371O179J6634J5247J6288J5473N53j6796j2988R160
13166A99239K3277J7846O690L290P212J4070J9411J5678K088q114n296K083N984
13153C03458J4893L0964L2391Q054j1657L300K8667K0721q028m493L5728N6767
$$ plain form
13243 33511 28358 46270 53734 37294 29574 55770 86268 77164 38551 21262 42377 66639
13231 66639 65847 54140 50198 44929 31500 32854 65820 102487 103720 75138 54273 54004 55928
13218 55928 53164 59763 75455 78764 64694 56920 69852 86602 89220 85871 91126 100122 100133 92068
13204 92068 85037 82996 88540 104664 121809 121209 104325 99344 121597 146932 145651 126230 120521
13191 120521 137648 158553 168871 172041 173291 173120 175009 180659 180863 169424 160395 170184 187628
13178 187628 186323 164860 149489 155668 172302 187549 203837 219310 219863 203067 190079 199239
13166 199239 222516 240362 247052 250342 257554 271624 291035 306713 308801 300687 295391 297474 303458
13153 303458 318351 349315 381706 389760 378103 381403 410070 430791 422763 418270 453998 510765
13141E10765L2929R394K5106N0137L9643O550o374L880O811n281j3066j1941j6548
13128F32005k6737k4398o107Q802N755q902j8725r844J9515M7700M1470j407l7015
13115F22112k6833J1291L2238K7346K2184K2649R405j3447j1887K0967M2872K1954
13103G80851j3786j6824J1261K4788k95l6292m4153k2458k899o070j7871j4311
13091F41941K769J0901L519j629L508J033j8662l1878j7758K205l353j9201l773
13078E69622L8555N4162J9192k2870k3653O847K6849K4170J8362J7833P991j9082
13066G17978m6546n2011l6171k4536l5689n0750l2494J6203L9476J169n4694n9310
13054C82625j7441N549j1793k2202Q10J9118L402j5571q889k676k0641k8808L997
$$ plain form
13141 510765 543694 553088 578194 628331 667974 674524 668150 672030 678841 673560 660494 648553 632005
13128 632005 605268 580870 574763 583565 589320 580418 561693 551849 571364 619064 660534 659127 622112
13115 622112 595279 606570 638808 666154 688338 710987 720392 706945 695058 716025 758897 780851
13103 780851 767065 750241 761502 786290 785995 749703 705550 683092 680193 674123 656252 641941
13091 641941 644710 655611 659130 657501 661009 662042 643380 611502 593744 595949 592596 573395 569622
13078 569622 608177 662339 681531 658661 635008 641855 668704 692874 711236 729069 737060 717978
13066 717978 671432 619421 583250 558714 523025 472275 439781 455984 495460 496629 441935 382625
13054 382625 365184 370733 358940 336738 337548 356666 360068 344497 335608 332932 312291 283483 287480
13041B87480L8732K5183j1656j5324N328O64k3342j7424J4532J7744j4075k5878
13029B81964J211K0245N251r040M25O278n134k062K3842K6870j0903l4481n167
13016B99299K8716J2421k1142j0986K4327K1027j7501k8042M064K5048N406j9757
13004C22880j8093o183n969m954J2785L1976K9059P200j0893j0472M818J7982
12992C70136J1985j0108k3447j3766O37j159p257M055K1023J4647j0050j7663
12980C39033L589K7253L0149J6916J108r296p116O479J2902O77j0587r25J0896
12967D21078j462j8619m446K4567K0296j1413j5730J4541K2743j1049l0277J318
12955D11547L5848K3756m664m94J6565K171k4368j2735K4666K9843j840j4747
$$ plain form
13041 287480 326212 351395 339739 324415 329743 330407 307065 289641 304173 321917 307842 281964
13029 281964 283175 303420 308671 299631 300056 306334 301200 299138 322980 349850 338947 304466 299299
13016 299299 328015 340436 319294 308308 332635 353662 336161 308119 312183 337231 342637 322880
13004 322880 304787 298604 292635 287681 300466 332442 361501 368701 357808 347336 352154 370136
12992 370136 382121 372013 348566 334800 335437 334278 327021 331076 352099 366746 356696 339033
12980 339033 342622 369875 400024 416940 418048 408752 401636 408115 421017 421694 411107 410182 421078
12967 421078 419616 400997 396551 421118 441414 430001 414271 428812 451555 440506 410229 411547
12955 411547 447395 471151 466487 465993 482558 484729 460361 447626 472292 502135 500295 485548
12943D85548J3040L6571J8716j7497l1101j6156N962J6543R138o765p843J3617
12931E19773K7131J817l9342m2328Q71L9811L6815R760q073j1699j0158k461J0515
12918E32432J5937J0005P404J4792J7427O707k685L93K955o338j2201K876K5026
12905F14730K5191J119j8983j3268R480K3733J5662m114j3008k238J1928Q446
12893F58678j0516k2379j3207Q032K3911K5558J5485M316L112R562Q116n262j0910
12880F94496M095J8574Q005j0143Q22L3635L9896L061l3314k7068Q605L3815L4143
12867H08622K0282R43j7309k0834m455J4332J5405K235n249L472J9160K1983R55
12854H59542k6351k2931J9195N3727L6297o698j2034K3057L6167N87l2983j9925
$$ plain form
12943 485548 498588 535159 553875 536378 505277 489121 495083 511626 520764 513999 506156 519773
12931 519773 546904 548721 509379 467051 467922 507733 544548 554308 546235 534536 524378 521917 532432
12918 532432 548369 558374 565778 580570 597997 604704 602019 602412 605367 599029 586828 589704 614730
12905 614730 639921 641040 622057 608789 618269 642002 657664 653550 640542 638304 650232 658678
12893 658678 648162 625783 612576 620608 644519 670077 685562 689878 692990 702552 710668 705406 694496
12880 694496 698591 717165 725170 715027 715849 749484 789380 792441 759127 732059 740664 774479 808622
12867 808622 828904 829847 812538 791704 787249 801581 816986 819221 813972 817444 836604 858587 859542
12854 859542 833191 810260 829455 883182 919479 912781 900747 923804 959971 960558 927575 907650
12842I07650J3379K3615J5520J1840P017n059k342K1151K7880O09j5160J3974
12830A020074M3937K6808k498R748L3878J0528l2526k1328L1687M7217J8338J2429
12818A198292L4487J5755m2328m5897K6225O5458Q968m9415j4143N3866M6234
12807A297502j1381j5566L3862M4392l126k8569N518M0412K9265L016M12J0979
12795A406716J7468K9279M5274L9872J1171p574l985l602j4367q573J9324L2880
12783A563883J7326Q039K4843L3146R074r839J2058M0960K7318q377q032K7420
12771A737819M0999J3151j1992j992J9523K3396K1320L2622M1573K4252l978n314
12759A931379K3615M5069L3487Q226J480J3757K0182J0984L728J3930L2393M0500
$$ plain form
12842 907650 921029 944644 960164 972004 979021 973962 971620 992771 1020651 1021260 1006100 1020074
12830 1020074 1064011 1090819 1088321 1098069 1131947 1142475 1109949 1088621 1120308 1167525 1185863 1198292
12818 1198292 1232779 1248534 1206206 1160309 1186534 1251992 1260960 1211545 1197402 1251268 1297502
12807 1297502 1286121 1270555 1304417 1348809 1345683 1317114 1322632 1363044 1392309 1395325 1395737 1406716
12795 1406716 1424184 1453463 1498737 1538609 1549780 1542206 1538221 1534619 1520252 1511679 1531003 1563883
12783 1563883 1581209 1589248 1614091 1647237 1656311 1646472 1658530 1699490 1726808 1718431 1710399 1737819
12771 1737819 1778818 1791969 1779977 1777985 1797508 1820904 1842224 1874846 1916419 1940671 1936693 1931379
12759 1931379 1954994 2000063 2033550 2041776 2043256 2057013 2077195 2088179 2091907 2105837 2138230 2178730
12747B178730L4732K5019J8865J8958K7799M0953M3396K7868J0284J0170K2977
12736B459751L1550L6945N0604O0753M2716Q456N439M6349P7411N0319k850j0684
12724B856759L6051P3294N6974K0127J6448M3797N7224L8457J5731J7310L6735
12713C268907N2203N6286N2441M0163K2945J9673M4999Q1451R4120P6353N8133
12702C867674O1319P0923O6543N8962O9522Q9288R1027P5410P2003R1818J10162
12691D724651J06020R1375Q7224R2183R1674Q3362P8242Q5588J05640J27848J33333
12680E807140J14021R1445R6459J26307J46280J40443J31210J36510J41394J33247
12670G064456J31414J51461J70110J62946J51155J67020J93683J89843J62170
$$ plain form
12747 2178730 2213462 2238481 2257346 2276304 2304103 2345056 2388452 2416320 2426604 2436774 2459751
12736 2459751 2491301 2528246 2578850 2639603 2682319 2690775 2696214 2742563 2819974 2870293 2867443 2856759
12724 2856759 2892810 2966104 3023078 3043205 3059653 3103450 3160674 3199131 3214862 3232172 3268907
12713 3268907 3321110 3377396 3429837 3470000 3492945 3512618 3557617 3639068 3733188 3809541 3867674
12702 3867674 3928993 3999916 4066459 4125421 4194943 4284231 4375258 4450668 4522671 4614489 4724651
12691 4724651 4830671 4922046 5009270 5101453 5193127 5276489 5354731 5440319 5545959 5673807 5807140
12680 5807140 5921161 6012606 6109065 6235372 6381652 6522095 6653305 6789815 6931209 7064456
12670 7064456 7195870 7347331 7517441 7680387 7831542 7998562 8192245 8382088 8544258
12661H544258J57674J86507K09250K08084K12328K35296K42774K15303J91525
12652A0402999K09159K43545K50678K38463K44537K67436K74669K65747K71221
12643A2668454K92242K95907K77204K72995K98370L17299L01952K79959K89654
12634A5294036L19884L32283L23493L26328L56523L92025M07320M04604M05641
12625A8562137M26010M59438M81783M76167M57995M60872M90324N12419N03216
12616B2830361M86403M98502N37429N75047O03409O34596O68100O95635P29422
12607B8258904P87486Q57760R15648R68885J040890J119224J175011J228012J327846
12598C7679666J468492J594764J703504J853971K059905K275718K527060K922702
$$ plain form
12661 8544258 8701932 8888439 9097689 9305773 9518101 9753397 9996171 10211474 10402999
12652 10402999 10612158 10855703 11106381 11344844 11589381 11856817 12131486 12397233 12668454
12643 12668454 12960696 13256603 13533807 13806802 14105172 14422471 14724423 15004382 15294036
12634 15294036 15613920 15946203 16269696 16596024 16952547 17344572 17751892 18156496 18562137
12625 18562137 18988147 19447585 19929368 20405535 20863530 21324402 21814726 22327145 22830361
12616 22830361 23316764 23815266 24352695 24927742 25531151 26165747 26833847 27529482 28258904
12607 28258904 29046390 29904150 30819798 31788683 32829573 33948797 35123808 36351820 37679666
12598 37679666 39148158 40742922 42446426 44300397 46360302 48636020 51163080 54085782
12590E4085782L452038L917896M229249M627619N350956O085758O068703M906886
12582I2724887L111524J599086P41508J16555q22919k056733l061244l399816
12574H8952848l079556k377475j521585o43470R8909N86431R63942J578576K501991
12565H7060611L230658L134469K235312J292056R82840J194233J301590J002612
12557A01434381O22870O50357J224894K111215K925385L277823K909543J903428
12549A17059896O90313l25839j127551j942652k789675l361296l411322l060797
12541A01731077k555941j861558p84578M66491J166714P92370k78982j106200
12533I7569393j235625j117830j386244k036907k550906k568754k104279j256680
$$ plain form
12590 54085782 57537820 61455716 65684965 70312584 75663540 81749298 87818001 92724887
12582 92724887 95836411 97435497 98177005 98293560 97470641 95413908 92352664 88952848
12574 88952848 85873292 83495817 81974232 81330762 81429671 82016102 82980044 84558620 87060611
12565 87060611 90291269 93425738 95661050 96953106 97935946 99130179 100431769 101434381
12557 101434381 102057251 102707608 103932502 106043717 108969102 112246925 115156468 117059896
12549 117059896 117750209 117424370 116296819 114354167 111564492 108203196 104791874 101731077
12541 101731077 99175136 97313578 96529000 96995491 98162205 98954575 98675593 97569393
12533 97569393 96333768 95215938 93829694 91792787 89241881 86673127 84568848 83312168
12525H3312168j38330R33193J619930K066148K804317L903520M551677L877730
12517A02930353K030872N7695j255144k073508l027898m366976n743561o619725
12509H1932108o702712o098085n200765m413082l881121l498400l145570k833391
12501D6158982k599466k396185k163306j928804j754203j634465j522359j406082
12493C0754112j298797j191340j075242r77926r19847q68980p90366p08783o67795
12484B2255036o55481o28459n87146n66471n64354n40024m84005m35350m18015
12475A7375731m04892l64648l12143k87046k98322l13873l05015k83697k82288
12466A4523807l02833l10399k87026k64925k77884l02282k89523k44653k20174
$$ plain form
12525 83312168 83173838 84107031 85726961 87793109 90597426 94500946 99052623 102930353
12517 102930353 104961225 105018920 103763776 101690268 98662370 94295394 88551833 81932108
12509 81932108 75229396 69131311 63930546 59517464 55636343 52137943 48992373 46158982
12501 46158982 43559516 41163331 39000025 37071221 35317018 33682553 32160194 30754112
12493 30754112 29455315 28263975 27188733 26210807 25290960 24421980 23631614 22922831 22255036
12484 22255036 21599555 20971096 20383950 19817479 19253125 18713101 18229096 17793746 17375731
12475 17375731 16970839 16606191 16294048 16007002 15708680 15394807 15089792 14806095 14523807
12466 14523807 14220974 13910575 13623549 13358624 13080740 12778458 12488935 12244282 12024108
12457A2024108k31517k36047k09614j86225j94558k07395j91854j67038j68642
12448A0231218j88462j92504j76311j62440j59479j57872j53385j47757j39505
12439H753503j33688j41616j54968j47488j19463j05967j20048j28991j14480
12430G586794j08825j32210j43113j04804n8533o5888j09766j22242r0310o3552
12420F587551o7942q1136q9493j02696j09621q4152m2536l4564o6925r1804q2960
12409E733722o7486o9039p5308p7847q8925j00174q0775l9699l2646p6528j12030
12398D913265q9596m2654k9685m6348m8061k8982k2416l8012m9565m2456l3219
12387D442271l8522n2677o0011n2378l4163j9133j6839j8436r593J095r700l8139
$$ plain form
12457 12024108 11792591 11556544 11346930 11160705 10966147 10758752 10566898 10399860 10231218
12448 10231218 10042756 9850252 9673941 9511501 9352022 9194150 9040765 8893008 8753503
12439 8753503 8619815 8478199 8323231 8175743 8056280 7950313 7830265 7701274 7586794
12430 7586794 7477969 7345759 7202646 7097842 7039309 6973421 6863655 6741413 6651103 6587551
12420 6587551 6519609 6438473 6348980 6246284 6136663 6052511 6009975 5975411 5908486 5816682 5733722
12409 5733722 5666236 5597197 5521889 5444042 5355117 5254943 5174168 5134469 5101823 5025295 4913265
12398 4913265 4823669 4781015 4751330 4704982 4656921 4627939 4605523 4567511 4517946 4475490 4442271
12387 4442271 4403749 4351072 4291061 4238683 4204520 4185387 4168548 4150112 4140519 4141614 4131914 4093775
12375D093775n0085l2618j7003l1662o2600q1965q5458p7818n3582k1411j5195
12364C564378m5909p1769n5024k0480j4134l0720l4019k6662l8817o0265n1322
12353C115257k1610k7028p3177r2182m7802J427p405m2642l4324Q207J2881l3213
12341B758389n9939k7191J1715j976m0303m0859j0626q271m0076m8898j4659O934
12329B484240k3060n8179m0263N219R952k9154n0185k5301N518N803j0458j8906
12317B255226k2244k6834k3028j0171o658j7339k3609j9370k0444k6134j4462
12306B044933Q796N330k8860m4155j6136R868n884l0485j8983O327K35k1395j3005
12293A896586J4113J1866j6135k2635m639o115l1862l5745o513Q375j4100l3436
$$ plain form
12375 4093775 4043690 4011072 3994069 3962407 3899807 3817842 3732384 3654566 3600984 3579573 3564378
12364 3564378 3518469 3446700 3391676 3371196 3357062 3326342 3292323 3265661 3226844 3166579 3115257
12353 3115257 3093647 3066619 2993442 2901260 2853458 2854885 2847480 2804838 2770514 2778721 2791602 2758389
12341 2758389 2698450 2671259 2682974 2680998 2640695 2599836 2589210 2580939 2540863 2491965 2477306 2484240
12329 2484240 2461180 2403001 2362738 2367957 2377909 2348755 2298570 2273269 2278787 2284590 2274132 2255226
12317 2255226 2232982 2206148 2183120 2172949 2166291 2148952 2125343 2105973 2085529 2059395 2044933
12306 2044933 2053729 2059059 2030199 1986044 1969908 1979776 1973892 1943407 1924424 1930751 1930986 1909591 1896586
12293 1896586 1910699 1922565 1906430 1883795 1879156 1873041 1841179 1805434 1798921 1807296 1793196 1759760
12281A759760j7834O075Q702O524J7668J8902r533l7743l0254l573M413m901m743
12268A713463M512J489j1833j4142n190m437j3373j3478r85O975K931j448J01
12255A664585p70n298L44K0451L5227K5836K833o778L905J5864J6649J8821L3452
12242A825121M3870L0493R740J3029L0202J8324k3462l9514m988K5028j509m8528
12230A877806n0337j7355r805l0601k7492O959K3472Q724M800K1426J4411k3566
12218A798442l6517m776J3570j3338k9762N991L8939J0881l3394j9796L0615M3172
12206A804027J4311L95J0526M826j6547j3814R439Q644j7759k6775j3525j5687
12194A748061l2239j9699J9831K8353j1269m4629l5850j6299j6457j8749r287
$$ plain form
12281 1759760 1741926 1748001 1756703 1763227 1780895 1799797 1790264 1752521 1722267 1718694 1723107 1718206 1713463
12268 1713463 1717975 1719464 1707631 1693489 1688299 1683862 1670489 1657011 1656026 1663001 1665932 1664484 1664585
12255 1664585 1663815 1658517 1658861 1679312 1714539 1740375 1743208 1736430 1740335 1756199 1772848 1791669 1825121
12242 1825121 1868991 1899484 1909224 1922253 1952455 1970779 1947317 1907803 1902815 1927843 1926334 1877806
12230 1877806 1827469 1810114 1800309 1769708 1742216 1749175 1772647 1781371 1786171 1807597 1822008 1798442
12218 1798442 1761925 1757149 1770719 1757381 1727619 1733610 1772549 1783430 1750036 1730240 1760855 1804027
12206 1804027 1818338 1818733 1829259 1834085 1817538 1803724 1813163 1821807 1804048 1777273 1763748 1748061
12194 1748061 1715822 1696123 1715954 1744307 1733038 1688409 1652559 1636260 1619803 1601054 1591767
12183A591767j0145k5494j9325J5876L0474n27k7245m530L3651L2921L057j2878
12171A607602j2657j9817k8260j9747r729k1284l7223k9887j4395j9398k9368
12160A365837j3584Q871l519l6895l8930q170L043j9468k6555P572L7465J8880
12148A294547k1813l1791r033P177N0j1055r824j169P051J3493J3334J71j8135
12135A233003k1975m915J4761J5234j990j4128m963J5941K4611R696j5948k9308
12123A220019k0007m55N829r399k4480j1103K3720L7666R118k7683k9027m432
12111A169766M004q388p823J0863J2014j2990k2431M513K7026J0881j2546m033
12099A170856J1599p603l6841j9873L0405M3574L092k8637j1385J5493O251j8572
$$ plain form
12183 1591767 1581622 1556128 1536803 1552679 1583153 1582626 1555381 1550851 1584502 1617423 1620480 1607602
12171 1607602 1594945 1575128 1546868 1527121 1517392 1496108 1458885 1428998 1414603 1395205 1365837
12160 1365837 1352253 1361124 1357605 1320710 1281780 1273610 1276653 1257185 1230630 1238202 1275667 1294547
12148 1294547 1272734 1240943 1231910 1239087 1239137 1228082 1218258 1217089 1224140 1237633 1250967 1251138 1233003
12135 1233003 1211028 1206113 1220874 1236108 1234118 1219990 1215027 1230968 1255579 1265275 1249327 1220019
12123 1220019 1200012 1199557 1205386 1195987 1171507 1160404 1184124 1221790 1230908 1203225 1174198 1169766
12111 1169766 1173770 1165382 1157559 1168422 1180436 1167446 1145015 1149528 1176554 1187435 1174889 1170856
12099 1170856 1182455 1174852 1138011 1118138 1148543 1192117 1195209 1166572 1155187 1170680 1176931 1158359
12087A158359j4089J4776K5751M109k2625k5440l519K1596K6795R115p309J562
12075A189081K4397K7409M759j2254m458Q232M343n475l736K643J607K030J2321
12062A250899J5359k686j7457J168L3682L1513p670k9781k373L6664L4191l047
12050A340462k2963m260J9266J3875p081r164J0396K1531P352j3023j3461N341
12038A348271K1986K2793J2216J867j61P071J6403J8938J6171J8866K9043L3674
12026A547138K4573J3540J6544L1503M2496L8210J8532o006j5510J250K2886J4309
12014A749465j8258k4710J3400M3497J8103k5909k1158K2637L5096K64k1127N604
12002A776904L8209L4765J4828Q535N162n459L923M3055O2401K5123k1269j1718
$$ plain form
12087 1158359 1144270 1159046 1184797 1188906 1166281 1140841 1137322 1158918 1185713 1194828 1187519 1189081
12075 1189081 1213478 1240887 1245646 1233392 1228934 1237166 1241509 1236034 1232298 1234941 1236548 1238578 1250899
12062 1250899 1266258 1263572 1246115 1247283 1280965 1312478 1304808 1275027 1272654 1309318 1343509 1340462
12050 1340462 1317499 1313239 1332505 1346380 1339299 1330135 1340531 1362062 1369414 1356391 1342930 1348271
12038 1348271 1370257 1393050 1405266 1407133 1406972 1414043 1430446 1449384 1465555 1484421 1513464 1547138
12026 1547138 1571711 1585251 1601795 1633298 1675794 1714004 1732536 1726530 1711020 1712270 1735156 1749465
12014 1749465 1731207 1706497 1719897 1763394 1781497 1755588 1734430 1757067 1792163 1792427 1771300 1776904
12002 1776904 1815113 1849878 1864706 1873241 1878403 1872944 1876867 1919922 1982323 2007446 1986177 1974459
11990A974459L0728L1201j4171l3845p66K4238o481n0810m2950R967M4002K6636
11978A992208j2039k7000o633K5883M0702K8672P457j231J351j977j2406j1028
11966B023959P510K0217J0065l720P666L6698M7377K8448J1080K1409L8772K5554
11954B275035j3834l6418k4853j2690k8006m5298k7794O494Q015k4680m1561k2167
11942B012243m739j4946k0511O737L1524R496l2983l3539R180L5397J8512j474
11930B014897Q554K3322R287j5728j1147K1256L8910J8990j3078k0416M74K3073
11918B098394K8318K2862J9040J3601P02n689J2466M0570M0208M065k6518j5504
11906B232515K1714M6186M4599K6907m91k8863l4232m021L6011N1180M1623K9942
$$ plain form
11990 1974459 2005187 2036388 2022217 1988372 1987606 2011844 2005363 1954553 1911603 1921570 1965572 1992208
11978 1992208 1980169 1953169 1946536 1972419 2013121 2041793 2049250 2048019 2049370 2047393 2034987 2023959
11966 2023959 2031469 2051686 2061751 2058031 2065697 2102395 2149772 2178220 2189300 2210709 2249481 2275035
11954 2275035 2261201 2224783 2199930 2187240 2159234 2113936 2086142 2092636 2100651 2075971 2034410 2012243
11942 2012243 2007504 1992558 1972047 1978784 2010308 2019804 1986821 1953282 1962462 1997859 2016371 2014897
11930 2014897 2023451 2046773 2056060 2040332 2029185 2050441 2089351 2108341 2095263 2074847 2075321 2098394
11918 2098394 2126712 2149574 2168614 2182215 2182917 2177228 2189694 2230264 2270472 2274537 2248019 2232515
11906 2232515 2254229 2300415 2345014 2371921 2371430 2342567 2308335 2304314 2340325 2391505 2433128 2463070
11894B463070K2575J4556J3930K5526K7869N527j3191M575L5805L1899j815j3730
11882B616596J0808L3204L1628K7230L0655K3168Q063K0588O0816P4409L5023
11871B972188n359R176N5602P0544M1914J4120J8141L9142N0178M6962M4593N4025
11859C411226O6159O2875M8944N5483R0187J07855P1266J9541J7339N0896M9792
11848D051563R567J825M4386O0675J2181k5763J1921O7136N7319J5684K8886Q4521
11836D419901R4622M7336K2108N3448Q3757P1155N3817P3090J04351J05784Q5406
11825E214775Q0087R9333J19731J18040R5644Q0727J01236J41101J44875R3810
11815F289359M7827O7916J25835J48473J27824J17221J32964J38336J24099J24838
$$ plain form
11894 2463070 2485645 2500201 2514131 2539657 2567526 2573053 2559862 2564437 2600242 2632141 2630326 2616596
11882 2616596 2627404 2660608 2692236 2719466 2750121 2773289 2781352 2801940 2862756 2937165 2972188
11871 2972188 2966829 2976005 3031607 3102151 3144065 3158185 3176326 3215468 3265646 3312608 3357201 3411226
11859 3411226 3477385 3540260 3589204 3644687 3734874 3842729 3913995 3933536 3950875 4001771 4051563
11848 4051563 4061130 4062955 4107341 4168016 4180197 4154434 4166355 4233491 4290810 4306494 4335380 4419901
11836 4419901 4514523 4561859 4583967 4637415 4721172 4792327 4846144 4919234 5023585 5129369 5214775
11825 5214775 5294862 5394195 5513926 5631966 5727610 5808337 5909573 6050674 6195549 6289359
11815 6289359 6337186 6405102 6530937 6679410 6807234 6924455 7057419 7195755 7319854 7444692
11805G444692J45250J48433J34116J48963J93524K00560J45842J03375J36173
11796H800928J98297K09486J74129J56038J73028J89171J91128K03738K33598
11787A0529541K52771K44118K23863K14930K24908K48671K71086K74580K62468
11778A2746936K60939K79334K90188K74048K59514K82679L25598L38302L13893
11769A5371431K97238L15534L40819L36408L10161L00225L24342L63094L87802
11760A8347054L90825L87347L95365M18552M47138M70351M84883M94564N05871
11751B2341950N20976N32527N31302N22270N23116N41448N66765N92396O26670
11742B7299420O69416P00118P11539P33563P94660Q77044R42754R90273J050087
$$ plain form
11805 7444692 7589942 7738375 7872491 8021454 8214978 8415538 8561380 8664755 8800928
11796 8800928 8999225 9208711 9382840 9538878 9711906 9901077 10092205 10295943 10529541
11787 10529541 10782312 11026430 11250293 11465223 11690131 11938802 12209888 12484468 12746936
11778 12746936 13007875 13287209 13577397 13851445 14110959 14393638 14719236 15057538 15371431
11769 15371431 15668669 15984203 16325022 16661430 16971591 17271816 17596158 17959252 18347054
11760 18347054 18737879 19125226 19520591 19939143 20386281 20856632 21341515 21836079 22341950
11751 22341950 22862926 23395453 23926755 24449025 24972141 25513589 26080354 26672750 27299420
11742 27299420 27968836 28668954 29380493 30114056 30908716 31785760 32728514 33718787 34768874
11733C4768874J133761J222932J303558J379877J459978J555000J683419J849465
11725D6356864K028924K201814K389496K645958L026466L550001M142858M654892
11717G0997273N051628N559643O373810P122169O933998N369181L112871J337517
11709A11858090M03962l82842j667608l165287m114174m192887l623194k674868
11701I2441192j540258n39175O9701N06022J246745K258506K833898K423559J362378
11692A01062568M94790K30226K39634L2931m20852p17725m98301K32712J223798
11683A01879781K256780L193441L805544L777148L008523J804809O09539l86612
11675A19948953j247040k012748k628194l060073l232737k894344j890092o41996
$$ plain form
11733 34768874 35902635 37125567 38429125 39809002 41268980 42823980 44507399 46356864
11725 46356864 48385788 50587602 52977098 55623056 58649522 62199523 66342381 70997273
11717 70997273 76048901 81608544 87982354 95104523 102038521 107407702 110520573 111858090
11709 111858090 112262052 111879210 110211602 107046315 102932141 98739254 95116060 92441192
11701 92441192 90900934 90361759 90431460 90937482 92184227 94442733 97276631 99700190 101062568
11692 101062568 101557358 101787584 102027218 102060149 101639297 100921572 100423271 100655983 101879781
11683 101879781 104136561 107330002 111135546 114912694 117921217 119726026 120335565 119948953
11675 119948953 118701913 116689165 114060971 111000898 107768161 104873817 102983725 102341729
11667A02341729p71l84881j286666j876105j933844j926047k266451k814796l130333
11658H6721835k967847k404347j626701p60724R9771Q28347J357806J838265K529660
11649H5616065L367048L743472L026377J345739m13933j556447k266650l161653
11641H9700018m384954n458724n913713n727231n151859m427815l745654l249267
11633E1640801k938967k690582k434960k214557k047155j874201j678418j519617
11625C4242344j416736j317775j214620j157609j128032j035679q81729p81986
11617B5308178p78108p67530o82742n99426n88872n95491n52293m99633m91310
11608A9752773m88037m43773m02239m07008m05142l44293k82990k95303l38564
$$ plain form
11667 102341729 102340958 101956077 100669411 98793306 96859462 94933415 92666964 89852168 86721835
11658 86721835 83753988 81349641 79722940 78962216 79061987 79890334 81248140 83086405 85616065
11649 85616065 88983113 92726585 95752962 97098701 96684768 95128321 92861671 89700018
11641 89700018 85315064 79856340 73942627 68215396 63063537 58635722 54890068 51640801
11633 51640801 48701834 46011252 43576292 41361735 39314580 37440379 35761961 34242344
11625 34242344 32825608 31507833 30293213 29135604 28007572 26971893 26090164 25308178
11617 25308178 24530070 23762540 23079798 22480372 21891500 21296009 20743716 20244083 19752773
11608 19752773 19264736 18820963 18418724 18011716 17606574 17262281 16979291 16683988 16345424
11599A6345424l27519k77143k58505k66016k43439k00890j93519k13671k09883
11590A4154839j88632j95564k16693j99270j56470j52329j90237k11244j99415
11581A2444985j95620k05930j90295j51755j45211j77702j85908j41523j00765
11572A0950276j11820j41479j38980j17809j23092j54557j71606j56925j34982
11563I699026j32160j45821j56377j55706j54365j59669j57543j34758j13723
11554H388904j30779j72756j79410j32127r2520j13245j55179j48199r8903p2146
11544G093640q7507j04054r8663r0029q4067o3279m0733n8935j13842j39624j00432
11533F112475m7866m8633r2524j15834r3245o1529n6731o7480o4048m8684n0554
$$ plain form
11599 16345424 16017905 15740762 15482257 15216241 14972802 14771912 14578393 14364722 14154839
11590 14154839 13966207 13770643 13553950 13354680 13198210 13045881 12855644 12644400 12444985
11581 12444985 12249365 12043435 11853140 11701385 11556174 11378472 11192564 11051041 10950276
11572 10950276 10838456 10696977 10557997 10440188 10317096 10162539 9990933 9834008 9699026
11563 9699026 9566866 9421045 9264668 9108962 8954597 8794928 8637385 8502627 8388904
11554 8388904 8258125 8085369 7905959 7773832 7681312 7568067 7412888 7264689 7165786 7093640
11544 7093640 7006133 6902079 6803416 6713387 6629320 6566041 6525308 6466373 6352531 6212907 6112475
11533 6112475 6064609 6015976 5923452 5807618 5714373 5652844 5596113 5528633 5464585 5415901 5365347
11522E365347p4414q3755n3036j4486j8693n8792p7706n3264k7223l4383n2593
11511D817002m9665l3972k5229j7734q633k0061n2863o1950k4173J1888m246m6848
11499D483516o2491n5476o0339o7604m9810l0325m8865q2298p7541m3537l2209
11488C873021m6346m7558l8193m8665n8517k4537K2209Q890n1148p0084l2533
11477C486539j7109n1077o2458j6940J3659k1545o1705m2148k087m900k7941j6969
11465C175319J0754L049l2948n1233m6122m2567l9944k7332k2883m0188m8094
11454B837811j9979J0783J458k7523k9410r927q889k8223l7375l0905k6592k3663
11442B607566j1792l607j3632k5374k0592j5691k6865l0017l367K1065K466l8140
$$ plain form
11522 5365347 5290933 5207178 5154142 5139656 5120963 5062171 4984465 4931201 4903978 4869595 4817002
11511 4817002 4767337 4733365 4708136 4690402 4681769 4661708 4608845 4546895 4522722 4534610 4530364 4483516
11499 4483516 4421025 4365549 4305210 4237606 4187796 4157471 4108606 4026308 3948767 3905230 3873021
11488 3873021 3826675 3779117 3740924 3692259 3633742 3609205 3631414 3640304 3589156 3519072 3486539
11477 3486539 3469430 3418353 3355895 3338955 3352614 3331069 3269364 3227216 3225129 3220229 3192288 3175319
11465 3175319 3186073 3189122 3156174 3104941 3058819 3016252 2976308 2948976 2926093 2885905 2837811
11454 2837811 2817832 2828615 2830073 2802550 2773140 2763213 2754324 2726101 2688726 2657821 2631229 2607566
11442 2607566 2595774 2592167 2578535 2553161 2532569 2516878 2490013 2459996 2456629 2477694 2480160 2442020
11430B442020m7346j8931P967J1557l30k1422m3828m3894j5076Q243J126q824
11418B271262O172J6975j1143m7168l9592k740J0098n350j1987m774p131j3409
11406B161213l688L405j8186m0225k3025M194j1993m6824l2908J6714K3692j9946
11394B012423l8643p618Q551k1049l8048n975J9543j0419n0729l8894N315K3118
11382A857575R872J758N717N44j5185k2536j4926j281Q177L184j7261k9748j2236
11369A773654J2351J039l7468m8760j9004M541m708j4298j200N653j3852k7429
11357A630519r059J1391Q88k0713k0656p770n080o168J433N177l201l105J5198
11344A588854K2801p48k8495k8649j1530k200j358k688j1963k2366j1920J0463
$$ plain form
11430 2442020 2394674 2375743 2383710 2395267 2394937 2373515 2329687 2285793 2270717 2278960 2280086 2271262
11418 2271262 2277434 2294409 2283266 2236098 2196506 2193766 2203864 2198514 2186527 2181753 2174622 2161213
11406 2161213 2157525 2160930 2142744 2102519 2079494 2083688 2071695 2024871 1991963 2008677 2032369 2012423
11394 2012423 1973780 1966162 1974713 1953664 1915616 1909641 1929184 1918765 1868036 1829142 1834457 1857575
11382 1857575 1867447 1869205 1874922 1875466 1860281 1837745 1822819 1821538 1829715 1832899 1815638 1785890 1773654
11369 1773654 1786005 1787044 1749576 1700816 1681812 1686353 1681645 1667347 1666147 1671800 1657948 1630519
11357 1630519 1621460 1632851 1633739 1613026 1592370 1584600 1579520 1573352 1574785 1579962 1576761 1573656 1588854
11344 1588854 1611655 1610907 1582412 1553763 1542233 1540033 1538675 1535987 1524024 1501658 1489738 1500201
11332A500201M969k7934l4042M731L0865M147l0897k3118K612J935q985J491R565
11319A435540j5157l7805j4613K0037N786l8833m8510k0402n007r487J506K2016
11307A295071J0389k5466l3077p148M349r680q153J6257J6440k1797m5525j9594
11295A172066J6468J3438j4867k2709k216J4189M125j7181j6502J5974M5530K8639
11283A236954k3910n0133k0756J9641K4200R624P906L447k2448l2779N596M4744
11271A202086K2046k9619l0541J2255K1512j3746k6113L708J6561j1791k8936
11260A137422n613J5551L962j0415n323l705j1966M08K9206K4499j6426k9238
11248A128362P621L0863M252j7246Q847L2359L229l3877j7038K5173K6155q274
$$ plain form
11332 1500201 1505170 1477236 1443194 1447925 1478790 1482937 1452040 1428922 1431534 1433469 1424484 1425975 1435540
11319 1435540 1420383 1382578 1367965 1388002 1393788 1354955 1306445 1286043 1281036 1271549 1273055 1295071
11307 1295071 1305460 1279994 1246917 1239769 1244118 1234438 1226285 1242542 1258982 1237185 1191660 1172066
11295 1172066 1188534 1201972 1187105 1164396 1162180 1176369 1180494 1163313 1146811 1162785 1208315 1236954
11283 1236954 1213044 1162911 1142155 1161796 1185996 1195620 1203526 1206973 1184525 1151746 1157342 1202086
11271 1202086 1224132 1194513 1163972 1176227 1197739 1183993 1157880 1161588 1178149 1166358 1137422
11260 1137422 1131809 1147360 1151322 1140907 1135584 1131879 1119913 1120321 1149527 1174026 1157600 1128362
11248 1128362 1135983 1166846 1171098 1153852 1162699 1195058 1198287 1164410 1147372 1172545 1198700 1190426
11236A190426k2150m307J2168J5163J3926K786j8980k1683P958K9507R791j8300
11224A196305j2723M856n013k2193n493K5347K0100j3751k5344n812Q950P363
11212A172592Q771J1477k536j8229l462K9607L6058R621j0427l132J2919K2307
11200A265566K9628L2199J9126K29j768J1206J5997O375l556p837r591j799K1512
11187A377287M2946M0351K0059O563J0323K7337N2845P3356O7565L8818K1075
11176A778525K9503L6307K0127J375j171o185k6745l6527j9748q350k4576l6019
11164A706516j7493l295j9518k2720K2442O1441L1324k5669k6007J7421K5645
11153A750087o729j2292K1739L6435J2716j895J2869K3008J8044K7255M6754L6345
$$ plain form
11236 1190426 1168276 1163969 1176137 1191300 1205226 1208012 1189032 1167349 1175307 1204814 1214605 1196305
11224 1196305 1183582 1188438 1183425 1161232 1155739 1181086 1201186 1187435 1162091 1156279 1165229 1172592
11212 1172592 1181363 1192840 1190304 1172075 1168613 1198220 1234278 1243899 1233472 1230340 1243259 1265566
11200 1265566 1295194 1327393 1346519 1346748 1344980 1356186 1372183 1378558 1375002 1367165 1357574 1355775 1377287
11187 1377287 1420233 1460584 1480643 1487206 1497529 1524866 1577711 1651067 1718632 1757450 1778525
11176 1778525 1808028 1844335 1864462 1865837 1864666 1858481 1831736 1795209 1775461 1767111 1742535 1706516
11164 1706516 1689023 1685728 1666210 1643490 1665932 1727373 1758697 1733028 1707021 1724442 1750087
11153 1750087 1743358 1731066 1752805 1789240 1801956 1800061 1812930 1835938 1853982 1881237 1927991 1964336
11141A964336J154p293J7285K7245J3475J8472M5167M5328J6854J7622N7587P3347
11129B290579M3604L3747Q0505J22700J04017O8274Q9878J66351K33445K42086
11119C475186J82603P9476q894l5006k8444o3028j45053k02115j97334j74489
11109B882902j67001j49009j10430r3110j09571j09627p4019n7415q7098j03921
11099A821701o4153j9034k5043m9173l6680p737j0753l4057l7009k3727k0531
11088A493804k0649q337J543m374q580l372j0497k8375k1705N712K145l5158m1388
11075A320769k149R716l3045n1574j590L7630M31m8539l3880K7j1239k4174J6220
11062A178603M7733k471o6393l8954L6860M2384j6789l9579j1510o69q891J4924
$$ plain form
11141 1964336 1965490 1958197 1975482 2002727 2016202 2034674 2079841 2125169 2142023 2159645 2217232 2290579
11129 2290579 2334183 2367930 2448435 2571135 2675152 2743426 2833304 2999655 3233100 3475186
11119 3475186 3657789 3737265 3728371 3693365 3664921 3601893 3456840 3254725 3057391 2882902
11109 2882902 2715901 2566892 2456462 2363352 2253781 2144154 2070135 2012720 1925622 1821701
11099 1821701 1757548 1738514 1713471 1664298 1627618 1619881 1609128 1575071 1538062 1514335 1493804
11088 1493804 1473155 1464818 1466361 1461987 1453407 1450035 1439538 1411163 1389458 1395170 1397315 1362157 1320769
11075 1320769 1318620 1328336 1295291 1243717 1242127 1279757 1280188 1231649 1197769 1197796 1186557 1162383 1178603
11062 1178603 1226336 1223865 1157472 1118518 1155378 1197762 1180973 1141394 1129884 1129215 1120324 1135248
11050A135248M1926K931o0475m4128L3728N6545R874q233K2018J3646m5790n5626
11038A101664J5143O4611K9952j8256j0050K1400K6359J5825N009j8103l3658
11027A199896j951M3826K7594l2085l7746J8898M1118P08j9187J3565K6786m962
11015A276460j0563K6110K2486l5933m7273J8393M8365j1805n4976q894L2609
11004A254979p992m3203Q654N9451J3634m7017j2200M8909J4149o1644m0524N1841
10992A239037P3050Q397k4448J0300K8335m481k6351j0630r84p091R083L7151
10980A331368K4135k0289l1389j835J3958K575J071J2177N575o785J0456L6019
10968A377036K2185j3221j6152N491O280k418J7920L8897Q248l9577k8434K5455
$$ plain form
11050 1135248 1177174 1180105 1119630 1075502 1109230 1165775 1175649 1167416 1189434 1203080 1157290 1101664
11038 1101664 1116807 1181418 1211370 1193114 1183064 1204464 1230823 1246648 1251657 1233554 1199896
11027 1199896 1197945 1241771 1269365 1237280 1199534 1218432 1259550 1260258 1241071 1254636 1281422 1276460
11015 1276460 1265897 1292007 1314493 1278560 1231287 1249680 1298045 1286240 1231264 1222370 1254979
11004 1254979 1246987 1203784 1212438 1271889 1285523 1238506 1226306 1275215 1289364 1227720 1187196 1239037
10992 1239037 1312087 1320484 1296036 1306336 1334671 1330190 1303839 1293209 1292225 1285134 1294217 1331368
10980 1331368 1355503 1335214 1303825 1301990 1315948 1318523 1319594 1331771 1337346 1330561 1341017 1377036
10968 1377036 1399221 1386000 1369848 1375339 1381619 1379201 1397121 1436018 1444266 1404689 1376255 1401710
10956A401710L8861L086j5962m204p615k4558r187K3612J4313k4353k3257J5304
10944A387750K4475J892P570L5901K0962k6745k4889K7269L8750q357k4668K2397
10932A482307M9433R622k6461j664L3918K4402J51M347J6990J0316J654L839l264
10919A605590j7521o932J9049J3689j5235j1210K0262J3082l0976l3788J3869
10908A569879K5611k4049m6600N136N5587M3437J9745L8625O1890M7512L0703
10897A827476M3642M9798K5440J1907K6035J8974j7575j5244L7931M9498j6247
10886B041635n4827P136P8431N0986k7441m8180j5838l909j3981j723J8531Q495
10874B039315p647P600K2318m708l5599j5603K9248M1822K8145K3021J7487m785
$$ plain form
10956 1401710 1440571 1443657 1427695 1423491 1415876 1391318 1382131 1405743 1420056 1395703 1372446 1387750
10944 1387750 1412225 1414117 1421687 1457588 1478550 1451805 1426916 1454185 1492935 1484578 1459910 1482307
10932 1482307 1531740 1541362 1514901 1513237 1547155 1571557 1571708 1576055 1593045 1603361 1605015 1608854 1605590
10919 1605590 1588069 1581137 1600186 1613875 1598640 1587430 1607692 1620774 1589798 1556010 1569879
10908 1569879 1595490 1571441 1524841 1529977 1585564 1629001 1648746 1687371 1749261 1796773 1827476
10897 1827476 1871118 1920916 1946356 1958263 1984298 2003272 1985697 1970453 2008384 2057882 2041635
10886 2041635 1986808 1993944 2072375 2123361 2095920 2047740 2031902 2027993 2014012 2012289 2030820 2039315
10874 2039315 2031668 2039268 2061586 2056878 2021279 2005676 2034924 2076746 2104891 2127912 2145399 2140614
10862B140614j6843j945O126m701R726N4494O0687J0778q658M4044Q1026L9243
10850B414591m113K3517N5593K0133j4852L0119Q5850N5174q438j338M3593L2852
10838B732681r286k486K6385N270l0543r898K3962k027l3729J1514O9096L3643
10826B814582l4912p370P9865Q9732K6495M911K8421J1224k2997J6241Q2136N3602
10814C141930k8244j6920P0548Q1098P695n184O0728O8846l584k1533M7469P6382
10802C479231K7780J7300P4429Q0545Q842j0382O4797J07811O2739L5453P0195
10791D018740O6396L62m355Q0652J09865K7002k6344K7772O7254J2020l0011J3769
10779D363122L9163j8547m9852R423M5275p027k7653M9219R2552K7691l756Q9194
$$ plain form
10862 2140614 2123771 2121826 2127952 2123251 2132977 2187471 2248158 2258936 2250278 2294322 2375348 2414591
10850 2414591 2410478 2433995 2489588 2509721 2494869 2524988 2610838 2666012 2657574 2656236 2699829 2732681
10838 2732681 2723395 2720909 2747294 2752564 2722021 2712123 2736085 2734058 2700329 2711843 2780939 2814582
10826 2814582 2779670 2772300 2852165 2941897 2968392 2973303 3001724 3012948 2989951 3006192 3088328 3141930
10814 3141930 3113686 3096766 3167314 3248412 3256107 3250923 3311651 3380497 3376913 3355380 3402849 3479231
10802 3479231 3507011 3524311 3598740 3679285 3688127 3677745 3742542 3850353 3913092 3948545 4018740
10791 4018740 4085136 4085498 4081143 4161795 4271660 4298662 4272318 4300090 4367344 4379364 4349353 4363122
10779 4363122 4402285 4383738 4333886 4343309 4388584 4381557 4353904 4403123 4495675 4523366 4519610 4608804
10767D608804J57733Q3705N694O2922J37869Q4632M059M6687J32142J14755N5330
10756E494332P9495J27817R2563M6660R3675J45952R4946M1754J07678J80260
10746F505132J13948K1052P8765J98121J83259Q4015Q3021J53055J38819P3532
10736G632719J01023J75971J51967Q1090J16758K03807J79073R7606J35365K43335
10726I118714K32311J37170J54609K68583K84428K00751K00621K94621L16912
10717A1208720K63916K94554L97746M00125L08407L07975M11679M39376L54394
10708A4386892K96007K80586K02132J18254J87598L33563L30747K13512K20773
10699A6570064L48834L65879K68537K88736M25401M24415K74114K54832M17756
$$ plain form
10767 4608804 4766537 4850242 4855936 4918858 5056727 5141359 5145418 5192105 5324247 5439002 5494332
10756 5494332 5573827 5701644 5794207 5840867 5934542 6080494 6175440 6217194 6324872 6505132
10746 6505132 6619080 6640132 6718897 6917018 7100277 7184292 7267313 7420368 7559187 7632719
10736 7632719 7733742 7909713 8061680 8142770 8259528 8463335 8642408 8740014 8875379 9118714
10726 9118714 9351025 9488195 9642804 9911387 10195815 10396566 10597187 10891808 11208720
10717 11208720 11472636 11767190 12164936 12565061 12873468 13181443 13593122 14032498 14386892
10708 14386892 14682899 14963485 15165617 15283871 15471469 15805032 16135779 16349291 16570064
10699 16570064 16918898 17284777 17553314 17842050 18267451 18691866 18965980 19220812 19638568
10690A9638568M83764L62555L02794M04267M50205L63406L59680M94807N29009
10681B3389055M05716L90070N57974O33158N19508M95789O73414P70928O57868
10672B8493480O05230P44657Q05555O62681O08135P81667Q76478P33091O68446
10663C4979420Q64199R94497Q42395P11923Q19446Q64716O50496N25133P22391
10654D1974616Q72209O96440N69668Q11357J050658R29287Q05364J064220J351978
10645E0125797J247077J083985J300036J557810J383219J104531J243409J525319
10637F0571183J450219J298733J563195J919310J824136J602433J837174K237687
10629G4304070K273644K326956K952320L643886L719448L724099M421777N188177
$$ plain form
10690 19638568 20122332 20484887 20787681 21191948 21642153 22005559 22365239 22860046 23389055
10681 23389055 23794771 24184841 24742815 25375973 25895481 26391270 27064684 27835612 28493480
10672 28493480 29098710 29843367 30648922 31311603 31919738 32701405 33577883 34310974 34979420
10663 34979420 35843619 36838116 37680511 38392434 39211880 40076596 40727092 41252225 41974616
10654 41974616 42846825 43543265 44112933 44924290 45974948 46904235 47709599 48773819 50125797
10645 50125797 51372874 52456859 53756895 55314705 56697924 57802455 59045864 60571183
10637 60571183 62021402 63320135 64883330 66802640 68626776 70229209 72066383 74304070
10629 74304070 76577714 78904670 81856990 85500876 89220324 92944423 97366200 102554377
10621A02554377N177206N208259O384016P734325P764548P477967Q829874J1004587
10613A62135159J1995292J3227086J7677274K3295991K4625341K2882536K7067352
10606C02906031L9842015M8697024L9575813J6263950k927141p783348o850534
10599D29723810j3170002k7180120l8797738m1161725l6170352k8921551k2501759
10592B21820563j8107794j5963829j4980498j3687043j2005818j0785895r952947
10585A26336739q706492p181740o287529o095596n840403n328802n004362m800180
10577G7091635m226886l463705l144008l170241k888440k316707k068341k156381
10569E3656926k007249j616999j574439j903548j957750j564314j266992j295874
$$ plain form
10621 102554377 107731583 112939842 119323858 127058183 134822731 142300698 151130572 162135159
10613 162135159 174130451 187357537 205034811 228330802 252956143 275838679 302906031
10606 302906031 342748046 391445070 431020883 447284833 444357692 436574344 429723810
10599 429723810 416553808 389373688 350575950 309414225 273243873 244322322 221820563
10592 221820563 203712769 187748940 172768442 159081399 147075581 136289686 126336739
10585 126336739 117630247 110448507 104160978 98065382 92224979 86896177 81891815 77091635
10577 77091635 72864749 69401044 66257036 63086795 60198355 57881648 55813307 53656926
10569 53656926 51649677 50032678 48458239 46554691 44596941 43032627 41765635 40469761
10561D0469761j250002r72164q34491r50144r42199p12027o46785q46009r02084
10552C2413856o77132n64490p33365q19454o31822m94911o04437o78117n40521
10543B6669607m55501n77368o39324m89303l94785n13012n79102m26298l12534
10534B2282380m16371m94942l67594k72370m02565n29900m37799l17717l81935
10525A8661187m67539l80502k75031l36874m20969l49686k58959l10990l63166
10516A5497471k56518j45558k08567l03208k39391j32946j62162k24999j63297
10507A3660825q5412j42346k16337j52739p2399j32513k05453j24938k6730j00917
10497A2401041k19314j66727m5327p9878j98478j85574r7130j37602k51426k23815
$$ plain form
10561 40469761 39219759 38247595 37413104 36462960 35520761 34808734 34161949 33315940 32413856
10552 32413856 31736724 31172234 30438869 29619415 28987593 28492682 27888245 27210128 26669607
10543 26669607 26214106 25636738 24997414 24508111 24113326 23600314 23021212 22594914 22282380
10534 22282380 21866009 21371067 21003473 20731103 20328538 19798638 19360839 19043122 18661187
10525 18661187 18193648 17813146 17538115 17201241 16780272 16430586 16171627 15860637 15497471
10516 15497471 15240953 15095395 14886828 14583620 14344229 14211283 14049121 13824122 13660825
10507 13660825 13575413 13433067 13216730 13063991 12991592 12859079 12653626 12528688 12501958 12401041
10497 12401041 12181727 12015000 11969673 11889795 11691317 11505743 11408613 11271011 11019585 10795770
10487A0795770r0524o8846j54458j53291n9304m5223j15083j08731k9093l6758
10477I934459j29784j41875n6777k7790q3667r8154n2628n5441j00371p1402J5009
10466I131579L1661o893K5991J06340R9799M6188J11283K54513K48596N9150r3822
10455A0014385j02491j09528k12170l05562l10264l03527l29556l08079k21066
10446G812142j75741k01526j92656j23394j07485j72530j92025j19332p3725j10904
10436F342824j23126n7956k3787p8107j16577p7869n8908j16563j50683j01167
10426E438081p1253j29959j73458j15239m5285o4201j13207j02437o6198o3999
10416D492845o1340k6776j6803n6321o7618j7288R029k6630l1747L0587M5885
$$ plain form
10487 10795770 10705246 10636400 10481942 10328651 10269347 10224124 10109041 10000310 9971217 9934459
10477 9934459 9804675 9662800 9606023 9578233 9494566 9396412 9343784 9288343 9187972 9116570 9131579
10466 9131579 9163240 9156347 9182338 9288678 9388477 9434665 9545948 9800461 10049057 10108207 10014385
10455 10014385 9911894 9802366 9590196 9284634 8974370 8670843 8341287 8033208 7812142
10446 7812142 7636401 7434875 7242219 7118825 7011340 6838810 6646785 6527453 6453728 6342824
10436 6342824 6219698 6161742 6137955 6059848 5943271 5865402 5806494 5689931 5539248 5438081
10426 5438081 5366828 5236869 5063411 4948172 4902887 4838686 4725479 4623042 4556844 4492845
10416 4492845 4431505 4404729 4387926 4331605 4263987 4246699 4255728 4229098 4197351 4227938 4273823
10405D273823m0294r3048j4465P2375L0078o1384o0051o943k2307p6171o1256
10394C940357j952J279l7438l2667K431l865l1218j3700K0433M197l1594k0423
10382C795840M441k1033n4730k7486R577k9134r5620q6313k9373k9425p6734q0030
10370C279980m7043o0346j04028q6130j6380L934l8431n5645k1808l52r404j429
10358B842918K2650J3418j5643o475K2818O643l3027j8859K8294J5703m8262o1604
10346B768574j2913r66n2920p7898l3485P393l774j9355p281q848l8555m2214
10334B477758k562J8028j5499n5484n8814m1598k2356J634P105l4283q1569o8339
10322B124021j8877j3008m3608l3877R563L479m7027m4597J9199L8038j9373n4418
$$ plain form
10405 4273823 4233529 4140481 4126016 4198391 4228469 4167085 4107034 4100091 4077784 4001613 3940357
10394 3940357 3938405 3939684 3902246 3869579 3872010 3868145 3836927 3823227 3843660 3847857 3816263 3795840
10382 3795840 3800281 3779248 3724518 3697032 3706609 3677475 3581855 3495542 3466169 3436744 3360010 3279980
10370 3279980 3232937 3172591 3068563 2982433 2966053 2969987 2931556 2875911 2854103 2853751 2844347 2842918
10358 2842918 2865568 2878986 2863343 2856868 2879686 2886329 2853302 2834443 2862737 2878440 2830178 2768574
10346 2768574 2755661 2754695 2701775 2623877 2590392 2597785 2594011 2574656 2567375 2558527 2519972 2477758
10334 2477758 2475196 2493224 2477725 2422241 2363427 2321829 2299473 2301107 2308212 2273929 2192360 2124021
10322 2124021 2105144 2092136 2048528 2014651 2024214 2027693 1980666 1936069 1955268 1993306 1973933 1919515
10310A919515j9614P223j2663m394N8362P9195J4931l0275J3496N7017J9748k3465
10298B079076R828N1686J4923l9239j6715L1475O381n1507l7251K3959K3061l9100
10286B056577o3919l0669r865k0129j3396O986j2512n7690n4998k491K3502J22
10274A821518j3937O218J4026j1527k8016j2817R25n205n798N872N2k3294k1484
10261A726533J3166K9288p00l3462k4086P537J6305p5j0463m768m157k1614l6448
10248A657056j9553K0372L5417J331l6827k1100K8533L7516o695l3057l237K7811
10236A687567Q618k5451k2210r6j19p544Q235K5328J2125o211N477K2439Q299
10223A716457j0551O147L1391J7593j4955j7144j334r624k7918j7836m94j9316
$$ plain form
10310 1919515 1899901 1907124 1894461 1890067 1948429 2027624 2042555 2012280 2025776 2082793 2102541 2079076
10298 2079076 2088904 2140590 2155513 2116274 2099559 2131034 2137415 2085908 2048657 2072616 2095677 2056577
10286 2056577 1992658 1961989 1952124 1931995 1918599 1925585 1913073 1855383 1800385 1797894 1821396 1821518
10274 1821518 1807581 1813799 1827825 1816298 1788282 1775465 1776390 1771185 1765387 1771259 1771311 1748017 1726533
10261 1726533 1739699 1768987 1768287 1734825 1710739 1718276 1734581 1734506 1724043 1719275 1715118 1693504 1657056
10248 1657056 1637503 1657875 1693292 1694623 1657796 1636696 1665229 1702745 1696050 1662993 1659756 1687567
10236 1687567 1696185 1670734 1648524 1648428 1648309 1640765 1649000 1674328 1686453 1680242 1685719 1708158 1716457
10223 1716457 1705906 1712053 1743444 1761037 1746082 1728938 1727604 1717980 1690062 1672226 1671732 1652416
10211A652416n0222l9677l242N274p276l13P093k7220o8743n3548r291j2109m5690
10198A347452l0692K0775J8755l7946n2907m633J6860k4383n0828k1164j151k8389
10186A151749l8506N174L2479l841l4360K142M4364J7286l4926k9874J2393J6752
10174A140832j4227j9271P529J7569k81j0600k81J0039J1612J2499J0779L149
10162A169348J432R759J1578K803K066Q678k080k2694j1972K6145L2049q752l0688
10149A187672K808L5449J8377o178J0272L0486M864l0010j4738K5599K7853j72
10137A292282o106R174Q219k91J7650M3281L2044j514n608J9721L1865K6623L3996
10124A501336M7944L5780P149K006J8602K1244R643J2908K3749O941l1410m7669
$$ plain form
10211 1652416 1602194 1562517 1559275 1564549 1557273 1556960 1564053 1536833 1468090 1414542 1405251 1393142 1347452
10198 1347452 1316760 1337535 1356290 1318344 1265437 1260804 1277664 1253281 1202453 1181289 1180138 1151749
10186 1151749 1113243 1118417 1150896 1147055 1112695 1114837 1159201 1176487 1141561 1111687 1124080 1140832
10174 1140832 1126605 1107334 1114863 1132432 1132151 1121551 1121270 1131309 1142921 1155420 1166199 1169348
10162 1169348 1170780 1180539 1192117 1194920 1196986 1205664 1203584 1180890 1168918 1195063 1227112 1218360 1187672
10149 1187672 1190480 1225929 1244306 1238128 1248400 1278886 1283750 1253740 1239002 1264601 1292454 1292282
10137 1292282 1286176 1295350 1303569 1303278 1320928 1364209 1396253 1394739 1389131 1408852 1440717 1467340 1501336
10124 1501336 1549280 1585060 1592209 1594215 1612817 1634061 1643704 1656612 1680361 1687302 1655892 1608223
10112A608223l1231j3124q859p011o687j4011j2941R280K4728N773j8370l934
10100A531836L2159M2247L0129L5719N7190N8535M0130L5064M9252O6157Q9413
10089B067831J20141J25878J01802J17553K12691K90242K28456O9511l0106k5460
10079C278539k4409r5441j73451j91923j81743j85180j79199j43010j11402j05923
10069A886858r2943n7673m1603o2504p6011n9069n0469o5976n9453j6845P0l9193
10057A265189p0404m3119p802k0809m2819j7600J7705l764n6422n9614m736M1010
10045I96815L7352N332k3818l3830j5590J5517J7861j7516l9526j2693K1330R687
10033I60921k6902l4646j3932l049o757l844O34r491j8106m653R052o112k9808
$$ plain form
10112 1608223 1576992 1563868 1555009 1547998 1541311 1527300 1514359 1523639 1548367 1554140 1535770 1531836
10100 1531836 1563995 1606242 1636371 1672090 1729280 1787815 1827945 1863009 1912261 1978418 2067831
10089 2067831 2187972 2313850 2415652 2533205 2745896 3036138 3264594 3334105 3303999 3278539
10079 3278539 3254130 3158689 2985238 2793315 2611572 2426392 2247193 2104183 1992781 1886858
10069 1886858 1793915 1736242 1694639 1632135 1556124 1497055 1446586 1380610 1321157 1304312 1304382 1265189
10057 1265189 1194785 1151666 1143864 1123055 1080236 1062636 1080341 1076577 1020155 960541 955805 996815
10045 996815 1034167 1039499 1015681 981851 966261 981778 999639 982123 942597 929904 951234 960921
10033 960921 934019 899373 885441 882392 875635 871791 872425 862934 844828 840175 849227 843115 813307
10020H13307k4406Q81J1082O055P946J2595M199n603o75M590l126l464J4036J6080
10006H53497j4510l3434p387K0688O371j2685J0416L1750j0358o8323m7793L0490
9994G58722N4466j398m5190k4345N961j557j2473N157J7225n713l0958k5159q843
9981F85895o631j677J9832L2203J6331n042r954r223r347O963L5645L7304n99
9968G91700l4778l0362r482n014r661m371J982m492j2563q368n3K650M834N647
9954F87669o435k2791j5623J4425K9555J1067j3298j5664m137M740J2377J9348
9942G01233J5385L846K882J1734J1069K297N805J7049J1410m162K135K4471K3057
9929H28211l094j2386J038k130k3512j6170K0243K1777k6258m9541q630K9271
$$ plain form
10020 813307 788901 789782 800864 806919 814865 827460 831659 826056 825381 829971 826845 823381 837417 853497
10006 853497 838987 805553 798166 818854 825225 812540 822956 854706 844348 776025 728232 758722
9994 758722 813188 811790 766600 742255 748216 746659 734186 739343 756568 750855 719897 694738 685895
9981 685895 679264 677587 697419 729622 745953 740911 730957 721734 712387 719350 754995 792299 791700
9968 791700 756922 726560 717078 712064 702403 698032 700014 695522 682959 674591 674538 677188 682022 687669
9954 687669 681234 658443 642820 657245 686800 697867 684569 668905 664768 669508 681885 701233
9942 701233 716618 720464 723346 735080 746149 748446 754251 771300 782710 778548 780683 805154 828211
9929 828211 825117 812731 813769 811639 788127 771957 792200 813977 787719 738178 729548 758819
9917G58819P649j9903R028M6553J8638l5849k5497L5306M8153n958m0874r201
9905G86864L2413K6351m563j4037l452K857N160J4593K3338J7130j013j5778j5751
9892H54112n60J5965J4647l625j3367q94J3455R130k441m886r487k8327m0839
9879H02883k5434j960j768j5127j1613L903J245k0181l0478j7466K470J6073K1999
9866G24546J5384m635k0490j7247o180k491J585J4394J9341L504j2398n998R352
9853G18667J1787P482P020q71j5930p176L0225M4712P363k7680o709K8079P100
9840H04069m3148l9476J8693M8016J3539l0433l7090k1020n480Q673J1007j2839
9828G14511l6731k0845J6459K1296n052j2428N542P230r075j163K7400K5157p874
$$ plain form
9917 758819 766468 746565 755593 802146 820784 784935 759438 794744 842897 836939 796065 786864
9905 786864 819277 845628 841065 827028 823576 826433 831593 846186 869524 886654 885641 869863 854112
9892 854112 853552 869517 884164 880539 867172 866278 879733 888863 886422 881536 872049 843722 802883
9879 802883 777449 775489 773721 758594 746981 750884 752129 731948 701470 684004 686474 702547 724546
9866 724546 739930 735295 714805 697558 691378 688887 690472 704866 724207 727711 715313 709315 718667
9853 718667 730454 737936 744956 744085 728155 720979 751204 795916 803279 775599 768890 796969 804069
9840 804069 760921 721445 740138 788154 801693 771260 734170 713150 707670 716343 727350 714511
9828 714511 677780 656935 673394 694690 689638 677210 682752 689982 680907 679744 707144 732301 724427
9815G24427j2728J8735K4026j3947k9962P191L7597J6248j3367m950J3412N123
9803G71805o117Q354K4175J6551Q926J8465J5658j2589k3823N718L1992J8934
9791H78049j336N260J5464Q049J3221M6319O1945L3690R606K7281M6934L3574
9779A178056K7199N8240P4615L7360P719M2402P9948M2181k0571r358N3135O3292
9767A634218J0368k1668m701P706m307n191L845j7792n8212o2730l7109l9562
9755A404865o8914o4616k2960p782l3880m3858j8904j1300m1615n8676l2179K00
9743A000381O905N561P946k664j9433j1192J1983P794j5841r808J9753J6780j5207
9730A002958j1567L0706L9087p91j3178K9303N3042J9116n502K4458M7607J5266
$$ plain form
9815 724427 711699 730434 754460 740513 710551 717742 755339 771587 758220 753270 766682 771805
9803 771805 765688 774042 798217 814768 823694 842159 857817 845228 821405 827123 859115 878049
9791 878049 876713 881973 897437 905486 918707 965026 1026971 1060661 1070267 1097548 1144482 1178056
9779 1178056 1205255 1263495 1338110 1375470 1383189 1425591 1505539 1547720 1527149 1517791 1570926 1634218
9767 1634218 1644586 1622918 1618217 1625923 1621616 1616425 1620270 1602478 1544266 1481536 1444427 1404865
9755 1404865 1335951 1271335 1248375 1240593 1206713 1162855 1143951 1132651 1091036 1032360 1000181 1000381
9743 1000381 1007286 1012847 1020793 1018129 998696 987504 999487 1007281 991440 981632 1001385 1018165 1002958
9730 1002958 991391 1022097 1061184 1060393 1047215 1076518 1129560 1148676 1143174 1167632 1215239 1230505
9718A230505j1381K6091O9183M1852j6095k0316J8400L0968J4115J4316K8436
9707A426074J9329j78R074L0582J9761r394p849J8136K0536k613j0808j210r973
9694A501467l8518m7759k6742p839j1367k3512k8038k0914k228J4042K593k9490
9682A281695l4729J949K5566n369m5079l2350Q489J1932j9713l1911j5678p958
9670A136844j3021m564P211q905l1982j2335L6439M9998J8381k771P499O971k0774
9657A168991k8807J0855N3861M9530J0914j4525p292J7150L5206L1382R393o812
9645A329846k029P753M428J51R342J3806l623j8536n963Q615n278j9935K022K9614
9631A350213J2723k0289n722L6044K7341k8116m3153O744M4519K3507n692K726
$$ plain form
9718 1230505 1219124 1245215 1314398 1356250 1340155 1319839 1338239 1369207 1383322 1397638 1426074
9707 1426074 1445403 1445225 1454299 1484881 1504642 1495248 1487399 1505535 1526071 1523458 1512650 1511440 1501467
9694 1501467 1462949 1415190 1388448 1380609 1369242 1345730 1317692 1296778 1294550 1308592 1311185 1281695
9682 1281695 1246966 1248915 1274481 1269112 1224033 1191683 1200172 1212104 1192391 1160480 1144802 1136844
9670 1136844 1123823 1119259 1126470 1117565 1085583 1073248 1109687 1159685 1178066 1175295 1182794 1189765 1168991
9657 1168991 1140184 1151039 1204900 1254430 1265344 1250819 1243527 1260677 1295883 1327265 1336658 1329846
9645 1329846 1327817 1335570 1339998 1340149 1349491 1363297 1359674 1341138 1335175 1343790 1338512 1318577 1320599 1350213
9631 1350213 1362936 1342647 1336925 1372969 1400310 1372194 1329041 1335785 1380304 1403811 1398119 1400845
9619A400845J6491O68j7383q283N591K843M675K2878K9260J3548P892K0559J3796
9606A513380j8672k6215Q979L4234K0851J5017M4034N6141J7468j1785K5247P8857
9594A757536P1757K4312J2777M5468O7489O0579N8170P6738R7845J07765J06536
9583B486972R4172Q4178J02801J43606J62635J49040J47342J73776J75173J18640
9573C838335N3655K7404P574m4848r6482j09317j17353j54021j74047j38052j02599
9562B990249j23525j42688q9844k7412n3867j20246j02169j8211l445p4831j02215
9551B131796l4570J8578j8638p1288o0696k9848l8637n2187k3762Q628j886k0327
9539A807163n02K4701O438k8223k6909j893M380l269J466O812n796j2294J0040
$$ plain form
9619 1400845 1417336 1418004 1400621 1392338 1397929 1400772 1405447 1428325 1457585 1471133 1479025 1499584 1513380
9606 1513380 1494708 1468493 1477472 1511706 1532557 1547574 1591608 1647749 1665217 1653432 1678679 1757536
9594 1757536 1829293 1853605 1866382 1911850 1979339 2039918 2098088 2174826 2272671 2380436 2486972
9583 2486972 2581144 2665322 2768123 2911729 3074364 3223404 3370746 3544522 3719695 3838335
9573 3838335 3891990 3919394 3926968 3882120 3785638 3676321 3558968 3404947 3230900 3092848 2990249
9562 2990249 2866724 2724036 2634192 2606780 2552913 2432667 2330498 2312287 2308842 2234011 2131796
9551 2131796 2097226 2115804 2097166 2025878 1965182 1935334 1896697 1844510 1820748 1829376 1827490 1807163
9539 1807163 1806661 1831362 1837800 1809577 1782668 1780775 1785155 1781886 1783352 1790164 1784368 1772074 1782114
9526A782114K9523J2003j3668m218K1459J8851j211M902L3172L8444Q727k2276
9514A907822k8763j4819P138K3521J8999k74k493K2596L9331J9826r316r573J1345
9501A985340K2916K3416K6951K6080R791m478L077J7542J4412M78l300L123R861
9488B135209J6686J6629n626l4293k5977J7757L4903o55k8001K142M0406K2299
9476B191479j7648m137M7188N4668O577k5522n952K2704K4167J5100J3191Q531
9464B330346K143J1706K6787J6286j0930j1508J7861L1789J2786m590o92o00j6338
9451B405046j7595J2158M0082L3855P186r863j1384n984J921N238k858j0759k828
9438B444215P411n394l0346l2875j3942q112k1951k7437j9895k4773l9530l0372
$$ plain form
9526 1782114 1811637 1823640 1809972 1805754 1827213 1846064 1844853 1849755 1882927 1921371 1930098 1907822
9514 1907822 1879059 1864240 1871378 1894899 1913898 1913624 1911131 1933727 1973058 1992884 1983568 1973995 1985340
9501 1985340 2008256 2031672 2058623 2084703 2094494 2090016 2093093 2110635 2125047 2125525 2122225 2125348 2135209
9488 2135209 2151895 2168524 2162898 2128605 2102628 2120385 2155288 2154633 2126632 2128774 2169180 2191479
9476 2191479 2173831 2169694 2216882 2271550 2278127 2252605 2246653 2269357 2293524 2308624 2321815 2330346
9464 2330346 2332489 2344195 2370982 2387268 2376338 2364830 2382691 2414480 2427266 2422676 2421984 2421384 2405046
9451 2405046 2387451 2399609 2439691 2473546 2480732 2470869 2459485 2453501 2455422 2460660 2457802 2447043 2444215
9438 2444215 2451626 2446232 2415886 2383011 2369069 2360957 2339006 2311569 2291674 2266901 2227371 2196999
9426B196999J67N729k5216m6697l4159k1768l2560l6297j2522O797j783r489L158
9413A992359J270l6279o1530l1638J1822N868l2313l9028r206O233r580k3334
9401A774644j8446j3684j5247p182P004L540j6160k3968j3103o128j0884r045
9389A651341M564R079n642k1372k1540j2730o853m399l964r978k3134l5489l8801
9376A481082l0185j3156j59m734k2456l2416k6338j8582j7544j1718Q76j413k5751
9363A277506m1983k6935l699l246j3830p903N347l46j5846j3132m12q833l1603
9350A115085k9982l75J6532J059j9110j9413j0997p795j803J0248J1215n083j7119
9337A042462j0256j102p362j7974j5168n960q050j7980j6628q23J0306K498j3310
$$ plain form
9426 2196999 2197166 2202895 2177679 2130982 2096823 2075055 2042495 2006198 1993676 2000473 1998690 1989201 1992359
9413 1992359 1993629 1957350 1895820 1864182 1876004 1881872 1849559 1810531 1801325 1807558 1797978 1774644
9401 1774644 1756198 1742514 1727267 1720085 1727089 1730629 1714469 1690501 1677398 1671270 1660386 1651341
9389 1651341 1655905 1664984 1659342 1637970 1616430 1603700 1596847 1592448 1588484 1578506 1555372 1519883 1481082
9376 1481082 1450897 1437741 1437582 1432848 1410392 1377976 1351638 1333056 1315512 1303794 1304670 1303257 1277506
9363 1277506 1235523 1208588 1204889 1201643 1187813 1179910 1185257 1184911 1169065 1155933 1155521 1146688 1115085
9350 1115085 1085103 1084728 1101260 1102319 1083209 1063796 1052799 1045004 1043201 1053449 1064664 1059581 1042462
9337 1042462 1032206 1031104 1023742 1005768 990600 984640 976590 958610 941982 941159 951465 953963 940653
9324I40653j5889m332p71j4856k0891N147L5587J9664l2353m6435O333N2340J8101
9311I42298n4211o4848m472L8048J3736k3696j5130J6599J7648j0897k6088j1459
9299H17528J0366J7783J0974L58n372m593m587r848r760N656K2065J7016l498
9286H64088j3282p894n206n902P148K7046K3877k322j3133P819K7719J8407j647
9273I26718l752P570J4408J8592K7147K9600J6718K603N145J9699K8769K3461
9261A116678N703j3919j7002K603K0700J2176p376n837P997K86j9984j1305J8617
9248A109337J3876l0505m8227j1186J9957m61k6450o996K2345P673k4248j7400
9236A007715J1024N731k5160l0418j1194j0529k6366j9828K090l987l1581l0132
$$ plain form
9324 940653 924764 920432 919661 904805 883914 889061 924648 944312 911959 865524 871857 924197 942298
9311 942298 888087 823239 818767 856815 870551 846855 831725 848324 865972 855075 828987 817528
9299 817528 827894 845677 856651 857009 851637 847044 842457 832609 822849 828505 850570 867586 864088
9286 864088 850806 842912 837706 831804 838952 865998 889875 887553 874420 882239 909958 928365 926718
9273 926718 922966 930536 944944 963536 990683 1020283 1037001 1039604 1044749 1064448 1093217 1116678
9261 1116678 1122381 1108462 1091460 1094063 1114763 1126939 1119563 1113726 1121723 1122009 1102025 1090720 1109337
9248 1109337 1123213 1092708 1044481 1033295 1053252 1052791 1026341 1019345 1041690 1049363 1025115 1007715
9236 1007715 1018739 1024470 999310 968892 957698 947169 920803 900975 903065 899078 867497 837365
9224H37365K737J4908q558k4887j4966r951k1440j7053J3395L2821K0520K360
9212H27251j319j000L591K9291N7388M0762j4808m1359p793L4389L4733J1469
9200I72595J327J152k203J081Q576q076m3190m1271J3855N3081J9922l9491m7600
9187H89758j0760O840r507j7445R06J7949J5467N059l741j1758j2655l942l376
9174H62795k0114k9405j3125N60j7103l8181k1669R612O62m0858n1542j3570J9433
9161F47495R642j4579j6529n525n946j4118j4373p342J7P222P883r269l4415l9299
9147E10864j8117J910K919J41R055J8051J2337J69m031k004r9N008J3107J2377
9133E61687O29m603N998J4813N705o948r72J5738J6297l068j8081j3866l996n609
$$ plain form
9224 837365 840102 855010 846452 821565 806599 796648 775208 758155 771550 804371 824891 827251
9212 827251 825932 824932 828523 857814 915202 955964 941156 899797 892004 926393 961126 972595
9200 972595 973922 975074 972871 973952 982528 974452 931262 889991 903846 956927 976849 937358 889758
9187 889758 878998 885838 876331 858886 859792 877741 893208 898267 894526 882768 870113 866171 862795
9174 862795 842681 813276 800151 800711 783608 745427 723758 733370 734032 693174 641632 628062 647495
9161 647495 657137 642558 626029 620504 614558 600440 586067 578725 578742 585964 593847 584578 550163 510864
9147 510864 492747 494657 497576 497717 506772 524823 537160 537329 533298 531294 531195 536203 549310 561687
9133 561687 562316 557713 563711 578524 584229 577281 576309 592047 608344 605276 587195 573329 569333 563724
9119E63724j4436j6534j1908j0698j2245o266M454K945j1824j5476K615J2414
9107D86765j2681m1934k4373K4815L3716j6046n1676j8135L4721L0933j3544k5313
9095D07248M817J8915k19o652J3582J1896k8603m8022o821L8854K1318k9392l2552
9082C64369J6721M4172J2670k9660l1106o820J478p041m215J1289J1841r265k2332
9069C52101p190J3190P378j4447j6658K453O183j7836l1645p802K1491J4309j1930
9056C09597j0830J2974J2601j7135k6469O682L7622K3249j6445l5265k3369k618
9044B70594J2289J8906J4407K101n544n580p742j0734j615J3556J1451o361j0702
9031B95026L354N213j3758j9693K842K0043R885J355J4602J6825j3854l5167j0912
$$ plain form
9119 563724 549288 532754 520846 510148 497903 491637 496091 499036 487212 471736 474351 486765
9107 486765 474084 432150 407777 432592 466308 450262 398586 380451 415172 446105 432561 407248
9095 407248 412065 430980 430761 424109 437691 449587 420984 372962 366141 404995 426313 396921 364369
9082 364369 381090 425262 437932 408272 377166 370346 371824 364783 360568 371857 383698 374433 352101
9069 352101 344911 358101 365479 351032 334374 336827 343010 325174 293529 285727 307218 321527 309597
9056 309597 298767 311741 324342 307207 280738 287420 325042 348291 331846 296581 273212 270594
9044 270594 282883 301789 316196 318297 312753 307173 299431 288697 287082 300638 312089 305728 295026
9031 295026 298380 303593 289835 270142 272984 293027 302912 304267 318869 335694 321840 286673 275761
9018B75761J7301q80l0865j1886K9237J9482k9346l6442P344K4244j2093l2135
9006B19722K778L2363P449k3983p151K1495N017k7259j1224L5777M0740l873l1289
8993B60562r612J8023J3064n777j0251q215j4501j7770n316Q974Q027O17K916
8980B40741Q876L107r459j1352l518l696j3256j0388J3126K9573J1513k2013k5552
8967B07702O038K5147R67l1449k2662J5358K7605q20k6917j7782Q084J9587J3767
8954B24625J079j4746k3366p815K1754K7154k480k8014j8762J580k75j1359k325
8941A67050J6631J6591L774L126O499r387k7032r470K7587K8331j2270l4471q737
8928A68222J8187L687k1790j1796J5946J2601j7305k4175M769K7522J5160q930
$$ plain form
9018 275761 293062 292182 261317 249431 278668 298150 268804 232362 239706 263950 251857 219722
9006 219722 222500 254863 262312 238329 231178 252673 257690 230431 219207 254984 295724 291851 260562
8993 260562 250950 268973 282037 276260 266009 257794 243293 225523 220207 229181 237208 237825 240741
8980 240741 249617 252724 243265 231913 228395 224699 211443 201055 214181 243754 255267 233254 207702
8967 207702 213740 238887 239854 208405 185743 201101 228706 227886 200969 183187 191271 210858 224625
8954 224625 225704 210958 187592 179777 201531 228685 226205 198191 179429 181009 180734 169375 167050
8941 167050 183681 200272 204046 207172 213671 204284 177252 167782 195369 223700 211430 176959 168222
8928 168222 186409 190096 168306 156510 172456 185057 167752 143577 148346 175868 191028 182098
8916A82098j1611L448J0652R82j2316j3957j065J4479J4584l758j7109k621K3986
8903A87792K2123j4800m2093k3918J4147K1789l370j7008K038K2892J4321r619
8891A74294j7216o219L283M851N629K542j0779k0048n547J9959K1702l896k0295
8878A48260o497J1675N348j2255j1726M162R748P2o852m292k648l190M718J7109
8864A53632J3421j0372k9209k1555K156J6187J2077J779l574m763o279p049k652
8851A13799O643J3768J2600N645k11m124j0026j5476j2231m38R456J2390J3131
8838A44926J1007k095k0574k2280p06J9544J6820K801j572m62p452j4139n761
8825A20057O489K953o747n49J1965M494j3562p613J8623K1859q917l1379j8520
$$ plain form
8916 182098 170487 173935 184587 185569 173253 159296 158231 172710 187294 183536 166427 163806 187792
8903 187792 209915 195115 153022 129104 143251 165040 161670 144662 146700 169592 183913 174294
8891 174294 157078 150859 154142 158993 164622 167164 156385 136337 130790 150749 172451 168555 148260
8878 148260 141763 153438 158786 146531 134805 138967 148715 148787 141935 137643 134995 131805 136523 153632
8864 153632 167053 156681 127472 105917 108073 124260 136337 138116 134542 129779 123500 116451 113799
8851 113799 120442 134210 146810 152455 152244 148120 138094 122618 110387 109949 119405 131795 144926
8838 144926 155933 153838 133264 110984 110278 129822 146642 149443 147871 147409 139957 125818 120057
8825 120057 126546 129499 122752 122203 134168 138662 125100 117487 136110 157969 149052 117673 99153
8812I9153K157L150J056J2852J5597p316k1661L943L4047J6394k7686l0238J4678
8799A16126L9378Q650k8698k0481J2113J7916l628j1856N611J8146L993j9091
8787A38179k3293p360P883Q444P70JJ0847K1271J5183q503l1430l2918j1967R734
8773I6841J0088p167j4630L611K6375K0737r734k6142j0512P530j88j2765L686
8760H7730L2079K4119j9159l8788n255L3583K3018j8176l0573k912K0752J3662
8748A20080k729n404k798n617k707J0509J0972j4839l6741j9209K1245L5222J1229
8735A19213j2027p640M290j928j5231j1406N293J2365O578L963R345J0176o08
8722A22383j4507k0934j7736r052j661J72J375Q486J2821J60j7117p222K6130
$$ plain form
8812 99153 101310 104460 105516 118368 133965 126649 104988 108931 142978 159372 131686 101448 116126
8799 116126 155504 164154 135456 114975 127088 145004 141376 129520 135131 153277 157270 138179
8787 138179 114886 107526 115409 123853 124623 124624 135471 156742 171925 163422 131992 99074 87107 96841
8773 96841 106929 99762 85132 88743 115118 135855 126121 99979 89467 96997 96809 84044 87730
8760 87730 119809 143928 124769 85981 80726 114309 137327 119151 88578 85666 106418 120080
8748 120080 117351 111947 109149 103532 100825 111334 122306 107467 70726 51517 72762 107984 119213
8735 119213 107186 99546 103836 101908 86677 75271 80564 92929 99507 103470 112815 122991 122383
8722 122383 107876 86942 69206 60154 58493 58665 60040 68526 81347 81507 64390 57168 83298
8709H3298L2890r135m7283k7237K0077K5841o768j4512J4086K3587l236j3446
8697G8162J5069K7409p735l2897m93L6172J0357l8769k8048K8294M1357n991l7861
8684H5026j4157J5468P685r502k252R486o38j4206o692O408J714r348o230K671
8670F5433Q96l160N003J6361J4755M369j482j525M80M769M913q794k4818j7581
8656E9619R656K2337Q671j925P401J1563n447j4181Q173K8979R284k9496l8185
8643G6449j5644Rq24N451K0002J5843q907k0872n196J2270J0422L681R059J4017
8629A15760J111j7309j5465N103J5263o30k1652j7877Q467K5360J5566m55P62
8616A14004P409m966k6463k5179j961R102j622o636L465K266j5573j2936K3088
$$ plain form
8709 83298 116188 107053 59770 32533 52610 78451 71683 57171 71257 94844 91608 78162
8697 78162 93231 120640 112905 80008 79515 115687 126044 87275 59227 87521 128878 122887 85026
8684 85026 70869 86337 94022 84520 82268 91754 91116 76910 70218 76626 78340 68992 62762 65433
8670 65433 66329 63169 68172 84533 99288 103657 102175 100650 101130 105899 110812 102018 77200 59619
8656 59619 69275 91612 100283 98358 105759 117322 111875 97694 105867 134846 144130 114634 76449
8643 76449 60805 60814 59990 65441 85443 101286 92379 71507 66311 78581 89003 92684 101743 115760
8629 115760 116871 99562 84097 89200 104463 103833 82181 64304 72771 98131 113697 113242 114004
8616 114004 121413 116447 89984 64805 62844 71946 70324 63688 67153 69419 53846 40910 63998
8603F3998M5277J8770j8556j8081J409l948k1726j1770J3519J0740j1982q825
8591E8825J8118K2734R36l746J5153J4138j5210k4835K841J9289o202l2601j6579
8578E2861K0155L4641K5676J2515n705k8578l1782o057J6198J0548Q09J2127K1874
8565A35282K166k2601j1902K1162K8238O08k2127j3690Q670J6991O434o634l801
8552A38796J5486K6617P091k5272k8514J221K0049M235j4126l986J5206J4246
8540A71049L782M262M291q319j0877J1655K4626k014l1334j2940K8894K9762r783
8527B03054k6794J234K7277J6097r053j6649j0822o971n386l904l864K337J8714
8514A85270K4808L270k1521j5438O726N923r390K090L3325L1990r156l5318j8113
$$ plain form
8603 63998 109275 128045 109489 91408 92817 88869 67143 55373 68892 79632 67650 58825
8591 58825 76943 99677 100613 96867 112020 126158 110948 86113 88954 108243 102041 69440 52861
8578 52861 73016 107657 133333 145848 140143 111565 79783 73726 89924 100472 101281 113408 135282
8565 135282 137448 114847 102945 124107 152345 152953 130826 117136 125806 142797 149231 142597 138796
8552 138796 154282 180899 187990 162718 134204 135425 155474 159709 145583 141597 156803 171049
8540 171049 174831 179093 183384 175065 164188 175843 200469 198455 167121 154181 183075 212837 203054
8527 203054 176260 177494 204771 220868 211815 195166 184344 177373 171987 168083 164219 166556 185270
8514 185270 210078 213348 191827 176389 183115 189038 179648 181738 215063 247053 237897 202579 184466
8501A84466O730R757Q486J3736L353k0220j4483K4622L7312k734l4346p404L0353
8488B39628J3735k9097k6667J5840L2467Q552p290N105J2021l922j6443r225R4
8475B34798J155O395J5225Q889r224j1967L597R391k979q462K264M657j0938j5796
8461B27005O985K7334J4241j3590j7291L435J5993O910m855l437L144K242l241
8448B64875k510N843J2056P505n182j4399j1560l83O880K830n943l958J5504L6137
8434C07695K9892p692m0946l1353J0103L1339O067l2356l8012j0889J2571J1113
8422B47532k821q347R7J1611J0176p654k2097j0842J5827K2935J851j5301p138
8409B35829L975n306j6209j332K5773L2687J8605M549o926k2437k7697r959P443
$$ plain form
8501 184466 191196 200953 209439 223175 226528 206308 191825 216447 253759 251025 216679 209275 239628
8488 239628 253363 224266 197599 213439 245906 254458 247168 252273 264294 260372 243929 234704 234798
8475 234798 235953 242348 257573 266462 257238 245271 248868 258259 255280 246818 249082 253739 242801 227005
8461 227005 233990 261324 275565 261975 244684 248119 264112 271022 266167 262730 265874 268116 264875
8448 264875 262365 268208 280264 287769 282587 268188 256628 256245 263125 265955 260012 256054 271558 307695
8434 307695 337587 329895 288949 257596 267699 299038 305105 272749 234737 223848 236419 247532
8422 247532 244711 236364 236461 248072 258248 250594 228497 217655 233482 256417 258268 242967 235829
8409 235829 239804 234498 218289 216957 242730 275417 294022 298571 291645 269208 241511 231552 238995
8396B38995j181j4053K571K6791J0359l4252m4083m797K9047K3637Q286R073O384
8383B56777j2388j8498L692K0733O857j0695k498J1256K171j3209p038O884l86
8370B43658k0706k5993j4091K65J5409K7973J7479j5966l0579l272K2372O38l5641
8357A81546k2859K7253M2221L108k9629j4596J4140J2878o491j0017K056P884
8345B07494L862k87o075j7641k2475o437J8856K5232M548j9043j8430K720J4679
8332A87003J282j6844j1434J0586J7852N209l8J0628R456j4558k6833l577K1153
8319A89885P542k2849k2292N324J7227N082k503k47q657k0484o973J9973J5891
8306A76919j6362k1267J4952L1528j0174n6915l9665K3623N5895K7234j7450k8303
$$ plain form
8396 238995 237814 223761 226332 253123 263482 229230 185147 180350 209397 233034 241320 250393 256777
8383 256777 244389 225891 229583 250316 257173 246478 243980 255236 257407 244198 237160 244044 243658
8370 243658 222952 196959 182868 183133 198542 226515 243994 228028 197449 194177 216549 217187 181546
8357 181546 158687 185940 228161 231269 201640 187044 201184 214062 207571 197554 199610 207494
8345 207494 211356 211069 204994 187353 164878 158441 177297 202529 207077 188034 169604 172324 187003
8332 187003 188285 171441 160007 170593 188445 193654 193616 204244 213700 199142 172309 168732 189885
8319 189885 197427 174578 152286 157610 174837 179919 177416 177169 168512 148028 141055 161028 176919
8306 176919 160557 139290 154242 185770 175596 118681 79016 102639 158534 185768 168318 140015
8294A40015o926J0997M404j1231o582J8718K8165q65l4607k4574J8367L6120Q467
8281A80468k3859k8229j8833j0939P913L5406L6128k30k9277j7355O712M164j1119
8268A30950o011J2623J7346Q151o11j1313k2854j4127J3075J5301k2602m3741
8256G6187k449N2614M7715n33j7866O217J5106r959k7492j7629o283k366J3388
8243A26650L0070J2898k2612k0488J7693K5720j4731l8400o641K8646J6923j0604
8231A45124p597P510L72q405J1176K9844P039k9407k3663J4048K4810l213k3819
8218A43819j1854P798J2133Q824P029K088m414l230J111m008j4243j5042p284
8205A22727j308M243J2333J1282l616j0695M319J6219n23k2501j2365J5590J6908
$$ plain form
8294 140015 133089 144086 148490 137259 130677 149395 177560 176695 142088 117514 135881 172001 180468
8281 180468 156609 128380 109547 98608 106521 141927 178055 177825 148548 131193 137905 142069 130950
8268 130950 124939 137562 154908 163059 162448 151135 128281 114154 127229 142530 119928 76187
8256 76187 73738 126352 174067 173534 155668 161885 176991 167032 139540 121911 115628 113262 126650
8243 126650 156720 169618 147006 126518 144211 169931 155200 116800 110159 138805 155728 145124
8231 145124 137527 145037 145409 137004 148180 178024 185063 155656 131993 146041 170851 167638 143819
8218 143819 131965 139763 151896 160720 167749 169837 165423 162193 163304 159296 145053 130011 122727
8205 122727 121419 125662 137995 149277 145661 134966 139285 155504 154981 132480 120115 135705 152613
8192A52613p698j4607P858K2342N967j9324k9468k6259j3124J3832L9577L5287
8180A66996J739k7124l0568j6846O363L5212M5216J4175k7971k7693P733J6701
8168A63933j4150k4988J3543M5357K0635k3643k9198n859M659N852K1425L2508
8156B10074R072k4807k4420m90L548j0773r094M495Nq831J4969M7945K7094l8371
8142B00416o1753q547M8386L9198p932k6887r085J1137J8890J6378l061l1409
8130A85731l1069J0489M3763K2576k3355l2037l65K2257J3832j488n139l010L423
8117B05608J7583K1835l277l4864k8916J1878L7305K2448l900j2359q871l765
8105B20705R687K5703J7437j6424l4484j1021K2249K4650O021J187J0493P340
$$ plain form
8192 152613 144915 130308 138166 160508 166475 147151 117683 91424 78300 92132 131709 166996
8180 166996 168735 141611 111043 94197 100560 135772 180988 195163 167192 139499 147232 163933
8168 163933 149783 124795 138338 183695 204330 180687 151489 145630 150289 156141 177566 210074
8156 210074 219146 194339 169919 169429 172977 162204 153110 157605 157610 148779 163748 211693 238787 200416
8142 200416 138663 130116 178502 217700 209768 182881 173796 184933 203823 220201 217140 185731
8130 185731 154662 165151 208914 231490 208135 176098 175733 197990 211822 210334 205195 202185 205608
8117 205608 223191 245026 241749 206885 177969 189847 227152 249600 245700 233341 224470 220705
8105 220705 230392 256095 273532 257108 222624 211603 233852 258502 264523 265710 276203 283543
8093B83543j0881k0485j2750j060Q816K1371K7081J0380j6102j9780K362J5303
8081B87798l98j7255l543K6978L4735J0840j3117r902J0995K2010J3647Q30j425
8068C62193L188K205m320l567Q427J7630J2299J652J118O515N49j6472k1530n30
8054C69357L0181M3443L2025J0253o705j3608r859L226J7279J8771L825j1981
8042D86207q002J4247K7637J3040j1117j0745J4154K6507P694j1740J058K7837
8030E76777K7366K335m912J7670L1548J0358j8492j9117k01Q373N818J1289K1432
8017F70244J5907j502m738R604J3598n852k0845n23M2335O2640L6510r935k8574
8004G78869k427L5181M1036J6158P54J2740K1059j27k1101Q09M7180N7494J9792
$$ plain form
8093 283543 272662 252177 239427 238367 247183 268554 295635 306015 289913 270133 272495 287798
8081 287798 287400 270145 266602 293580 328315 339155 326038 316136 327131 349141 362788 363618 362193
8068 362193 365381 367586 363266 359699 368126 385756 398055 399707 400825 407340 407889 391417 369887 369357
8054 369357 399538 442981 475006 485259 478554 464946 455087 458313 475592 494363 498188 486207
8042 486207 478205 492452 520089 533129 522012 511267 525421 551928 559622 547882 548940 576777
8030 576777 604143 606478 601566 619236 650784 661142 642650 623533 623332 631705 637523 648812 670244
8017 670244 686151 684649 679911 689515 703113 697261 676416 675893 718228 780868 817378 807443 778869
8004 778869 776442 811623 852659 868817 869571 882311 903370 903243 882142 882951 930131 987625 1007417
7991A007417j0893K492K7528K3108N486J2328L4746L4981J2750L199J5494K2203
7979A190839J2268Q448K1161K7723J5892R601K5603L7753J7894j2565j1159J9425
7967A362883L4739J6091m525L972K8222L5644J9981K247P13J6445L7654M4600
7955A598666K2308j5857k9513L454N1142O1075K6997l734N457L4788M2150K2051
7943A818984O387J4813L0263K8996J5218J1539K4207L4948K9041J6419J4561K0935
7931B066311J9467J0291J1008K4661L1552K4991K7766N0332O0221L0228m772J0059
7919B362115N9862P3052L1473K814L5971Q5614Q6725N3275M3521O3925P4355O7081
7907C039783P1576Q8582Q6065O3676N9952Q6504J11644J19660J29979J44842J37992
$$ plain form
7991 1007417 996524 999016 1026544 1049652 1055138 1067466 1102212 1137193 1149943 1153142 1168636 1190839
7979 1190839 1203107 1211555 1232716 1260439 1276331 1285932 1311535 1349288 1367182 1354617 1343458 1362883
7967 1362883 1397622 1413713 1409188 1413160 1441382 1477026 1497007 1499254 1499967 1516412 1554066 1598666
7955 1598666 1620974 1605117 1575604 1579058 1630200 1691275 1718272 1714538 1719995 1754783 1796933 1818984
7943 1818984 1825371 1840184 1870447 1899443 1914661 1926200 1950407 1985355 2014396 2030815 2045376 2066311
7931 2066311 2085778 2096069 2107077 2131738 2163290 2188281 2216047 2266379 2326600 2356828 2352056 2362115
7919 2362115 2421977 2495029 2526502 2529316 2565287 2650901 2737626 2790901 2834422 2898347 2972702 3039783
7907 3039783 3111359 3199941 3286006 3349682 3409634 3496138 3607782 3727442 3857421 4002263 4140255
7896D140255J14502J19817J61240J82134J51695J19975J34772J59281J33973P5746
7886E493390M4656M1378J2114n6678j18704j44867j59738j90309k25836k42320
7876D453086k33553k09926j90283j91574k04357j93552j50234j17042j24718j35703
7866B702144j04771o4150p5473j17753j10682m7030q303l2265n8440m0130k1294
7855B021853m8925q6874q3245o1076o9408r2612q4063n4734n1719p0615o3394
7844A255188k4348o76j6301m2006m7479l7035k7032k3700k6733k8567j6398K592
7832I67505k596l7679n8965l5988n116j1360l1080j6433J2899P61l9943m0450
7820G01555O049K9071k625l5464k7743j0051j4006j6981p08N306j3462j6625J6241
$$ plain form
7896 4140255 4254757 4374574 4535814 4717948 4869643 4989618 5124390 5283671 5417644 5493390
7886 5493390 5538046 5579424 5591538 5534860 5416156 5271289 5111551 4921242 4695406 4453086
7876 4453086 4219533 4009607 3819324 3627750 3423393 3229841 3079607 2962565 2837847 2702144
7866 2702144 2597373 2533223 2457750 2339997 2229315 2182285 2173982 2141717 2083277 2043147 2021853
7855 2021853 1972928 1886054 1802809 1741733 1672325 1579713 1495650 1440916 1389197 1318582 1255188
7844 1255188 1230840 1230164 1213863 1171857 1124378 1087343 1060311 1036611 1009878 981311 964913 967505
7832 967505 964909 927230 868265 832277 827161 815801 784721 768288 781187 781948 742005 701555
7820 701555 707604 736675 734050 698586 670843 660792 646786 629805 629097 634403 620941 604316 620557
7807F20557L4894J497l6591k4175P853J754k3816j5603Q786p905n0649n0272m771
7794D61559J5538j1183k7891n932J0025n815j1267J7638L0879r497n4655m3794
7782C65605n28J2649n299r093O161M869j5986k0313J565J7458Q522p490j4338
7769C43782j6914j6496m833R814O321j2152j8041l630P459O99j0586j5356j9310
7756B50757j8957J585L2176L3476m577l6896k5336N596J0604o650r084P148J0139
7743B49981q687j9446m481J4617J3313l056j6565k1515j8115l382J7023K5324
7731B25011J3508m992j4645j4325p953L189J1094M315r537o847J4307K4214O244
7718B43583j4863j3011l075j1257k5183j4188J3308J7775p472k4246r164J4345
$$ plain form
7807 620557 655451 656948 620357 596182 604035 605789 581973 566370 575156 567251 516602 466330 461559
7794 461559 477097 465914 438023 432091 442116 436301 425034 442672 473551 464054 409399 365605
7782 365605 365077 377726 372427 363334 369495 374364 358378 338065 339630 357088 365610 358120 343782
7769 343782 326868 310372 305539 315353 321674 309522 291481 287851 295310 296009 285423 270067 250757
7756 250757 231800 233385 265561 299037 294460 257564 232228 237824 248428 241778 232694 239842 249981
7743 249981 241294 221848 217367 231984 245297 242241 225676 204161 186046 182664 199687 225011
7731 225011 238519 233527 218882 204557 196604 199793 210887 215202 205665 198818 213125 237339 243583
7718 243583 228720 215709 212634 201377 176194 162006 175314 193089 185617 161371 152207 166552
7706A66552J7914O971r86o591j4823j5469j114J3363J1025j873r138q841p287
7693A49703l879J222j37p511o147N215M279j4539j7419J6973M8466K5869k9135
7680A72960m5263p467K1713K060k3985o508K7662J9633k3616l7721k52L5936K1613
7667A56765k1246l5622n242L2604L6803L699l5208m2950r948L2373L8485N4l8877
7654A11690l2609Q969L4387J8516q881r580J2384K4167J1882q002j8243j9321
7642A25359j7658j3881p526m05P859J6951J8924P579o403o971O39l943j9942k0964
7628G9618K425K1885J1643j2723j9545p064L084M778R188J4564O119j2741j7698
7615H3533P39K1099J9681q83j9789k2788j2466j748k89l680m43P308L724j1748
$$ plain form
7706 166552 184466 191437 190451 183860 169037 153568 152454 165817 176842 174969 165831 156990 149703
7693 149703 145824 147046 146909 139398 133251 138466 142745 128206 110787 127760 176226 202095 172960
7680 172960 127697 120230 141943 144003 120018 113510 141172 160805 137189 99468 99216 135152 156765
7667 156765 135519 99897 94655 127259 164062 167761 132553 89603 79655 112028 150513 150567 111690
7654 111690 79081 88050 122437 140953 132072 122492 134876 159043 170925 162923 144680 125359
7642 125359 107701 93820 86294 85889 93748 110699 129623 137202 130799 123828 124467 120524 100582 79618
7628 79618 82043 103928 115571 102848 83303 76239 79323 84101 93289 107853 113972 101231 83533
7615 83533 84272 105371 125052 124169 104380 81592 69126 67378 67089 63409 62966 70274 73998 62250
7601F2250j4965N585K3461J2891p452m277J3301R939j2592j7442K506J3071m71
7588H5805j2009p615q302j9385r673K8603M8757J8360k3753k5130J061N158j7459
7575F4418k7719j0385J0506J6903J3569L933j1882j8690k126K0532J9013m457
7563G3615k0477j7921j1471q534j490R700J6435J8974J9650R351j2064j8716M451
7550F1503K6745J3395j7410k4703j1474p557n955J8334M0178J1607m5113n3617
7538E933k298L6245K3141L627R748M236l0945l9380J0391M9871J5389l9551k8424
7525A7983K5622L3394r828k5834P993K8500L252j9531k460K0951J2328r726j0832
7512G1812M276J1055L550j0184k1284j6027J0216L0479J4979j6963j8816Q507
$$ plain form
7601 62250 47285 52870 76331 89222 81770 77493 90794 100733 88141 70699 73205 86276 85805
7588 85805 73796 66181 57879 38494 28821 57424 106181 124541 100788 75658 76719 81877 64418
7575 64418 36699 26314 36820 53723 67292 71225 59343 40653 38527 59059 78072 73615
7563 73615 53138 35217 23746 15212 13722 23422 39857 58831 78481 87832 75768 57052 61503
7550 61503 88248 101643 84233 59530 48056 40499 34544 52878 93056 104663 59550 5933
7538 5933 3635 39880 63021 66648 76396 80632 49687 10307 20698 70569 85958 46407 17983
7525 17983 43605 76999 67171 41337 49330 77830 81082 61551 59091 80042 92370 82644 71812
7512 71812 76088 87143 90693 80509 59225 43198 53414 83893 98872 81909 63093 71600
7500G1600J7792k944j1970P310J4706j1182k9285p735J8199Q066j3857n475J7468
7487G2693J2615j2015j3490J1811K6439J4415m333j4807j7626p122J8066L1696
7475A18342J1153j7548j2877J3070J2211j6539k3196N911K0883o973l2855j1664
7463E9918K4883J8186k1049k7857J4549M6928K2438k5043l2219L653K6845P200
7451A18432j9884j1592J7979K3318j194j6442l477R988J364r532p09J0510J971
7438A20732p321R899L2801K0652j5332k4763J51J4754P95o927Q078R317k1250
7425A41586l5878L334M8753L1464k8663m7676j577M3700L3670n377k0122l653
7413A59561J4764J8217R672n629j8777j4927O179K1956J6287J448m697m467n298
$$ plain form
7500 71600 89392 86448 74478 81788 96494 85312 56027 48292 66491 74557 60700 55225 72693
7487 72693 85308 73293 59803 71614 98053 112468 108135 93328 75702 68580 86646 118342
7475 118342 129495 111947 99070 112140 124351 107812 84616 90527 111410 104437 71582 59918
7463 59918 84801 102987 81938 54081 68630 115558 137996 112953 80734 84387 111232 118432
7451 118432 98548 86956 104935 128253 127059 110617 107140 117128 118492 108960 108251 118761 120732
7438 120732 113411 123310 156111 176763 161431 136668 136819 151573 152368 145441 153519 162836 141586
7425 141586 105708 109042 157795 189259 160596 112920 111343 155043 188713 183336 163214 159561
7413 159561 174325 192542 202214 196585 177808 162881 169060 191016 207303 208751 204054 199587 194289
7400A94289L69J6324K2649L559j9670j6060N569J0707l235l924J8992L5967K7308
7387B92844J0674K244r530k7883k5726P261L2537J9424L84J8043M5790K6718k4847
7374C67933l7208J999K4275l995k5800M961M1233K3359j9364k2413M323L981k0503
7361C42781j6583J4878J8783j0059j3980J9978L0649p252l2137k919K5065k775
7349C66429l9130j3359M3350M5753n252k8318L787L1410J7502K76J1955K3837
7337D58240R095n184Q142K4244J4069o45J1443L1673K3890j373p514K668m856
7324E63892l1196m0182j9104J798j302j5231j9987j7181j5111j2060q086j1370
7312C74880k0612k1007q898n39m462n836O085J4504J21k4697l0904j4608M10N13
$$ plain form
7400 194289 194658 210982 233631 237190 217520 201460 207029 217736 214501 210577 229569 265536 292844
7387 292844 303518 305762 296232 268349 242623 249884 282421 301845 302229 320272 366062 392780 367933
7374 367933 330725 332724 356999 353004 327204 332165 373398 396757 377393 354980 359303 363284 342781
7361 342781 326198 341076 359859 349800 335820 355798 386447 379195 347058 344139 369204 366429
7349 366429 327299 313940 357290 403043 397791 369473 373260 404670 422172 422448 434403 458240
7337 458240 467335 462151 470293 494537 508606 507961 519404 551077 574967 573594 566080 568748 563892
7324 563892 532696 492514 473410 475208 473906 458675 438688 421507 406396 394336 386250 374880
7312 374880 354268 333261 324363 323824 319362 313526 319611 334115 334236 309539 278635 264027 264437 264950
7298B64950j519O108J2446L654j0281q352P506J2501k824j4279J902L0194L2969
7285C34975L303k3512j8412L003O199j3301k7454j6138R294K3164J2604j2607
7273B81118k8085j6395J0690K0251K43k0720j5106p61j0926l2920k3037J6997
7261A81349L2069n89l1229j6143J2901O015j9124j1805J8476J6484j9399k9272
7249A39733O088L0035N370k3854r965J7651P251k4579k4426L850Q531j7105k3352
7236I5228Q119L1715J4140j4222j5389l702j0278k4169j4948Q440R520j2976j9723
7223E1755O347L0991J9731j0867j9016K97R693j2373l5777k0304K2748M0505J0999
$$ plain form
7298 264950 263431 269539 281985 285639 275358 267006 274512 287013 284189 269910 271812 302006 334975
7285 334975 338278 314766 296354 299357 305556 292255 264801 248663 257957 281121 293725 281118
7273 281118 253033 236638 247328 267579 267822 247102 231996 231235 220309 187389 164352 181349
7261 181349 213418 212829 181600 165457 178358 184373 165249 153444 171920 188404 169005 139733
7249 139733 145821 175856 181226 157372 147407 165058 172309 147730 123304 127154 135685 118580 95228
7236 95228 103347 135062 149202 134980 119591 115889 105611 81442 66494 74934 84454 71478 51755
7223 51755 58102 89093 108824 97957 78941 79238 88931 76558 40781 20477 43225 83730 94729
$$ [...]
##END NTUPLES=NMR SPECTRUM
##END=
