##TITLE=1H ikalashn
EC-3331(II-1)x31
18.9.2024
##JCAMPDX= 6.0         $$ Bruker NMR JCAMP-DX V2.0
##DATA TYPE= NMR SPECTRUM
##DATA CLASS= NTUPLES
##ORIGIN= UXNMR, Bruker Analytische Messtechnik GmbH
##OWNER= root
$$ TOPSPIN		Version 1.3
$$ 2024-09-18 10:04:02.703 +0400  Irina@DPX200
$$ Compression mode = diff/dup
##.OBSERVE FREQUENCY= 200.131392401
##.OBSERVE NUCLEUS= ^1H
##.ACQUISITION MODE= SIMULTANEOUS
##.ACQUISITION SCHEME= undefined
##.AVERAGES= 64
##.DIGITISER RES= 18
##SPECTROMETER/DATA SYSTEM= spect
##.PULSE SEQUENCE= zg
##.SOLVENT NAME= CDCl3
##.SHIFT REFERENCE= INTERNAL, CDCl3, 1, 17.95386
##AUDIT TRAIL= $$ (NUMBER, WHEN, WHO, WHERE, WHAT)
$$ ##TITLE= Audit trail, TOPSPIN		Version 1.3
$$ ##JCAMPDX= 5.01
$$ ##ORIGIN= Bruker BioSpin GmbH
$$ ##OWNER= Irina
$$ $$ F:/spectra/data/iren/nmr/1H/4/pdata/1/auditp.txt
$$ ##AUDIT TRAIL=  $$ (NUMBER, WHEN, WHO, WHERE, VERSION, WHAT)
(   1,<2024-09-18 10:03:18.500 +0400>,<Irina>,<DPX200>,<TOPSPIN 1.3>,
      <created by zg
	started at 2024-09-18 09:59:05.359 +0400,
	POWCHK disabled, PULCHK disabled
       configuration hash MD5:
       BE 6D 3F 07 2A EA 11 49 91 17 2B D3 AF B3 58 0D
       data hash MD5: 16K
       2C FF 77 38 B8 47 F4 0B 72 A7 6C F9 F0 DE D8 B6>)
(   2,<2024-09-18 10:03:40.750 +0400>,<Irina>,<DPX200>,<TOPSPIN 1.3>,
      <Start of raw data processing
       efp BC_mod = 2 LB = 0.5 FT_mod = 6 PKNL = 1 PHC0 = 98.26936 PHC1 = 13.98207 SI = 32K 
       data hash MD5: 32K
       64 D3 5E FB 33 4B 40 DD DC EF 45 E6 9D D4 D8 58>)
(   3,<2024-09-18 10:03:42.953 +0400>,<Irina>,<DPX200>,<TOPSPIN 1.3>,
      <apk 
       data hash MD5: 32K
       66 30 67 45 07 5D 91 FD 46 C8 10 95 F0 23 47 81>)
(   4,<2024-09-18 10:03:51.703 +0400>,<Irina>,<DPX200>,<TOPSPIN 1.3>,
      <pk fgphup PHC0 = -2.9 PHC1 = 0 
       data hash MD5: 32K
       5C DD 3F C7 C1 83 5C 93 D6 83 1A B7 6D 02 0E 18>)
(   5,<2024-09-18 10:03:53.468 +0400>,<Irina>,<DPX200>,<TOPSPIN 1.3>,
      <abs n ABSG = 5 
       data hash MD5: 32K
       C1 A2 34 86 A4 29 18 15 99 14 97 09 FA 14 55 AF>)
$$ ##END=
$$ 
$$ $$ hash MD5
$$ $$ 35 17 A4 17 05 1B B8 76 D9 54 96 00 EB 45 FF 8E
##$RELAX= 
##$RELAX= 
##$RELAX= 
##$RELAX= 
##$RELAX= 
##$RELAX= 
##$RELAX= 
##$RELAX= 
##$RELAX= 
$$ Bruker specific parameters
$$ --------------------------
##$DU= <F:/spectra>
##$EXPNO= 4
##$NAME= <1H>
##$PROCNO= 1
##$TYPE= <nmr>
##$USER= <iren>
##$AMP= (0..31)
100 100 100 100 100 100 100 100 100 100 100 100 100 100 100 100 100 100 
100 100 100 100 100 100 100 100 100 100 100 100 100 100 
##$ANAVPT= -1
##$AQSEQ= 0
##$AQ_mod= 1
##$AUNM= <au_zg>
##$AUTOPOS= <>
##$BF1= 200.13
##$BF2= 200.13
##$BF3= 200.13
##$BF4= 200.13
##$BF5= 200.13
##$BF6= 200.13
##$BF7= 200.13
##$BF8= 200.13
##$BYTORDA= 1
##$CFDGTYP= 0
##$CFRGTYP= 5
##$CHEMSTR= <none>
##$CNST= (0..63)
1 1 145 1 1 1 1 1 1 1 1 1 1 1 1 1 1 1 1 1 1 1 1 1 1 1 1 1 1 1 1 1 1 1 
1 1 1 1 1 1 1 1 1 1 1 1 1 1 1 1 1 1 1 1 1 1 1 1 1 1 1 1 1 1 
##$CPDPRG= <>
##$CPDPRG1= <>
##$CPDPRG2= <>
##$CPDPRG3= <>
$$ [...]
##$SW_h= 4401.40845070422
##$TD= 16384
##$TD0= 1
##$TE= 300
##$TE2= 300
##$TE3= 300
##$TEG= 300
##$TL= (0..7)
0 120 120 120 120 120 120 120 
##$TP= (0..7)
150 150 150 150 150 150 150 150 
##$TP07= 0
##$TPNAME0= <>
##$TPNAME1= <>
##$TPNAME2= <>
##$TPNAME3= <>
##$TPNAME4= <>
##$TPNAME5= <>
##$TPNAME6= <>
##$TPNAME7= <>
##$TPOAL= (0..7)
0.5 0.5 0.5 0.5 0.5 0.5 0.5 0.5 
##$TPOFFS= (0..7)
0 0 0 0 0 0 0 0 
##$TUNHIN= 0
##$TUNHOUT= 0
##$TUNXOUT= 0
##$USERA1= <user>
##$USERA2= <user>
##$USERA3= <user>
##$USERA4= <user>
##$USERA5= <user>
##$V9= 5
##$VALIST= <valist>
##$VCLIST= <CCCCCCCCCCCCCCC>
##$VD= 0
##$VDLIST= <DDDDDDDDDDDDDDD>
##$VPLIST= <PPPPPPPPPPPPPPP>
##$VTLIST= <TTTTTTTTTTTTTTT>
##$WBST= 1024
##$WBSW= 25
##$XGAIN= (0..3)
0 0 0 0 
##$XL= 0
##$YL= 0
##$YMAX_a= 1020346
##$YMIN_a= -676111
##$ZGOPTNS= <>
##$ZL1= 120
##$ZL2= 120
##$ZL3= 120
##$ZL4= 120
##$ABSF1= 17.95386
##$ABSF2= -4.038887
##$ABSG= 5
##$ABSL= 3
##$ALPHA= 0
##$AQORDER= 0
##$ASSFAC= 0
##$ASSFACI= 0
##$ASSFACX= 0
##$ASSWID= 0
##$AUNMP= <proc_1d>
##$AXLEFT= 0
##$AXRIGHT= 0
##$AXTYPE= 0
##$AXUNIT= <>
##$AZFE= 0.1
##$AZFW= 0.1
##$BCFW= 0
##$BC_mod= 2
##$BYTORDP= 0
##$COROFFS= 0
##$CY= 7568.61572265625
##$DATMOD= 1
##$DC= 0
##$DFILT= <>
##$DTYPP= 0
##$F1P= 17.9538593292236
##$F2P= -4.03888763876832
##$FCOR= 0.5
##$FTSIZE= 32768
##$FT_mod= 6
##$GAMMA= 0
##$GB= 0
##$INTBC= 0
##$INTSCL= 1.483618e-010
##$ISEN= 128
##$LB= 0.5
##$LEV0= 0
##$LPBIN= 0
##$MAXI= 945.577
##$MC2= 0
##$MEAN= 0
##$ME_mod= 0
##$MI= -402.1523
##$NCOEF= 0
##$NC_proc= -6
##$NLEV= 6
##$NOISF1= 8.587773
##$NOISF2= 6.764455
##$NSP= 0
##$NTH_PI= 0
##$NZP= 0
##$OFFSET= 17.95386
##$PC= 1
##$PHC0= 108.0458
##$PHC1= -3.167623
##$PH_mod= 1
##$PKNL= yes
##$PPARMOD= 0
##$PPDIAG= 0
##$PPIPTYP= 0
##$PPMPNUM= 100
##$PPRESOL= 1
##$PSCAL= 0
##$PSIGN= 0
##$REVERSE= no
##$SF= 200.13
##$SI= 32768
##$SIGF1= 16.12182
##$SIGF2= -4.496377
##$SINO= 3.521527
##$SIOLD= 32768
##$SREGLST= <1H.CDCl3>
##$SSB= 0
##$STSI= 32768
##$STSR= 0
##$SW_p= 4401.40845070423
##$SYMM= 0
##$S_DEV= 0
##$TDeff= 16384
##$TDoff= 0
##$TI= <>
##$TILT= no
##$TM1= 0
##$TM2= 0
##$TOPLEV= 0
##$USERP1= <user>
##$USERP2= <user>
##$USERP3= <user>
##$USERP4= <user>
##$USERP5= <user>
##$WDW= 1
##$XDIM= 32768
##$YMAX_p= 372690969
##$YMIN_p= -700082
$$ End of Bruker specific parameters
$$ ---------------------------------
##NTUPLES= NMR SPECTRUM
##VAR_NAME=  FREQUENCY,     SPECTRUM/REAL,   SPECTRUM/IMAG
##SYMBOL=    X,             R,               I
##VAR_TYPE=  INDEPENDENT,   DEPENDENT,       DEPENDENT
##VAR_FORM=  AFFN,          ASDF,            ASDF
##VAR_DIM=   32768,         32768,           32768
##UNITS=     HZ,            ARBITRARY UNITS, ARBITRARY UNITS
##FACTOR=    0.134324425510551, 1,           1
##FIRST=     4401.40845070423, -54744,       -2899053
##LAST=      0,             56081,           -2932913
##MIN=       0,             -700082,         0
##MAX=       4401.40845070423, 372690969,    0
$$ Real data points
##PAGE= N=1
##DATA TABLE= (X++(R..R)), XYDATA
$$ [...]
11227A0964401J2781m9021q8870r2290m4178K7860N9672L2236l816j3201k4635
11216A0780939n7123o5911k0574K3570O315l3561k0882K5118K1086l4202n0856
11205A0573919Q55L3792j6611q1280n4293N2241J22853Q4263k5668j25069j68893
11194A0396109j58238j15726p1834n0187m7347l8985j6250k478k0208n2513n8797
11183I763546l0008n823k3847p0023j01137j02027q9257o7295k5378J7225J4274
11172I280250l6274p3023n8583l9075o7277j10922j05449o5336n9303q8702q4156
11161H492150l2491j1352o1624j10777q0141k773L0947j479m8839p1503p0093
11150H032025n2887l1822l2594n9006o9809m1776k6189p7365j49166j43345n4699
$$ y = [10964401, 10977182, 10928161, 10839291, 10747001, 10702823, 10730683, 10790355, 10822591, 10818775, 10805574, 10780939, 10723816, 10657905, 10637331, 10660901, 10667216, 10633655, 10612773, 10637891, 10658977, 10624775, 10573919, 10574774, 10608566, 10591955, 10510675, 10456382, 10508623, 10631476, 10715739, 10690071, 10565002, 10396109, 10237871, 10122145, 10050311, 10000124, 9952777, 9913792, 9897542, 9895064, 9874856, 9822343, 9763546, 9733538, 9727715, 9703868, 9633845, 9532708, 9430681, 9341424, 9274129, 9248751, 9265976, 9280250, 9243976, 9170953, 9112370, 9073295, 9006018, 8895096, 8789647, 8724311, 8665008, 8576306, 8492150, 8459659, 8448307, 8386683, 8275906, 8195765, 8192992, 8223939, 8222460, 8173621, 8102118, 8032025, 7979138, 7947316, 7914722, 7855716, 7785907, 7744131, 7717942, 7640577, 7491411, 7348066, 7293367]
11139G293367J7217J3146j4668q078K237l1904o9638k6920Q8263J58669R3307
11128G514998n9593j60289j27202k1457K5391l8211j28674j36158n8064J7708
11118F828449M2148N1222P5578P8182K4159m2869n4068j4194J2270j535j9199
11107F980143j1580K40j3244m4298o4934o6135o1141o0747n8552m0763j0383J923
11095F550529l2167r0760j08068n0542L2232O1974K5171j8545j4204L3794Q2001
11084F471415R1923N2264j3660n7392m6033J883L9803M8580M4025L5142J0471
11073F678421k8852n6729n6318m0361k5193p650K0575N6558R4087J28842J49351
11062F912731J42790J13785P7641L7794l737k2786j251K6735J2260k0322R069
$$ y = [7293367, 7310584, 7323730, 7309062, 7300984, 7303221, 7271317, 7201679, 7174759, 7263022, 7421691, 7514998, 7455405, 7295116, 7167914, 7146457, 7171848, 7133637, 7004963, 6868805, 6810741, 6828449, 6870597, 6921819, 6997397, 7075579, 7099738, 7056869, 7002801, 6988607, 7000877, 6999342, 6980143, 6968563, 6968803, 6955559, 6911261, 6846327, 6780192, 6719051, 6658304, 6599752, 6558989, 6548606, 6550529, 6518362, 6427602, 6319534, 6268992, 6301224, 6363198, 6388369, 6369824, 6355620, 6389414, 6471415, 6563338, 6615602, 6601942, 6544550, 6498517, 6500400, 6540203, 6588783, 6632808, 6667950, 6678421, 6649569, 6592840, 6536522, 6496161, 6470968, 6463318, 6483893, 6540451, 6634538, 6763380, 6912731, 7055521, 7169306, 7246947, 7284741, 7281004, 7258218, 7256967, 7283702, 7295962, 7275640, 7284709]
11051G284709J09088J83308J68982J34361J65059K16646J80261O0729k3340j7241
11041H462562R13m2235j04782j09253n7868k878M3997R8235J30049Q3911k8982
11030H473669j19836j21764o0933j1068p983l2555n8017q0362r6305p8374l056
11019G803416R6484J41848R9825L6863M3138J15154J64164J41922R8394R2654
11009H833862J06263R2906P1181J04016K00481K95841L31880L12673K75945K49797
10999A0874845K47762K69459K87967K64311J95182J28152J10008J30363J33414
10990A2641463Q2549N66n9490p9343r8943j60937k39721k58726j91553j11232
10980A1524633j05735j68313k13842j90831j29245p8961n1410l5790k9389k9032
$$ y = [7284709, 7393797, 7577105, 7746087, 7880448, 8045507, 8262153, 8442414, 8503143, 8479803, 8462562, 8463475, 8421240, 8316458, 8207205, 8149337, 8146459, 8190456, 8288691, 8418740, 8502651, 8473669, 8353833, 8232069, 8171136, 8160068, 8152085, 8119530, 8061513, 7981151, 7884846, 7806472, 7803416, 7899900, 8041748, 8141573, 8178436, 8221574, 8336728, 8500892, 8642814, 8741208, 8833862, 8940125, 9033031, 9104212, 9208228, 9408709, 9704550, 10036430, 10349103, 10625048, 10874845, 11122607, 11392066, 11680033, 11944344, 12139526, 12267678, 12377686, 12508049, 12641463, 12724012, 12724578, 12665088, 12585745, 12486802, 12325865, 12086144, 11827418, 11635865, 11524633, 11418898, 11250585, 11036743, 10845912, 10716667, 10637706, 10586296, 10550506, 10521117, 10492085]
10970A0492085k4460k1218m1974q5291j10944q8344l4812J4940M9438O6520N0957
10959A0266897M132k6099R420R2234J51532J49761J21539J24539J78879K58463
10949A1331297L17175L19954K71968K21704K13304K32892K27240J80456J40211
10940A3456201J48779J74261J43191L5641q2436j32780j12841r1063j18565j70566
10930A3249822j91303j76764j76006k10851k39393k22616j87086j79350j87381
10921A1479072j64580j19704j15186j63840j92247j42154n7318k1377m4696o8058
10911A0389912n8869m3741m5553m4033j8747Q322R55m0673p8302p2716j2149P8834
10899A0063240J45595J38143O2614j0949j4160M8180J08587J15987Q4978O4421
$$ y = [10492085, 10467625, 10446407, 10404433, 10319142, 10208198, 10119854, 10085042, 10099982, 10149420, 10215940, 10266897, 10271029, 10244930, 10254350, 10346584, 10498116, 10647877, 10769416, 10893955, 11072834, 11331297, 11648472, 11968426, 12240394, 12462098, 12675402, 12908294, 13135534, 13315990, 13456201, 13604980, 13779241, 13922432, 13958073, 13875637, 13742857, 13630016, 13538953, 13420388, 13249822, 13058519, 12881755, 12705749, 12494898, 12255505, 12032889, 11845803, 11666453, 11479072, 11314492, 11194788, 11079602, 10915762, 10723515, 10581361, 10524043, 10502666, 10457970, 10389912, 10331043, 10287302, 10241749, 10197716, 10178969, 10187291, 10188246, 10147573, 10069271, 9996555, 9984406, 10063240, 10208835, 10346978, 10409592, 10398643, 10384483, 10432663, 10541250, 10657237, 10742215, 10806636]
10889A0806636P8077J07557J18619Q9217K2706m7813p5352m3837J203o726p2917
10878A0977370j27112j12899o5095n9384r9960j11077m9947K5460L4913j6866
10868A0395403n7359m7622j4444J1007L1994N3395N8758M3557L3286L9856L2703
10857A0580534j1291n5487m6283M471K8155o701n3028n1629k461N0809P7433P5609
10845A0590131N5632L6005M0340O8961Q5258N9454J5927L169K3187L1819J3206
10834A1023089P888M5793R1365R0504M6495J1477J7230N0743Q8475J17150J24054
10823A1714263J05368Q8042J07158J53476J78935J66152J54863J78315K09018
10814A3055590J99886J53652J15445J11721J30478J50840J59068J43902J11230
$$ y = [10806636, 10884713, 10992270, 11110889, 11200106, 11222812, 11174999, 11099647, 11055810, 11057013, 11050287, 10977370, 10850258, 10737359, 10672264, 10612880, 10512920, 10401843, 10351896, 10377356, 10412269, 10395403, 10338044, 10290422, 10275978, 10286985, 10318979, 10372374, 10431132, 10474689, 10507975, 10547831, 10580534, 10569243, 10513756, 10467473, 10471944, 10500099, 10493398, 10440370, 10388741, 10386280, 10437089, 10514522, 10590131, 10645763, 10681768, 10722108, 10791069, 10876327, 10935781, 10951708, 10954877, 10978064, 11009883, 11023089, 11030977, 11076770, 11168135, 11258639, 11305134, 11316611, 11333841, 11384584, 11473059, 11590209, 11714263, 11819631, 11907673, 12014831, 12168307, 12347242, 12513394, 12668257, 12846572, 13055590, 13255476, 13409128, 13524573, 13636294, 13766772, 13917612, 14076680, 14220582, 14331812]
10805A4331812R8429J35616J90857J94564J30238O2570N3389Q2218Q2834L9442
10795A5401969R374M9944J48379K32954K43126J84216J17285R6806J20889J47719
10785A6752661J52758J49509J53974J57390J49526J44872J62258J95073K25661
10776A8243682K53150K78601K79411K39845K00905K28678L18648L78643L38753
10767B0760316K43587J94792K24656K74319K88982K82219K92378L18730L31421
10758B3211400L21760L12418L26267L66271M19405M61867M66270M23489L58239
10749B6667386L10895L05430L41273M02414M57794M69438M30340L86204L85227
10740C0156401M09979M01261L53547L32903L75650M23762M09668L64069L73461
$$ y = [14331812, 14430241, 14565857, 14756714, 14951278, 15081516, 15144086, 15197475, 15279693, 15362527, 15401969, 15411343, 15461287, 15609666, 15842620, 16085746, 16269962, 16387247, 16484053, 16604942, 16752661, 16905419, 17054928, 17208902, 17366292, 17515818, 17660690, 17822948, 18018021, 18243682, 18496832, 18775433, 19054844, 19294689, 19495594, 19724272, 20042920, 20421563, 20760316, 21003903, 21198695, 21423351, 21697670, 21986652, 22268871, 22561249, 22879979, 23211400, 23533160, 23845578, 24171845, 24538116, 24957521, 25419388, 25885658, 26309147, 26667386, 26978281, 27283711, 27624984, 28027398, 28485192, 28954630, 29384970, 29771174, 30156401, 30566380, 30967641, 31321188, 31654091, 32029741, 32453503, 32863171, 33227240, 33600701]
10731C3600701M50779N20921N35203N26138N27609N11834M52164L95871M12049
10722C7933269M91460N55017N53572N11474M74473M61028M71822N05563N47996
10713D2505674N73792N75639N70617N67687N53153N23240N06866N32057N82583
10704D7491308O11867N96751N59694N38109N46530N71708N92392N95428N77451
10695E2681238N41285M96697M61424M51571M65751M84967M94816N01237N14801
10686E7093787N26306N13922M74199M29761M01431L86687L73744L64738L71995
10677F0936570L95877M18214M20391M03898L90573M00769M27912M35328L84830
10668F4614362K74715J51348Q0573R8456J77821K42374K29445J49835P6987O7746
$$ y = [33600701, 34051480, 34572401, 35107604, 35633742, 36161351, 36673185, 37125349, 37521220, 37933269, 38424729, 38979746, 39533318, 40044792, 40519265, 40980293, 41452115, 41957678, 42505674, 43079466, 43655105, 44225722, 44793409, 45346562, 45869802, 46376668, 46908725, 47491308, 48103175, 48699926, 49259620, 49797729, 50344259, 50915967, 51508359, 52103787, 52681238, 53222523, 53719220, 54180644, 54632215, 55097966, 55582933, 56077749, 56578986, 57093787, 57620093, 58134015, 58608214, 59037975, 59439406, 59826093, 60199837, 60564575, 60936570, 61332447, 61750661, 62171052, 62574950, 62965523, 63366292, 63794204, 64229532, 64614362, 64889077, 65040425, 65120998, 65219454, 65397275, 65639649, 65869094, 66018929, 66095916, 66163662]
10658F6163662J05139J30588J15657P9450M8001K8310K0657K4210K3881K36l8029
10647F6701762n8908n6288o5459j10429j61534j71498j36677r7505r0904j25828
10637F5626732j93075k70897l25009l29436k92216k47619k25184k35869k76154
10628F3231273l26503l55382l48318l29891l36953l73277m09010m19510m04626
10619E9927803l76784l54899l64740m15971m78408n09839n09383n12884n31903
10610E5872992n34105m98113m51728m31154m30968m24514m12836m19899m51246
10601E1818429m90193n29052n71198o00873n84969n20700m58148m51398m93460
10592D7118438n21073m91222m39664m45223n32741o29906o40216n51667m47589
$$ y = [66163662, 66268801, 66399389, 66515046, 66594496, 66642497, 66670807, 66691464, 66715674, 66739555, 66739791, 66701762, 66642854, 66586566, 66521107, 66410678, 66249144, 66077646, 65940969, 65843464, 65752560, 65626732, 65433657, 65162760, 64837751, 64508315, 64216099, 63968480, 63743296, 63507427, 63231273, 62904770, 62549388, 62201070, 61871179, 61534226, 61160949, 60751939, 60332429, 59927803, 59551019, 59196120, 58831380, 58415409, 57937001, 57427162, 56917779, 56404895, 55872992, 55338887, 54840774, 54389046, 53957892, 53526924, 53102410, 52689574, 52269675, 51818429, 51328236, 50799184, 50227986, 49627113, 49042144, 48521444, 48063296, 47611898, 47118438, 46597365, 46106143, 45666479, 45221256, 44688515, 44058609, 43418393, 42866726, 42419137]
10583D2419137m07780m29395m60395m78446m99650n23562n15522m56459l80806
10574C8267122l44504l68391m26950m81121n06106m94235m50782l94267l51207
10565C4449559l39336l52630l65856l58449l35481l22583l38298l73667m00531
10556C1262728l96769l62509l18697k95322l13396l65226m10963m06500l44516
10547B8048830k66742k29392k53296l08503l47647l50068l28802l00942k68851
10538B5394587k37136k26448k44979k57233k17857j43183j11540j68490k60502
10529B3527219k97027k60793k17368k23168k67248l09220l30905l29902k97358
10520B0994230k34260j70440j37035j30032j24824j15081j10973j10930j08704
$$ y = [42419137, 42011357, 41581962, 41121567, 40643121, 40143471, 39619909, 39104387, 38647928, 38267122, 37922618, 37554227, 37127277, 36646156, 36140050, 35645815, 35195033, 34800766, 34449559, 34110223, 33757593, 33391737, 33033288, 32697807, 32375224, 32036926, 31663259, 31262728, 30865959, 30503450, 30184753, 29889431, 29576035, 29210809, 28799846, 28393346, 28048830, 27782088, 27552696, 27299400, 26990897, 26643250, 26293182, 25964380, 25663438, 25394587, 25157451, 24931003, 24686024, 24428791, 24210934, 24067751, 23956211, 23787721, 23527219, 23230192, 22969399, 22752031, 22528863, 22261615, 21952395, 21621490, 21291588, 20994230, 20759970, 20589530, 20452495, 20322463, 20197639, 20082558, 19971585, 19860655, 19751951]
10511A9751951j22233j74680k42050k63705k23302j76634j68238j62129j05703
10502A8113277l1052k1969q6430j39054j29086j09013j32003j52430j02901k2387
10492A7186952j3794q8857j48968j29428p3702l7949j0268K4283J7251o7267j61232
10481A6497021j62579p3027J0910L2187K3398K3490J9260j0828n2788q1364q6680
10470A6139000o2346q854M0360M1952N571j2620O402J8446p285m2144n8402p8509
10458A5981571j21404j51402j33850r9521r5134j05145q7250n7756o8445j11300
10448A4950364j21319p7263k9977j6840j2745Q885K3088k527n0072p3240n2267
10437A4546087l139M3715N5461J6469m2269o0750k1000K4594K0663k0553m4979
$$ y = [19751951, 19629718, 19455038, 19212988, 18949283, 18725981, 18549347, 18381109, 18218980, 18113277, 18082225, 18060256, 17973826, 17834772, 17705686, 17596673, 17464670, 17312240, 17209339, 17186952, 17173158, 17084301, 16935333, 16805905, 16732203, 16694254, 16683986, 16708269, 16725520, 16658253, 16497021, 16334442, 16261415, 16272325, 16304512, 16327910, 16351400, 16370660, 16359832, 16307044, 16225680, 16139000, 16076654, 16067800, 16108160, 16150112, 16155683, 16143063, 16149465, 16167911, 16160626, 16118482, 16060080, 15981571, 15860167, 15708765, 15574915, 15475394, 15380260, 15275115, 15187865, 15130109, 15061664, 14950364, 14829045, 14751782, 14721805, 14704965, 14692220, 14701105, 14724193, 14721666, 14671594, 14598354, 14546087, 14542948, 14586663, 14642124, 14658593, 14616324, 14555574, 14534574, 14559168, 14579831, 14559278, 14514299]
10426A4514299l0611j34K7669O1792J12206J65617J96271J91700J69121J69836
10416A5577766K22911L03632L46416L17222K56726K29283K44756K60246K48832
10407A8007790K30083K28336K31863K07832J39671L8377p0400j62475k30141k88445
10397A8332491l56041m23406m52387m19564l52691l07815l07204l13729k79425
10388A5120229k11788j68858j81305k06311j85608j30188j03854j24681j35722
10379A3671914r5346m8238o3726j34377j86137j75509j29683r5280r1279j13189
10369A2539150j42095j44328j00580m2592k5571n9234j03321j32301j54765j60533
10359A1473830j11680j6789M5204K4026k5879k5085J3606J5469l3934p3898p0832
$$ y = [14514299, 14483688, 14483554, 14511223, 14573015, 14685221, 14850838, 15047109, 15238809, 15407930, 15577766, 15800677, 16104309, 16450725, 16767947, 17024673, 17253956, 17498712, 17758958, 18007790, 18237873, 18466209, 18698072, 18905904, 19045575, 19083952, 19013552, 18851077, 18620936, 18332491, 17976450, 17553044, 17100657, 16681093, 16328402, 16020587, 15713383, 15399654, 15120229, 14908441, 14739583, 14558278, 14351967, 14166359, 14036171, 13932317, 13807636, 13671914, 13576568, 13528330, 13464604, 13330227, 13144090, 12968581, 12838898, 12743618, 12652339, 12539150, 12397055, 12252727, 12152147, 12109555, 12083984, 12024750, 11921429, 11789128, 11634363, 11473830, 11362150, 11345361, 11390565, 11414591, 11388712, 11363627, 11377233, 11392702, 11358768, 11284870, 11214038]
10348A1214038n9173o6681o7170l4735J0126L9202N4365N7325K9812j9408l4842
10337A1122859J0334N9244M8983J1300K6567R3623J23705P2824P695J0573P6047
10326A1663754J41137J72215J75668J56223J18627R4578J15083J57986J71042
10317A2966313J55028J77238K78182M00563M49056M05908L49293L55645M18068
10308A5955294M77877N09696N41345N95505O49598O69598O55745O26809N77815
10299B1259282M92131L91558L30062L21208L06230K19415O0476j23330l00747
10290B2956285m64552n92908o52043o46510o31216o54307p04912p29427o88478
10281A7191932n92671m92765m36804m28196m29094m11782l90123l81924l64593
$$ y = [11214038, 11154865, 11088184, 11021014, 10986279, 10996405, 11035607, 11089972, 11147297, 11177109, 11157701, 11122859, 11133193, 11192437, 11241420, 11252720, 11279287, 11372910, 11496615, 11569439, 11577134, 11587707, 11663754, 11804891, 11977106, 12152774, 12308997, 12427624, 12522202, 12637285, 12795271, 12966313, 13121341, 13298579, 13576761, 13977324, 14426380, 14832288, 15181581, 15537226, 15955294, 16433171, 16942867, 17484212, 18079717, 18729315, 19398913, 20054658, 20681467, 21259282, 21751413, 22142971, 22473033, 22794241, 23100471, 23319886, 23380362, 23257032, 22956285, 22491733, 21898825, 21246782, 20600272, 19969056, 19314749, 18609837, 17880410, 17191932, 16599261, 16106496, 15669692, 15241496, 14812402, 14400620, 14010497, 13628573, 13263980]
10272A3263980l08897k43608k32166k79048l13692k87345k34202k05727j94482
10263A0964813j69594j47073j63998k03845k09940j69609j28845j17582j13122
10254I541205r4651q7360j21005j72704j84982j34760o4388m0753q5441j45421
10244H409740j44822p6697k4553o5457j66407k17598j67725q1572m9924q3132
10234G331853j20065j12546o8493k5656j1318k6360n3354p7908j00636j19973
10224F615544j13725o5528q334l755o3134j22236j16876n7217l233Q762j1663
10213F058605l7887m6544k5702O807O850m3070r5288q5249j4468M6650M1455j3906
10201E798253n8927n4797j4949J5775N554l5282o8826p1536m9995j7150K0057
$$ y = [13263980, 12955083, 12711475, 12479309, 12200261, 11886569, 11599224, 11365022, 11159295, 10964813, 10795219, 10648146, 10484148, 10280303, 10070363, 9900754, 9771909, 9654327, 9541205, 9446554, 9359194, 9238189, 9065485, 8880503, 8745743, 8681355, 8640602, 8555161, 8409740, 8264918, 8188221, 8163668, 8098211, 7931804, 7714206, 7546481, 7464909, 7414985, 7331853, 7211788, 7099242, 7030749, 7005093, 6993775, 6967415, 6914061, 6836153, 6735517, 6615544, 6501819, 6436291, 6427957, 6424202, 6361068, 6238832, 6121956, 6064739, 6061506, 6070268, 6058605, 6020718, 5974174, 5948472, 5955279, 5962129, 5919059, 5823771, 5738522, 5724054, 5770704, 5812159, 5798253, 5739326, 5684529, 5669580, 5685355, 5690909, 5655627, 5586801, 5515265, 5465270, 5448120, 5468177]
10190E468177M0965J5106m8591q9247o7735k7085l5301q7539j16308q9646m4799
10179D917997k1781j4960l669J1581J9870J5456n477l2971k9244L0715J01225
10168D988742R9773J4092p3319q7924m3047N775L3882L9889J4360l5823o7333
10157D889067n3144k8328l8530o9992p9269o7222o8088q2097p7998n5124m3582
10146D225693m1260j0027N1559Q5682N0880k0189o6235p0048n7451m6057k6585
10135D075962J0013M8922O1930L8847M323p740n1j1728n7659r4754p9479l5676
10123C952910k0382l5953l0471J4354N2832M8097K3878J7982K5527J7331j6937
10112D049168o7024j12353j16734n5025K9545M3170m1430j28034j10302q123P0950
$$ y = [5468177, 5509142, 5524248, 5475657, 5386410, 5318675, 5291590, 5256289, 5168750, 5052442, 4962796, 4917997, 4896216, 4881256, 4877587, 4889168, 4909038, 4924494, 4919017, 4886046, 4856802, 4887517, 4988742, 5088515, 5102607, 5029288, 4941364, 4898317, 4904092, 4937974, 4977863, 4992223, 4956400, 4889067, 4835923, 4807595, 4769065, 4699073, 4619804, 4552582, 4484494, 4402397, 4324399, 4269275, 4225693, 4184433, 4174406, 4225965, 4311647, 4362527, 4342338, 4276103, 4206055, 4148604, 4102547, 4075962, 4085975, 4134897, 4196827, 4235674, 4239997, 4232257, 4232206, 4220478, 4162819, 4068065, 3988586, 3952910, 3932528, 3896575, 3866104, 3880458, 3933290, 3981387, 4005265, 4023247, 4048774, 4066105, 4049168, 3982144, 3869791, 3753057, 3698032, 3727577, 3770747, 3729317, 3601283, 3490981, 3482858, 3553808]
10101C553808Q0298O8379P1312N6761J846m4532k8872K0354L0621p886k7437J9670
10089C794322Q9464R5488J3614q5855j14471o0929L631J3345j8699k7472J8047
10078C720485Q0466J04145P5919K6526j1667l3570n2702p4508q3930o3613k2731
10067C664820N779M072j0491j8230k9224n3969n9763l442R0048J32420P8683j1351
10055C789352n1718l8376l4537o6517q6502m4670M2508J12810J21303O8168j3455
10044C798366p7200q5077l3688L7411P3962N0668q943n2731m4460L018M0398L4474
10032C736198K501j6423j3298j0066j4719r308R859J6147j916j1471J5329M8326
10020C751159L9130j774j9270k078K076k4432k5216M4236J33111J54141J00355
$$ y = [3553808, 3634106, 3702485, 3773797, 3830558, 3832404, 3787872, 3759000, 3779354, 3809975, 3802089, 3774652, 3794322, 3883786, 3979274, 3992888, 3907033, 3792562, 3731633, 3735264, 3748609, 3729910, 3702438, 3720485, 3800951, 3905096, 3981015, 4007541, 3995874, 3962304, 3909602, 3835094, 3751164, 3687551, 3664820, 3670599, 3674671, 3664180, 3645950, 3616726, 3562757, 3502994, 3499552, 3589600, 3722020, 3800703, 3789352, 3737634, 3699258, 3664721, 3598204, 3511702, 3467032, 3509540, 3622350, 3743653, 3811821, 3798366, 3721166, 3636089, 3602401, 3639812, 3713774, 3764442, 3755499, 3702768, 3658308, 3661326, 3701724, 3736198, 3738699, 3722276, 3708978, 3698912, 3684193, 3674885, 3684744, 3700891, 3698975, 3687504, 3702833, 3751159, 3790289, 3788515, 3769245, 3767167, 3769243, 3744811, 3719595, 3763831, 3896942, 4051083, 4151438]
10009D151438M3550K7579K5256N733j7932l0553m9338q1156q8976m4633J7023
9998C957991M3657M0155M5108N0529R673p2479j22114r4470l4807o261l185J4105
9986C827902L2258j319q2803j33109r5608r241M3909L4729J843q241J5846N4981
9974C681147P6154N0007j7671p2442o0590J847M1384K0868j3439m119L0611K6386
9962C760143k7024o8533n5607k1619j8421l9861l9736l624L7740N9295O8098P5312
9950C726163P3507N4645K9861J6511J5839J2739p899m6666q4242r2913o5388k9442
9938C602715j8513l0547l6596k9682l6185o7265q7542n7198J0847O3211P0361
9927C383606N5868O0457R3359J22131J02597K3419o9341j02668n0405K9599N4354
$$ y = [4151438, 4194988, 4222567, 4247823, 4253556, 4235624, 4205071, 4155733, 4074577, 3985601, 3940968, 3957991, 4001648, 4041803, 4086911, 4137440, 4147113, 4074634, 3952520, 3858050, 3823243, 3816982, 3813797, 3827902, 3860160, 3858841, 3776038, 3642929, 3547321, 3538080, 3581989, 3616718, 3618561, 3610320, 3626166, 3681147, 3757301, 3807308, 3789637, 3717195, 3656605, 3658452, 3699836, 3720704, 3707265, 3703146, 3733757, 3760143, 3733119, 3664586, 3608979, 3587360, 3568939, 3529078, 3489342, 3485718, 3523458, 3582753, 3650851, 3726163, 3799670, 3854315, 3884176, 3900687, 3916526, 3929265, 3921366, 3874700, 3790458, 3697545, 3632157, 3602715, 3584202, 3553655, 3517059, 3487377, 3451192, 3383927, 3296385, 3239187, 3250034, 3313245, 3383606, 3439474, 3499931, 3593290, 3715421, 3818018, 3841437, 3772096, 3669428, 3619023, 3648622, 3702976]
9916C702976R075m3647m8339j7484M395K985q190k6976n8448q0556n7616M400
9904C382575N3135N6360M0967M3638N2710L2475j4714m9763n2509l9270k7347
9893C478257j8702k0215l9982n5159k5778M2024Q7727P5542M1024K6993J7320
9882C609051j6331l9922J469Q3113J15018O2615j2808m9832n8388o6672n8351
9871C568962j2086L8760M3296J0028m748K0686M5648K6203k8245o7221n3846k742
9859C584695L4206K5583j261p37J8761O275l9242m4471L4097J31490J54100J02053
9847D005549M8699K3380j2076p6629j32844j46973j24325p1553J4736J01326J22203
9836C751493O3516m349j5391J4764L5544L9008M2458L1603j8169q0420r3759l9254
$$ y = [3702976, 3712051, 3668404, 3620065, 3602581, 3606976, 3609961, 3601771, 3574795, 3516347, 3435791, 3378175, 3382575, 3435710, 3492070, 3533037, 3576675, 3629385, 3661860, 3647146, 3597383, 3544874, 3505604, 3478257, 3459555, 3439340, 3399358, 3344199, 3318421, 3360445, 3448172, 3523714, 3564738, 3591731, 3609051, 3592720, 3552798, 3554267, 3637380, 3752398, 3815013, 3802205, 3752373, 3693985, 3627313, 3568962, 3556876, 3595636, 3638932, 3648960, 3644212, 3664898, 3710546, 3736749, 3708504, 3641283, 3587437, 3584695, 3618901, 3644484, 3643223, 3642486, 3661247, 3667522, 3628280, 3583809, 3617906, 3749396, 3903496, 4005549, 4054248, 4077628, 4065552, 3988923, 3856079, 3709106, 3584781, 3513228, 3527964, 3629290, 3751493, 3815009, 3810660, 3795269, 3810033, 3845577, 3884585, 3927043, 3958646, 3940477, 3860057, 3766298, 3727044]
9824C727044L9064R0741J02545Q8641P0528O6504P2576N7361N065m4233l6029
9813D239807J7315M1853K331m4874k7069M7509J04004R6010M8062N868j8014l3993
9801D478809l8279j3721L9336R6315J34824J50723J45907J20828Q7753O9034O5670
9790E337199M8824O258k4299l612M2497N0862J1532k0155r951J0902Q942K939
9778E461938J7927K9460K081m7252p3616o9705n8010l6007J6077P9934J05633
9767E428460P8640L6904J4821Q132L49j0908j9951j6750J3081O1019P8829L1246
9755E703872m4078q1308q3554j08023j49481j21569R393J45560J71375R5767J9751
9744E557705N98J3215K1441J9606Q920j0919k3870j3933K572l82j1398n92K1278
$$ y = [3727044, 3766108, 3856849, 3959394, 4048035, 4118563, 4185067, 4257643, 4315004, 4320069, 4275836, 4239807, 4257122, 4298975, 4301306, 4256432, 4229363, 4276872, 4380876, 4476886, 4524948, 4530816, 4512802, 4478809, 4440530, 4426809, 4466145, 4562460, 4697284, 4848007, 4993914, 5114742, 5202495, 5271529, 5337199, 5386023, 5392281, 5367982, 5364370, 5406867, 5457729, 5469261, 5449106, 5439155, 5450057, 5458999, 5461938, 5479865, 5509325, 5511406, 5464154, 5390538, 5320833, 5262823, 5226816, 5242893, 5322827, 5428460, 5507100, 5544004, 5558825, 5566957, 5567306, 5556398, 5536447, 5519697, 5532778, 5593797, 5672626, 5703872, 5659794, 5578486, 5494932, 5386909, 5237428, 5115859, 5125252, 5270812, 5442187, 5537954, 5557705, 5558303, 5571518, 5592959, 5612565, 5621485, 5610566, 5586696, 5572763, 5575335, 5574953, 5563555, 5562963, 5584241]
9731E584241J2986k6303m8025k6633Q005K7383M5282P4678Q6397N0401p618l0824
9719E749970j335M4521O4334M8594J7159j569R550M0630O1049N2505K8181P254
9707F120843j5970n5457r4469r2131l5160L8608P9698P6421N4612L9962L4505
9696F151462K5346K690l2261o7920q7399q0285n4798l3525l0016l1976j6275J9290
9684E764333N0729O0269O1103P4174Q8049O7375P840m3315m3259j2290m813k8364
9672F041831l2229J2019N9926N5183R815k0959k4097l2967n1320l9721L377J4936
9660E995794l3463o7255o992J02009J38206O9353j2406k8659p310p272k1672o758
9648F113575L9868Q2971J02993J00685P0821J3459m3077o5769n3419k6055M710
$$ y = [5584241, 5597227, 5570924, 5522899, 5496266, 5504271, 5531654, 5576936, 5651614, 5738011, 5788412, 5780794, 5749970, 5748635, 5793156, 5857490, 5906084, 5923243, 5921674, 5931224, 5971854, 6032903, 6085408, 6113589, 6120843, 6104873, 6049416, 5954947, 5862816, 5827656, 5866264, 5945962, 6022383, 6076995, 6116957, 6151462, 6176808, 6179498, 6147237, 6079317, 5991918, 5911633, 5856835, 5823310, 5793294, 5761318, 5745043, 5764333, 5815062, 5875331, 5936434, 6010608, 6098657, 6166032, 6173872, 6130557, 6087298, 6075008, 6070195, 6041831, 6009602, 6021621, 6081547, 6136730, 6146545, 6125586, 6101489, 6068522, 6017202, 5977481, 5980858, 5995794, 5962331, 5895076, 5888084, 5990093, 6128299, 6197652, 6185246, 6156587, 6149277, 6142005, 6120333, 6113575, 6153443, 6236414, 6339407, 6440092, 6510913, 6524372, 6481295, 6415526, 6362107, 6336052, 6340762]
9637F340762L2988M9744N9264P7122R0418N9558j0171m7520j3081L0228Q377m4763
9625F632926l9760K6653P4314P1234O4463P4236N7662M229k5601O48L1393K3120
9613F995517J3446M2214O5884K4333n2791q1032l5252L5936Q9317J20142J29347
9602G347061J13841Q7494P0451O0124M1385J4644r804k5112j4162M3976J23485
9591G853383J46687P2497m3027j16115j27302r8472k8456P8604J60815J60135
9581H058749J16425J16157J59161J63059R8346L0253J4888L6886O8344J09352
9571H971620J44762J36104Q7758N5501O2991P5308P5364Q8616J05999P2770k938
9560I873855k4515M7774J15120Q3597Q733J623N9751J01873J18673J63117K17717
$$ y = [6340762, 6373750, 6423494, 6482758, 6559880, 6650298, 6709856, 6699685, 6652165, 6639084, 6669312, 6677689, 6632926, 6593166, 6619819, 6694133, 6765367, 6829830, 6904066, 6961728, 6965957, 6940356, 6941004, 6972397, 6995517, 7008963, 7051177, 7117061, 7141394, 7088603, 7007571, 6972319, 7008255, 7097572, 7217714, 7347061, 7460902, 7548396, 7618847, 7678971, 7720356, 7735000, 7725196, 7700084, 7685922, 7729898, 7853383, 8000070, 8072567, 8029540, 7913425, 7786123, 7687651, 7659195, 7737799, 7898614, 8058749, 8175174, 8291331, 8450492, 8613551, 8711897, 8742150, 8757038, 8793924, 8862268, 8971620, 9116382, 9252486, 9340244, 9395745, 9458736, 9534044, 9609408, 9698024, 9804023, 9876793, 9873855, 9849340, 9897114, 10012234, 10095831, 10104564, 10106187, 10165938, 10267811, 10386484, 10549601, 10767318]
9549A0767318K02205J17685O5289R8600J58341J80619J75685J65794J36439R5261
9539A2163236R8018J61000K14995K00998J51964J26314J20286J06301J01603J29363
9529A3574078J59115J59627J68728K28841K87927K59048J60968J00226J13284
9520A5211842J28404J02992R4355J47137K03232J95575J62025J81276K40185K55275
9510A6922298K06793J64399J75968K06515K06739J81697J64699J68779J90522
9501A8588409K25668K57039K57981K28847K02538J99267K08808K29825K80247
9492B0678629L43493L56596K96449K33020K38108K75489K52657J62768R5667J05950
9482B3038826J49008J69460J78996K04456K18140J78311J06411O7986Q8745J31435
$$ y = [10767318, 10969523, 11087208, 11152497, 11251097, 11409438, 11590057, 11765742, 11931536, 12067975, 12163236, 12261254, 12422254, 12637249, 12838247, 12990211, 13116525, 13236811, 13343112, 13444715, 13574078, 13733193, 13892820, 14061548, 14290389, 14578316, 14837364, 14998332, 15098558, 15211842, 15340246, 15443238, 15537593, 15684730, 15887962, 16083537, 16245562, 16426838, 16667023, 16922298, 17129091, 17293490, 17469458, 17675973, 17882712, 18064409, 18229108, 18397887, 18588409, 18814077, 19071116, 19329097, 19557944, 19760482, 19959749, 20168557, 20398382, 20678629, 21022122, 21378718, 21675167, 21908187, 22146295, 22421784, 22674441, 22837209, 22932876, 23038826, 23187834, 23357294, 23536290, 23740746, 23958886, 24137197, 24243608, 24311594, 24400339, 24531774]
9472B4531774J49050J27110P8951L0661J1364L3620P8081J10370J14505J04001
9462B5369487J04840J29671J58903J49599Q3425N384j4244L6477R6840J12005
9452B6232387Q8814N8541K8996L037J155K2481J7235n1262j38392j61908j02104
9441B5998980j5673L8517M5711J9603j4411k5719q234J719k7087o7042o6056k4047
9429B5856261J0307J1756J208L8O473J6311K7728K9460J9463K1270M3694M9857
9417B6093826J6875n777L4376R5907J01698O9926Q2828J35316J35762O9478L2631
9406B6862846O8168R9592Q6222J10779K22218L12991K73721J76953J71663K59349
9396B8644502L15229K93535K70347K92082L13245L01950K98373L36395L85491
$$ y = [24531774, 24680824, 24807934, 24886885, 24917546, 24928910, 24962530, 25040611, 25150981, 25265486, 25369487, 25474327, 25603998, 25762901, 25912500, 25995925, 26001309, 25987065, 26023542, 26120382, 26232387, 26321201, 26379742, 26408738, 26411775, 26412930, 26435411, 26452646, 26401384, 26262992, 26101084, 25998980, 25983307, 26021824, 26067535, 26087138, 26072727, 26047008, 26038774, 26040493, 26013406, 25946364, 25880308, 25856261, 25866568, 25878324, 25879532, 25879570, 25886043, 25902354, 25930082, 25959542, 25979005, 26000275, 26043969, 26093826, 26110701, 26104924, 26139300, 26235207, 26336905, 26406831, 26489659, 26624975, 26760737, 26830215, 26862846, 26931014, 27030606, 27116828, 27227607, 27449825, 27762816, 28036537, 28213490, 28385153, 28644502, 28959731, 29253266, 29523613, 29815695, 30128940, 30430890, 30729263, 31065658, 31451149]
9387C1451149L97997L60106K88101K21075K06473K41566K54661K06223J71012
9378C3798363K36054L52095L91028L31577K74852K80480L05393L15504L39264
9369C6624610L83292M05535M07461M50489N43545O13034O22524O24058O53026
9360D1327574O76146O86548P39043Q36333Q94133Q86561R11287J027878J144957
9351D9130460J169859J166432J242891J366420J420958J393473J378229J432625
9343E9701347J536000J658469J776546J857023J909032K006145K181516K369537
9335G4995615K534929K769039L149552L601862M029262M475350M999930N506966
9327A06062505N894380O263131O721425P061379O937561O347200N616863M911694
$$ y = [31451149, 31849146, 32209252, 32497353, 32718428, 32924901, 33166467, 33421128, 33627351, 33798363, 34034417, 34386512, 34777540, 35109117, 35383969, 35664449, 35969842, 36285346, 36624610, 37007902, 37413437, 37820898, 38271387, 38814932, 39427966, 40050490, 40674548, 41327574, 42003720, 42690268, 43429311, 44265644, 45159777, 46046338, 46957625, 47985503, 49130460, 50300319, 51466751, 52709642, 54076062, 55497020, 56890493, 58268722, 59701347, 61237347, 62895816, 64672362, 66529385, 68438417, 70444562, 72626078, 74995615, 77530544, 80299583, 83449135, 87050997, 91080259, 95555609, 100555539, 106062505, 111956885, 118220016, 124941441, 132002820, 138940381, 145287581, 150904444, 155816138]
9319A55816138M127679L324096K803812K534950J909378M59022j453387l048772
9311A66472916m032710m660350n057388n003790m437175l704264l138098k724158
9303A33714983k360520k138062k128836k136301j924043j549663j238016j034321
9295A19205221q11596n43845l37457k13989p0459J29355K97880L88227M67488
9286A18510825N85113O97966P79714Q92732J080966J273604J370218J371414J361412
9277A27923964J393413J446912J482755J497411J521919J586478J686947J785802
9269A40325601J855382J911849J986030K071305K132682K163745K196889K250283
9261A56893766K298911K311768K291645K264783K252022K261579K291997K329556
$$ y = [155816138, 159943817, 163267913, 166071725, 168606675, 170516053, 170975075, 169521688, 166472916, 162440206, 157779856, 152722468, 147718678, 143281503, 139577239, 136439141, 133714983, 131354463, 129216401, 127087565, 124951264, 123027221, 121477558, 120239542, 119205221, 118393625, 117849780, 117512323, 117298334, 117227875, 117357230, 117655110, 118043337, 118510825, 119095938, 119793904, 120573618, 121466350, 122547316, 123820920, 125191138, 126562552, 127923964, 129317377, 130764289, 132247044, 133744455, 135266374, 136852852, 138539799, 140325601, 142180983, 144092832, 146078862, 148150167, 150282849, 152446594, 154643483, 156893766, 159192677, 161504445, 163796090, 166060873, 168312895, 170574474, 172866471, 175196027]
9253A75196027K352471K344140K299894K230611K169635K156567K189331K209004
9245A93147680K165304K084223K031445K019531K001083J952531J905429J876445
9237B09183671J822518J703179J548958J425396J349612J277547J161604R96542
9229B20469027Q22469P00037O58726O46135N57483L51490J13182m3265j17432
9220B24157852k12652l84482n63421o58467o88086p55650r13403j104651j248763
9211B17628277j339740j432971j560913j701373j824411j929017k016784k063932
9203B03759136k055363k031582k061398k163796k286419k368555k399318k406542
9195A85986163k417599k446698k495892k548178k576139k573411k561956k556541
$$ y = [175196027, 177548498, 179892638, 182192532, 184423143, 186592778, 188749345, 190938676, 193147680, 195312984, 197397207, 199428652, 201448183, 203449266, 205401797, 207307226, 209183671, 211006189, 212709368, 214258326, 215683722, 217033334, 218310881, 219472485, 220469027, 221291496, 221991533, 222650259, 223296394, 223853877, 224205367, 224318549, 224275284, 224157852, 223945200, 223560718, 222997297, 222338830, 221650744, 220895094, 219981691, 218877040, 217628277, 216288537, 214855566, 213294653, 211593280, 209768869, 207839852, 205823068, 203759136, 201703773, 199672191, 197610793, 195446997, 193160578, 190792023, 188392705, 185986163, 183568564, 181121866, 178625974, 176077796, 173501657, 170928246, 168366290, 165809749]
9187A65809749k543504k509802k468541k434987k401650k362547k338306k344637
9179A46405775k354427k327335k265249k203668k158793k119435k082655k056247
9171A28837966k027415j970021j888780j820397j782443j752820j708563j656412
9163A14231115j615130j589848j568429j525840j441406j336950j277713j291925
9155A02583874j308192j234650j092513r95538r89433r97921r57468r14895r32392
9146I3160872r73527r64292r12179q76464q56144p98569p02823o28102n99753
9137H5849019n81255n43154m93332m35975l66610l13663l18517l62947l78678
9128H2054888l41011k92057k60882k28870j91567j82920k09034k24291k05634
$$ y = [165809749, 163266245, 160756443, 158287902, 155852915, 153451265, 151088718, 148750412, 146405775, 144051348, 141724013, 139458764, 137255096, 135096303, 132976868, 130894213, 128837966, 126810551, 124840530, 122951750, 121131353, 119348910, 117596090, 115887527, 114231115, 112615985, 111026137, 109457708, 107931868, 106490462, 105153512, 103875799, 102583874, 101275682, 100041032, 98948519, 97952981, 96963548, 95965627, 95008159, 94093264, 93160872, 92187345, 91223053, 90310874, 89434410, 88578266, 87779697, 87076874, 86448772, 85849019, 85267764, 84724610, 84231278, 83795303, 83428693, 83115030, 82796513, 82433566, 82054888, 81713877, 81421820, 81160938, 80932068, 80740501, 80557581, 80348547, 80124256, 79918622]
9119G9918622j85697j78011j40614o0501k751j2512k9856K3763J22965J81860
9109G9637268J83655J84520K10930K35440K46022K63155K86762K93968K95250
9100H1836970L32561M13434M99299N63939O13791O49436O60674O64606O97168
9091H6931878P60808Q26590Q85304R43407R76436R56860R31488R90925J139227
9082I5342923J269122J300651J275280J271870J297554J316789J330737J360844
9074A05765770J390527J387143J360828J348988J357283J357151J326646J263119
9066A16557455J178739J110725J101389J135145J135400J063439R74636R27856
9058A25184784Q91488Q09230P12561O76431O88585O62656N77886N06077M83366
$$ y = [79918622, 79732925, 79554914, 79414300, 79353799, 79351048, 79338536, 79308680, 79332443, 79455408, 79637268, 79820923, 80005443, 80216373, 80451813, 80697835, 80960990, 81247752, 81541720, 81836970, 82169531, 82582965, 83082264, 83646203, 84259994, 84909430, 85570104, 86234710, 86931878, 87692686, 88519276, 89404580, 90347987, 91324423, 92281283, 93212771, 94203696, 95342923, 96612045, 97912696, 99187976, 100459846, 101757400, 103074189, 104404926, 105765770, 107156297, 108543440, 109904268, 111253256, 112610539, 113967690, 115294336, 116557455, 117736194, 118846919, 119948308, 121083453, 122218853, 123282292, 124256928, 125184784, 126076272, 126885502, 127598063, 128274494, 128963079, 129625735, 130203621, 130709698, 131193064]
9049A31193064M51011L61312K60155K11558K02766J81276J40273J10938R9926
9040A33212279Q3373M3114k5138j13130j77712j54734m2894N6481M2777n3936
9030A32870480j05067m4337O2861J25108J42862J82594K68951L53547L86780L81359
9020A34625138L92257M57328N71804P02360Q06066Q49228Q37092Q24884Q71610
9011A40937767R76410J085784J168566J248527J349563J453181J541397J637035
9003A51398230J752620J838984J852969J851361J935982K109448K269500K357425
8995A67366519K424097K519174K605215K639693K668735K763998K915357L059782
8987A88962570L179330L295208L393583L439324L452847L495558L576099L640441
$$ y = [131193064, 131644075, 132005387, 132265542, 132477100, 132679866, 132861142, 133001415, 133112353, 133212279, 133295652, 133338766, 133313628, 133200498, 133022786, 132868052, 132825158, 132881639, 132924416, 132870480, 132765413, 132721076, 132783937, 132909045, 133051907, 133234501, 133503452, 133856999, 134243779, 134625138, 135017395, 135474723, 136046527, 136748887, 137554953, 138404181, 139241273, 140066157, 140937767, 141914177, 142999961, 144168527, 145417054, 146766617, 148219798, 149761195, 151398230, 153150850, 154989834, 156842803, 158694164, 160630146, 162739594, 165009094, 167366519, 169790616, 172309790, 174915005, 177554698, 180223433, 182987431, 185902788, 188962570, 192141900, 195437108, 198830691, 202270015, 205722862, 209218420, 212794519, 216434960]
8979B16434960L664164L688567L745648L805342L826158L814843L805662L809097
8971B46594441L803694L758445L652958L497667L337543L208960L094242K952356
8963B73900306K789992K653731K545653K402514K182369J922634J679971J456725
8955B91533895J228100J005084Q16412O45196M36486J70629j10000l57117n71991
8946B94796694p92126j039428j296917j533483j739580j928311k104601k256164
8938B82106084k390132k553517k779711l025584l207197l299350l352572l406113
8930B58091908l444647l465556l522353l645289l765985l792260l736108l696849
8922B29022861l722573l758015l742554l695480l670910l673747l662599l612015
$$ y = [216434960, 220099124, 223787691, 227533339, 231338681, 235164839, 238979682, 242785344, 246594441, 250398135, 254156580, 257809538, 261307205, 264644748, 267853708, 270947950, 273900306, 276690298, 279344029, 281889682, 284292196, 286474565, 288397199, 290077170, 291533895, 292761995, 293767079, 294583491, 295228687, 295665173, 295835802, 295725802, 295368685, 294796694, 294004568, 292965140, 291668223, 290134740, 288395160, 286466849, 284362248, 282106084, 279715952, 277162435, 274382724, 271357140, 268149943, 264850593, 261498021, 258091908, 254647261, 251181705, 247659352, 244014063, 240248078, 236455818, 232719710, 229022861, 225300288, 221542273, 217799719, 214104239, 210433329, 206759582, 203096983, 199484968]
8914A99484968l532921l441469l342658l248702l187016l172608l179312l153252
8906A73227030l061700k925073k795437k707038k655276k616997k573938k517025
8898A51374546k448987k387657k344307k293081k192306k051459j943510j921458
8890A33791781j949119j950000j903339j850249j819701j796673j761656j715988
8882A19045056j661102j593556j531804j509914j527333j536164j498326j431979
8874A06754878j384152j377238j396405j409231j382884j302341j191084j102499
8866I6209044j075668j103987j148252j167188j136740j063240r84511r37481
8858H7591977r19067q99018q70461q55660q56661q41187p97190p62942p71498
$$ y = [199484968, 195952047, 192510578, 189167920, 185919218, 182732202, 179559594, 176380282, 173227030, 170165330, 167240257, 164444820, 161737782, 159082506, 156465509, 153891571, 151374546, 148925559, 146537902, 144193595, 141900514, 139708208, 137656749, 135713239, 133791781, 131842662, 129892662, 127989323, 126139074, 124319373, 122522700, 120761044, 119045056, 117383954, 115790398, 114258594, 112748680, 111221347, 109685183, 108186857, 106754878, 105370726, 103993488, 102597083, 101187852, 99804968, 98502627, 97311543, 96209044, 95133376, 94029389, 92881137, 91713949, 90577209, 89513969, 88529458, 87591977, 86672910, 85773892, 84903431, 84047771, 83191110, 82349923, 81552733, 80789791, 80018293]
8849H0018293p94993p81443p27646o78291o63928o74396o87338o90635o78634
8840G3640989o54929o39116o45150o52470o24795n61994n08977n03929n36831
8831F8312798n70149n84415n87343n85562n66869n19834m62558m34250m49986
8822F3551832m77163m72135m29318l73244l15743k57767k28776k72224l72142
8813F0353320m40862m15494l33405k74310k57525k42734k10971j91043k08868
8804E7778108k54674l01897l23626k94979k19672j53024j53990k05158k20656
8795E5650432j49879m1331J5766r327o5364q1665m2656k421j9221p3415p9245
8784E5101674L06Q9035R5338M1750K6831P4944J11337R5788Q7605J37130J93684
$$ y = [80018293, 79223300, 78441857, 77714211, 77035920, 76371992, 75697596, 75010258, 74319623, 73640989, 72986060, 72346944, 71701794, 71049324, 70424529, 69862535, 69353558, 68849629, 68312798, 67742649, 67158234, 66570891, 65985329, 65418460, 64898626, 64436068, 64001818, 63551832, 63074669, 62602534, 62173216, 61799972, 61484229, 61226462, 60997686, 60725462, 60353320, 59912458, 59496964, 59163559, 58889249, 58631724, 58388990, 58178019, 57986976, 57778108, 57523434, 57221537, 56897911, 56602932, 56383260, 56230236, 56076246, 55871088, 55650432, 55500553, 55459222, 55474988, 55465661, 55400297, 55318632, 55275976, 55273555, 55254334, 55180919, 55101674, 55101980, 55191015, 55286353, 55328103, 55354934, 55429878, 55541215, 55637003, 55724608, 55861738, 56055422]
8773E6055422J85923J38033J34172J97232K66060K79070K33666J76685J72360
8764E7838623K57783L92354M76113M58247M00469L90558M26980M46795M38764
8755F1526686M53354N06188N45837N34119N01621M99655N35445N74786N84565
8746F6262256N64406N53330N96005O80577P34167P16741O88121P25531Q03459
8737G2324593Q32842Q05022Q04513Q70511R40028R58080R57539R86854J036720
8728H0516702J087967J157784J240458J274425J239224J220378J294355J402025
8720I0433318J430188J379824J352589J393733J455261J510430J594285J708587
8712A02258215J786374J794218J791209J837538J907829J945813J950741J954095
$$ y = [56055422, 56241345, 56379378, 56513550, 56710782, 56976842, 57255912, 57489578, 57666263, 57838623, 58096406, 58488760, 58964873, 59423120, 59823589, 60214147, 60641127, 61087922, 61526686, 61980040, 62486228, 63032065, 63566184, 64067805, 64567460, 65102905, 65677691, 66262256, 66826662, 67379992, 67975997, 68656574, 69390741, 70107482, 70795603, 71521134, 72324593, 73157435, 73962457, 74766970, 75637481, 76577509, 77535589, 78493128, 79479982, 80516702, 81604669, 82762453, 84002911, 85277336, 86516560, 87736938, 89031293, 90433318, 91863506, 93243330, 94595919, 95989652, 97444913, 98955343, 100549628, 102258215, 104044589, 105838807, 107630016, 109467554, 111375383, 113321196, 115271937, 117226032]
8704A17226032J952857J926268J893418J897040J939319J979607J993010J993335
8696A32800886J995249J983098J927444J820805J693967J597136J553353J527900
8688A46899838J462610J345446J220381J118205J011828Q65952P00900N67135
8680A55192295M71052L68747K34750R9948O488n0898j16540k13363l10695l63639
8670A55318145l75892l99300m60990n19085n22922m95911n06865n63295n96262
8661A50877623n68813n34651n50140n86386n84967n53170n33780n15601m57513
8652A45992602l84640l67874l99367l79822k64452j44777j33436k23321l15401
8643A43379512l42736l09688k42590j66410j15699j10520j23831j17531j02560
$$ y = [117226032, 119178889, 121105157, 122998575, 124895615, 126834934, 128814541, 130807551, 132800886, 134796135, 136779233, 138706677, 140527482, 142221449, 143818585, 145371938, 146899838, 148362448, 149707894, 150928275, 152046480, 153058308, 153924260, 154625160, 155192295, 155663347, 156032094, 156266844, 156366792, 156373280, 156322382, 156205842, 155992479, 155681784, 155318145, 154942253, 154542953, 154081963, 153562878, 153039956, 152544045, 152037180, 151473885, 150877623, 150308810, 149774159, 149224019, 148637633, 148052666, 147499496, 146965716, 146450115, 145992602, 145607962, 145240088, 144840721, 144460899, 144196447, 144051670, 143918234, 143694913, 143379512, 143036776, 142727088, 142484498, 142318088, 142202389, 142091869, 141968038, 141850507, 141747947]
8634A41747947j14476j37688j16988n4775l1086r1796j69074j64904q1993j3508
8624A40771659j4430m2612l7318l482J1562j0616m9317q6924j22512j48944j52396
8613A40114670j40072j39022j57798j74374j72544j63890j57420j33081p0289
8604A38806180J5729R3746J61664K46792L67837N15181O57061P48668P59788P24294
8594A43096940P36923Q55975J027579J158811J247765J369561J538432J676334
8586A52708320J747032J828821J990961K171996K266929K288890K349989K501209
8578A69854147K682394K830892K953987L075408L184697L272195L359159L461674
8570A94674553L568186L676734L808701L959242M081277M154163M226843M350949
$$ y = [141747947, 141633471, 141495783, 141378795, 141324020, 141292934, 141201138, 141032064, 140867160, 140785167, 140771659, 140757229, 140714617, 140677299, 140673817, 140685379, 140674763, 140625446, 140538522, 140416010, 140267066, 140114670, 139974598, 139835576, 139677778, 139503404, 139330860, 139166970, 139009550, 138876469, 138806180, 138821909, 138915655, 139077319, 139324111, 139691948, 140207129, 140864190, 141612858, 142372646, 143096940, 143833863, 144689838, 145717417, 146876228, 148123993, 149493554, 151031986, 152708320, 154455352, 156284173, 158275134, 160447130, 162714059, 165002949, 167352938, 169854147, 172536541, 175367433, 178321420, 181396828, 184581525, 187853720, 191212879, 194674553, 198242739, 201919473, 205728174, 209687416, 213768693, 217922856, 222149699, 226500648]
8562B26500648M503136M617898M675632M716459M781603M878221M990021N086658
8554B64750276N129856N103255N035388M972015M932587M910441M896541M875879
8546C04606238M818493M708957M574473M450975M331187M180714L996704L811760
8538C39479501L643972L483273L325914L177682L016523K799091K523355K244962
8530C63694273K007385J789175J546642J277411J008160P42764M61666J63493
8522C72690969j27764l98195o61572r37597j228998j522030j798201k046544k272922
8513C61697146k492955k710084k912745l102480l306001l538061l766860l944526
8505C35923434m064813m161535m254471m333026m398178m479732m590639m697724
$$ y = [226500648, 231003784, 235621682, 240297314, 245013773, 249795376, 254673597, 259663618, 264750276, 269880132, 274983387, 280018775, 284990790, 289923377, 294833818, 299730359, 304606238, 309424731, 314133688, 318708161, 323159136, 327490323, 331671037, 335667741, 339479501, 343123473, 346606746, 349932660, 353110342, 356126865, 358925956, 361449311, 363694273, 365701658, 367490833, 369037475, 370314886, 371323046, 372065810, 372527476, 372690969, 372563205, 372165010, 371503438, 370565841, 369336843, 367814813, 366016612, 363970068, 361697146, 359204191, 356494107, 353581362, 350478882, 347172881, 343634820, 339867960, 335923434, 331858621, 327697086, 323442615, 319109589, 314711411, 310231679, 305641040, 300943316]
8497C00943316m768794m823081m895204m965118m973258m908203m831381m795723
8489B61982554m781062m741574m684264m655860m667852m681202m663798m619711
8481B24487231m555166m458808m334292m216065m126765m045553l943908l828882
8473A90977792l724612l634474l551694l485337l439385l383131l282037l146964
8465A63330158l014994k895081k777497k682513k638182k609533k520525k368728
8457A41823105k250878k232708k250395k198845k076490j972996j931856j898210
8449A25010727j813285j702754j640667j653927j690300j675093j586679j473748
8441A11774274j397726j366389j342350j309914j292214j289689j254817j168621
$$ y = [300943316, 296174522, 291351441, 286456237, 281491119, 276517861, 271609658, 266778277, 261982554, 257201492, 252459918, 247775654, 243119794, 238451942, 233770740, 229106942, 224487231, 219932065, 215473257, 211138965, 206922900, 202796135, 198750582, 194806674, 190977792, 187253180, 183618706, 180067012, 176581675, 173142290, 169759159, 166477122, 163330158, 160315164, 157420083, 154642586, 151960073, 149321891, 146712358, 144191833, 141823105, 139572227, 137339519, 135089124, 132890279, 130813789, 128840793, 126908937, 125010727, 123197442, 121494688, 119854021, 118200094, 116509794, 114834701, 113248022, 111774274, 110376548, 109010159, 107667809, 106357895, 105065681, 103775992, 102521175, 101352554]
8433A01352554j095523j098478j130620j090728r78111r05580r40070j011950
8425I3101494j024117r82798r59688r71799r70274r29194q80063q56235q53992
8416H4673334q59964q78579r13488r44745r44554r11598q81208q96001r58692
8407G6484505j017318j016221r63758r21868r18714r08850q47534p68219p39692
8398F8382331p69070q03780q21752q55238r11457r33010q77388p92908p64196
8389F0853532q02890q42833q37912q14140q12034q20729q00354p45900o93353
8380E3683387o69236o65800o68169o75060o80296o61989o14487n72867n76338
8371D7899145o15770o46560o49164o45006o50439o49853o26939n92405n62812
$$ y = [101352554, 100257031, 99158553, 98027933, 96937205, 95959094, 95053514, 94113444, 93101494, 92077377, 91094579, 90134891, 89163092, 88192818, 87263624, 86383561, 85527326, 84673334, 83813370, 82934791, 82021303, 81076558, 80132004, 79220406, 78339198, 77443197, 76484505, 75467187, 74450966, 73487208, 72565340, 71646626, 70737776, 69890242, 69122023, 68382331, 67613261, 66809481, 65987729, 65132491, 64221034, 63288024, 62410636, 61617728, 60853532, 60050642, 59207809, 58369897, 57555757, 56743723, 55922994, 55122640, 54376740, 53683387, 53014151, 52348351, 51680182, 51005122, 50324826, 49662837, 49048350, 48475483, 47899145, 47283375, 46636815, 45987651, 45342645, 44692206, 44042353, 43415414, 42823009, 42260197]
8362D2260197n36309n07790m85740m74639m61803m41965m34461m54471m86715
8353C7976304n08183n14715n03815m60346l90044l38468l37789l59399l61328
8344C4202217l56063l78914m12098m04923l58594l23416l14611l01559k83367
8335C1068672k96034l28359l13964k39650j81925j91710k21493k24209k43598
8326B8827730l23704l95999l62850k55687j99752k33974k72825k54030k20435
8317B6308474k25033k44873k37942k18468k22761k46080k59313k54095k35493
8308B4164416k03538j74320j84335k38146k82283k67564k11918j68429j56720
8299B2277163j60666j69926j85106j97530j97998j92750j84053j55546j08428
$$ y = [42260197, 41723888, 41216098, 40730358, 40255719, 39793916, 39351951, 38917490, 38463019, 37976304, 37468121, 36953406, 36449591, 35989245, 35599201, 35260733, 34922944, 34563545, 34202217, 33846154, 33467240, 33055142, 32650219, 32291625, 31968209, 31653598, 31352039, 31068672, 30772638, 30444279, 30130315, 29890665, 29708740, 29517030, 29295537, 29071328, 28827730, 28504026, 28108027, 27745177, 27489490, 27289738, 27055764, 26782939, 26528909, 26308474, 26083441, 25838568, 25600626, 25382158, 25159397, 24913317, 24654004, 24399909, 24164416, 23960878, 23786558, 23602223, 23364077, 23081794, 22814230, 22602312, 22433883, 22277163, 22116497, 21946571, 21761465, 21563935, 21365937, 21173187, 20989134, 20833588, 20725160]
8290B0725160q8167j31566k01567k22584j79097j34531j43895j85810j99389j63543
8280A9075011j17789j11029j43934j69841j55530j27535j34554j71993j86756
8271A7756050j63140j47301j59091j44292p0691j2478n3157j42219j53258p5102
8261A6635321l2132r3384j72231j68028j11351r1429j11684j08474o9422m0996
8251A5636190l8392l2314k2242m8557j21817j98025k34371k22184j62645o4224
8241A4491419K6263M4919j5000r0020j23831j19624j03461q2245o0750n6806o8649
8230A3842215o2767k6177J820j5153n4231p3304q0924j14798j62987j63502r1614
8219A2998578m53M7541N5227O6570Q8647P6114j368j03447j52890j20257n4509
$$ y = [20725160, 20636993, 20505427, 20303860, 20081276, 19902179, 19767648, 19623753, 19437943, 19238554, 19075011, 18957222, 18846193, 18702259, 18532418, 18376888, 18249353, 18114799, 17942806, 17756050, 17592910, 17445609, 17286518, 17142226, 17071535, 17059057, 17005900, 16863681, 16710423, 16635321, 16603189, 16509805, 16337574, 16169546, 16058195, 15966766, 15855082, 15746608, 15677186, 15636190, 15597798, 15565484, 15543242, 15494685, 15372868, 15174843, 14940472, 14718288, 14555643, 14491419, 14517682, 14562601, 14547601, 14457581, 14333750, 14214126, 14110665, 14028420, 13967670, 13910864, 13842215, 13779448, 13753271, 13755091, 13739938, 13685707, 13612403, 13531479, 13416681, 13253694, 13090192, 12998578, 12998125, 13045666, 13100893, 13167463, 13256110, 13332224, 13330856, 13227409, 13074519, 12954262, 12899753]
8208A2899753k1692l1445m4442l9853l9722n9210o9231l7151J5995L5413P374
8197A2615789j8226P458O5981R0456M6428k4608n2928k3025J1442M8m0536n6500
8185A2621779l2313j889O872l101k9095p4839j11917q8660q009N2963M2037L106
8173A2376934k572L289l2049p9498o4438k566P813n4923r0917l6179L5052L4359
8161A2094305L50K2171Q2013Q4429J6068l6108l0281k9326q3432j39518j20419
8150A1860252l6770L5141N2071L2547R859j365k727o136k2313l8773k6773J4450
8138A1869463M6422M4796L2698L1561J5392l7312p4396k1251J00916J76727J38108
8127A2323124M7401O487L1233O1481N9473M1621K8109J6765Q264J1006J4973K759
$$ y = [12899753, 12878061, 12846616, 12802174, 12762321, 12722599, 12663389, 12594158, 12557007, 12573002, 12608415, 12615789, 12597563, 12605021, 12671002, 12761458, 12807886, 12783278, 12730350, 12707325, 12718767, 12718815, 12678279, 12621779, 12589466, 12587577, 12594449, 12591348, 12562253, 12487414, 12375497, 12286837, 12278828, 12331791, 12373828, 12376934, 12374362, 12377651, 12345602, 12266104, 12201666, 12199100, 12206913, 12151990, 12061073, 12024894, 12059946, 12094305, 12094655, 12116826, 12198839, 12283268, 12299336, 12263228, 12232947, 12203621, 12120189, 11980671, 11860252, 11823482, 11858623, 11910694, 11943241, 11953100, 11951735, 11949008, 11942872, 11920559, 11881786, 11855013, 11869463, 11915885, 11960681, 11993379, 12024940, 12040332, 12003020, 11928624, 11907373, 12008289, 12185016, 12323124, 12370525, 12377012, 12408245, 12469726, 12529199, 12570820, 12598929, 12615694, 12623958, 12634964, 12649937, 12652696]
8115A2652696o537K7959R3669J15342N6273j4778p676O6892J16396R3416M2697
8104A3236349J9563K1608K1882K0637L2473N3412O8607P1960O2199M4355M4334
8093A3697379Q4647J32396J20765M8719L094L7050Q4567O3969J5807M1294J27903
8082A4457590J50137N9549l3421j5199P9777J39090J28490J01164R1667Q1561
8072A5240405N8689M3357N0961P4783J07832J43867J59440J34226R1510Q2854
8062A6187924J24806J76362J84977J37943P0788L9675P4285J39828J63080J19289
8052A7418957O9699P9482J24350J27681P3561K4764L1421P9747J36756J87432
8042A8353850K13052J89165J29512Q4892P6356P6280P4219J00976J54158J65391
$$ y = [12652696, 12646159, 12674118, 12767787, 12883129, 12939402, 12924624, 12916948, 12983840, 13100236, 13193652, 13236349, 13255912, 13277520, 13299402, 13320039, 13352512, 13405924, 13474531, 13546491, 13608690, 13653045, 13697379, 13782026, 13914422, 14035187, 14083906, 14087000, 14124050, 14208617, 14272586, 14288393, 14329687, 14457590, 14607727, 14667276, 14633855, 14618656, 14698433, 14837523, 14966013, 15067177, 15158844, 15240405, 15299094, 15342451, 15393412, 15468195, 15576027, 15719894, 15879334, 16013560, 16105070, 16187924, 16312730, 16489092, 16674069, 16812012, 16882800, 16922475, 16996760, 17136588, 17299668, 17418957, 17488656, 17568138, 17692488, 17820169, 17893730, 17918494, 17949915, 18029662, 18166418, 18353850, 18566902, 18756067, 18885579, 18970471, 19046827, 19123107, 19197326, 19298302, 19452460, 19617851]
8032A9617851R8324K5279L4634J00098J23587Q7816P6916J39165K13001K20698
8022B0737369J72443J35909J43969J71748J78985J44939Q2774M2045P2581J61314
8012B2044076K28768K15865J54189J20755J41109J73001J77302J66656J76312
8003B3598033K13287K48340K48759K14769J87842K14606K90011L47633L28688
7994B5891968K55164K07871K31231K89767L27139L35019L39801L48631L47057
7985B8573648L40252L54577L90650M12056M01212L96728M43393N22696N71375
7976C2406587N65513N47470N61437O00111O34958O63854O94105P04444O72120
7967C8050599O30565O48890P41288Q39761Q80424Q82163R07869R74527J041778
$$ y = [19617851, 19716175, 19741454, 19776088, 19876186, 19999773, 20087589, 20164505, 20303670, 20516671, 20737369, 20909812, 21045721, 21189690, 21361438, 21540423, 21685362, 21768136, 21810181, 21882762, 22044076, 22272844, 22488709, 22642898, 22763653, 22904762, 23077763, 23255065, 23421721, 23598033, 23811320, 24059660, 24308419, 24523188, 24711030, 24925636, 25215647, 25563280, 25891968, 26147132, 26355003, 26586234, 26876001, 27203140, 27538159, 27877960, 28226591, 28573648, 28913900, 29268477, 29659127, 30071183, 30472395, 30869123, 31312516, 31835212, 32406587, 32972100, 33519570, 34081007, 34681118, 35316076, 35979930, 36674035, 37378479, 38050599, 38681164, 39330054, 40071342, 40911103, 41791527, 42673690, 43581559, 44556086, 45597864]
7958D5597864J075457J080610J073903J063363J061560J081086J103057J084228
7950E4221128J015778R44278R08171Q81281Q13498P03605N86953M65165L04632
7941F0844489J11178n0427j39744k01386l05325m55620n98023o97138p61582q03223
7931E6943199q18694q15731q18324q34126q45569q41358q29309q12647p84490
7922D9542951p52513p34560p20427o78398o14996n80338n85162n63495m68003
7913D3845059l60692l40177l99427m30402l69832k67862j96089j57793j24691
7904D1198094j03232j11586j27487j12559o8994k5899J6085P9944J58356K10692
7894D1113414K19413K11832K15795K25898K27136K23820K25017K19497J84854
$$ y = [45597864, 46673321, 47753931, 48827834, 49891197, 50952757, 52033843, 53136900, 54221128, 55236906, 56181184, 57089355, 57970636, 58784134, 59487739, 60074692, 60539857, 60844489, 60955667, 60905240, 60765496, 60564110, 60258785, 59803165, 59205142, 58508004, 57746422, 56943199, 56124505, 55308774, 54490450, 53656324, 52810755, 51969397, 51140088, 50327441, 49542951, 48790438, 48055878, 47335451, 46657053, 46042057, 45461719, 44876557, 44313062, 43845059, 43484367, 43144190, 42744763, 42314361, 41944529, 41676667, 41480578, 41322785, 41198094, 41094862, 40983276, 40855789, 40743230, 40674236, 40648337, 40664422, 40744366, 40902722, 41113414, 41332827, 41544659, 41760454, 41986352, 42213488, 42437308, 42662325, 42881822, 43066676]
7885D3066676J12979J4344r3739j92583k67012l19602l74050m49211n31286n86560
7875D0379956o04787o14835o45313o79161o67873n94667n03058m46255m23685
7866C5200322l94699l47969l18704l26415l36151l12580k80678k85132l05116
7857C2292878k68997j64129p6694q8562j71377k24139j93520j13672l8456J7995
7847C0971327O7814J18300J72474K33399K91565L30422L57549M03804M73079N20408
7837C3940141N04997M38288L48910K33374R2655r857n750N9112M5872j03358k87668
7826C5256716l95560m58000n69260p08955p58801o88331o06909o00827o20320
7817B9849753n84136n11451m72278m65629m35326l76026l37789l34089l21260
$$ y = [43066676, 43179655, 43193999, 43100260, 42907677, 42640665, 42321063, 41947013, 41497802, 40966516, 40379956, 39775169, 39160334, 38515021, 37835860, 37167987, 36573320, 36070262, 35624007, 35200322, 34805623, 34457654, 34138950, 33812535, 33476384, 33163804, 32883126, 32597994, 32292878, 32023881, 31859752, 31783058, 31694496, 31523119, 31298980, 31105460, 30991788, 30953332, 30971327, 31039141, 31157441, 31329915, 31563314, 31854879, 32185301, 32542850, 32946654, 33419733, 33940141, 34445138, 34883426, 35232336, 35465710, 35558365, 35548508, 35542758, 35601870, 35647742, 35544384, 35256716, 34861156, 34403156, 33833896, 33124941, 32366140, 31677809, 31070900, 30470073, 29849753, 29265617, 28754166, 28281888, 27816259, 27380933, 27004907, 26667118, 26333029, 26011769]
7808B6011769k73934k16743j72561j37338j16632j28673j53219j34721o4283p328
7798B4606337j2756l6606K02J06872K18707K78662K81681K48178J92413J19998
7788B6003688L4260n4540j17146j22878r1279j01526k10355l71868m82980n07621
7778B3977755n08409n43225n81221n58390m81867m25794m30103m53842m43005
7769A9551899m01977l66751l38468k91490k37613k26991k69307l02442k74787
7760A6842073k23106k21580k74884l15421k99498k49949j97429j37830p1741l5529
7750A4815106n5570j05618j44887j69289j89461j87923j44498q7294p1272j09954
7740A3549340j64927j97847j98509j68913j19475q0531p9229j00439j03704q0558
$$ y = [26011769, 25737835, 25521092, 25348531, 25211193, 25094561, 24965888, 24812669, 24677948, 24613665, 24606337, 24593581, 24556975, 24557177, 24664049, 24882756, 25161418, 25443099, 25691277, 25883690, 26003688, 26037948, 25983408, 25866262, 25743384, 25652105, 25550579, 25340224, 24968356, 24485376, 23977755, 23469346, 22926121, 22344900, 21786510, 21304643, 20878849, 20448746, 19994904, 19551899, 19149922, 18783171, 18444703, 18153213, 17915600, 17688609, 17419302, 17116860, 16842073, 16618967, 16397387, 16122503, 15807082, 15507584, 15257635, 15060206, 14922376, 14850635, 14815106, 14759536, 14653918, 14509031, 14339742, 14150281, 13962358, 13817860, 13730566, 13659294, 13549340, 13384413, 13186566, 12988057, 12819144, 12699669, 12619138, 12539909, 12439470, 12335766, 12255208]
7730A2255208n9637n3395m2651k4556l0402p1746j07202r6475o1208n5773r1822
7719A1560341j26090j19568q0885m7491m2770n8689p1805p1002o8480q0210r9362
7708A0693989j02023q1177n9783o1827q2024r4292q4138o5549o7098r9712j35931
7697I760435j33307r0291o0105q2142j16875r3612j8012K4388j3480p5815r1045
7686I010139p1155p2733r7088r3537m6661J028J3447l878l6524p9525j13655j10029
7674H299829p4517m7585m4205l4895n747P226k4876p1215q6523p9529q9482j13397
7662G635084j08150o0971j0588P706k528k7080o4460j04184j17947r7183p1422
7651F978277o3707n3888j6898K6744L9216K8509L4975N7202M4415k1259q3513
$$ y = [12255208, 12195571, 12142176, 12099525, 12074969, 12044567, 11972821, 11865619, 11769144, 11707936, 11652163, 11560341, 11434251, 11314683, 11233798, 11186307, 11143537, 11084848, 11013043, 10942041, 10873561, 10793351, 10693989, 10591966, 10510789, 10451006, 10389179, 10307155, 10212863, 10128725, 10063176, 9996078, 9896366, 9760435, 9627128, 9536837, 9476732, 9394590, 9277715, 9184103, 9166091, 9190479, 9176999, 9101184, 9010139, 8938984, 8866251, 8769163, 8675626, 8628965, 8629993, 8643440, 8639562, 8603038, 8523513, 8409858, 8299829, 8225312, 8177727, 8133522, 8098627, 8092880, 8100106, 8075230, 8004015, 7917492, 7837963, 7748481, 7635084, 7526934, 7465963, 7455375, 7463081, 7460553, 7433473, 7369013, 7264829, 7146882, 7049699, 6978277, 6914570, 6860682, 6843784, 6870528, 6909744, 6938253, 6973228, 7030430, 7074845, 7053586, 6970073]
7640F970073q5720n0418m3099p7925j05717r0258n2832l2071l4069l9650l9108
7629F319206m0696n2326o5260n6342j2426M1366N4750J4587k3053J349O2422P4386
7617F317963Q120o8018q5110o1248n5313p4972q1631o2741m4052l7472k7185j1249
7605E717092j2775l7040n1979k8310K3051O4505O4160J1993o9446j22079r1021
7594E468151R786Q9046O4043m5552j30355j05900m200O2235K6787n9063r4415
7583E280563n2271J413R291p529o010J552k0995n3808l7532L3490R2774Q6875
7571E327813L1647k6633n7581l9784L7652J34455J65846R4589j1299n4619k3002
7560E579084J4082P850j6553j2113K4127N5333N4773L1919J2197M429k325j1975
$$ y = [6970073, 6884353, 6833935, 6790836, 6712911, 6607194, 6516936, 6464104, 6432033, 6397964, 6358314, 6319206, 6278510, 6226184, 6160924, 6104582, 6092156, 6133522, 6188272, 6202859, 6179806, 6181155, 6243577, 6317963, 6326083, 6258065, 6172955, 6111707, 6056394, 5981422, 5899791, 5837050, 5792998, 5755526, 5728341, 5717092, 5704317, 5667277, 5615298, 5586988, 5610039, 5674544, 5738704, 5750697, 5681251, 5559172, 5468151, 5477937, 5566983, 5631026, 5585474, 5455119, 5349219, 5345019, 5407254, 5434041, 5374978, 5280563, 5228292, 5229705, 5238996, 5231467, 5225457, 5227009, 5206014, 5152206, 5114674, 5148164, 5240938, 5327813, 5359460, 5332827, 5275246, 5235462, 5273114, 5407569, 5573415, 5668004, 5656705, 5602086, 5579084, 5593166, 5601016, 5584463, 5572350, 5596477, 5651810, 5706583, 5738502, 5750699, 5755128, 5752803, 5740828]
7548E740828q819J5602L9537L9489L0366M4437P6534R0697Q2833Q9516J21476
7537F362496J36631J03955N0904J6882r75k1483l6351l2073k1056j1322J9945
7526F567553P7448J08110O6152j0147m6848l6290k5428k1867J0979O7377Q7635
7515F844674M9411L054o801M669J0359J5686K5981K1901J64p211J3242K8398J8561
7502G022088J9509O1968J08801J01733M2226k0951o0913q2614q2976n0569K108
7491G060410M7031P7057J02057J19743J25441J38624J78001K15352J98066J23066
7481H384848N0257L1693N8728R2062J15466J38611J62321J63091J16098L0382
7471I343557m3295n1865N130P1830R8105R1458R1720J09821J17033Q9738M1163
$$ y = [5740828, 5732009, 5747611, 5787148, 5826637, 5857003, 5901440, 5977974, 6068671, 6151504, 6241020, 6362496, 6499127, 6603082, 6653986, 6670868, 6669893, 6648410, 6612059, 6579986, 6558930, 6547608, 6567553, 6645001, 6753111, 6819263, 6809116, 6762268, 6725978, 6700550, 6678683, 6689662, 6757039, 6844674, 6894085, 6897139, 6890338, 6895007, 6905366, 6921052, 6947033, 6968934, 6969098, 6961887, 6975129, 7003527, 7022088, 7041597, 7103565, 7212366, 7314099, 7356325, 7335374, 7274461, 7191847, 7108871, 7058302, 7060410, 7107441, 7184498, 7286555, 7406298, 7531739, 7670363, 7848364, 8063716, 8261782, 8384848, 8435105, 8466798, 8525526, 8617588, 8733054, 8871665, 9033986, 9197077, 9313175, 9343557, 9300262, 9248397, 9253527, 9325357, 9423462, 9514920, 9606640, 9716461, 9833494, 9923232, 9964395]
7460I964395N384K488K0157K5558L582j6221Q175O7328J01426Q1819N2421N8426
7448A0374938P4001N0745P306O972N9672J11789J31830J40981J51553J42495J15569
7437A1367851J11146J37322J42866J00769O5174R5404J66841K12259K16912K13161
7427A2829705K07111J77021J32863J10670J05780P5249K0736Q603P6722J68162
7417A3912622J97846J55457J01309P8878P6372P3662Q3986J26328J79076J94010
7407A5179546J60700J31762J60948K25582K44008J81620J07293J13360J99977
7398A6704796K81366L00643K88760K96990L19601L16496K77866K25305J70973
7389A9182796J19537R5905J20420J58395J47117Q5290M5428P3299J20745J13617
$$ y = [9964395, 9969779, 9972267, 9992424, 10017982, 10021564, 10005343, 10013518, 10080846, 10182272, 10264091, 10316512, 10374938, 10448939, 10499684, 10506990, 10513962, 10573634, 10685423, 10817253, 10958234, 11109787, 11252282, 11367851, 11478997, 11616319, 11759185, 11859954, 11925128, 12020532, 12187373, 12399632, 12616544, 12829705, 13036816, 13213837, 13346700, 13457370, 13563150, 13638399, 13659135, 13667738, 13744460, 13912622, 14110468, 14265925, 14367234, 14446112, 14522484, 14596146, 14680132, 14806460, 14985536, 15179546, 15340246, 15472008, 15632956, 15858538, 16102546, 16284166, 16391459, 16504819, 16704796, 16986162, 17286805, 17575565, 17872555, 18192156, 18508652, 18786518, 19011823, 19182796, 19302333, 19398238, 19518658, 19677053, 19824170, 19909460, 19954888, 20028187, 20148932, 20262549]
7379B0262549M7685k6271p9032j10117j03536m4979K0688J9129m9912r8614o4534
7368A9773056J6234P7192J05617J18430J10212Q4693R5458J82937K92683L28196
7358B1184708K78500K27070K33862K73806L00447L05256K93300K58575K12164
7349B3567688J86685J83982J61938J02207M8362M2889O3423N7332R350n7425j18546
7338B4247885j57134j67657j78911k34907l20271l51198k87897k10494k19487
7329B2119929k96429l38636l09535k69432k60926k52605k17372j88928k02832
7320A9783234k40383k69114k88443k95539k55004j54497n5745l3106p7700j12958
7310A8000745r7338o3557n4336o4571o4655n0378m5568o6704j02062j24601j18390
$$ y = [20262549, 20310234, 20283963, 20204931, 20094814, 19991278, 19946299, 19966987, 19986116, 19936204, 19837590, 19773056, 19789290, 19866482, 19972099, 20090529, 20200741, 20285434, 20380892, 20563829, 20856512, 21184708, 21463208, 21690278, 21924140, 22197946, 22498393, 22803649, 23096949, 23355524, 23567688, 23754373, 23938355, 24100293, 24202500, 24250862, 24293751, 24357174, 24414506, 24423856, 24366431, 24247885, 24090751, 23923094, 23744183, 23509276, 23189005, 22837807, 22549910, 22339416, 22119929, 21823500, 21484864, 21175329, 20905897, 20644971, 20392366, 20174994, 19986066, 19783234, 19542851, 19273737, 18985294, 18689755, 18434751, 18280254, 18224509, 18191403, 18113703, 18000745, 17903407, 17839850, 17785514, 17720943, 17656288, 17605910, 17560342, 17493638, 17391576, 17266975, 17148585]
7299A7148585r2366o9852o5761p8079j02132j41951j96049k38723k35710j86836
7289A5741126j37991j31745j52276j47035j10179j07827j86096k82172k87914
7280A4197891k00955j42131j94243k90661l18267k74045k40538k41987k22898
7271A2072166j66600j36700j71682k19482k21877k00517k06757k33108k29613
7262A0285830j79722j14915p4666q3271j39000j97341j98284j40558r0550q6344
7252H981179q4284m6694k3020p0477j42498j51053j12878j26422k04733k44068
7242G775052j87954j17580j20796j56965j31758m9731m261l9651j02324j27558
7232F736474j11228q5379p1177p2269q2472q6962p7580p0311q4255j03332q9758
$$ y = [17148585, 17056219, 16986367, 16920606, 16842527, 16740395, 16598444, 16402395, 16163672, 15927962, 15741126, 15603135, 15471390, 15319114, 15172079, 15061900, 14954073, 14767977, 14485805, 14197891, 13996936, 13854805, 13660562, 13369901, 13051634, 12777589, 12537051, 12295064, 12072166, 11905566, 11768866, 11597184, 11377702, 11155825, 10955308, 10748551, 10515443, 10285830, 10106108, 9991193, 9916527, 9833256, 9694256, 9496915, 9298631, 9158073, 9067523, 8981179, 8896895, 8850201, 8827181, 8756704, 8614206, 8463153, 8350275, 8223853, 8019120, 7775052, 7587098, 7469518, 7348722, 7191757, 7059999, 7010268, 7006007, 6966356, 6864032, 6736474, 6625246, 6539867, 6468690, 6396421, 6313949, 6226987, 6149407, 6079096, 5994841, 5891509, 5801751]
7221E801751m3505j5917m3530r2632j00106o0327l7495q0632j51034j61286q2289
7210D932998J6312M5279n105o8127r0433q4720q8136j02921j03317q2187o0319
7199D309324n2794n1481m5179l7061l2976k8074j8724j8322m3107q1281r3117
7188C807208n4490O665L2526l751p1063j18622j27962j15354r3676n3982R055
7177C216554O8332P7852K0642o1848j00893p1274k4221l1418r6105j44212j14194
7166B739215l0121L5535M8726L1854J1057j2874l9649n3758m7980l7209l4785
7155B610011l4105k6326k0802l4210o6121r2223q0815k4153L8681M7735q004o5156
7143B244512o1662j9078m508k5906k8926J054R652k7928n3782k2740J2716j7618
$$ y = [5801751, 5758246, 5742329, 5698799, 5606167, 5506061, 5445734, 5408239, 5327607, 5176573, 5015287, 4932998, 4949310, 4994589, 4989484, 4921357, 4830924, 4746204, 4658068, 4555147, 4451830, 4369643, 4309324, 4256530, 4205049, 4159870, 4122809, 4089833, 4061759, 4043035, 4024713, 3981606, 3900325, 3807208, 3752718, 3759383, 3791909, 3788158, 3717095, 3598473, 3470511, 3355157, 3261481, 3207499, 3216554, 3284886, 3362738, 3383380, 3321532, 3220639, 3149365, 3125144, 3093726, 2997621, 2853409, 2739215, 2709094, 2744629, 2793355, 2825209, 2836266, 2823392, 2783743, 2729985, 2682005, 2644796, 2610011, 2575906, 2549580, 2528778, 2494568, 2428447, 2336224, 2255409, 2231256, 2269937, 2317672, 2309668, 2244512, 2182850, 2163772, 2159264, 2133358, 2104432, 2105486, 2115138, 2087210, 2033428, 2010688, 2023404, 2005786]
7131B005786q1773q6644j8101M0819L1614j2473l4657k6931j0456M767J0492j0627
7119A811816n4433p9352m9648J8434P0194O2323l509p8505r9893n4157o744l1654
7107A504872j05990j21029j9731J20895J79052J24944K8005m3494p8407r0814
7097A498303q7021p4839o7890o6058n6575m2575m4018n9710n6344j4250L8513
7086I67536O2210N9799O4894Q0844O6470m495r5196j41262j24940r0018q2556
7075G63286r8291r8084o0041j130M7095O9699P2838O5590M5934J0189k5743k9439
7063G61903Q973N0126M2708j0270m8463k8110K5263N5064M2884J6295K532j33
7051I18772j0575m1887q4199j01908o6606m953J5089k9957p7714n9730N952M7694
$$ y = [2005786, 1924013, 1837369, 1819268, 1860087, 1891701, 1879228, 1844571, 1817640, 1807184, 1811951, 1822443, 1811816, 1757383, 1678031, 1628383, 1646817, 1717011, 1779334, 1775825, 1697320, 1597427, 1543270, 1536526, 1504872, 1398882, 1277853, 1258122, 1379017, 1558069, 1683013, 1711018, 1667524, 1589117, 1498303, 1411282, 1336443, 1268553, 1202495, 1145920, 1103345, 1059327, 999617, 943273, 929023, 967536, 1029746, 1089545, 1154439, 1235283, 1301753, 1297258, 1202062, 1060800, 935860, 845842, 763286, 664995, 566911, 506870, 505740, 552835, 622534, 695372, 760962, 806896, 817085, 791342, 761903, 770876, 821002, 863710, 853440, 804977, 776867, 802130, 857194, 900078, 916373, 918905, 918772, 908197, 866310, 782111, 680203, 613597, 608644, 623733, 593776, 516062, 456332, 462284, 509978]
7039E09978M0345J6030n810l0136l4511J5869Q8119R4425J5887n6428m5477J1123
7027F19414L5972K7616L3538N1371L5411j7421n9085o2526m2900j0878L5901P1792
7015G18205N2662j5578o3937m0164K7645O5998L4607m1392j01586j05145o5380
7004D65935k9332k0966k4751l3557p0885j31075j42627n5413O3063R7976M5842
6993A64210J5041N4626P7868M120j04611j25097m1557M8617P5518O5032O6193
6982B99960P8817P5296M8202R490k9878n7764n7443k6915P739J3369j7649o0478
6970B82746p8571n0267J4417P4864Q4250K7095o0530j14071r4836k5289L4317
6959I4125M5313J9754p168j6100q062R635K5606K7626K0396K3431L4184J9088
$$ y = [509978, 550323, 566353, 560543, 530407, 495896, 511765, 599884, 694309, 710196, 653768, 608291, 619414, 655386, 683002, 716540, 767911, 803322, 785901, 726816, 664290, 621390, 610512, 646413, 718205, 770867, 755289, 691352, 651188, 678833, 744831, 779438, 738046, 636460, 531315, 465935, 436603, 415637, 390886, 357329, 286444, 155369, 12742, -42671, 20392, 118368, 164210, 179251, 233877, 311745, 315865, 211254, 86157, 44600, 93217, 168735, 233767, 299960, 378777, 454073, 502275, 511765, 481887, 424123, 366680, 339765, 347504, 360873, 343224, 282746, 204175, 153908, 168325, 243189, 327439, 354534, 294004, 179933, 85097, 59808, 94125, 139438, 159192, 152024, 135924, 127862, 137497, 163103, 190729, 211125, 234556, 268740, 287828]
6947B87828k9501n6742j3158O1203P9901K9832j7359j6036M720J9961N5155J11347
6935E17151J19960L9115o0381q1862l8414k2215o1628r2976p0740k5437J517J0741
6923B34831J0028j2888n1424o1649j7685M6336P7016N8129P795m8653q0383n7856
6911A03597J1069P1983P6908L1565k5978o8689q0796m4786L2828R7409Q9300J3510
6899C07920o2499q3968n7253k0109Q350L2741N5566O8975O9183O1780M7934J7549
6887D46169l3111q2309r5678o2374r773K2239J4713k2537o1886p1753l8327J3960
6875A9333M0479K9605J8474L6223N5656L4336j4823l7544j5678J4539K2900J7920
6863B21420J0670p330l2232l6710j4543J431q480j7321M12K2880J8122m957k1145
$$ y = [287828, 258327, 201585, 188427, 249630, 329531, 359363, 342004, 325968, 330688, 350649, 405804, 517151, 637111, 676226, 615845, 533983, 495569, 473354, 411726, 318750, 248010, 222573, 224090, 234831, 244859, 231971, 180547, 118898, 101213, 147549, 224565, 282694, 290489, 241836, 161453, 103597, 114666, 186649, 263557, 295122, 269144, 200455, 119659, 74873, 107701, 205110, 294410, 307920, 245421, 161453, 104200, 84091, 92441, 125182, 180748, 249723, 318906, 380686, 428620, 446169, 413058, 330749, 235071, 172697, 162924, 185163, 199876, 177339, 115453, 43700, 5373, 19333, 59812, 89417, 107891, 144114, 199770, 234106, 219283, 181739, 166061, 180600, 203500, 221420, 232090, 224760, 192528, 155818, 141275, 142706, 134226, 116905, 117317, 140197, 158319, 153362, 132217]
6850A32217l3790n1648n0198q680L6694L6446J0958K3642P3333Q5041K3176n4688
6838B22503q6078q1636p2885m2020L2670J01352Q8768N272n6081l9793J1449L0256
6826A13777P205k4071m2496m8315m4298l7324l7899l5492n86O2099R4211N9459
6814F6270J1425K7326Q6115Q4845q463r0024n3061O6384J36150R2468l477o3260
6802C52698o5594m4001k9288k7051k5615r730J8683L2803J4672j0266n843J2330
6790B13798o340n9947p6709j3281P5213J05126P0875L3411K4586J8791m327k4433
6778C56763k3927k3627m6336p1826o2719k5057p590l3200o1539m4615J65J2310
6766c1198j8232l0661R410M3007J567p6860q9199j5925N2618N2256K5895L1065
$$ y = [132217, 98427, 46779, -3419, -12099, 24595, 61041, 71999, 95641, 168974, 254015, 277191, 222503, 136425, 54789, -18096, -60116, -27446, 73906, 162674, 167946, 111865, 72072, 83521, 113777, 120982, 96911, 54415, 6100, -38198, -75522, -113421, -148913, -149499, -87400, 6811, 66270, 77695, 105021, 191136, 275981, 267518, 177494, 124433, 190817, 326967, 419435, 415958, 352698, 287104, 243103, 213815, 186764, 161149, 151419, 170102, 202905, 217577, 207311, 201468, 213798, 207458, 147511, 70802, 57521, 132734, 237860, 308735, 342146, 366732, 385523, 381196, 356763, 332836, 309209, 262873, 191047, 128328, 103271, 95681, 62481, 942, -43673, -43508, -31198, -49430, -80091, -70681, -27674, -26107, -102967, -192166, -208091, -155473, -103217, -77322, -46257]
6754d6257M1805N603n4243o6111j4123M7854P1660N3399J2240k1408j2829L4373
6742E1963N8545J0001p5640j20524j00168m5986K0408R0646J28331R9379L6227
6731A53182n6j4391n6267j09854j00112k2880K8522K434l2984R4P4936J11185
6719C3809Q0977J3249n5044q6233n3115J3509M1399J8717J4788N7349P0572R71
6707A50948p5675o2264J0684M4015K3505M661j3046p1892j35712j13328j0109
6696b48213O1124M2565j593q305j189j0773o161L5595O8764M8330N24k7315l1229
6683g7876j8422K7575R2910J02459J2105j07382j45343q2995O794O3547Q3085
6672d3543P7959N5688L1133J3747j1626n3881q0646n6743m408K0036K664j6945
$$ y = [-46257, -4452, 1151, -53092, -119203, -133326, -85472, -13812, 39587, 51827, 30419, 17590, 51963, 110508, 120509, 44869, -75655, -175823, -221809, -201401, -110755, 17576, 116955, 153182, 153126, 138735, 82468, -27386, -127498, -150378, -121856, -119422, -152406, -152312, -77376, 33809, 114786, 128035, 72991, -13242, -66357, -52848, -11449, 7268, 22056, 79405, 149977, 150948, 75273, 13009, 23693, 67708, 91213, 95874, 82828, 10936, -124776, -238104, -248213, -187089, -144524, -146117, -154422, -155611, -166384, -172545, -136950, -68186, -19856, -19332, -46647, -77876, -96298, -68723, 24187, 126646, 138751, 31369, -113974, -196969, -190175, -126628, -43543, 34416, 90104, 121237, 134984, 123358, 69477, -11169, -67912, -72320, -52284, -49620, -66565]
6660f6565o572K5617N5882O6245M3352r157n7150o4302l2586Q776M2670O2616
6648F8826M9157p844o9445p7691l1448R076L853j8565r536L4462P4926P8767M5986
6635A50524L457j7890p787J8116M2087O2562P6768O5559K2887j6734j7112M310
6623C86747J761k5173l2275p013R891o148k4706j6448j264o681j7934r120Q061
6610B59698R760R061L2553O3776N8673J2664l2942n3493o6617q4872q3419l8007
6598H6835L1848Q3099R6446Q0687M2558j9241q8449j25034j01543l7310J8290
6587F8186L4941K1327j021k1273k7669L68N9319R7940O8618J208k0651K9431Q1020
6574C91744O7979K2991J9536N1656M2023l3170r8211q1193q187M3904M9076M0560
$$ y = [-66565, -73137, -47520, 8362, 74607, 117959, 108802, 51652, -12650, -45236, -36460, 6210, 68826, 117983, 110139, 40694, -36997, -68445, -59369, -55516, -74081, -83617, -49155, 25771, 104538, 150524, 153981, 136091, 128304, 146420, 188507, 251069, 327837, 393396, 416283, 399549, 382437, 386747, 388508, 363335, 331060, 324047, 333938, 327790, 303084, 286636, 285372, 278691, 260757, 251637, 259698, 269458, 278519, 311072, 374848, 433521, 446185, 413243, 359750, 293133, 208261, 124842, 86835, 118683, 201782, 298228, 378915, 421473, 402232, 313783, 188749, 87206, 49896, 68186, 103127, 124454, 123433, 102160, 74491, 74859, 134178, 232118, 300736, 301944, 281293, 310724, 391744, 459723, 482714, 502250, 553906, 595929, 562759, 464548, 383355, 375168, 419072, 468148, 508708]
6562E08708M0249L0257n009m6272o0222l4242J3139M3086K3411l5930q0092o5936
6550C31147j7007O864o464n643M4298J04771J13970O6946J1501j8690l0492l8040
6538E63161l8378k4453K705L7782O8110P1279M0461P119P273K7049J9286k1272
6526G60122m2698j1659L8382O1674O4311P7949J00792J07106R3685P4797M9234
6515A373695J6417Q270N2622J13038J21816P5476L9717M6961M7764p858r1279
6504A796639j35807j20159p4258l2102j6065m0511q8790j07156o3958M9K2086
6493A139968K115j2204j3826m4732j04249j16046l0890Q0976R8968J241j07909
6482H93412j25555n9720R340L8638N0756O7651O8260L0391k1453m3500l0624j3544
$$ y = [508708, 548957, 579214, 574205, 527933, 467711, 433469, 446608, 489694, 513105, 477175, 397083, 331147, 314140, 321004, 314540, 308897, 353195, 457966, 571936, 638882, 650383, 631693, 601201, 563161, 524783, 500330, 503035, 540817, 608927, 680206, 720667, 727786, 735059, 762108, 781394, 760122, 717424, 705765, 744147, 805821, 870132, 948081, 1048873, 1155979, 1249664, 1324461, 1373695, 1390112, 1398382, 1451004, 1564042, 1685858, 1761334, 1801051, 1848012, 1895776, 1887918, 1796639, 1660832, 1540673, 1466415, 1434313, 1418248, 1377737, 1288947, 1181791, 1117833, 1117882, 1139968, 1142083, 1129879, 1116053, 1071321, 967072, 851026, 820136, 901112, 1000080, 1001321, 893412, 767857, 708137, 717477, 756115, 806871, 874522, 942782, 973173, 951720, 908220, 877596, 864052]
6470H64052q143m482l475k0566m1813k1713M6958R8992P3478L8l8547j7512O979
6457I34246j1414m6253m7758j6774M709j716r698R223M6096O6224M8676M482m0643
6444I39400p0169p7720n6042n749M4109N0819J0077k7375j4945L0101N4796M4310
6432I21612K9434K6103J4157j3606k8116j5129r631m1297p4844n2614J6367O0461
6420H32897M2221N052N521L7467N3592L7737J9207K3859M4863O4347P4716O8831
6408A310310L5037j9424n8232n2211j6359J1245K0489L2249N0229M1543j7946
6397A336930r9017j41233j12706l5721L8385O9156N3923K9520L8387P9705J05152
6386A362481P7304J7160k7918m6984o2271p1665m0952L2712R1229Q1936K8493
$$ y = [864052, 855909, 851427, 847952, 827386, 785573, 763860, 810818, 909810, 983288, 983326, 944779, 927267, 934246, 922832, 876579, 828821, 812047, 816756, 815040, 805342, 814565, 860661, 926885, 975561, 980043, 939400, 869231, 791511, 735469, 729720, 773829, 824648, 834725, 807350, 792405, 822506, 877302, 921612, 951046, 977149, 991306, 977700, 949584, 934455, 924824, 883527, 808683, 756069, 772436, 832897, 875118, 880170, 885691, 923158, 976750, 1014487, 1033694, 1057553, 1102416, 1166763, 1241479, 1310310, 1345347, 1325923, 1267691, 1215480, 1199121, 1210366, 1230855, 1263104, 1313333, 1354876, 1336930, 1237913, 1096680, 983974, 948253, 986638, 1055794, 1109717, 1139237, 1177624, 1257329, 1362481, 1439785, 1456945, 1429027, 1382043, 1319772, 1248107, 1207155, 1239867, 1331096, 1413032, 1441525]
6375A441525j748J1385K3862K940k3487j5288J5260K4763R115Q779M1520P3346
6363A611972P3911O0833N8143M6561J069m7347m5889n880Q923j6771k8651q69
6351A716005J6688j2004l8628p835M7473N7720K7017J7622M5664O5939N1097J7204
6339B003962k3895o8689q0241j6762Q6254J31928Q1278j832m3204l7514j6274
6328B015011K517O205j5309l7168j6757L3316M7104N988k6196k865L5891L7416
6316B085153J7244J4092K1643K1015K7536M6889L8159j5828n3805k2465L1975
6305B211608L6109O472P525L3424K8701k347q595M986p362k5380J5562R2532J02531
6292B495766K5243l5700j4681K0895l266m3218j6601O2159J09393R1563M5101
$$ y = [1441525, 1439777, 1451162, 1475024, 1477964, 1454477, 1439189, 1454449, 1479212, 1488327, 1497106, 1538626, 1611972, 1685883, 1746716, 1804859, 1851420, 1852489, 1805142, 1759253, 1753373, 1762296, 1745525, 1716874, 1716005, 1732693, 1720689, 1682061, 1674226, 1721699, 1779419, 1806436, 1824058, 1869722, 1935661, 1986758, 2003962, 1980067, 1911378, 1831137, 1814375, 1900629, 2032557, 2113835, 2112003, 2068799, 2031285, 2015011, 2017528, 2023733, 2008424, 1971256, 1954499, 1987815, 2034919, 2040907, 2014711, 2011846, 2047737, 2085153, 2102397, 2116489, 2138132, 2159147, 2186683, 2233572, 2271731, 2255903, 2202098, 2179633, 2211608, 2247717, 2254189, 2261714, 2295138, 2323839, 2321492, 2312897, 2317883, 2310521, 2285141, 2300703, 2393235, 2495766, 2521009, 2485309, 2470628, 2491523, 2488257, 2445039, 2428438, 2490597, 2599990, 2691553, 2736654]
6281B736654O519j5584j8591o534J75j0298k2450k0725q956J3394N4840R1993
6269B800437P5466N833m6543l4370M105J7666K2934N5777Q8924O8508O109l1703
6257C033143j1027M6188J08857J52557J46022Q0782P369j0214K7196O4042O7127
6246C712042M5882R248m1144p7145n8856P577O9471R1325Q3140O6284N1115M8024
6234D006963N9064N7934K0991k0987j0082N2191R5386P4932L1211K7374O4320
6223D459297R0719P6271M3873L5231O3492R9635J01428O0675J7246J3641M2299
6212E103807N8699M3035K2850L0193O0753Q7000R5296R5708J00275J01024P6122
6201E874762K3797j6335K889P5996J43014J59557J42682J30808J29350J23282
$$ y = [2736654, 2743173, 2727589, 2708998, 2702464, 2702639, 2692341, 2669891, 2649166, 2640210, 2653604, 2708444, 2800437, 2875903, 2881736, 2835193, 2800823, 2804928, 2822594, 2845528, 2901305, 2990229, 3058737, 3064846, 3033143, 3022116, 3068304, 3177161, 3329718, 3475740, 3556522, 3563891, 3553677, 3580873, 3644915, 3712042, 3757924, 3767172, 3726028, 3648883, 3590027, 3597604, 3667075, 3758400, 3841540, 3907824, 3958939, 4006963, 4066027, 4123961, 4144952, 4123965, 4113883, 4166074, 4261460, 4336392, 4367603, 4394977, 4459297, 4550016, 4626287, 4670160, 4705391, 4768883, 4868518, 4969946, 5030621, 5047867, 5061508, 5103807, 5162506, 5205541, 5228391, 5258584, 5319337, 5406337, 5501633, 5597341, 5697616, 5798640, 5874762, 5898559, 5882224, 5885113, 5961109, 6104123, 6263680, 6406362, 6537170, 6666520, 6789802]
6191F789802J14347J08984R1212M8664J2046K7496R4213J63200J94508J87906
6181G832378J63546J40504J31180J35511J44209J55978J74473J84414J65848J41500
6171I369541J59901K11794K26364J85686J69638K29498K91920K71027K10256K10494
6161A1536119K67054K92755K70763K63961K88059K96136K86973L10881L61924
6152A4174625L80291L72604M11673M98320N43444N15415M87694N06615N29783
6143A8420464N33564N58627N99324N71905M56847L58155L52600L89385M07395
6134B2648266M37496N09369N69609N81700O02105O66106P04889O75048O62730
6125B8057318P46248Q55233Q88126Q78238R13980R76239R90548R73072R92333
$$ y = [6789802, 6904149, 7013133, 7104345, 7153009, 7165055, 7192551, 7286764, 7449964, 7644472, 7832378, 7995924, 8136428, 8267608, 8403119, 8547328, 8703306, 8877779, 9062193, 9228041, 9369541, 9529442, 9741236, 9967600, 10153286, 10322924, 10552422, 10844342, 11115369, 11325625, 11536119, 11803173, 12095928, 12366691, 12630652, 12918711, 13214847, 13501820, 13812701, 14174625, 14554916, 14927520, 15339193, 15837513, 16380957, 16896372, 17384066, 17890681, 18420464, 18954028, 19512655, 20111979, 20683884, 21140731, 21498886, 21851486, 22240871, 22648266, 23085762, 23595131, 24164740, 24746440, 25348545, 26014651, 26719540, 27394588, 28057318, 28803566, 29658799, 30546925, 31425163, 32339143, 33315382, 34305930, 35279002, 36271335]
6116C6271335J044920J094093J170928J311218J451516J515050J544511J627657
6108D7031228J753552J865372J983492K142653K280529K329872K349135K421587
6100F4157420K509965K560859K652193K862024L093589L226923L343555L589836
6092H7996364L927161M256372M675025N336274O160572O988257P896674R010350
6084A36247049J0121778J0938001J1601242J2421856J3115718J2938162J1697056
6077B19080862J0013998Q407274O804563N236543M176780L579297K295244o60766
6069B58933795m651060q076863j0226328j1569363j2402692j2298054j1107048
6062A88602387r560821q407711p625504o932890o478754o478233o610796o369110
$$ y = [36271335, 37316255, 38410348, 39581276, 40892494, 42344010, 43859060, 45403571, 47031228, 48784780, 50650152, 52633644, 54776297, 57056826, 59386698, 61735833, 64157420, 66667385, 69228244, 71880437, 74742461, 77836050, 81062973, 84406528, 87996364, 91923525, 96179897, 100854922, 106191196, 112351768, 119340025, 127236699, 136247049, 146368827, 157306828, 168908070, 181329926, 194445644, 207383806, 219080862, 229094860, 237502134, 244306697, 249543240, 253720020, 257299317, 259594561, 258933795, 254282735, 246205872, 235979544, 224410181, 212007489, 199709435, 188602387, 179041566, 170633855, 163008351, 156075461, 149596707, 143118474, 136507678, 130138568]
6054A30138568n761918n184713m782120m385869l947211l603156l373405l147886
6046I5952290k937888k837628k777973k599651k337564k170413k115343k021536
6038G6154294j847999j708751j648554j598628j558311j607934j725307j782609
6030F2676201j747333j715071j727796j720818j660983j584392j490752j347698
6022D9681358j198799j120629j081469r94332q93060q85718r42909r19784q00811
6013D0843847p33965p89567q67290q86342q88911q97795q45782p20665o22029
6004C3591501n96559n66459m95988m72704n34086n69996n07548m46869m85714
5995B8915578n41849m95947m00563l85789m36608m29294l44386k87999l15987
$$ y = [130138568, 124376650, 119191937, 114409817, 110023948, 106076737, 102473581, 99100176, 95952290, 93014402, 90176774, 87398801, 84799150, 82461586, 80291173, 78175830, 76154294, 74306295, 72597544, 70948990, 69350362, 67792051, 66184117, 64458810, 62676201, 60928868, 59213797, 57486001, 55765183, 54104200, 52519808, 51029056, 49681358, 48482559, 47361930, 46280461, 45286129, 44393069, 43507351, 42564442, 41644658, 40843847, 40109882, 39320315, 38453025, 37566683, 36677772, 35779977, 34934195, 34213530, 33591501, 32994942, 32428483, 31932495, 31459791, 30925705, 30355709, 29848161, 29401292, 28915578, 28373729, 27877782, 27477219, 27091430, 26654822, 26225528, 25881142, 25593143, 25277156]
5986B5277156l69277l85986l70322l42859l08265k78916k66222k55093k40201
5977B2460015k60204l33198l92979l67480k94070k72500l19904l60157l52621
5968A9506902l42379l68065l98983l94944l69744l58054l56095l30942k74934
5959A6312762k26688k31168k78358k94565k23066j11369p3024j47848k50750k87041
5949A4188885k63388k40078k27374j95476j53197j44408j76963k13242k27857
5940A2346902k29498k30487k31482k29463k15166j80725j50597j68957k26663
5931A0483864k47639j92678j28031j32221j80387j92518j57888j29736j23673
5922H999093j09704r1136j01970j26297j05691l7017J2830K063m4841r8966j56906
$$ y = [25277156, 24907879, 24521893, 24151571, 23808712, 23500447, 23221531, 22955309, 22700216, 22460015, 22199811, 21866613, 21473634, 21106154, 20812084, 20539584, 20219680, 19859523, 19506902, 19164523, 18796458, 18397475, 18002531, 17632787, 17274733, 16918638, 16587696, 16312762, 16086074, 15854906, 15576548, 15281983, 15058917, 14947548, 14874524, 14726676, 14475926, 14188885, 13925497, 13685419, 13458045, 13262569, 13109372, 12964964, 12788001, 12574759, 12346902, 12117404, 11886917, 11655435, 11425972, 11210806, 11030081, 10879484, 10710527, 10483864, 10236225, 10043547, 9915516, 9783295, 9602908, 9410390, 9252502, 9122766, 8999093, 8889389, 8798253, 8696283, 8569986, 8464295, 8427278, 8440108, 8442171, 8397330, 8298364, 8141458]
5911H141458j96717j79875j20520q4720r6485j09804r7498r6728j31414j57686
5901F870011j33536q6683o3873o0239m9780m4140o4295q3197n5875M129K9030
5890F261552j8677j00424j50157j49828j42889j71107k07672j79984p2544K9279
5880E097549L9814j1467k6128J8148M5536R437m1312n2721m7164o7093r5839r0735
5868D778025n7347l9599n9794j05383j50556j61762j12260k2071M5834N6369L7482
5857D208938K1787k607m9235q6968q2989n6433m3031l8915k7506l0086p2070j19343
5845C621542j07546l0933M4752N8512R063o2750j15376j30719j16620q5236l2417
5834C052272L5890O5288Q03j11894j46694o1331L0080J2343o9491r0027l2346
$$ y = [8141458, 7944741, 7764866, 7644346, 7559626, 7463141, 7353337, 7255839, 7159111, 7027697, 6870011, 6736475, 6649792, 6585919, 6525680, 6475900, 6431760, 6367465, 6284268, 6228393, 6232522, 6261552, 6242875, 6142451, 5992294, 5842466, 5699577, 5528470, 5320798, 5140814, 5068270, 5097549, 5137363, 5125896, 5099768, 5117916, 5163452, 5172889, 5131577, 5078856, 5031692, 4964599, 4868760, 4778025, 4720678, 4681079, 4621285, 4515902, 4365346, 4203584, 4091324, 4069253, 4115087, 4171456, 4208938, 4230725, 4228118, 4178883, 4091915, 4008926, 3952493, 3909462, 3870547, 3843041, 3812955, 3740885, 3621542, 3513996, 3483063, 3527815, 3586327, 3595390, 3532640, 3417264, 3286545, 3169925, 3084689, 3052272, 3088162, 3153450, 3154253, 3042359, 2895665, 2834334, 2864414, 2876757, 2807266, 2717239, 2684893]
5823B684893Q861j2547m1975l5384k1521k9779l9865l5134l7934n8246o2249k4274
5811B294846L2136O7566O4106J9468n1885j03473r2652m3182k1906m3677n6652
5800B064695l4710j7188k9463l2466K756K7428j8173j05357j43698r2505N12O4759
5788A686590P3610M6106J0442k2993n7045q2795p6813l8663r140j7465k8985O963
5776A489812O9107Q3272K9357l2273m8927k7343J2396O2343Q5326K7113q9861
5765A660322j56923j14514l4474j2485l9420m4848j5247O872N095k859j3751l0508
5753A207260k9551K129K3672k250l6547j9213K6405K4772k9655o5455n0133l0231
5741A021203m1262n4267l9634j9310j9408k0324P185M7801N6900J5135m8908q1671
$$ y = [2684893, 2693754, 2681207, 2639232, 2603848, 2582327, 2552548, 2512683, 2477549, 2439615, 2381369, 2319120, 2294846, 2326982, 2394548, 2458654, 2478122, 2426237, 2322764, 2230112, 2186930, 2165024, 2121347, 2064695, 2029985, 2012797, 1983334, 1950868, 1953624, 1981052, 1962879, 1857522, 1713824, 1621319, 1621831, 1686590, 1760200, 1806306, 1816748, 1793755, 1736710, 1653915, 1577102, 1538439, 1529299, 1511834, 1482849, 1489812, 1558919, 1642191, 1671548, 1639275, 1590348, 1563005, 1575401, 1637744, 1723070, 1750183, 1660322, 1503399, 1388885, 1354411, 1341926, 1302506, 1257658, 1242411, 1249283, 1254378, 1251519, 1237768, 1207260, 1177709, 1179838, 1203510, 1201260, 1164713, 1145500, 1171905, 1196677, 1167022, 1101567, 1051434, 1021203, 979941, 925674, 886040, 866730, 847322, 826998, 834183, 881984, 938884, 954019, 905111, 823440]
5729H23440n1767J1927M2558J6313j3829J527K8048L449n4437o9545k6616J3020
5717G24088J9977L7020Q5519J09183N5392m2729j09544j13235p6040l4348j6042
5706F39241k4269k4043J9836Q0214Q8665L1243l1309n5826o6486q6581q8320n1817
5694D30548j2422m58J1230M8946Q0209O8385L5198J2892j3747n5888o7669k1359
5682E15865J6539k2749q2638n2884N1580J00100M0976k7137j1903M4731N1587
5671F24067O286j9750P811N0354N4391P767n2348p0915l1011J7189J1577l6722
5659E68696n5397j6517K0606l543o4311r1604o1757j3817Q633K663R63L5858R8688
5646D29161J35189J03517L3459o298K515J7512J7950L6556Q7158J23468J11515
$$ y = [823440, 771673, 783600, 826158, 842471, 828642, 830169, 858217, 861666, 807229, 737684, 711068, 724088, 744065, 781085, 866604, 975787, 1031179, 988450, 878906, 765671, 689631, 655283, 639241, 614972, 590929, 610765, 690979, 779644, 810887, 779578, 723752, 657266, 570685, 482365, 430548, 418126, 417668, 428898, 477844, 558053, 626438, 661636, 674528, 660781, 604893, 537224, 515865, 532404, 509655, 427017, 374133, 425713, 525813, 566789, 539652, 527749, 572480, 624067, 630353, 610603, 618414, 668768, 723159, 730926, 678578, 607663, 576652, 593841, 605418, 568696, 513299, 496782, 517388, 513845, 449534, 357930, 296173, 282356, 290989, 293652, 294615, 330473, 429161, 564350, 667867, 701326, 695028, 697543, 715055, 733005, 769561, 856719, 980187, 1091702]
5635A091702Q9731J03657J23378Q7889M494n8506o4418l7134o215K1437L4482
5624A390497J2109m2794r9037j30061j26144q3847j8468K3535P879l5969m8961
5613H48739k3279j906k555j416N42l7539j16859j63849j18749j8041N5346P0922
5601D91356N6789L8266K1043J5731K7084K7241j3069p0857r4341p9721p5678j01279
$$ y = [1091702, 1181433, 1285090, 1408468, 1496357, 1500851, 1442345, 1377927, 1340793, 1334578, 1356015, 1390497, 1402606, 1359812, 1260775, 1130714, 1004570, 920723, 902255, 925790, 933669, 897700, 848739, 825460, 823554, 820999, 819583, 820125, 782586, 665727, 501878, 383129, 365088, 420434, 491356, 548145, 586411, 607454, 623185, 650269, 677510, 664441, 593584, 499243, 419522, 343844, 242565]
$$ [...]
##END NTUPLES=NMR SPECTRUM
##END=
