##TITLE=1H ikalashn
EC-331(II-1)x3
18.9.2024
##JCAMPDX= 6.0         $$ Bruker NMR JCAMP-DX V2.0
##DATA TYPE= NMR SPECTRUM
##DATA CLASS= NTUPLES
##ORIGIN= UXNMR, Bruker Analytische Messtechnik GmbH
##OWNER= root
$$ TOPSPIN		Version 1.3
$$ 2024-09-18 08:42:46.625 +0400  Irina@DPX200
$$ Compression mode = diff/dup
##.OBSERVE FREQUENCY= 200.131392401
##.OBSERVE NUCLEUS= ^1H
##.ACQUISITION MODE= SIMULTANEOUS
##.ACQUISITION SCHEME= undefined
##.AVERAGES= 32
##.DIGITISER RES= 18
##SPECTROMETER/DATA SYSTEM= spect
##.PULSE SEQUENCE= zg
##.SOLVENT NAME= CDCl3
##.SHIFT REFERENCE= INTERNAL, CDCl3, 1, 17.95386
##AUDIT TRAIL= $$ (NUMBER, WHEN, WHO, WHERE, WHAT)
$$ ##TITLE= Audit trail, TOPSPIN		Version 1.3
$$ ##JCAMPDX= 5.01
$$ ##ORIGIN= Bruker BioSpin GmbH
$$ ##OWNER= Irina
$$ $$ F:/spectra/data/iren/nmr/1H/4/pdata/1/auditp.txt
$$ ##AUDIT TRAIL=  $$ (NUMBER, WHEN, WHO, WHERE, VERSION, WHAT)
(   1,<2024-09-18 08:41:16.921 +0400>,<Irina>,<DPX200>,<TOPSPIN 1.3>,
      <created by zg
	started at 2024-09-18 08:39:08.968 +0400,
	POWCHK disabled, PULCHK disabled
       configuration hash MD5:
       BE 6D 3F 07 2A EA 11 49 91 17 2B D3 AF B3 58 0D
       data hash MD5: 16K
       22 73 4C 48 B0 55 95 3E 3B 07 6E A8 F2 D7 EB 11>)
(   2,<2024-09-18 08:42:32.031 +0400>,<Irina>,<DPX200>,<TOPSPIN 1.3>,
      <Start of raw data processing
       efp BC_mod = 2 LB = 0.02 FT_mod = 6 PKNL = 1 PHC0 = -52.44849 PHC1 = 4.053818 SI = 32K 
       data hash MD5: 32K
       C7 70 CF 32 88 66 93 13 0F A2 67 49 82 E7 CC 46>)
(   3,<2024-09-18 08:42:34.062 +0400>,<Irina>,<DPX200>,<TOPSPIN 1.3>,
      <apk 
       data hash MD5: 32K
       A4 A1 B1 58 79 6F 32 32 DB 87 4A 8B B3 80 E0 62>)
(   4,<2024-09-18 08:42:36.796 +0400>,<Irina>,<DPX200>,<TOPSPIN 1.3>,
      <abs n ABSG = 5 
       data hash MD5: 32K
       DE 5A 8F 37 CC 88 DE B8 FF 57 56 2F 37 81 50 69>)
$$ ##END=
$$ 
$$ $$ hash MD5
$$ $$ 4E 82 33 FE 34 38 6A 99 C0 34 6A 06 EF 28 75 5C
##$RELAX= 
##$RELAX= 
##$RELAX= 
##$RELAX= 
##$RELAX= 
##$RELAX= 
##$RELAX= 
##$RELAX= 
##$RELAX= 
$$ Bruker specific parameters
$$ --------------------------
##$DU= <F:/spectra>
##$EXPNO= 4
##$NAME= <1H>
##$PROCNO= 1
##$TYPE= <nmr>
##$USER= <iren>
##$AMP= (0..31)
100 100 100 100 100 100 100 100 100 100 100 100 100 100 100 100 100 100 
100 100 100 100 100 100 100 100 100 100 100 100 100 100 
##$ANAVPT= -1
##$AQSEQ= 0
##$AQ_mod= 1
##$AUNM= <au_zg>
##$AUTOPOS= <>
##$BF1= 200.13
##$BF2= 200.13
##$BF3= 200.13
##$BF4= 200.13
##$BF5= 200.13
##$BF6= 200.13
##$BF7= 200.13
##$BF8= 200.13
##$BYTORDA= 1
##$CFDGTYP= 0
##$CFRGTYP= 5
##$CHEMSTR= <none>
##$CNST= (0..63)
1 1 145 1 1 1 1 1 1 1 1 1 1 1 1 1 1 1 1 1 1 1 1 1 1 1 1 1 1 1 1 1 1 1 
1 1 1 1 1 1 1 1 1 1 1 1 1 1 1 1 1 1 1 1 1 1 1 1 1 1 1 1 1 1 
##$CPDPRG= <>
##$CPDPRG1= <>
##$CPDPRG2= <>
##$CPDPRG3= <>
##$CPDPRG4= <mlev>
##$CPDPRG5= <mlev>
##$CPDPRG6= <mlev>
##$CPDPRG7= <mlev>
##$CPDPRG8= <mlev>
##$CPDPRGB= <>
##$CPDPRGT= <>
##$D= (0..63)
$$ [...]
##$SW_h= 4401.40845070422
##$TD= 16384
##$TD0= 1
##$TE= 300
##$TE2= 300
##$TE3= 300
##$TEG= 300
##$TL= (0..7)
0 120 120 120 120 120 120 120 
##$TP= (0..7)
150 150 150 150 150 150 150 150 
##$TP07= 0
##$TPNAME0= <>
##$TPNAME1= <>
##$TPNAME2= <>
##$TPNAME3= <>
##$TPNAME4= <>
##$TPNAME5= <>
##$TPNAME6= <>
##$TPNAME7= <>
##$TPOAL= (0..7)
0.5 0.5 0.5 0.5 0.5 0.5 0.5 0.5 
##$TPOFFS= (0..7)
0 0 0 0 0 0 0 0 
##$TUNHIN= 0
##$TUNHOUT= 0
##$TUNXOUT= 0
##$USERA1= <user>
##$USERA2= <user>
##$USERA3= <user>
##$USERA4= <user>
##$USERA5= <user>
##$V9= 5
##$VALIST= <valist>
##$VCLIST= <CCCCCCCCCCCCCCC>
##$VD= 0
##$VDLIST= <DDDDDDDDDDDDDDD>
##$VPLIST= <PPPPPPPPPPPPPPP>
##$VTLIST= <TTTTTTTTTTTTTTT>
##$WBST= 1024
##$WBSW= 25
##$XGAIN= (0..3)
0 0 0 0 
##$XL= 0
##$YL= 0
##$YMAX_a= 962505
##$YMIN_a= -633794
##$ZGOPTNS= <>
##$ZL1= 120
##$ZL2= 120
##$ZL3= 120
##$ZL4= 120
##$ABSF1= 17.95386
##$ABSF2= -4.038887
##$ABSG= 5
##$ABSL= 3
##$ALPHA= 0
##$AQORDER= 0
##$ASSFAC= 0
##$ASSFACI= 0
##$ASSFACX= 0
##$ASSWID= 0
##$AUNMP= <proc_1d>
##$AXLEFT= 0
##$AXRIGHT= 0
##$AXTYPE= 0
##$AXUNIT= <>
##$AZFE= 0.1
##$AZFW= 0.1
##$BCFW= 0
##$BC_mod= 2
##$BYTORDP= 0
##$COROFFS= 0
##$CY= 7568.61572265625
##$DATMOD= 1
##$DC= 0
##$DFILT= <>
##$DTYPP= 0
##$F1P= 17.9538593292236
##$F2P= -4.03888763876832
##$FCOR= 0.5
##$FTSIZE= 32768
##$FT_mod= 6
##$GAMMA= 0
##$GB= 0
##$INTBC= 0
##$INTSCL= 1.483618e-010
##$ISEN= 128
##$LB= 0.02
##$LEV0= 0
##$LPBIN= 0
##$MAXI= 945.577
##$MC2= 0
##$MEAN= 0
##$ME_mod= 0
##$MI= -402.1523
##$NCOEF= 0
##$NC_proc= -6
##$NLEV= 6
##$NOISF1= 8.587773
##$NOISF2= 6.764455
##$NSP= 0
##$NTH_PI= 0
##$NZP= 0
##$OFFSET= 17.95386
##$PC= 1
##$PHC0= 106.1883
##$PHC1= 3.555002
##$PH_mod= 1
##$PKNL= yes
##$PPARMOD= 0
##$PPDIAG= 0
##$PPIPTYP= 0
##$PPMPNUM= 100
##$PPRESOL= 1
##$PSCAL= 0
##$PSIGN= 0
##$REVERSE= no
##$SF= 200.13
##$SI= 32768
##$SIGF1= 16.12182
##$SIGF2= -4.496377
##$SINO= 3.521527
##$SIOLD= 32768
##$SREGLST= <1H.CDCl3>
##$SSB= 0
##$STSI= 32768
##$STSR= 0
##$SW_p= 4401.40845070423
##$SYMM= 0
##$S_DEV= 0
##$TDeff= 16384
##$TDoff= 0
##$TI= <>
##$TILT= no
##$TM1= 0
##$TM2= 0
##$TOPLEV= 0
##$USERP1= <user>
##$USERP2= <user>
##$USERP3= <user>
##$USERP4= <user>
##$USERP5= <user>
##$WDW= 1
##$XDIM= 32768
##$YMAX_p= 421301523
##$YMIN_p= -941216
$$ End of Bruker specific parameters
$$ ---------------------------------
##NTUPLES= NMR SPECTRUM
##VAR_NAME=  FREQUENCY,     SPECTRUM/REAL,   SPECTRUM/IMAG
##SYMBOL=    X,             R,               I
##VAR_TYPE=  INDEPENDENT,   DEPENDENT,       DEPENDENT
##VAR_FORM=  AFFN,          ASDF,            ASDF
##VAR_DIM=   32768,         32768,           32768
##UNITS=     HZ,            ARBITRARY UNITS, ARBITRARY UNITS
##FACTOR=    0.134324425510551, 1,           1
##FIRST=     4401.40845070423, -475478,      -2408423
##LAST=      0,             164882,          -2757105
##MIN=       0,             -941216,         0
##MAX=       4401.40845070423, 421301523,    0
$$ Real data points
##PAGE= N=1
##DATA TABLE= (X++(R..R)), XYDATA
$$ [...]
$$ plain form
11221 17357580 17506111 17729542 17818798 17700546 17509167 17399210 17418492 17567730 17802610 17955967
11211 17955967 17865942 17629623 17523106 17619961 17710384 17651282 17543902 17489577 17449318 17450583 17619879
11200 17619879 17848391 17757951 17247336 16774131 16785571 17114891 17278318 17157828 17010076 16960068
11190 16960068 16908963 16872371 16989532 17178942 17155863 16863253 16583466 16547259 16688412 16843183
11180 16843183 16944096 16952248 16828434 16639836 16498744 16364106 16112491 15814332 15689867 15760827
11170 15760827 15811082 15741406 15683075 15690977 15629740 15479431 15442724 15580619 15639670 15456646 15258709
11159 15258709 15297753 15430082 15374571 15197046 15173666 15281611 15218108 14932565 14772493 14974867
11149 14974867 15284794 15275237 14906368 14576922 14637890 14980332 15168636 14957662 14585506 14464684
$$ packed form
11221A7357580J48531K23431Q9256j18252j91379j09957J9282J49238K34880J53357
11211A7955967r0025k36319j06517R6855R0423n9102j07380n4325m0259J265J69296
11200A7619879K28512r0440n10615m73205J1440L29320J63427j20490j47752n0008
11190A6960068n1105l6592J17161J89410k3079k92610k79787l6207J41153J54771
11180A6843183J00913Q152j23814j88598j41092j34638k51615k98159j24465P0960
11170A5760827N0255o9676n8331P902o1237j50309l6707J37895N9051j83024j97937
11159A5258709L9044J32329n5511j77525k3380J07945o3503k85543j60072K02374
11149A4974867L09927r557l68869l29446O0968L42442J88304k10974l72156j20822
$$ plain form
11139 14464684 14647089 14789297 14674884 14514729 14562465 14664687 14494896 14116571 13954127
11130 13954127 14182368 14482873 14537083 14471570 14580151 14796332 14753429 14344094 13943656 13970426
11120 13970426 14392310 14813974 14957186 14879619 14740891 14561889 14322477 14146386 14198010 14432977
11110 14432977 14618746 14607772 14448331 14227265 13976831 13769529 13714951 13780925 13791313 13700425
11100 13700425 13689880 13861902 14025401 13979389 13849379 13897887 14102867 14192238 14060901 13893799
11090 13893799 13858853 13914798 13978856 14073482 14208652 14276903 14182381 13989978 13865148 13908059
11080 13908059 14069802 14185652 14110544 13895103 13789676 13969372 14289720 14441075 14324980
11071 14324980 14143252 14117128 14246526 14362413 14323764 14162318 14083509 14254353 14534337 14573195
$$ packed form
11139A4464684J82405J42208j14413j60155M7736J02222j69791l78325j62444
11130A3954127K28241L00505N4210o5513J08581K16181m2903m09335m00438K6770
11120A3970426M21884M21664J43212p7567j38728j79002k39412j76091N1624K34967
11110A4432977J85769j0974j59441k21066k50434k07302n4578O5974J0388r0888
11100A3700425j0545J72022J63499m6012j30010M8508K04980Q9371j31337j67102
11090A3893799l4946N5945O4058R4626J35170O8251r4522j92403j24830M2911
11080A3908059J61743J15850p5108k15441j05427J79696L20348J51355j16095
11071A4324980j81728k6124J29398J15887l8649j61446p8809J70844K79984L8858
$$ plain form
11061 14573195 14297210 14078680 14195245 14370467 14226253 13981521 14169658 14737292 15045202
11052 15045202 14860379 14707539 14970140 15251916 15074080 14712740 14779065 15289784 15732806
11043 15732806 15857433 15840800 15793249 15662959 15606847 15916509 16501531 16905830 16940249 16890342
11033 16890342 16985600 17065155 16936588 16711489 16576632 16508364 16412422 16323455 16288165 16233256
11023 16233256 16094054 15921758 15775091 15666392 15648724 15746246 15787903 15588555 15319044 15350813
11013 15350813 15663383 15808013 15601830 15416109 15534126 15679339 15553531 15432417 15726763
11004 15726763 16245916 16460262 16327876 16285597 16482487 16604310 16517775 16539780 16886777 17311859
10994 17311859 17528979 17637639 17868673 18198556 18488475 18791446 19256082 19864661 20482115
$$ packed form
11061A4573195k75985k18530J16565J75222j44214k44732J88137N67634L07910
11052A5045202j84823j52840K62601K81776j77836l61340O6325N10719M43022
11043A5732806J24627j6633m7551j30290n6112L09662N85022M04299L4419m9907
11033A6890342R5258P9555j28567k25099j34857o8268r5942q8967l5290n4909
11023A6233256j39202j72296j46667j08699j7668R7522M1657j99348k69511L1769
11013A5350813L12570J44630k06183j85721J18017J45213j25808j21114K94346
11004A5726763N19153K14346j32386m2279J96890J21823q6535K2005L46997M25082
10994A7311859K17120J08660K31034L29883K89919L02971M64636O08579O17454
$$ plain form
10985 20482115 21053606 21582553 22030720 22397560 22774997 23165014 23367435 23217851 22823292
10976 22823292 22392839 21957055 21455817 20990765 20731895 20609760 20354717 19872414 19367386
10967 19367386 19038882 18844573 18647240 18423331 18206088 17957959 17654940 17420144 17404941
10958 17404941 17547082 17597253 17427681 17195112 17122874 17216694 17308640 17321069 17335868 17406710
10948 17406710 17470207 17501044 17594406 17783926 17923567 17910454 17904928 18125629 18513443 18839905
10938 18839905 19094265 19474453 19995435 20441468 20790568 21328179 22143263 22841996 23066464
10929 23066464 23049835 23291836 23836477 24250188 24234071 23879164 23352204 22734767 22212823 22010446
10919 22010446 21998947 21741250 21109048 20510672 20272295 20134865 19701516 19105656 18802356
$$ packed form
10985B0482115N71491N28947M48167L66840L77437L90017K02421j49584l94559
10976B2823292m30453m35784n01238m65052k58870j22135k55043m82303n05028
10967A9367386l28504j94309j97333k23909k17243k48129l03019k34796j5203
10958A7404941J42141N0171j69572k32569p2238R3820R1946J2429J4799P0842
10948A7406710O3497L0837R3362J89520J39641j3113n526K20701L87814L26462
10938A8839905K54360L80188N20982M46033L49100N37611Q15084O98733K24468
10929B3066464j6629K42001N44641M13711j6117l54907n26960o17437n21944k02377
10919B2010446j1499k57697o32202n98376k38377j37430m33349n95860l03300
$$ plain form
10910 18802356 18847847 18849656 18612965 18393664 18414331 18515982 18475433 18363173 18344462 18336493 18130774
10899 18130774 17755240 17484007 17511389 17766569 18028296 18119173 18030603 17938614 18025342 18217091
10889 18217091 18235511 18025996 17948719 18306957 18833396 18993777 18767228 18719322 19179748 19737236
10879 19737236 19833091 19571150 19545835 19988364 20498228 20658540 20549646 20486822 20521602 20460068
10869 20460068 20249129 20082140 20107445 20216269 20202413 20040379 19908060 19948818 20096529 20188850
10859 20188850 20203689 20271507 20433535 20527771 20430463 20305145 20426389 20791714 21115463 21230119
10849 21230119 21272825 21383176 21433705 21246042 20937820 20836970 21088296 21506142 21798435 21817031
10839 21817031 21631280 21484871 21631633 22065636 22454348 22502961 22349272 22399853 22782813 23199206
$$ packed form
10910A8802356M5491J809k36691k19301K0667J01651m0549j12260j8711p969k05719
10899A8130774l75534k71233K7382K55180K61727R0877q8570r1989Q6728J91749
10889A8217091J8420k09515p7277L58238N26439J60381k26549m7906M60426N57488
10879A9737236R5855k61941k5315M42529N09864J60312j08894o2824L4780o1534
10869B0460068k10939j66989K5305J08824j3856j62034j32319M0758J47711R2321
10859B0188850J4839O7818J62028R4236r7308j25318J21244L65325L23749J14656
10849B1230119M2706J10351N0529j87663l08222j00850K51326M17846K92293J8596
10839B1817031j85751j46409J46762M34003L88712M8613j53689N0581L82960M16393
$$ plain form
10829 23199206 23374950 23415193 23563751 23808833 23944471 23924236 23935984 24135522 24469856 24788669
10819 24788669 25018571 25197523 25408796 25698368 26017432 26267045 26446659 26708392 27175241
10810 27175241 27738845 28152431 28330906 28451313 28722380 29146568 29562667 29850350 30025029
10801 30025029 30179178 30403823 30745770 31171937 31575510 31876858 32131667 32486098 32996992
10792 32996992 33541400 33948045 34190095 34400283 34716724 35166023 35672725 36108047 36352143
10783 36352143 36427744 36584759 37096584 37892429 38546343 38774521 38810159 39086078 39652611 40182640
10773 40182640 40517333 40876156 41439597 42040890 42470137 42837249 43369012 44007803 44503100
10764 44503100 44825153 45201884 45743973 46282149 46633403 46845972 47118098 47599926 48297005
$$ packed form
10829B3199206J75744M0243J48558K45082J35638k0235J1748J99538L34334L18813
10819B4788669K29902J78952K11273K89572L19064K49613J79614K61733M66849
10810B7175241N63604M13586J78475J20407K71067M24188M16099K87683J74679
10801C0025029J54149K24645L41947M26167M03573L01348K54809L54431N10894
10792C2996992N44408M06645K42050K10188L16441M49299N06702M35322K44096
10783C6352143P5601J57015N11825P95845O53914K28178L5638K75919N66533N30029
10773D0182640L34693L58823N63441O01293M29247L67112N31763O38791M95297
10764D4503100L22053L76731N42089N38176L51254K12569K72126M81828O97079
$$ plain form
10755 48297005 49047767 49610017 49925462 50281935 51015037 52036686 52888937 53325549 53595218
10746 53595218 54027033 54583988 55043542 55432033 55986809 56746659 57451373 57887004 58141003
10737 58141003 58458111 58980940 59682315 60431386 61059458 61450602 61643844 61806457 62067003
10728 62067003 62410078 62751134 63057388 63360527 63698628 64091815 64544879 65021374 65420529
10719 65420529 65634983 65672785 65707451 65944936 66395095 66809299 66922536 66764967 66655646 66853415
10709 66853415 67286219 67677646 67866530 67913716 67945049 68007409 68081099 68130782 68114831 68028249
10699 68028249 67973559 68098623 68383816 68559122 68365484 67904937 67591944 67669944 67884562 67796089
10689 67796089 67368460 67023599 67049904 67199831 67073895 66718909 66528084 66603678 66581630 66182596
$$ packed form
10755D8297005P50762N62250L15445L56473P33102J021649Q52251M36612K69669
10746E3595218M31815N56955M59554L88491N54776P59850P04714M35631K53999
10737E8141003L17108N22829P01375P49071O28072L91144J93242J62613K60546
10728F2067003L43075L41056L06254L03139L38101L93187M53064M76495L99155
10719F5420529K14454L7802L4666K37485M50159M14204J13237j57569j09321J97769
10709F6853415M32804L91427J88884M7186L1333O2360P3690M9683j5951q6582
10699F8028249n4690J25064K85193J75306j93638m60547l12993P8000K14618q8473
10689F7796089m27629l44861K6305J49927j25936l54986j90825P5594k2048l99034
$$ plain form
10679 66182596 65613497 65220512 64991718 64670449 64202712 63778647 63493939 63237376 62908567
10670 62908567 62521292 62075909 61531012 60934937 60414623 60002765 59621540 59237952 58870462
10661 58870462 58452391 57893384 57289076 56838084 56503149 56007950 55270139 54577585 54165857
10652 54165857 53852364 53318692 52580863 51917143 51438714 51001467 50496929 49974673 49466304
10643 49466304 48905638 48266613 47617427 47008221 46445078 45977083 45644421 45322676 44795531
10634 44795531 44033725 43245316 42592894 42017678 41414839 40821212 40321725 39905760 39532996
10625 39532996 39214582 38897156 38396528 37629490 36822886 36280745 35979387 35613373 35051664
10616 35051664 34511026 34195077 33986573 33662111 33240576 32893272 32602529 32170281 31569949
$$ packed form
10679F6182596n69099l92985k28794l21269m67737m24065k84708k56563l28809
10670F2908567l87275m45383n44897n96075n20314m11858l81225l83588l67490
10661E8870462m18071n59007o04308m50992l34935m95199p37811o92554m11728
10652E4165857l13493n33672p37829o63720m78429m37247n04538n22256n08369
10643D9466304n60666o39025o49186o09206n63143m67995l32662l21745n27145
10634D4795531p61806p88409o52422n75216o02839n93627m99487m15965l72764
10625C9532996l18414l17426n00628p67038q06604n42141l01358l66014n61709
10616C5051664n40638l15949k08504l24462m21535l47304k90743m32248o00332
$$ plain form
10607 31569949 31040860 30743053 30520029 30142998 29630862 29149862 28717124 28234595 27770838
10598 27770838 27547953 27581452 27546248 27141508 26462035 25862246 25528833 25338631 25113486 24862123
10588 24862123 24708656 24660905 24546845 24213000 23747626 23421070 23357867 23348522 23100650 22628649
10578 22628649 22229328 22067077 21980745 21776773 21513673 21341630 21219934 21006104 20734390
10569 20734390 20573027 20524948 20393846 20091055 19788572 19675310 19690869 19614489 19358322 19073156
10559 19073156 18959747 19028252 19088241 18987211 18796263 18668378 18563924 18309283 17959275 17846109
10549 17846109 18102743 18364351 18208820 17740099 17426374 17456403 17596709 17643559 17639317 17601788
10539 17601788 17416721 17120587 16958231 17004599 17024122 16862301 16676598 16598445 16482121 16223921
$$ packed form
10607C1569949n29089k97807k23024l77031n12136m81000m32738m82529m63757
10598B7770838k22885L3499l5204m04740o79473n99789l33413j90202k25145k51363
10588B4862123j53467m7751j14060l33845m65374l26556o3203r345k47872m72001
10578B2628649l99321j62251q6332k03972k63100j72043j21696k13830k71714
10569B0734390j61363m8079j31102l02791l02483j13262J5559p6380k56167k85166
10559A9073156j13409O8505N9989j01030j90948j27885j04454k54641l50008j13166
10549A7846109K56634K61608j55531m68721l13725L0029J40306M6850m242l7529
10539A7601788j85067k96134j62356M6368J9523j61821j85703p8153j16324k58200
$$ plain form
10529 16223921 16022315 16027984 16017610 15761841 15474299 15501177 15753683 15868327 15784237 15712442
10519 15712442 15641633 15380783 15065025 15076947 15381284 15467922 15135163 14821720 14881756 15001938
10509 15001938 14744860 14304447 14215692 14511534 14687335 14471912 14173030 14160123 14365799 14482154
10499 14482154 14415455 14333824 14367352 14442975 14422307 14301554 14214930 14250818 14327870 14312414 14212497
10488 14212497 14144013 14128051 14086453 14056340 14191697 14449854 14503978 14171395 13759197 13721233
10478 13721233 14062904 14365735 14380117 14310902 14456205 14807565 15129037 15260333 15211916 15080777
10468 15080777 14997167 15075713 15312352 15578491 15783661 15973263 16198302 16392439 16508864 16703913
10458 16703913 17190033 17887434 18418922 18567951 18589121 18866283 19342894 19557086 19275836
$$ packed form
10529A6223921k01606N669j0374k55769k87542K6878K52506J14644q4090p1795
10519A5712442p0809k60850l15758J1922L04337Q6638l32759l13443O0036J20182
10509A5001938k57078m40413q8755K95842J75801k15423k98882j2907K05676J16355
10499A4482154o6699q1631L3528P5623k0668j20753q6624L5888P7052j5456r9917
10488A4212497o8484j5962m1598l0113J35357K58157N4124l32583m12198l7964
10478A3721233L41671L02831J4382o9215J45303L51360L21472J31296m8417j31139
10468A5080777q3610P8546K36639K66139K05170J89602K25039J94137J16425J95049
10458A6703913M86120O97401N31488J49029K1170K77162M76611K14192k81250
$$ plain form
10449 19275836 18808088 18530160 18365406 18020447 17541529 17232893 17086357 16754507 16185466
10440 16185466 15830708 15974092 16229522 16056073 15505931 15067438 14941072 14894140 14760536
10431 14760536 14662832 14697164 14745825 14694508 14574539 14420499 14220066 14055023 14057444 14173198
10421 14173198 14199103 14105060 14080800 14205396 14325337 14350209 14421457 14665223 14988871 15240715
10411 15240715 15385687 15435684 15407005 15420327 15612731 15876089 15954141 15899324 16116952 16787010
10401 16787010 17559370 18059194 18412447 18996598 19912023 20977669 22010930 22803989 23054775
10392 23054775 22685908 22065447 21563240 21053477 20221538 19182955 18347916 17781023 17181641
10383 17181641 16475419 15941063 15692809 15480940 15114296 14698850 14355667 14062827 13864725
$$ packed form
10449A9275836m67748k77928j64754l44959m78918l08636j46536l31850n69041
10440A6185466l54758J43384K55430j73449n50142m38493j26366m6932j33604
10431A4760536r7704L4332M8661n1317j19969j54040k00433j65043K421J15754
10421A4173198K5905r4043k4260J24596J19941K4872P1248K43766L23648K51844
10411A5240715J44972M9997k8679J3322J92404K63358P8052n4817K17628O70058
10401A6787010P72360M99824L53253N84151R15425J065646J033261P93059K50786
10392B3054775l68867o20461n02207n09763q31939j038583q35039n66893n99382
10383A7181641p06222n34356k48254k11869l66644m15446l43183k92840j98102
$$ plain form
10374 13864725 13865605 13924407 13751206 13411442 13299896 13468983 13465099 13066163 12687963 12713473
10364 12713473 12873281 12732412 12408097 12291918 12357542 12305267 12184192 12268149 12417735 12196413
10354 12196413 11656076 11403956 11719877 12127755 12099704 11753161 11528407 11514388 11480239 11374118
10344 11374118 11392980 11600099 11794489 11815760 11759134 11790965 11886303 11876057 11715131 11578478
10334 11578478 11630829 11779767 11788128 11622115 11522751 11670675 11948080 12144512 12230309 12270516
10324 12270516 12241005 12144629 12154623 12379747 12617695 12642672 12617615 12852202 13231536 13330977
10314 13330977 13108689 12997850 13196702 13369627 13290922 13304778 13767982 14418235 14764467 14852185
10304 14852185 15137032 15717360 16191431 16302682 16312852 16618240 17282883 18073434 18769124
$$ packed form
10374A3864725Q80N8802j73201l39764j11546J69087l884l98936l78200K5510
10364A2713473J59808j40869l24315j16179O5624n2275j21075Q3957J49586k21322
10354A2196413n40337k52120L15921M07878k8051l46543k24754j4019l4149j06121
10344A1374118J8862K07119J94390K1271n6626L1831R5338j0246j60926j36653
10334A1578478N2351J48938Q361j66013r9364J47924K77405J96432Q5797M0207
10324A2270516k9511r6376R994K25124K37948K4977k5057K34587L79334R9441
10314A3330977k22288j10839J98852J72925p8705J3856M63204O50253L46232Q7718
10304A4852185K84847N80328M74071J11251J0170L05388O64643P90551O95690
$$ plain form
10295 18769124 19352452 20007977 20946735 22155424 23412559 24662735 26170176 28042681
10287 28042681 29792527 30759461 30890379 30687439 30412404 29819587 28757245 27525606 26396791
10278 26396791 25203626 23730604 22184121 20913112 19907023 18932066 17965228 17114973
10270 17114973 16274276 15276024 14310556 13748521 13538545 13205087 12538369 11897012 11655188
10261 11655188 11681299 11593940 11277105 10883059 10511570 10160852 9887499 9754674 9665363 9465332
10251 9465332 9190755 9016123 8960543 8843629 8574964 8316848 8272344 8415582 8516184 8386017
10241 8386017 8060542 7759833 7663996 7701182 7621900 7352798 7162381 7300207 7564635 7520030
10231 7520030 7154711 6964154 7210566 7448313 7131356 6460795 6168780 6516928 6986743
$$ packed form
10295A8769124N83328O55525R38758J208689J257135J250176J507441J872505
10287B8042681J749846R66934J30918k02940k75035n92817j062342j231639j128815
10278B6396791j193165j473022j546483j271009j006089r74957r66838q50255
10270A7114973q40697r98252r65468n62035k09976l33458o66718o41357k41824
10261A1655188K6111q7359l16835l94046l71489l50718k73353j32825q9311k00031
10251I465332k74577j74632n5580j16914k68665k58116m4504J43238J00602j30167
10241H386017l25475l00709r5837L7186p9282k69102j90417J37826K64428m4605
10231G520030l65319j90557K46412K37747l16957o70561k92015L48148M69815
$$ plain form
10222 6986743 7062779 6871942 6799263 6844714 6743663 6508377 6427826 6586246 6747927 6743525
10212 6743525 6659836 6585080 6448167 6218050 6029550 5989002 6045435 6152881 6347602 6543079
10202 6543079 6489723 6136703 5821912 5842975 6001370 5882856 5499534 5305657 5559784 5991175
10192 5991175 6191228 6069070 5795838 5538032 5413547 5511985 5749198 5833674 5588643 5229072
10182 5229072 5123035 5323808 5524136 5463844 5219196 5066937 5175663 5445922 5589324 5406752
10172 5406752 5051123 4899849 5048228 5106173 4744973 4281314 4311717 4803569 5052405 4696306
10162 4696306 4267974 4389974 4844423 4958528 4648229 4460596 4646221 4823339 4693255
10153 4693255 4519045 4606774 4764654 4663003 4418242 4397164 4617832 4747968 4629045 4452103
$$ packed form
10222F986743P6036j90837p2679M5451j01051k35286q0551J58420J61681m402
10212F743525q3689p4756j36913k30117j88500m0548N6433J07446J94721J95477
10202F543079n3356l53020l14791K1063J58395j18514l83322j93877K54127M31391
10192E991175K00053j22158k73232k57806j24485R8438K37213Q4476k45031l59571
10182E229072j06037K00773K00328o0292k44648j52259J08726K70259J43402j82572
10172E406752l55629j51274J48379N7945l61200m63659L0403M91852K48836l56099
10162D696306m28332J22000M54449J14105l10299j87633J85625J77118j30084
10153D693255j74210Q7729J57880j01651k44761k1078K20668J30136j18923j76942
$$ plain form
10143 4452103 4411645 4464602 4470315 4374040 4231671 4181178 4338634 4598827 4665698 4459639 4322973
10132 4322973 4546453 4854512 4744443 4254859 3948122 4098432 4356433 4356518 4217978 4203360
10122 4203360 4258843 4213151 4144347 4198870 4255478 4130398 3974794 4093529 4421151 4534419
10112 4534419 4230229 3808759 3683483 3897778 4134587 4105772 3850296 3663060 3743404 3954358
10102 3954358 4018216 3905618 3830377 3849513 3759937 3507019 3371523 3523815 3700913 3641270
10092 3641270 3555598 3756253 4051180 4010112 3702702 3618441 3868126 4025009 3849326 3631224
10082 3631224 3631281 3675230 3557212 3407580 3366571 3287396 3091228 3051993 3347697 3642590 3539824
10071 3539824 3200351 3064054 3155589 3160512 3071585 3221549 3648756 3924401 3755930 3381316
$$ packed form
10143D452103m0458N2957N713r6275j42369n0493J57456K60193O6871k06059j36666
10132D322973K23480L08059j10069m89584l06737J50310K58001Q5j38540j4618
10122D203360N5483m5692o8804N4523N6608j25080j55604J18735L27622J13268
10112D534419l04190m21470j25276K14295K36809k8815k55476j87236Q0344K10954
10102C954358O3858j12598p5241J9136q9576k52918j35496J52292J77098n9643
10092C641270q5672K00655K94927m1068l07410q4261K49685J56883j75683k18102
10082C631224N7M3949j18018j49632m1009p9175j96168l9235K95704K94893j02766
10071C539824l39473j36297R1535M923q8927J49964M27207K75645j68471l74614
$$ plain form
10061 3381316 3189310 3249954 3399778 3532950 3599870 3508667 3249026 3011009 3001759 3197972
10051 3197972 3406080 3514070 3562969 3599868 3586188 3486186 3367080 3332060 3364752 3338518
10041 3338518 3240960 3274934 3561357 3810425 3584592 2962340 2613299 2979123 3641182 3840676
10031 3840676 3461598 3095141 3175723 3477628 3566833 3392009 3224123 3242057 3391514 3530416
10021 3530416 3550626 3426818 3252408 3177758 3261251 3435557 3619171 3761808 3788911 3639677
10011 3639677 3381370 3164360 3055556 3034565 3123869 3348995 3580265 3619923 3480002 3383937
10001 3383937 3454295 3588581 3681235 3756686 3818146 3779406 3646087 3578267 3664199 3781842 3771605
9990 3771605 3616131 3403709 3251691 3266236 3407497 3441552 3263814 3184324 3527021 4000697
$$ packed form
10061C381316j92006O0644J49824J33172O6920r1203k59641k38017r250J96213
10051C197972K08108J07990M8899L6899j3680j00002j19106l5020L2692k6234
10041C338518r7558L3974K86423K49068k25833o22252l49041L65824O62059J99494
10031C840676l79078l66457Q0582L01905Q9205j74824j67886J7934J49457J38902
10021C530416K0210j23808j74410p4650Q3493J74306J83614J42637K7103j49234
10011C639677k58307k17010j08804k0991Q9304K25126K31270L9658j39921r6065
10001C383937P0358J34286R2654P5451O1460l8740j33319o7820Q5932J17643j0237
9990C771605j55474k12422j52018J4545J41261L4055j77738p9490L42697M73676
$$ plain form
9980 4000697 3973495 3437412 3108430 3345057 3595411 3332772 2944944 3071423 3509748 3546436
9970 3546436 3129176 2903117 3126741 3326041 3154444 2912298 2957825 3156269 3224421 3193235
9960 3193235 3217519 3261569 3257927 3301600 3435490 3492209 3381150 3298746 3421533 3595946 3560471
9949 3560471 3309884 3043925 2906164 2936320 3122220 3347640 3440568 3392287 3361702 3384941
9939 3384941 3317638 3159117 3129545 3262235 3246904 2921863 2613226 2674432 2954337 3075804
9929 3075804 3020787 3049138 3204861 3316643 3380662 3524147 3645800 3517438 3247370 3225653
9919 3225653 3534077 3785021 3666010 3323497 3073465 3015530 3074235 3167744 3193002 3075742
9909 3075742 2968293 3158655 3631766 3963605 3844179 3487070 3293751 3305888 3269910 3116450
$$ packed form
9980D000697k7202n36083l28982K36627K50354k62639l87828J26479M38325L6688
9970C546436m17260k26059K23624J99300j71597k42146M5527J98444O8152l1186
9960C193235K4284M4050l642M3673J33890N6719j11059q2404J22787J74413l5475
9949C560471k50587k65959j37761L0156J85900K25420R2928m8281l0585K3239
9939C384941o7303j58521k9572J32690j5331l25041l08637O1206K79905J21467
9929C075804n5017K8351J55723J11782O4019J43485J21653j28362k70068k1717
9919C225653L08424K50944j19011l42513k50032n7935N8705R3509K5258j17260
9909C075742j07449J90362M73111L31839j19426l57109j93319J2137l5978j53460
$$ plain form
9899 3116450 3059384 3230704 3481784 3604144 3565445 3466084 3393914 3373661 3363927 3277705 3095903
9888 3095903 2965467 3065498 3345402 3524635 3429360 3228093 3226599 3490795 3791314 3896075
9878 3896075 3791713 3601527 3416097 3279079 3240391 3306700 3381692 3365664 3296524 3287640 3339390
9867 3339390 3337177 3250524 3199046 3265446 3357639 3331041 3163986 2958118 2858468 3012952 3467580
9856 3467580 4010497 4264953 4079536 3722849 3556786 3627794 3732493 3756822 3734347 3663043
9846 3663043 3519594 3414427 3468760 3543629 3374670 3022289 2891287 3180087 3579865 3704868
9836 3704868 3593611 3547283 3648547 3733185 3749477 3825269 3954850 3917349 3638270 3404946
9826 3404946 3514966 3840984 3985242 3825548 3649413 3693089 3814739 3799726 3759007 3919690
$$ packed form
9899C116450n7066J71320K51080J22360l8699r9361p2170k0253r734q6222j81802
9888C095903j30436J00031K79904J79233r5275k01267j494K64196L00519J04761
9878C896075j04362j90186j85430j37018l8688O6309P4992j6028o9140q884N1750
9867C339390k213q6653n1478O6400R2193k6598j67055k05868r9650J54484M54628
9856C467580N42917K54456j85417l56687j66063P1008J04699K4329k2475p1304
9846C663043j43449j05167N4333P4869j68959l52381j31002K88800L99778J25003
9836C704868j11257m6328J01264Q4638J6292P5792J29581l7501k79079k33324
9826C404946J10020L26018J44258j59694j76135M3676J21650j5013m0719J60683
$$ plain form
9816 3919690 4147419 4072410 3717708 3595440 3999001 4539709 4655097 4318932 3946835 3810103
9806 3810103 3878215 4072325 4299559 4343162 4101738 3872639 4013343 4372817 4481996 4291363
9796 4291363 4237027 4504457 4735068 4649305 4485494 4539607 4676009 4635166 4502748 4510632 4618374
9785 4618374 4644130 4619525 4686097 4799237 4838563 4864795 4981289 5090618 5071993 5043718 5152310
9774 5152310 5259836 5168528 5015712 5086415 5331349 5440183 5343120 5282631 5399987 5579001
9764 5579001 5700260 5744019 5644379 5350756 5045970 5001764 5193113 5339973 5342017 5364440 5461841
9753 5461841 5448169 5238336 5032278 5028758 5170629 5278451 5263444 5147700 5034680 5076419
9743 5076419 5303282 5512906 5516912 5425862 5449254 5514438 5406845 5204867 5178741 5288476 5226912
$$ packed form
9816C919690K27729p5009l54702j22268M03561N40708J15388l36165l72097j36732
9806C810103O8112J94110K27234M3603k41424k29099J40704L59474J09179j90633
9796D291363n4336K67430K30611q5763j63811N4113J36402m0843j32418P884J07742
9785D618374K5756k4605O6572J13140L9326K6232J16494J09329j8625k8275J08592
9774E152310J07526r1308j52816P0703K44934J08834r7063o0489J17356J79014
9764E579001J21259M3759r9640k93623l04786m4206J91349J46860K044K2423R7401
9753E461841j3672k09833k06058l520J41871J07822j5007j15744j13020M1739
9743E076419K26863K09624M006r1050K3392O5184j07593k01978k6126J09735o1564
$$ plain form
9732 5226912 4996460 4972171 5278427 5561417 5550951 5416449 5366872 5322292 5217075 5214041 5345602
9721 5345602 5340703 5107501 4992239 5216582 5448801 5341556 5138088 5267969 5625934 5765158
9711 5765158 5605597 5437590 5359447 5223595 5074896 5148903 5422493 5591409 5533114 5430733
9701 5430733 5411539 5397957 5341100 5292305 5230215 5107405 5053021 5223604 5476355 5522311 5397762
9690 5397762 5433220 5724035 5977693 5954349 5744442 5533495 5386514 5347227 5473611 5684205
9680 5684205 5807305 5838105 5908475 5982049 5866029 5572949 5374987 5422225 5578749 5702154
9670 5702154 5803414 5861380 5776408 5601208 5534615 5597995 5602867 5511898 5507239 5610493 5603177
9659 5603177 5467142 5509475 5827286 6033453 5828568 5520054 5588858 5971148 6187889 6070048
$$ packed form
9732E226912k30452k4289L06256K82990j0466j34502m9577m4580j05217l034J31561
9721E345602m899k33202j15262K24343K32219j07245k03468J29881L57965J39224
9711E765158j59561j68007p8143j35852j48699P4007K73590J68916n8295j02381
9701E430733j9194j3582n6857m8795o2090j22810n4384J70583K52751M5956j24549
9690E397762L5458K90815K53658k3344k09907k10947j46981l9287J26384K10594
9680E684205J23100L0800P0370P3574j16020k93080j97962M7238J56524J23405
9670E702154J01260N7966q4972j75200o6593O3380M872r0969m659J03254p316
9659E603177j36035M2333L17811K06167k04885l08514O8804L82290K16741j17841
$$ plain form
9649 6070048 5944502 6091502 6359099 6428697 6249252 6052933 6009004 6005226 5859890 5694320
9639 5694320 5868852 6421156 6825177 6630870 6158466 6098758 6505682 6749702 6531143 6311747
9629 6311747 6494453 6775270 6720487 6490201 6484254 6651054 6687493 6638130 6745859 6921002
9619 6921002 6911404 6845967 7051131 7421990 7538399 7374946 7332452 7523233 7582984 7331720
9609 7331720 7114793 7259041 7592549 7759958 7711487 7640511 7670615 7814443 8053887 8277517
9599 8277517 8291273 8052455 7784484 7742376 7946607 8213104 8362236 8364284 8351675 8481407
9589 8481407 8728090 8893995 8904970 8936166 9091358 9168198 9001637 8834392 8981069 9274016
9579 9274016 9281185 9009440 8924173 9251055 9715196 10046565 10291041 10486015 10463030 10182243
$$ packed form
9649F070048j25546J47000K67597O9598j79445j96319m3929l778j45336j65570
9639E694320J74532N52304M04021j94307m72404n9708M06924K44020k18559k19396
9629F311747J82706K80817n4783k30286n947J66800L6439m9363J07729J75143
9619F921002r598o5437K05164L70859J16409j63453m2494J90781N9751k51264
9609G331720k16927J44248L33508J67409m8471p0976L0104J43828K39444K23630
9599H277517J3756k38818k67971m2108K04231K66497J49132K048j2609J29732
9589H481407K46683J65905J0975L1196J55192P6840j66561j67245J46677K92947
9579I274016P169k71745q5267L26882M64141L31369K44476J94974k2985k80787
$$ plain form
9569 10182243 9912529 9876887 10010660 10209021 10480756 10714907 10670891 10396692 10294006 10552037
9559 10552037 10881403 11038410 11199356 11497226 11607487 11250938 10795152 10831338 11326701 11710219
9549 11710219 11725721 11696627 11899063 12129146 12082323 11859097 11843818 12190026 12619459 12762503
9539 12762503 12611131 12520936 12728618 13023207 13073906 12946048 12981871 13234340 13418388 13449759
9529 13449759 13573948 13832651 13897354 13685451 13658323 14131949 14706830 14836514 14630709 14601792
9519 14601792 14870404 15137164 15266708 15390985 15534425 15602635 15677450 15905418 16163796 16234970
9509 16234970 16229298 16432558 16815171 17098226 17227294 17373973 17552890 17655340 17771882 18050702
9499 18050702 18344785 18460499 18613996 19093251 19600580 19600414 19283799 19439247 20252105 20977320
$$ packed form
9569A0182243k69714l5642J33773J98361K71735K34151m4016k74199j02686K58031
9559A0552037L29366J57007J60946K97870J10261l56549m55786L6186M95363L83518
9549A1710219J5502k9094K02436K30083m6823k23226j5279L46208M29433J43044
9539A2762503j51372r0195K07682K94589N0699j27858L5823K52469J84048L1371
9529A3449759J24189K58703O4703k11903k7128M73626N74881J29684k05805k8917
9519A4601792K68612K66760J29544J24277J43440O8210P4815K27968K58378P1174
9509A6234970n672K03260L82613K83055J29068J46679J78917J02450J16542K78820
9499A8050702K94083J15714J53497M79255N07329j66l16615J55448Q12858P25215
$$ plain form
9489 20977320 21053113 20850176 20969875 21415304 21875575 22303625 22749465 23041631 23086571 23149615
9479 23149615 23446949 23780805 23936970 24093445 24447673 24784989 24847559 24823903 25021623 25326595
9469 25326595 25455450 25505549 25753773 26088050 26158020 25996353 25991464 26261478 26511021 26554650
9459 26554650 26584176 26807490 27119731 27268407 27180614 27041454 27105039 27408090 27669038 27618648
9449 27618648 27428508 27521499 27894737 28046281 27774427 27575283 27876014 28324582 28366912 28162783
9439 28162783 28279107 28702104 28866458 28598279 28329076 28310298 28275775 28064676 27990001 28297387
9429 28297387 28708693 28818598 28624733 28398161 28289960 28299136 28408466 28539157 28539869 28384086
9419 28384086 28236726 28224507 28300359 28405587 28573822 28789868 28936662 28983745 29069418 29303054
$$ packed form
9489B0977320P5793k02937J19699M45429M60271M28050M45840K92166M4940O3044
9479B3149615K97334L33856J56165J56475L54228L37316O2570k3656J97720L04972
9469B5326595J28855N0099K48224L34277O9970j61667m889K70014K49543M3629
9459B6554650K9526K23314L12241J48676q7793j39160O3585L03051K60948n0390
9449B7618648j90140R2991L73238J51544k71854j99144L00731M48568M2330k04129
9439B8162783J16324M22997J64354k68179k69203j8778l4523k11099p4675L07386
9429B8297387M11306J09905j93865k26572j08201R176J09330J30691P12j55783
9419B8384086j47360j2219P5852J05228J68235K16046J46794M7083Q5673K33636
$$ plain form
9409 29303054 29608866 29827041 29873609 29788102 29712929 29790471 29994975 30164025 30287563 30570592
9399 30570592 31051273 31429866 31547376 31728941 32254998 32793377 32898665 32838530 33255444 34128372
9389 34128372 34820517 35172430 35746793 36808202 37851223 38487311 39088357 40084165 41223981
9380 41223981 42071689 42740032 43550524 44336733 44675481 44564488 44339183 44102901 43734583
9371 43734583 43331966 43185216 43355618 43628161 43832638 43956892 44052764 44256415 44743312 45447331
9361 45447331 46028415 46334882 46637533 47157987 47683042 47986244 48323770 49075888 50108974
9352 50108974 50940717 51415673 51822090 52427480 53243639 54178391 55128038 55988330 56784502
9343 56784502 57669850 58653341 59562657 60421839 61517073 62878940 64122804 65097309 66227567
$$ packed form
9409B9303054L05812K18175M6568q5507p5173P7542K04504J69050J23538K83029
9399C0570592M80681L78593J17510J81565N26057N38379J05288o0135M16914Q72928
9389C4128372O92145L51913N74363J061409J043021O36088O01046R95808J139816
9380D1223981Q47708O68343Q10492P86209L38748j10993k25305k36282l68318
9371D3734583m02617j46750J70402K72543K04477J24254R5872K03651M86897P04019
9361D5447331N81084L06467L02651N20454N25055L03202L37526P52118J033086
9352E0108974Q31743M74956M06417O05390Q16159R34752R49647Q60292P96172
9343E6784502Q85348R83491R09316Q59182J095234J361867J243864R74505J130258
$$ plain form
9334 66227567 67831895 69575473 71063213 72491737 74177750 75929264 77509982 79256151
9326 79256151 81526753 83978297 86141630 88287797 90906226 93779901 96511108 99515467
9318 99515467 103420802 107881353 112180307 116621935 121963023 127872107 133700028 140554083
9310 140554083 150315059 162034714 171537401 175850493 176323667 176009812 175587100 173665580
9302 173665580 169899045 165644190 162000863 159073849 157054121 156398019 156814108 157387402
9294 157387402 157856164 158683062 159849483 160711525 161140239 161708484 162575974 163205814 163400865
9285 163400865 163679529 164389364 165315832 166370727 167791462 169437721 170780217 171859166
9277 171859166 173374077 175507305 177549418 179089026 180687786 182853994 185163237 187027376
$$ packed form
9334F6227567J604328J743578J487740J428524J686013J751514J580718J746169
9326G9256151K270602K451544K163333K146167K618429K873675K731207L004359
9318I9515467L905335M460551M298954M441628N341088N909084N827921O854055
9310A40554083R760976J1719655R502687M313092M73174l13855m22712j921520
9302A73665580l766535m254855l643327k927014k019728o56102M16089N73294
9294A57387402M68762Q26898J166421Q62042M28714N68245Q67490O29840J95051
9285A63400865K78664P09835R26468J054895J420735J646259J342496J078949
9277A71859166J514911K133228K042113J539608J598760K166208K309243J864139
$$ plain form
9269 187027376 188643642 190499195 192501958 194304258 196040647 198042251 200136050 201887869
9261 201887869 203343826 204959930 206915309 208950510 210780500 212301106 213505099 214502080
9253 214502080 215503337 216564491 217505381 218227159 218834834 219304614 219415021 219224183 219177030
9244 219177030 219422217 219448942 218796272 217742644 216850312 216150477 215249372 213994708 212592626
9235 212592626 211258499 210128664 209301324 208611271 207614050 206154819 204682327 203628813
9227 203628813 202785925 201708165 200404361 199142024 197873121 196405969 194904382 193650895
9219 193650895 192507338 191158071 189695702 188402079 187145414 185607849 183941485 182539466
9211 182539466 181284620 179731131 177963502 176523277 175452181 174162515 172393953 170595047
$$ packed form
9269A87027376J616266J855553K002763J802300J736389K001604K093799J751819
9261B01887869J455957J616104J955379K035201J829990J520606J203993R96981
9253B14502080J001257J061154R40890P21778O07675M69780J10407j90838m7153
9244B19177030K45187K6725o52670j053628q92332o99835r01105j254664j402082
9235B12592626j334127j129835q27340o90053r97221j459231j472492j053514
9227B03628813q42888j077760j303804j262337j268903j467152j501587j253487
9219A93650895j143557j349267j462369j293623j256665j537565j666364j402019
9211A82539466j254846j553489j767629j440225j071096j289666j768562j798906
$$ plain form
9203 170595047 169152980 167883770 166510511 165053991 163524186 161801055 160050649 158681567
9195 158681567 157646145 156379370 154703072 153160720 152103548 151082713 149615568 147975269
9187 147975269 146659295 145555220 144247125 142783996 141522699 140464523 139335150 138146893
9179 138146893 137144484 136313756 135415660 134406050 133418259 132467319 131557900 130898697 130576479
9170 130576479 130207388 129408316 128471108 128029576 128130167 128192164 127900289 127576338 127549936 127679337
9160 127679337 127722544 127775551 128057278 128521612 128946103 129265304 129625157 130168625 130865488 131536870
9150 131536870 132063855 132596815 133429919 134577253 135674253 136483732 137271672 138402971 139788871
9141 139788871 141106520 142377045 143869436 145547413 147115516 148577429 150233799 152112237
$$ packed form
9203A70595047j442067j269210j373259j456520j529805j723131j750406j369082
9195A58681567j035422j266775j676298j542352j057172j020835j467145j640299
9187A47975269j315974j104075j308095j463129j261297j058176j129373j188257
9179A38146893j002409q30728q98096j009610r87791r50940r09419o59203l22218
9170A30576479l69091p99072r37208m41532J00591O1997k91875l23951k6402J29401
9160A27679337M3207N3007K81727M64334M24491L19201L59853N43468O96863O71382
9150A31536870N26985N32960Q33104J147334J097000Q09479P87940J131299J385900
9141A39788871J317649J270525J492391J677977J568103J461913J656370J878438
$$ plain form
9133 152112237 153939037 155743353 157903692 160427056 162780012 164721197 166735074 169251560
9125 169251560 171961408 174409613 176816392 179679368 182867585 185818991 188518759 191565718
9117 191565718 195192672 198874899 202158264 205343221 208970475 212995946 216925790 220596696
9109 220596696 224379595 228600956 233125926 237652213 242156161 246816605 251628090 256366944
9101 256366944 260950238 265564125 270317891 275010399 279466648 283916849 288701766 293681971
9093 293681971 298344603 302546318 306723553 311176070 315547188 319354759 322727256 326164090
9085 326164090 329735025 333010525 335760095 338222207 340557318 342488446 343768930 344685237
9077 344685237 345720074 346860506 347602013 347623864 347142409 346512876 345750679 344633361 343107803
$$ packed form
9133A52112237J826800J804316K160339K523364K352956J941185K013877K516486
9125A69251560K709848K448205K406779K862976L188217K951406K699768L046959
9117A91565718L626954L682227L283365L184957L627254M025471L929844L670906
9109B20596696L782899M221361M524970M526287M503948M660444M811485M738854
9101B56366944M583294M613887M753766M692508M456249M450201M784917M980205
9093B93681971M662632M201715M177235M452517M371118L807571L372497L436834
9085C26164090L570935L275500K749570K462112K335111J931128J280484R16307
9077C44685237J034837J140432P41507K1851m81455o29533p62197j117318j525558
$$ plain form
9068 343107803 341346197 339426730 337184645 334453968 331306172 327952719 324520262 321015242
9060 321015242 317392452 313526926 309229317 304474883 299550236 294766532 290063383 285125298
9052 285125298 279881152 274618961 269549493 264532245 259355465 254032781 248661173 243232656
9044 243232656 237804348 232634370 227870073 223253385 218426819 213430000 208601077 204057605
9036 204057605 199587969 195043918 190533796 186184549 181990105 177969790 174219923 170695551
9028 170695551 167159184 163482183 159826957 156398443 153159852 149933301 146671568 143491700
9020 143491700 140504151 137716756 135066993 132477403 129912084 127409501 125012601 122673423
9012 122673423 120319948 118007128 115857552 113827855 111708749 109444590 107293710 105528280
$$ packed form
9068C43107803j761606j919467k242085k730677l147796l353453l432457l505020
9060C21015242l622790l865526m297609m754434m924647m783704m703149m938085
9052B85125298n244146n262191n069468n017248n176780n322684n371608n428517
9044B43232656n428308n169978m764297m616688m826566m996819m828923m543472
9036B04057605m469636m544051m510122m349247m194444m020315l749867l524372
9028A70695551l536367l677001l655226l428514l238591l226551l261733l179868
9020A43491700k987549k787395k649763k589590k565319k502583k396900k339178
9012A22673423k353475k312820k149576k029697k119106k264159k150880j765430
$$ plain form
9004 105528280 104075304 102603454 100908162 99070629 97265520 95560104 93940073 92424168
8996 92424168 91054919 89784841 88455932 86967727 85440858 84092839 82911763 81610683
8988 81610683 80045399 78531328 77491433 76842965 76040467 74789388 73420717 72396780
8980 72396780 71691972 70902942 69818037 68611382 67525702 66596834 65713896 64793223 63855036
8971 63855036 63009803 62355523 61820930 61174358 60292807 59351474 58605372 58039603 57414016
8962 57414016 56639234 55906987 55390605 54990936 54492701 53854488 53205153 52611948 52001345
8953 52001345 51324890 50681703 50194995 49817332 49352481 48683726 47912764 47237597 46750768
8944 46750768 46412626 46167345 45986601 45805456 45510408 45030534 44405250 43756528 43217837
$$ packed form
9004A05528280j452976j471850j695292j837533j805109j705416j620031j515905
8996I2424168j369249j270078j328909j488205j526869j348019j181076j301080
8988H1610683j565284j514071j039895o48468q02498j251079j368671j023937
8980G2396780p04808p89030j084905j206655j085680r28868q82938r20673r38187
8971F3855036q45233o54280n34593o46572q81551r41333p46102n65769o25587
8962E7414016p74782p32247n16382l99669m98235o38213o49335n93205o10603
8953E2001345o76455o43187m86708l77663m64851o68755p70962o75167m86829
8944D6750768l38142k45281j80744j81145k95048m79874o25284o48722n38691
$$ plain form
8935 43217837 42853377 42593170 42288873 41894489 41528159 41277022 41044183 40726120 40424407
8926 40424407 40261994 40076845 39596428 38909706 38437817 38356944 38363551 38146319 37792434 37539563
8916 37539563 37394839 37226942 37012498 36762580 36412454 36015484 35832504 35966008 36103507
8907 36103507 35905971 35467032 35097168 34854004 34628031 34500653 34603094 34747893 34639152
8898 34639152 34381048 34338247 34518037 34538037 34234546 33874621 33703813 33689829 33788827 34064534
8888 34064534 34442098 34713176 34873257 35101385 35376619 35537566 35743687 36350581 37232958
8879 37232958 37814549 37944874 38119722 38567099 38797454 38486195 38139111 38292860 38619395
8870 38619395 38508111 38062286 37753172 37472689 36787948 35878913 35302160 34931428 34085297
$$ packed form
8935D3217837l64460k60207l04297l94384l66330k51137k32839l18063l01713
8926D0424407j62413j85149m80417o86722m71889q0873O607k17232l53885k52871
8916C7539563j44724j67897k14444k49918l50126l96970j82980J33504J37499
8907C6103507j97536m38939l69864k43164k25973j27378J02441J44799j08741
8898C4639152k58104m2801J79790K0000l03491l59925j70808j3984R8998K75707
8888C4064534L77564K71078J60081K28128K75234J60947K06121O06894Q82377
8879C7232958N81591J30325J74848M47377K30355l11259l47084J53749L26535
8870C8619395j11284m45825l09114k80483o84741r09035n76753l70732q46131
$$ plain form
8861 34085297 32761434 31791177 31532017 31299703 30500859 29545179 29095417 29042563 28844208
8852 28844208 28423865 28099994 27915393 27633248 27240080 26940784 26738933 26449855 26077051
8843 26077051 25810275 25686583 25569056 25433166 25393991 25459324 25481885 25348092 25062964 24718769
8833 24718769 24507981 24616412 24926582 25006270 24625454 24115226 23939337 24062790 24065773 23774092
8823 23774092 23425524 23252517 23236888 23284049 23334971 23280820 23049164 22804031 22784008 22909219
8813 22909219 22841097 22494576 22188043 22171748 22300734 22346852 22366946 22510449 22647511 22495529
8803 22495529 22073657 21763819 21844029 22127383 22194631 21927502 21665132 21769689 22145307 22353819
8793 22353819 22187463 21903042 21802184 21821555 21746667 21631189 21693381 21896736 21978478 21891496
$$ packed form
8861C4085297j323863r70257k59160k32314p98844r55680m49762n2854j98355
8852B8844208m20343l23871j84601k82145l93168k99296k01851k89078l72804
8843B6077051k66776j23692j17527j35890l9175O5333K2561j33793k85128l44195
8833B4718769k10788J08431L10170P9688l80816n10228j75889J23453K983k91681
8823B3774092l48568j73007j5629M7161N0922n4151k31656k45133k0023J25211
8813B2909219o8122l46521l06533j6295J28986M6118K0094J43503J37062j51982
8803B2495529m21872l09838Q0210K83354O7248k67129k62370J04557L75618K08512
8793B2353819j66356k84421j00858J9371p4888j15478O2192K03355Q1742q6982
$$ plain form
8783 21891496 21888424 22104171 22352903 22438667 22398270 22322331 22200214 22082618 22134776 22347567
8773 22347567 22442682 22281158 22134078 22284904 22571054 22645626 22542131 22592175 22832808 22909136
8763 22909136 22652248 22392329 22505335 22909683 23244921 23370473 23430516 23526856 23607510 23682193
8753 23682193 23890171 24252781 24546275 24574195 24455728 24480158 24734431 25042763 25251070 25384964
8743 25384964 25497645 25552317 25549008 25611312 25819231 26071391 26242203 26377346 26603024 26929160
8733 26929160 27264334 27529422 27644960 27549591 27379340 27450011 27849908 28238239 28321955 28328237
8723 28328237 28627370 29073904 29233375 29170392 29394546 29967045 30325937 30223013 30180210 30632502
8713 30632502 31218720 31447629 31544968 31973357 32504761 32554798 32245253 32324165 33024368 33750691
$$ packed form
8783B1891496l072K15747K48732Q5764m0397p5939j22117j17596N2158K12791
8773B2347567R5115j61524j47080J50826K86150P4572j03495N0044K40633P6328
8763B2909136k56888k59919J13006M04348L35238J25552O0043R6340Q0654P4683
8753B3682193K07978L62610K93494K7920j18467K4430K54273L08332K08307J33894
8743B5384964J12681N4672l309O2304K07919K52160J70812J35143K25678L26136
8733B6929160L35174K65088J15538r5369j70251P0671L99897L88331Q3716O282
8723B8328237K99133M46534J59471o2983K24154N72499L58892j02924m2803M52292
8713C0632502N86218K28909R7339M28389N31404N0037l09545P8912P00203P26323
$$ plain form
8703 33750691 34044246 34184360 34578768 35128911 35533922 35783688 36014376 36222722 36432904
8694 36432904 36845660 37524989 38196060 38628154 38977856 39493893 40124087 40688716 41217624
8685 41217624 41825619 42447892 42985133 43537373 44219425 44921356 45533700 46220705 47144853
8676 47144853 48090406 48735676 49188937 49862518 50860082 51870064 52678022 53430269 54330471
8667 54330471 55377947 56480680 57578656 58607795 59570865 60652135 62009439 63462054
8659 63462054 64678208 65669031 66758010 68044667 69303269 70493231 71905115 73597770
8651 73597770 75152029 76311259 77461110 79046584 80843674 82328274 83544573 85013702
8643 85013702 86848933 88568167 89881748 91123374 92685205 94474307 96200230 97824853
$$ packed form
8703C3750691K93555J40114L94408N50143M05011K49766K30688K08346K10182
8694C6432904M12756O79329O71071M32094L49702N16037O30194N64629N28908
8685D1217624O07995O22273N37241N52240O82052P01931O12344O87005R24148
8676D7144853R45553O45270M53261O73581R97564J009982Q07958P52247R00202
8667E4330471J047476J102733J097976J029139R63070J081270J357304J452615
8659F3462054J216154R90823J088979J286657J258602J189962J411884J692655
8651G3597770J554259J159230J149851J585474J797090J484600J216299J469129
8643H5013702J835231J719234J313581J241626J561831J789102J725923J624623
$$ plain form
8635 97824853 99417658 100893173 102254784 103828886 105836360 107922899 109579437 110922485
8627 110922485 112548301 114611561 116596838 118162101 119677320 121590953 123695038 125501496
8619 125501496 127083931 128988886 131372213 133756779 135760262 137625421 139809616 142374714
8611 142374714 145057694 147731724 150509762 153495767 156672727 159972135 163233344 166121347
8603 166121347 168300715 169743833 170749605 171643554 172563431 173527477 174569851 175763920
8595 175763920 177213246 179062625 181425651 184238951 187255651 190266891 193320380 196666399
8587 196666399 200478261 204662673 208974589 213298510 217762280 222566520 227780496 233353285
8579 233353285 239222431 245290336 251383525 257435422 263679824 270419136 277558641 284629899
$$ packed form
8635I7824853J592805J475515J361611J574102K007474K086539J656538J343048
8627A10922485J625816K063260J985277J565263J515219J913633K104085J806458
8619A25501496J582435J904955K383327K384566K003483J865159K184195K565098
8611A42374714K682980K674030K778038K986005L176960L299408L261209K888003
8603A66121347K179368J443118J005772Q93949R19877R64046J042374J194069
8595A75763920J449326J849379K363026K813300L016700L011240L053489L346019
8587A96666399L811862M184412M311916M323921M463770M804240N213976N572789
8579B33353285N869146O067905O093189O051897O244402O739312P139505P071258
$$ plain form
8571 284629899 291382446 298083162 305051787 312176538 319172604 326080117 333102605 340074538
8563 340074538 346557771 352507990 358412887 364609196 370823026 376618176 382001005 387267181
8555 387267181 392438001 397208317 401414950 405239883 408876143 412225150 415056891 417318163
8547 417318163 419112921 420446134 421183618 421301523 420986058 420336714 419108242 416997116 414142220
8538 414142220 411027201 407812772 404113846 399649813 394778496 390018844 385286381 380065149
8530 380065149 374214508 368097382 361921553 355487687 348701765 341821633 334974541 327894047
8522 327894047 320431737 312917535 305651117 298392228 290779911 282976001 275419173 268127036
8514 268127036 260737241 253162032 245729554 238664287 231843891 225131554 218578840 212198607
$$ packed form
8571B84629899O752547O700716O968625P124751O996066O907513P022488O971933
8563C40074538O483233N950219N904897O196309O213830N795150N382829N266176
8555C87267181N170820M770316M206633L824933L636260L349007K831741K261272
8547D17318163J794758J333213P37484J17905l15465o49344j228472k111126k854896
8538D14142220l115019l214429l698926m464033m871317m759652m732463n221232
8530C80065149n850641o117126o175829o433866o785922o880132o847092p080494
8522C27894047p462310p514202p266418p258889p612317p803910p556828p292137
8514B68127036p389795p575209p432478p065267o820396o712337o552714o380233
$$ plain form
8506 212198607 205861093 199557273 193515355 187909996 182636570 177490886 172428796 167550633
8498 167550633 162933068 158544654 154270805 150025716 145892234 142072072 138608271 135289285
8490 135289285 131968392 128796802 125908955 123067619 119971877 116804437 114064155 111868613
8482 111868613 109822665 107621387 105388985 103324996 101397482 99538676 97801104 96139263
8474 96139263 94344594 92395230 90598802 89185735 87994336 86737565 85353189 83928661
8466 83928661 82523718 81231725 80161546 79193972 78036917 76696345 75561512 74791601
8458 74791601 73982327 72772715 71441472 70472808 69800049 68975296 67918036 66968449 66254872
8449 66254872 65518890 64617961 63756684 63103066 62531402 61869759 61109083 60261638 59286054
$$ packed form
8506B12198607o337514o303820o041918n605359n273426n145684n062090m878163
8498A67550633m617565m388414m273849m245089m133482l820162l463801l318986
8490A35289285l320893l171590k887847k841336l095742l167440k740282k195542
8482A11868613k045948k201278k232402k063989j927514j858806j737572j661841
8474I6139263j794669j949364j796428j413067j191399j256771j384376j424528
8466H3928661j404943j291993j070179r67574j157055j340572j134833p69911
8458G4791601q09274j209612j331243r68664o72759q24753j057260r49587p13577
8449F6254872p35982r00929q61277o53618n71664o61643p60676q47445r75584
$$ plain form
8440 59286054 58265885 57417463 56798150 56205133 55463160 54635700 53873066 53222361 52656659
8431 52656659 52132438 51562486 50883288 50184671 49616440 49146189 48582708 47864676 47147399
8422 47147399 46567925 46092921 45632485 45144887 44602675 44002963 43417359 42891971 42332601
8413 42332601 41649292 40944476 40356513 39810246 39179571 38592616 38241138 37967399 37452102
8404 37452102 36792355 36422547 36392165 36214596 35596647 34842473 34301136 33876120 33392315 33015974
8394 33015974 32912134 32834625 32487473 32020539 31737826 31547179 31142321 30545983 30026718 29619187
8384 29619187 29167709 28732202 28504941 28399613 28156285 27793199 27520818 27273545 26811611
8375 26811611 26263606 26032282 26098537 25964234 25437891 24942414 24799709 24719861 24355981 23930534
$$ packed form
8440E9286054j020169q48422o19313n93017p41973q27460p62634o50705n65702
8431E2656659n24221n69952o79198o98617n68231m70251n63481p18032p17277
8422D7147399n79474m75004m60436m87598n42212n99712n85604n25388n59370
8413D2332601o83309p04816n87963n46267o30675n86955l51478k73739n15297
8404C7452102o59747l69808l0382j77569o17949p54174n41337m25016m83805l76341
8394C3015974j03840p7509l47152m66934k82713j90647m04858n96338n19265m07531
8384B9619187m51478m35507k27261j05328k43328l63086k72381k47273m61934
8375B6811611n48005k31324O6255j34303n26343m95477j42705p9848l63880m25447
$$ plain form
8365 23930534 23851541 24004535 23921596 23502255 23095061 22898123 22707906 22344347 21981719 21879581
8355 21879581 21983309 21983241 21708435 21319702 21083014 21028503 20934232 20663351 20379005 20290114 20295545
8344 20295545 20116485 19748308 19492482 19479463 19453069 19173846 18776232 18523544 18422522 18313304
8334 18313304 18172286 18077938 17999871 17859852 17700082 17565459 17331820 16908845 16518856 16475360
8324 16475360 16716526 16850958 16680722 16406703 16273196 16268584 16257785 16188132 16068546 15919909
8314 15919909 15812746 15790829 15735494 15514376 15277835 15321591 15582814 15612870 15229334 14851504
8304 14851504 14886596 15078916 14902115 14425323 14258208 14599704 14855245 14448039 13644694 13212938
8294 13212938 13436666 13842218 13887184 13592662 13357742 13362271 13395069 13249806 13063613 13106112
$$ packed form
8365B3930534p8993J52994q2939m19341m07194j96938j90217l63559l62628j02138
8355B1879581J03728o8k74806l88733k36688n4511r4271k70881k84346q8891N431
8344B0295545j79060l68177k55826j3019k6394k79223l97614k52688j01022j09218
8334A8313304j41018r4348p8067j40019j59770j34623k33639m22975l89989m3496
8324A6475360K41166J34432j70236k74019j33507m612j0799o9653j19586j48637
8314A5919909j07163k1917n5335k21118k36541M3756K61223L0056l83536l77830
8304A4851504L5092J92320j76801m76792j67115L41496K55541m07206q03345m31756
8294A3212938K23728M05552M4966k94522k34920M529L2798j45263j86193M2499
$$ plain form
8284 13106112 13326744 13348791 12982954 12533234 12405728 12570951 12684609 12641577 12640666 12687356
8274 12687356 12477578 11968627 11640100 11824857 12114571 11913547 11363418 11137332 11389476
8265 11389476 11556183 11316461 11107117 11365466 11800052 11865981 11567820 11294304 11158528 11037666
8255 11037666 11040935 11340344 11647467 11483205 10978595 10789344 11101471 11338478 11090474 10738047
8245 10738047 10770173 10995776 10946212 10684756 10622606 10745714 10646445 10280567 10107483 10373338
8235 10373338 10750587 10880128 10854031 10902558 10950899 10826238 10664949 10723390 10897037 10831335
8225 10831335 10519925 10391341 10652561 10908960 10735120 10357984 10343645 10716104 10897505 10606886
8215 10606886 10299102 10430184 10742120 10726070 10458580 10412116 10628711 10707082 10552404 10489795
$$ packed form
8284A3106112K20632K2047l65837m49720j27506J65223J13658m3032r11M6690
8274A2687356k09778n08951l28527J84757K89714k01024n50129k26086K52144
8265A1389476J66707k39722k09344K58349M34586O5929k98161k73516j35776j20862
8255A1037666L269K99409L07123j64262n04610j89251L12127K37007k48004l52427
8245A0738047L2126K25603m9564k61456o2150J23108r9269l65878j73084K65855
8235A0373338L77249J29541k6097M8527M8341j24661j61289N8441J73647o5702
8225A0831335l11410j28584K61220K56399j73840l77136j4339L72459J81401k90619
8215A0606886l07784J31082L11936j6050k67490m6464K16595P8371j54678o2609
$$ plain form
8205 10489795 10578097 10480174 10183147 10162540 10533264 10713680 10362592 10004702 10164682 10478255
8195 10478255 10367663 10085187 10232670 10613839 10527928 10026547 9876243 10261234 10513459 10309793
8185 10309793 10184861 10508780 10818622 10647334 10293737 10234412 10378663 10446005 10531021 10732392
8175 10732392 10737354 10385493 10178168 10558809 11090303 11079290 10698788 10690644 11141669 11391893
8165 11391893 11140641 10846621 10890121 11027797 10923138 10674439 10542427 10552350 10592701 10605495
8155 10605495 10540707 10398730 10369383 10618288 10934165 10959701 10760129 10718003 10855805 10796043
8145 10796043 10490009 10406216 10767087 11138823 11100123 10849947 10785471 10884374 10909602 10892451
8135 10892451 10994633 11141778 11171801 11135810 11130168 11063525 10898767 10858811 11062840 11249682
$$ packed form
8205A0489795Q8302r7923k97027k0607L70724J80416l51088l57890J59980L13573
8195A0478255j10592k82476J47483L81169q5911n01381j50304L84991K52225k03666
8185A0309793j24932L23919L09842j71288l53597n9325J44251O7342Q5016K01371
8175A0732392M962l51861k07325L80641N31494j1013l80502q144M51025K50224
8165A1391893k51252k94020M3500J37676j04659k48699j32012R923M0351J2794
8155A0605495o4788j41977k9347K48905L15877K5536j99572m2126J37802n9762
8145A0796043l06034q3793L60871L71736l8700k50176o4476R8903K5228j7151
8135A0892451J02182J47145L0023l5991n642o6643j64758l9956K04029J86842
$$ plain form
8125 11249682 11222619 11233708 11478185 11561025 11072845 10444672 10513416 11308413 11976030 11972043
8115 11972043 11667877 11615324 11823697 12022789 12126701 12144797 12052412 12004880 12275180 12743538
8105 12743538 12890520 12574719 12347706 12633194 13057420 13065866 12792787 12744760 12941951 13027974
8095 13027974 13025605 13263076 13604952 13502662 12937884 12623649 12987279 13545557 13672923 13494635
8085 13494635 13532410 13824676 13963461 13839268 13800393 14052722 14343416 14373735 14224399 14199609
8075 14199609 14412934 14675374 14743071 14604398 14504457 14647075 14895810 14925878 14718065 14668058
8065 14668058 15036751 15521785 15651912 15431678 15248766 15257162 15264656 15211067 15309803 15612155
8055 15612155 15841705 15842430 15833536 16002992 16182833 16192237 16193228 16382092 16591208 16575369 16496915
$$ packed form
8125A1249682k7063J1089K44477Q2840m88180o28173O8744P94997O67617l987
8115A1972043l04166n2553K08373J99092J03912J8096r2385m7532K70300M68358
8105A2743538J46982l15801k27013K85488M24226Q446k73079m8027J97191Q6023
8095A3027974k369K37471L41876j02290n64778l14235L63630N58278J27366j78288
8085A3494635L7775K92266J38785j24193l8875K52329K90694L0319j49336k4790
8075A4199609K13325K62440O7697j38673r9941J42618K48735L0068k07813n0007
8065A4668058L68693M85034J30127k20234j82912Q396P494n3589R8736L02352
8055A5612155K29550P25q894J69456J79841R404R91J88864K09116j5839p8454
$$ plain form
8044 16496915 16708878 17162025 17440534 17358699 17147216 17043478 17058047 17182837 17469045 17798197
8034 17798197 17890200 17675206 17419088 17381039 17567795 17878765 18222025 18415911 18288563 18003616
8024 18003616 17978263 18309724 18592312 18523600 18386399 18621502 19158063 19528634 19519385 19363743
8014 19363743 19347845 19527727 19823758 20127441 20292976 20244820 20134850 20224062 20572219 20969285
8004 20969285 21188760 21211501 21206857 21368581 21736592 22128809 22325928 22365540 22512818 22870912
7994 22870912 23219183 23375280 23502445 23842046 24319899 24670036 24814104 24872620 24933558 25064878
7984 25064878 25411081 25982555 26476997 26627108 26610461 26782840 27134502 27398484 27577840 27898635
7974 27898635 28298670 28480486 28495258 28745068 29319786 29870052 30274087 30853020 31691989 32341056
$$ packed form
8044A6496915K11963M53147K78509q1835k11483j03738J4569J24790K86208L29152
8034A7798197R2003k14994k56118l8049J86756L10970L43260J93886j27348k84947
8024A8003616k5353L31461K82588o8712j37201K35103N36561L70571r249j55642
8014A9363743j5898J79882K96031L03683J65535m8156j09970Q9212L48157L97066
8004B0969285K19475K2741m644J61724L68011L92217J97119L9612J47278L58094
7994B2870912L48271J56097J27165L39601M77853L50137J44068N8516O0938J31320
7984B5064878L46203N71474M94442J50111j6647J72379L51662K63982J79356L20795
7974B7898635M00035J81816J4772K49810N74718N50266M04035N78933Q38969O49067
$$ plain form
7964 32341056 32557481 32806230 33551201 34503520 35116440 35462952 36027867 36894694 37763080
7955 37763080 38603453 39647639 40787039 41622665 42178783 42979533 44264452 45652242 46797904
7946 46797904 47907072 49296210 50826714 52147883 53260238 54466660 55870330 57232043
7938 57232043 58313244 59134282 59853142 60531403 61093659 61473632 61725725 61927347 61988718
7929 61988718 61700663 61042964 60278746 59589604 58790942 57651912 56344561 55235169 54307936
7920 54307936 53196793 51809245 50496739 49484117 48540726 47440640 46380751 45617637
7912 45617637 44962833 44029568 42849138 41870206 41359732 41096941 40698016 40025016 39222022
7903 39222022 38513555 38035725 37771102 37599866 37439655 37307340 37216103 37100932 36927713 36792463
$$ packed form
7964C2341056K16425K48749P44971R52319O12920L46512N64915Q66827Q68386
7955C7763080Q40373J044186J139400Q35626N56118Q00750J284919J387790J145662
7946D6797904J109168J389138J530504J321169J112355J206422J403670J361713
7938E7232043J081201Q21038P18860O78261N62256L79973K52093K01622O1371
7929F1988718k88055o57699p64218o89142p98662j139030j307351j109392r27233
7920E4307936j111143j387548j312506j012622r43391j100086j059889p63114
7912D5617637o54804r33265j180430r78932n10474k62791l98925o73000q02994
7903C9222022p08467m77830k64623j71236j60211j32315r1237j15171j73219j35250
$$ plain form
7893 36792463 36800956 36905769 36972448 36970691 37004176 37176926 37501629 37906636 38281707 38571867
7883 38571867 38873874 39366714 40102249 40962274 41864194 42855220 43904308 44770018 45248506
7874 45248506 45430685 45518101 45478661 45110878 44401132 43573345 42765895 41883194 40838289 39753982
7864 39753982 38805191 37982432 37135259 36189755 35216920 34301818 33432767 32560674 31736762
7855 31736762 31119085 30790136 30612365 30362539 29996101 29652161 29392681 29116891 28797577
7846 28797577 28592533 28576335 28558110 28379736 28227585 28364607 28659635 28719938 28479948 28318771
7836 28318771 28518975 28921218 29255653 29535160 29907985 30337745 30701710 31095592 31764494
7827 31764494 32736049 33751825 34634132 35557484 36819778 38384808 39764134 40401897 40144149
$$ packed form
7893C6792463Q493J04813O6679j757L3485J72750L24703M05007L75071K90160
7883C8571867L02007M92840P35535Q60025R01920R91026J049088Q65710M78488
7874D5248506J82179Q7416l9440l67783p09746q27787q07450q82701j044905j084307
7864C9753982r48791q22759q47173r45504r72835r15102q69051q72093q23912
7855C1736762o17677l28949j77771k49826l66438l43940k59480k75790l19314
7846B8797577k05044j6198j8225j78374j52151J37022K95028O0303k39990j61177
7836B8318771K00204M02243L34435K79507L72825M29760L63965L93882O68902
7827C1764494R71555J015776Q82307R23352J262294J565030J379326O37763k57748
$$ plain form
7818 40144149 39285736 38198427 37032077 35797565 34556914 33364104 32127472 30755105
7810 30755105 29410453 28398515 27771444 27260549 26655519 26034207 25521386 25040882 24472946
7801 24472946 23891354 23450812 23141465 22831715 22485133 22179621 21963534 21822872 21740603 21685962
7791 21685962 21619819 21598881 21744939 21988919 22027123 21748601 21536161 21825329 22461027 22875539
7781 22875539 22910046 23043481 23675394 24578033 25308895 25825015 26321781 26693368 26604249 26038409
7771 26038409 25351040 24712957 23887061 22719069 21522297 20700028 20184304 19560052 18672310
7762 18672310 17811098 17260029 16922370 16533017 16067070 15726321 15561812 15328998 14826110
7753 14826110 14244359 13978113 14078342 14111731 13712507 13113299 12865787 13085377 13295799 13106965
$$ packed form
7818D0144149q58413j087309j166350j234512j240651j192810j236632j372367
7810C0755105j344652j011938o27071n10895o05030o21312n12821m80504n67936
7801B4472946n81592m40542l09347l09750l46582l05512k16087j40662q2269n4641
7791B1685962o6143k0938J46058K43980L8204k78522k12440K89168O35698M14512
7781B2875539L4507J33435O31913R02639P30862N16120M96766L71587q9119n65840
7771B6038409o87369o38083q25896j167992j196772q22269n15724o24252q87742
7762A8672310q61212n51069l37659l89353m65947l40749j64509k32814n02888
7753A4826110n81751k66246J00229L3389l99224n99208k47512K19590K10422j88834
$$ plain form
7743 13106965 12719864 12534495 12527987 12369384 12002621 11714728 11640199 11583353 11416450 11305089
7733 11305089 11375059 11442481 11283885 10961352 10677124 10485000 10340058 10260572 10230789 10105229
7723 10105229 9840102 9674583 9824964 10111201 10161665 9919904 9680442 9661619 9798828 9935619
7713 9935619 9965551 9793508 9412503 9039078 8935839 9067908 9151937 9068852 9000381 9107715
7703 9107715 9285778 9311743 9091667 8729798 8469922 8520700 8793656 8920626 8727042 8521951
7693 8521951 8627933 8825843 8705037 8401239 8395846 8626643 8499428 7920273 7586237 7922048
7683 7922048 8402072 8398237 8104818 8036599 8116817 7963712 7716824 7812738 8136089 8146375 7787514
7672 7787514 7566198 7690979 7788974 7601313 7377589 7389918 7535148 7615352 7616527 7549685 7378480
$$ packed form
7743A3106965l87101j85369o508j58603l66763k87893p4529n6846j66903j11361
7733A1305089O9970O7422j58596l22533k84228j92124j44942p9486k9783j25560
7723A0105229k65127j65519J50381K86237N0464k41761k39462j8823J37209J36791
7713I935619K9932j72043l81005l73425j03239J32069Q4029q3085o8471J07334
7703I107715J78063K5965k20076l61869k59876N0778K72956J26970j93584k05091
7693H521951J05982J97910j20806l03798n393K30797j27215n79155l34036L35811
7683G922048M80024l835k93419o8219Q0218j53105k46888R5914L23351J0286l58861
7672G787514k21316J24781R7995j87661k23724J2329J45230Q0204J175o6842j71205
$$ plain form
7661 7378480 7229143 7310822 7521556 7510585 7241616 7099524 7301232 7591729 7682243 7607512
7651 7607512 7476143 7246492 6948952 6776007 6754799 6673701 6509292 6541677 6839166 7039499
7641 7039499 6911373 6736752 6818329 6974902 6884181 6611136 6432291 6407978 6463122 6611632
7631 6611632 6773835 6684435 6337289 6178465 6443912 6668986 6367433 5856562 5780726 6072752
7621 6072752 6113858 5807496 5721121 6101209 6483752 6496837 6406019 6538451 6691917 6521039
7611 6521039 6145693 5969903 6111875 6346277 6470233 6454357 6321363 6100661 5884635 5801576
7601 5801576 5918759 6167675 6323314 6148972 5704375 5407281 5570143 5961251 6096785 5900449
7591 5900449 5741290 5829626 5944055 5838206 5595000 5451347 5511450 5719192 5911901 5891157
$$ packed form
7661G378480j49337Q1679K10734j0971k68969j42092K01708K90497R0514p4731
7651G607512j31369k29651k97540j72945k1208q1098j64409L2385K97489K00333
7641G039499j28126j74621Q1577J56573r0721k73045j78845k4313N5144J48510
7631F611632J62203q9400l47146j58824K65447K25074l01553n10871p5836K92026
7621F072752M1106l06362q6375L80088L82543J3085r0818J32432J53466j70878
7611F521039l75346j75790J41972K34402J23956j5876j32994k20702k16026q3059
7601E801576J17183K48916J55639j74342m44597k97094J62862L91108J35534j96336
7591E900449j59159Q8336J14429j05849k43206j43653O0103K07742J92709k0744
$$ plain form
7581 5891157 5666384 5568781 5822857 6107658 5969592 5592390 5593407 6023332 6219316 5845383
7571 5845383 5423029 5481578 5777807 5815853 5629290 5522619 5468861 5334520 5345021 5718881
7561 5718881 6115074 6061195 5716600 5588540 5675388 5572462 5324001 5430557 5960193 6352342
7551 6352342 6270391 6029968 5964694 5943565 5800171 5719982 5852678 5974594 5910293 5918169 6250152
7540 6250152 6627153 6595742 6218839 5985798 6130716 6421521 6591313 6629699 6609708 6521153
7530 6521153 6383694 6332369 6468334 6715317 6904042 6959243 6964127 7055651 7271422 7511241
7520 7511241 7662122 7723257 7752921 7739863 7632690 7474214 7382630 7398189 7465107 7555860 7676154
7509 7676154 7755453 7699944 7571134 7537389 7614352 7634939 7528749 7442025 7497174 7606003 7621083
$$ packed form
7581E891157k24773r7603K54076K84801j38066l77202J017M29925J95984l73933
7571E845383m22354N8549K96229L8046j86563j06671n3758j34341J0501L73860
7561E718881L96193n3879l44595j28060Q6848j02926k48461J06556N29636L92149
7551F352342q1951k40423o5274k1129j43394q0189J32696J21916o4301P876L31983
7540F250152L77001l1411l76903k33041J44918K90805J69792L8386j9991q8555
7530F521153j37459n1325J35965K46983J88725N5201M884R1524K15771K39819
7520G511241J50881O1135K9664j3058j07173j58476r1584J5559O6918R0753J20294
7509G676154P9299n5509j28810l3745P6963K0587j06190q6724N5149J08829J5080
$$ plain form
7498 7621083 7526837 7394350 7289015 7296055 7478800 7729076 7819589 7690452 7524902 7472043
7488 7472043 7486402 7519910 7639975 7833753 7934255 7898012 7916263 8072813 8158617 8057487
7478 8057487 8027887 8279382 8538770 8465063 8296725 8563275 9222747 9649586 9563129 9425766
7468 9425766 9693318 10145502 10312843 10209546 10204660 10373016 10438912 10316517 10276829 10484860
7458 10484860 10705936 10649024 10379251 10188153 10193882 10285540 10397342 10599740 10873103 10995971
7448 10995971 10810844 10500337 10419167 10660877 10954336 11034725 10960544 10947989 11012809 10969841
7438 10969841 10770327 10636323 10763494 11028533 11153316 11106859 11153069 11454948 11818327 11978008
7428 11978008 12001132 12166351 12492462 12690489 12651630 12657759 12909339 13144678 13053574 12843724
$$ packed form
7498G621083r4246j32487j05335P040J82745K50276R0513j29137j65550n2859
7488G472043J4359L3508J20065J93778J00502l6243J8251J56550Q5804j01130
7478H057487k9600K51495K59388p3707j68338K66550O59472M26839q6457j37363
7468I425766K67552M52184J67341j03297m886J68356O5896j22395l9688K08031
7458A0484860K21076n6912k69773j91098N729R1658J11802K02398K73363J22868
7448A0995971j85127l10507q1170K41710K93459Q0389p4181j2555O4820m2968
7438A0969841j99514j34004J27171K65039J24783m6457M6210L01879L63379J59681
7428A1978008K3124J65219L26111J98027l8859O129K51580K35339r1104k09850
$$ plain form
7418 12843724 12972408 13427446 13738489 13691182 13555437 13545005 13557106 13600847 13944282 14538937
7408 14538937 14802884 14407524 13871755 13873433 14301139 14552481 14514231 14593287 14896576 15073294
7398 15073294 15019473 15092245 15448021 15731922 15684269 15584963 15788809 16196731 16508951 16702904
7388 16702904 16936117 17199917 17382843 17537991 17831362 18306817 18859814 19346940 19639198
7379 19639198 19724371 19809503 20100052 20433742 20440226 20142287 20004714 20213908 20347888 20057288
7369 20057288 19639805 19512069 19492292 19161907 18671034 18535636 18739042 18710399 18265166 17929953
7359 17929953 18106267 18460201 18500865 18347640 18463689 18857138 19035542 18748002 18380586 18460278
7349 18460278 18989763 19487385 19624628 19609715 19844863 20356958 20796637 20978016 21129461 21484541
$$ packed form
7418A2843724J28684M55038L11043m7307j35745j0432J2101M3741L43435N94655
7408A4538937K63947l95360n35769J678M27706K51342l8250P9056L03289J76718
7398A5073294n3821P2772L55776K83901m7653r9306K03846M07922L12220J93953
7388A6702904K33213K63800J82926J55148K93371M75455N52997M87126K92258
7379A9639198Q5173Q5132K90549L33690O484k97939j37573K09194J33980k90600
7369B0057288m17483j27736j9777l30385m90873j35398K03406k8643m45233l35213
7359A7929953J76314L53934M0664j53225J16049L93449J78404k87540l67416P9692
7349A8460278N29485M97622J37243j4913K35148N12095M39679J81379J51445L55080
$$ plain form
7339 21484541 21902558 22147414 22321482 22664547 23043094 23065401 22723997 22506180 22720499 23066365
7329 23066365 23095933 22818272 22554146 22386611 22104626 21639165 21219446 21002008 20785941 20280949
7319 20280949 19543801 18937022 18651943 18478248 18155123 17765833 17551975 17449044 17150418
7310 17150418 16656098 16368586 16473602 16602622 16405004 16110475 16101634 16204981 15959047 15450517
7300 15450517 15262532 15555748 15806182 15633277 15338528 15333031 15496602 15475242 15260994 15081972
7290 15081972 14966576 14790989 14583198 14450809 14347403 14186941 14034477 13922517 13664316
7281 13664316 13144042 12610917 12355838 12252815 11975183 11534253 11214208 11056150 10819348
7272 10819348 10442973 10147975 10032084 9923797 9718941 9535670 9436309 9300863 9099736 9006564
$$ packed form
7339B1484541M18017K44856J74068L43065L78547K2307l41404k17817K14319L45866
7329B3066365K9568k77661k64126j67535k81985m65461m19719k17438k16067n04992
7319B0280949p37148o06779k85079j73695l23125l89290k13858j02931k98626
7310A7150418m94320k87512J05016J29020j97618k94529q841J03347k45934n08530
7300A5450517j87985K93216K50434j72905k94749n497J63571k1360k14248j79022
7290A5081972j15396j75587k07791j32389j03406j60462j52464j11960k58201
7281A3664316n20274n33125k55079j03023k77632m40930l20045j58058k36802
7272A0819348l76375k94998j15891j08287k04856j83271r9361j35446k01127r3172
$$ plain form
7262 9006564 9079273 9071265 8753447 8258983 7928395 7911050 8051988 8104927 7966113 7737692
7252 7737692 7593924 7560112 7477862 7256662 7040519 6979005 6977306 6902426 6886933 7089125 7249956
7241 7249956 6929504 6214426 5737079 5848343 6183637 6253640 6075478 5940975 5900972 5824631
7231 5824631 5722670 5667755 5578876 5400587 5321488 5488560 5660882 5501095 5104584 4883007
7221 4883007 4978404 5127588 5079925 4838469 4509140 4217547 4156148 4391928 4627345 4490892
7211 4490892 4093116 3932268 4170678 4390132 4236577 3950650 3985067 4345940 4617373 4507408
7201 4507408 4115939 3738268 3601503 3732980 3928184 3906401 3621788 3340875 3306763 3450557
7191 3450557 3570157 3644430 3766513 3881604 3842696 3682442 3583375 3573329 3484836 3267157
$$ packed form
7262I006564P2709q008l17818m94464l30588j7345J40938N2939j38814k28421
7252G737692j43768l3812q2250k21200k16143o1514j699p4880j5493K02192J60831
7241G249956l20452p15078m77347J11264L35294P0003j78162j34503m0003p6341
7231E824631j01961n4915q8879j78289p9099J67072J72322j59787l96511k21577
7221D883007R5397J49184m7663k41456l29329k91593o1399K35780K35417j36453
7211D490892l97776j60848K38410K19454j53555k85927L4417L60873K71433j09965
7201D507408l91469l77671j36765J31477J95204k1783k84613k80913l4112J43794
7191C450557J19600P4273J22083J15091l8908j60254r9067j0046q8493k17679
$$ plain form
7181 3267157 3122297 3224136 3458149 3562218 3430668 3178677 2975506 2903193 2937227 2994845
7171 2994845 3011658 2987078 2933328 2819397 2655161 2590388 2759669 3003046 2950199 2510025
7161 2510025 2096209 2156554 2587614 2869948 2756812 2554854 2644857 2965101 3142593 2992011
7151 2992011 2687290 2489918 2475443 2535765 2533478 2422999 2279388 2219539 2271420 2353044 2400642
7140 2400642 2437652 2469257 2429435 2340611 2390174 2653275 2836317 2569371 1954001 1534290
7130 1534290 1633053 1974318 2110746 1987264 1863436 1864259 1892220 1901222 1971423 2095384 2117830
7119 2117830 1957918 1745300 1672412 1797700 2015563 2152372 2109710 1978921 1952571 2038280
7109 2038280 1979191 1621820 1240627 1241238 1600599 1901722 1928617 1892874 1982121 2031982 1851257
$$ packed form
7181C267157j44860J01839K34013J04069j31550k51991k03171p2313L4034N7618
7171B994845J6813k4580n3750j13931j64236o4773J69281K43377n2847m40174
7161B510025m13816O0345M31060K82334j13136k01958R0003L20244J77492j50582
7151B992011l04721j97372j4475O0322k287j10479j43611n9849N1881Q1624M7598
7140B400642L7010L1605l9822q8824M9563K63101J83042k66946o15370m19711
7130A534290R8763L41265J36428j23482j23828Q23K7961R002P0201J23961K2446
7119B117830j59912k12618p2888J25288K17863J36809m2662j30789k6350Q5709
7109B038280n9089l57371l81193O11L59361L01123K6895l5743Q9247M9861j80725
$$ plain form
7098 1851257 1584676 1473762 1462424 1350501 1206755 1293741 1618926 1874408 1863459 1724678
7088 1724678 1653089 1621489 1498411 1281046 1082081 987831 1030794 1213544 1459097 1608376
7078 1608376 1572734 1449983 1396769 1414538 1365768 1209834 1114274 1254377 1554951 1741816
7068 1741816 1668529 1486355 1415071 1441224 1390152 1249177 1214388 1372650 1538606 1522729 1388435
7057 1388435 1283425 1170447 947737 736845 783965 1085027 1354330 1406367 1351864 1352022 1389552
7046 1389552 1386304 1358612 1317998 1174886 906557 704326 767875 1012482 1156792 1086089 970131
7035 970131 997333 1125858 1167196 1045043 893005 893565 1055600 1192053 1142819 977278 894119
7024 894119 936967 941921 815212 717990 844346 1109296 1231215 1104876 924535 898483 986098
$$ packed form
7098A851257k66581j10914j1338j11923j43746Q6986L25185K55482j0949j38781
7088A724678p1589l1600j23078k17365j98965r4250M2963J82750K45553J49279
7078A608376l5642j22751n3214J7769m8770j55934r5560J40103L00574J86865
7068A741816p3287j82174p1284K6153n1072j40975l4789J58262J65956j5877j34294
7057A388435j05010j12978k22710k10892M7120L01062K69303N2037n4503J58L7530
7046A389552l248k7692m0614j43112k68329k02231O3549K44607J44310p0703j15958
7035I70131K7202J28525M1338j22153j52038N60J62035J36453m9234j65541q3159
7024H94119M2848M954j26709r7222J26356K64950J21919j26339j80341k6052Q7615
$$ plain form
7013 986098 1007191 913654 828486 843368 896972 890355 838545 828478 864345 860485 807429 832223
7001 832223 1006870 1183073 1159558 980663 898606 1012048 1119572 1026646 843740 823819
6991 823819 999660 1164760 1184445 1147585 1175294 1221752 1150010 939174 738177 711685 851251
6980 851251 956534 845425 590214 463504 595212 778811 731804 476656 304445 383392
6970 383392 580483 705318 760530 855004 990660 1061059 1011294 903386 839410 867867 937726
6959 937726 922055 746373 521264 460682 612413 767412 732376 600526 607044 775122 901790
6948 901790 908973 982739 1229707 1379895 1094812 534555 315911 755664 1372724 1420128
6938 1420128 842959 383074 634818 1290535 1576740 1252120 807265 691761 746881 603112
$$ packed form
7013I86098K1093r3537q5168J4882N3604o617n1810j0067L5867l860n3056K4794
7001H32223J74647J76203k3515j78895q2057J13442J07524r2926j82906j9921
6991H23819J75841J65100J9685l6860K7709M6458p1742k10836k00997k6492J39566
6980H51251J05283j11109k55211j26710J31708J83599m7007k55148j72211P8947
6970C83392J97091J24835N5212R4474J35656P0399m9765j07908o3976K8457O9859
6959I37726j5671j75682k25109o0582J51731J54999l5036j31850O518J68078J26668
6948I01790P183P3766K46968J50188k85083n60257k18644M39753O17060M7404
6938A420128n77169m59885K51744O55717K86205l24620m44855j15504N5120j43769
$$ plain form
6928 603112 328733 314894 625813 867950 791772 673665 857579 1160440 1099532 642509
6918 642509 327782 519629 895094 937298 680335 580351 765856 869007 661558 426103
6908 426103 479350 670545 665444 493873 462511 651953 840658 868902 771543 593610 383355
6897 383355 339142 626494 1034425 1158254 971950 854891 961752 972870 661346 315243
6887 315243 297926 503646 598613 559613 591491 681038 640703 520548 586502 873360 1083632
6876 1083632 994760 727684 551645 592747 758368 829054 670230 454246 521891 863312
6866 863312 974541 530762 -27499 -15128 537084 953882 891254 667426 561962 406955
6856 406955 109139 3868 303231 634049 564410 263059 193598 405673 574969 563282
$$ packed form
6928F03112k74379j3839L10919K42137p6178j18107J83914L02861o0908m57023
6918F42509l14727J91847L75465M2204k56963r9984J85505J03151k07449k35455
6908D26103N3247J91195n101j71571l1362J89442J88705K8244r7359j77933k10255
6897C83355m4213K87352M07931J23829j86304j17059J06861J1118l11524l46103
6887C15243j7317K05720R4967l9000L1878Q9547m0335j20155O5954K86858K10272
6876A083632q8872k67076j76039M1102J65621P0686j58824k15984O7645L41421
6866H63312J11229m43779n58261J2371N52212M16798o2628k23828j05464j55007
6856D06955k97816j05271K99363L30818o9639l01351o9461K12075J69296j1687
$$ plain form
6846 563282 501291 437731 321580 252406 357895 480691 368099 136036 158530 493952
6836 493952 799857 860090 831110 880017 920958 846300 734231 675913 622351 533218 478633
6825 478633 480238 438425 324999 277178 397740 602840 737394 711503 509319 235911 148455
6814 148455 407612 778155 839945 543056 267865 265189 363297 357270 340121 433779 509054
6803 509054 446441 405266 529304 623187 467379 261138 362362 706844 890019 777981
6793 777981 633244 608660 516933 233824 -2580 93888 450976 744282 790231 678583
6783 678583 591667 615416 691098 681029 516437 315169 292855 508215 742917 698317 319673
6772 319673 -104513 -210180 51332 348446 370775 213094 190192 338794 398199 313600
$$ packed form
6846E63282o1991o3560j16151o9174J05489J22796j12592k32063K2494L35422
6836D93952L05905O0233k8980M8907M0941p4658j12069n8318n3562q9133n4585
6825D78633J605m1813j13426m7821J20562K05100J34554k5891k02184k73408q7456
6814A48455K59157L70543O1790k96889k75191k676R8108o027j7149R3658P5275
6803E09054o2613m1175J24038R3883j55808k06241J01224L44482J83175j12038
6793G77981j44737k4584r1727k83109k36404R6468L57088K93306M5949j11648
6783F78583q6916K3749P5682j0069j64592k01268k2314K15360K34702m4600l78644
6772C19673m24186j05667K61512K97114K2329j57681k2902J48602N9405q4599
$$ plain form
6762 313600 373916 661260 757929 361161 -128319 -116551 286158 438882 169508 -8588
6752 -8588 233518 550189 544013 360149 307189 306704 151961 9683 187055 566639 729238
6741 729238 573053 398843 383444 358999 199002 92044 262792 623730 865569 794688
6731 794688 491979 215751 192346 416259 619085 516544 123792 -234955 -254207 61774
6721 61774 437550 601660 510945 334299 235554 208387 175939 197253 414394 767889 956041
6710 956041 794491 463943 256988 219353 219472 241868 369276 532742 531609 320131 73874
6699 73874 -58723 -95119 -79993 12053 170652 296608 337102 364601 445919 520142 484660
6688 484660 351519 252146 292926 426869 482071 352277 153686 109660 260750 408207
$$ packed form
6762C13600O0316K87344R6669l96768m89480J1768M02709J52724k69374j78096
6752h588K42106L16671o176j83864n2960m85j54743j42278J77372L79584J62599
6741G29238j56185j74210j5399k4445j59997j06958J70748L60938K41839p0881
6731G94688l02709k76228k3405K23913K02826j02541l92752l58747j9252L15981
6721F1774L75776J64110r0715j76646r8745k7167l2448K1314K17141L53495J88152
6710I56041j61550l30548k06955l7635J19K2396J27408J63466j133k11478k46257
6699G3874j32597l6396J5126R2046J58599J25956M0494K7499Q1318P4223l5482
6688D84660j33141r9373M0780J33943N5202j29794j98591m4026J51090J47457
$$ plain form
6678 408207 392886 276718 163217 31981 -96122 -41343 245558 460730 330647 85894
6668 85894 176231 572690 771230 530353 192006 138633 302066 405320 380280 316100 235752
6657 235752 150109 146818 236495 283491 238399 236620 324332 336714 227141 234183 472424 637977
6645 637977 452014 163676 216001 566259 763731 633319 452879 434729 438661 306925
6635 306925 144728 106402 149569 160159 141879 148854 171327 193812 245407 308249 291003 174554
6623 174554 85805 144576 301243 392894 331996 201382 154375 215173 230826 115062 68022
6612 68022 322085 676179 638133 166190 -139029 122008 517659 456767 133084 163155
6602 163155 509681 546284 174393 41099 440497 795981 634192 367167 547418 915937
$$ packed form
6678D08207j5321j16168j13501j31236j28103N4779K86901K15172j30083k44753
6668H5894R0337L96459J98540k40877l38347n3373J63433J03254k5040o4180q0348
6657B35752q5643l291Q9677M6996m5092j779Q7712J2382j09573P042K38241J65553
6645F37977j85963k88338N2325L50258J97472j30412j80440j8150L932j31736
6635C06925j62197l8326M3167J0590j8280O975K2473K2485N1595O2842j7246j16449
6623A74554q8749N8771J56667R1651o0898j30614m7007O0798J5653j15764m7040
6612F8022K54063L54094l8046m71943l05219K61037L95651o0892l23683L0071
6602A63155L46526L6603l71891j33294L99398L55484j61789k67025J80251L68519
$$ plain form
6592 915937 864666 449014 224989 312266 327315 156495 122432 341067 502598 417274 293631
6581 293631 324566 403684 401338 370931 349582 276484 217682 341832 561211 545484 241365
6570 241365 34372 201202 519511 645196 582955 523280 474346 360742 295503 435380
6560 435380 671469 735649 550133 263582 29345 -53441 108415 472769 765305 749782
6550 749782 540984 427974 454505 434768 344664 387396 615057 770003 638927 357535
6540 357535 208975 270846 419365 566129 706894 784269 688149 440204 263812 377523
6530 377523 733155 1020412 971614 654044 413911 505181 817135 1023989 974987 848802
6520 848802 896841 1108007 1210557 1011920 667916 533391 733039 974606 893406 541884
$$ packed form
6592I15937n1271m15652k24025Q7277J5049j70820l4063K18635J61531q5324j23643
6581B93631L0935P9118k346l0407k1349p3098n8802J24150K19379j5727l04119
6570B41365k06993J66830L18309J25685o2241n9675m8934j13604o5239J39877
6560D35380K36089O4180j85516k86551k34237q2786J61856L64354K92536j5523
6550G49782k08798j13010K6531j9737r0104M2732K27661J54946j31076k81392
6540C57535j48560O1871J48519J46764J40765P7375r6120k47945j76392J13711
6530C77523L55632K87257m8798l17570k40133R1270L11954K06854m9002j26185
6520H48802M8039K11166J02550j98637l44004j34525J99648K41567q1200l51522
$$ plain form
6510 541884 373243 680756 1204571 1439510 1248593 986582 1016663 1290966 1500782 1506568
6500 1506568 1450536 1467745 1466754 1305904 1087670 1087653 1354637 1557999 1380852 962271 750222
6489 750222 940493 1269442 1392381 1253556 1000138 750501 603358 683916 953204 1089554
6479 1089554 813493 296593 20852 218953 643681 919708 945314 881827 886864 956210
6469 956210 978753 896931 804647 834024 929882 872545 615173 423443 497387 631240 532092
6458 532092 337811 433011 791145 944633 701661 455481 566551 817156 789193 503149
6448 503149 333329 459509 721168 906782 920736 762447 572992 586739 817491 947179
6438 947179 769503 547384 609773 791471 698829 403438 369044 695667 944912 821391
$$ packed form
6510E41884j68641L07513N23815K34939j90917k62011L0081K74303K09816N786
6500A506568n6032J7209r91j60850k18234j7K66984K03362j77147m18581k12049
6489G50222J90271L28949J22939j38825k53418k49637j47143Q0558K69288J36350
6479A089554k76061n16900k75741J98101M24728K76027K5606o3487N037O9346
6469I56210K2543q1822r2284K9377R5858n7337k57372j91730P3944J33853r9148
6458E32092j94281R5200L58134J53488k42972k46180J11070K50605k7963k86044
6448E03149j69820J26180K61659J85614J3954j58289j89455J3747K30752J29688
6438I47179j77676k22119O2389J81698r2642k95391l4394L26623K49245j23521
$$ plain form
6428 821391 563630 483245 528911 530359 519397 561878 563916 472180 403598 395221 328727 277645
6416 277645 543424 1090926 1373324 1093170 734663 856497 1211098 1165800 743419 551863
6406 551863 783380 997688 937823 868837 948749 915039 661566 546594 787886 1048718
6396 1048718 992883 806324 779437 796208 676349 625859 837725 990889 727811 361663
6386 361663 463376 911983 1047630 729314 532760 790799 1109772 1082421 895169 890302
6376 890302 1002256 1009561 970220 1020377 1042907 910739 796394 865319 907068 680763 419730
6365 419730 533839 938517 1156856 1044415 939258 1055750 1185763 1124187 986737 926791
6355 926791 883256 814848 871777 1091472 1201061 1014713 808047 964731 1391127 1627954
$$ packed form
6428H21391k57761q0385M5666J448j0962M2481K038r1736o8582q377o6494n1082
6416B77645K65779N47502K82398k80154l58507J21834L54601m5298m22381j91556
6406E51863K31517K14308n9865o8986P9912l3710k53473j14972K41292K60832
6396A048718n5835j86559k6887J6771j19859n0490K11866J53164k63078l66148
6386C61663J01713M48607J35647l18316j96554K58039L18973k7351j87252m867
6376H90302J11954P305l9341N0157K2530j32168j14345O8925M1749k26305k61033
6365D19730J14109M04678K18339j12441j05157J16492J30013o1576j37450n9946
6355I26791m3535o8408N6929K19695J09589j86348k06666J56684M26396K36827
$$ plain form
6345 1627954 1483158 1220361 1115884 1148543 1197928 1257896 1318703 1277153 1138594 1120124 1347765
6334 1347765 1582459 1473833 1027960 616229 534821 734080 977173 1080716 980085 752784
6324 752784 639474 856403 1289539 1543353 1413203 1145712 1081549 1210124 1288751 1253871
6314 1253871 1229766 1212253 1074621 892991 925186 1174223 1293145 1087757 832160 870086
6304 870086 1144525 1372969 1474190 1521555 1449571 1168465 877181 881762 1114595 1203468 1058463
6293 1058463 1011339 1253580 1505631 1464774 1280414 1295816 1519633 1658732 1568090 1392278
6283 1392278 1307445 1351237 1479125 1590810 1532469 1271733 1049290 1146588 1490348 1694106
6273 1694106 1546994 1280905 1262502 1551733 1866588 1915523 1697482 1502934 1616220 1971784
$$ packed form
6345A627954j44796k62797j04477L2659M9385N9968O0807m1550j38559j8470K27641
6334A347765K34694j08626m45873m11731q1408J99259K43093J03543j00631k27301
6324G52784j13310K16929M33136K53814j30150k67491o4163J28575P8627l4880
6314A253871k4105j7513j37632j81630L2195K49037J18922k05388k55597L7926
6304H70086K74439K28444J01221M7365p1984k81106k91284M581K32833Q8873j45005
6293A058463m7124K42241K52051m0857j84360J5402K23817J39099r0642j75812
6283A392278q4833M3792J27888J11685n8341k60736k22443R7298L43760K03758
6273A694106j47112k66089j8403K89231L14855M8935k18041j94548J13286L55564
$$ plain form
6263 1971784 2171752 1959667 1589122 1511284 1750976 1904636 1804439 1801256 2160314 2519427
6253 2519427 2352458 1785957 1481675 1725313 2096361 2156650 2028754 2039182 2146444 2091088
6243 2091088 1894132 1806599 1861807 1862074 1791141 1865907 2121489 2295216 2245929 2175262 2266983
6232 2266983 2396777 2410169 2414691 2523834 2552755 2313361 2035004 2089563 2387752 2482672 2276596
6221 2276596 2172869 2413072 2703872 2732179 2662540 2787756 2986169 2942437 2726844 2703876
6211 2703876 2923668 3054833 2972304 2971990 3229766 3448725 3353512 3231607 3547981 4148598
6201 4148598 4335735 3830941 3238687 3272333 3800639 4065417 3759452 3438690 3706551 4343673
6191 4343673 4600441 4218600 3764299 3859873 4403486 4795343 4767471 4662574 4865302 5255594
$$ packed form
6263A971784J99968k12085l70545p7838K39692J53660j00197l183L59058L59113
6253B519427j66969n66501l04282K43638L71048O0289j27896J0428J07262n5356
6243B091088j96956q7533N5208K67p0933P4766K55582J73727m9287p0667R1721
6232B266983J29794J3392M522J09143K8921k39394k78357N4559K98189R4920k06076
6221B276596j03727K40203K90800K8307o9639J25216J98413m3732k15593k2968
6211B703876K19792J31165q2529l14K57776K18959r5213j21905L16374O00617
6201D148598J87137n04794n92254L3646N28306K64778l05965l20762K67861O37122
6191D343673K56768l81841m54301R5574N43613L91857k7872j04897K02728L90292
$$ plain form
6181 5255594 5430559 5305249 5200749 5335938 5530732 5565483 5586257 5867827 6310635 6533062
6171 6533062 6460053 6449158 6725301 7048220 7142727 7127458 7224852 7333436 7266280 7199420 7441449
6160 7441449 7875921 8091952 8027641 8022413 8214508 8364056 8367843 8476456 8817614 9126087
6150 9126087 9182268 9162986 9316217 9603515 9894855 10212745 10554925 10776134 10869522 11056720
6140 11056720 11386594 11600001 11630682 11830553 12384500 12928778 13148025 13332255 13853528 14470093
6130 14470093 14726755 14750961 15030617 15600438 16063079 16289809 16520239 16863467 17244078 17736574
6120 17736574 18414504 18992099 19174391 19228099 19621659 20258214 20706039 21012513 21548707 22188468
6110 22188468 22477932 22556779 23019556 23849356 24420901 24642689 25115682 25993141 26703034 27070847
$$ packed form
6181E255594J74965j25310j04500J35189J94794L4751K0774K81570M42808K22427
6171F533062p3009j0895K76143L22919R4507j5269R7394J08584o7156o6860K42029
6160G441449M34472K16031o4311n228J92095J49548L787J08613L41158L08473
6150I126087N6181j9282J53231K87298K91340L17890L42180K21209R3388J87198
6140A1056720L29874K13407L0681J99871N53947N44278K19247J84230N21273O16565
6130A4470093K56662K4206K79656N69821M62641K26730K30430L43228L80611M92496
6120A7736574O77930N77595J82292N3708L93560O36555M47825L06474N36194O39761
6110B2188468K89464P8847M62777Q29800N71545K21788M72993Q77459P09893L67813
$$ plain form
6100 27070847 27688827 28804276 29848404 30493397 31187087 32203097 33203112 34214201 35890257
6091 35890257 38199512 40054864 40991699 41993065 43801168 45710362 47072121 48649356
6083 48649356 51190596 53958227 56158661 58589849 62201747 66240939 69716273 73531048
6075 73531048 79035569 85620487 92147328 99537906 109054222 119342288 129083505 141626369
6067 141626369 161580654 185823650 203387658 207216378 201727808 195230728 188888708 178087857
6059 178087857 161893737 145075935 131214220 119200137 107475783 97249039 89753404
6052 89753404 83736822 77711783 72254421 68259126 64926881 61219962 57670316 55129863
6044 55129863 53103161 50802835 48627198 47159261 45792718 43749903 41508121 39866558
$$ packed form
6100B7070847O17980J115449J044128O44993O93690J016010J000015J011089J676056
6091C5890257K309255J855352R36835J001366J808103J909194J361759J577235
6083D8649356K541240K767631K200434K431188L611898M039192L475334L814775
6075G3531048N504521O584918O526841P390578R516316J0288066R741217J2542864
6067A41626369J9954285K4242996J7564008L828720n488570o497080o342020j0800851
6059A78087857j6194120j6817802j3861715j2014083j1724354j0226744p495635
6052H9753404o016582o025039n457362l995295l332245l706919l549646k540453
6044E5129863k026702k300326k175637j467937j366543k042815k241782j641563
$$ plain form
6036 39866558 38462530 36550663 34476553 33020349 31933349 30476743 28866006 27829061
6028 27829061 27162111 26079186 24702765 23875173 23638368 23176949 22251492 21490793 21169261
6019 21169261 20796396 20101504 19437762 18975779 18375777 17519944 16795094 16392754 16014548
6010 16014548 15488828 15032272 14708244 14258681 13662399 13246928 13066883 12782548 12330402
6001 12330402 12079572 12117719 12035397 11682204 11481122 11647828 11719631 11290543 10678658 10390701
5991 10390701 10365638 10227609 9927110 9665695 9475748 9299115 9222783 9248398 9094237 8623023
5981 8623023 8205396 8225730 8449836 8350219 7901919 7571259 7585394 7682717 7606218 7424155
5971 7424155 7272775 7130592 6981434 6929061 6991448 6972076 6700979 6302718 6083787 6170840
$$ packed form
6036C9866558j404028j911867k074110j456204j087000j456606j610737j036945
6028B7829061o66950j082925j376421q27592k36805m61419r25457p60699l21532
6019B1169261l72865o94892o63742m61983o00002q55833p24850m02340l78206
6010A6014548n25720m56556l24028m49563n96282m15471j80045k84335m52146
6001A2330402k50830L8147q2322l53193k01082J66706P1803m29088o11885k87957
5991A0390701k5063j38029l00499k61415j89947j76633p6332K5615j54161m71214
5981H623023m17627K0334K24106r9617m48300l30660J4135R7323p6499j82063
5971G424155j51380j42183j49158n2373O2387j9372k71097l98261k18931Q7053
$$ plain form
5961 6170840 6344205 6272977 5911405 5593760 5652171 5993508 6207659 6074917 5761589 5496498
5951 5496498 5316443 5221167 5288653 5454375 5443014 5160132 4913221 4964554 5098562 4981885
5941 4981885 4740494 4733725 4894209 4824510 4532322 4486269 4803108 4962214 4633782 4266798
5931 4266798 4389239 4733630 4653447 4164973 3904014 4096617 4252539 4021265 3721912 3716824
5921 3716824 3796044 3622392 3380004 3458298 3751400 3811540 3559783 3328878 3274406 3250641
5911 3250641 3239285 3375997 3530302 3404387 3119944 3126585 3398473 3366565 2890044 2602814
5901 2602814 2890915 3207662 2980679 2579663 2642407 2947588 2842611 2444974 2434162 2802835
5891 2802835 2839805 2399643 2177387 2486134 2710660 2378692 1937818 1948127 2210539 2278292
$$ packed form
5961F170840J73365p1228l61572l17645N8411L41337K14151j32742l13328k65091
5951E496498j80055r5276O7486J65722j1361k82882k46911N1333J34008j16677
5941D981885k41391o769J60484o9699k92188m6053L16839J59106l28432l66984
5931D266798J22441L44391q0183m88474k60959J92603J55922k31274k99353n088
5921C716824P9220j73652k42388P8294K93102O0140k51757k30905n4472k3765
5911C250641j1356J36712J54305j25915k84443O641K71888l1908m76521k87230
5901B602814K88101L16747k26983m01016O2744L05181j04977l97637j0812L68673
5891B802835L6970m40162k22256L08747K24526l31968m40874J0309K62412O7753
$$ plain form
5881 2278292 2232939 2321861 2327581 1979989 1620938 1763574 2233239 2403145 2133752 1865772
5871 1865772 1859899 1917880 1859008 1775280 1762778 1794615 1889002 2064637 2142160 1928519 1585315
5860 1585315 1483428 1693184 1925463 1976124 1934224 1935764 1971666 1968774 1880078 1718812 1624766
5849 1624766 1757785 1982349 1903095 1444815 1098758 1254438 1593338 1590650 1332099 1271936
5839 1271936 1397701 1300482 988988 931191 1227443 1408456 1220723 1014377 1121210 1369234
5829 1369234 1469245 1428630 1334431 1142885 921287 904484 1089394 1160865 1018628 955583
5819 955583 1100526 1151765 941308 788213 938868 1104678 973394 776704 874668 1111896
5809 1111896 1100461 892025 850395 1025627 1146420 1119998 1081289 1027569 839657 614585
$$ packed form
5881B278292m5353Q8922N720l47592l59051J42636M69665J69906k69393k67980
5871A865772n873N7981n8872q3728j2502L1837R4387J75635P7523k13641l43204
5860A585315j01887K09756K32279N0661m1900J540L5902k892q8696j61266r4046
5849A624766J33019K24564p9254m58280l46057J55680L38900k688k58551o0163
5839A271936J25765r7219l11494n7797K96252J81013j87733k06346J06833K48024
5829A369234J00011m0615r4199j91546k21598j6803J84910P1471j42237o3045
5819I55583J44943N1239k10457j53095J50655J65810j31284j96690R7964K37228
5809A111896j1435k08436m1630J75232J20793k6422l8709n3720j87912k25072
$$ plain form
5799 614585 567519 636805 582401 458786 581617 980200 1265688 1157689 839287 656509
5789 656509 697537 806000 850379 847055 873454 922575 865311 626566 390180 449821 792430
5778 792430 1052855 1003641 836982 786187 758111 607723 495581 613281 773138 675322
5768 675322 429431 391760 582582 685655 581021 475938 514000 624595 765003 964113
5758 964113 1117833 1068662 887908 770889 694339 516640 353962 454866 731460 846786
5748 846786 771340 797743 962134 935277 604355 305109 310800 491643 634296 713746 712725
5737 712725 568435 425525 522749 719332 622980 318144 374973 896419 1203968 860512
5727 860512 373584 350360 537015 380781 72624 209413 694680 835659 468686 193989
$$ packed form
5799F14585m7066O9286n4404j23615J22831L98583K85488j07999l18402j82778
5789F56509M1028J08463M4379l324K6399M9121n7264k38745k36386N9641L42609
5778G92430K60425m9214j66659n0795k8076j50388j12142J17700J59857r7816
5768F75322k45891l7671J90822J03073j04634j05083L8062J10595J40408J99110
5758I64113J53720m9171j80754j17019p6550j77699j62678J00904K76594J15326
5748H46786p5446K6403J64391k6857l30922k99246N691J80843J42653P9450j021
5737G12725j44290j42910R7224J96583r6352l04836N6829N21446L07549l43456
5727H60512m86928k3224J86655j56234l08157J36789M85267J40979l66973k74697
$$ [...]
##END NTUPLES=NMR SPECTRUM
##END=
