##TITLE=1H ikalashn
EC-3331(II-1)x22
19.9.2024
##JCAMPDX= 6.0         $$ Bruker NMR JCAMP-DX V2.0
##DATA TYPE= NMR SPECTRUM
##DATA CLASS= NTUPLES
##ORIGIN= UXNMR, Bruker Analytische Messtechnik GmbH
##OWNER= root
$$ TOPSPIN		Version 1.3
$$ 2024-09-19 11:05:05.734 +0400  Irina@DPX200
$$ Compression mode = diff/dup
##.OBSERVE FREQUENCY= 200.131392401
##.OBSERVE NUCLEUS= ^1H
##.ACQUISITION MODE= SIMULTANEOUS
##.ACQUISITION SCHEME= undefined
##.AVERAGES= 16
##.DIGITISER RES= 18
##SPECTROMETER/DATA SYSTEM= spect
##.PULSE SEQUENCE= zg
##.SOLVENT NAME= CDCl3
##.SHIFT REFERENCE= INTERNAL, CDCl3, 1, 17.95386
##AUDIT TRAIL= $$ (NUMBER, WHEN, WHO, WHERE, WHAT)
$$ ##TITLE= Audit trail, TOPSPIN		Version 1.3
$$ ##JCAMPDX= 5.01
$$ ##ORIGIN= Bruker BioSpin GmbH
$$ ##OWNER= Irina
$$ $$ F:/spectra/data/iren/nmr/1H/4/pdata/1/auditp.txt
$$ ##AUDIT TRAIL=  $$ (NUMBER, WHEN, WHO, WHERE, VERSION, WHAT)
(   1,<2024-09-19 11:03:35.906 +0400>,<Irina>,<DPX200>,<TOPSPIN 1.3>,
      <acquisition in progress>)
(   2,<2024-09-19 11:04:42.656 +0400>,<Irina>,<DPX200>,<TOPSPIN 1.3>,
      <Start of raw data processing
       efp BC_mod = 2 LB = 0.02 FT_mod = 6 PKNL = 1 PHC0 = 307.1758 PHC1 = 3.520618 SI = 32K 
       data hash MD5: 32K
       1D BE 79 46 66 2E BB 0A 44 A4 C6 95 E3 18 78 C0>)
(   3,<2024-09-19 11:04:45.109 +0400>,<Irina>,<DPX200>,<TOPSPIN 1.3>,
      <apk 
       data hash MD5: 32K
       F9 82 BE 46 3A 1B 03 0E 99 8A 21 19 28 47 AE 9F>)
(   4,<2024-09-19 11:04:55.968 +0400>,<Irina>,<DPX200>,<TOPSPIN 1.3>,
      <pk fgphup PHC0 = -11.49956 PHC1 = 14.8 
       data hash MD5: 32K
       70 80 C9 D7 74 AC DB 20 BD 47 47 ED CA E9 59 D3>)
(   5,<2024-09-19 11:04:57.875 +0400>,<Irina>,<DPX200>,<TOPSPIN 1.3>,
      <abs n ABSG = 5 
       data hash MD5: 32K
       EC DC 00 65 78 78 0D 4B 55 D8 19 61 63 8D F6 6B>)
$$ ##END=
$$ 
$$ $$ hash MD5
$$ $$ B3 A7 04 1F 4F DC A6 4A C3 F5 A6 C6 5A C9 11 52
##$RELAX= 
##$RELAX= 
##$RELAX= 
##$RELAX= 
##$RELAX= 
##$RELAX= 
##$RELAX= 
##$RELAX= 
##$RELAX= 
$$ Bruker specific parameters
$$ --------------------------
##$DU= <F:/spectra>
##$EXPNO= 4
##$NAME= <1H>
##$PROCNO= 1
##$TYPE= <nmr>
##$USER= <iren>
##$AMP= (0..31)
100 100 100 100 100 100 100 100 100 100 100 100 100 100 100 100 100 100 
100 100 100 100 100 100 100 100 100 100 100 100 100 100 
##$ANAVPT= -1
##$AQSEQ= 0
##$AQ_mod= 1
##$AUNM= <au_zg>
##$AUTOPOS= <>
##$BF1= 200.13
##$BF2= 200.13
##$BF3= 200.13
##$BF4= 200.13
##$BF5= 200.13
##$BF6= 200.13
##$BF7= 200.13
##$BF8= 200.13
##$BYTORDA= 1
##$CFDGTYP= 0
##$CFRGTYP= 5
##$CHEMSTR= <none>
##$CNST= (0..63)
1 1 145 1 1 1 1 1 1 1 1 1 1 1 1 1 1 1 1 1 1 1 1 1 1 1 1 1 1 1 1 1 1 1 
1 1 1 1 1 1 1 1 1 1 1 1 1 1 1 1 1 1 1 1 1 1 1 1 1 1 1 1 1 1 
##$CPDPRG= <>
##$CPDPRG1= <>
##$CPDPRG2= <>
##$CPDPRG3= <>
##$CPDPRG4= <mlev>
##$CPDPRG5= <mlev>
##$CPDPRG6= <mlev>
##$CPDPRG7= <mlev>
##$CPDPRG8= <mlev>
##$CPDPRGB= <>
##$CPDPRGT= <>
##$D= (0..63)
0 2 0 0 0 0 0 0 0 0.06 0 0.03 0 0 0 0 0.0002 0 0 0 0 0 0 0 0 0 0 0 0 0 
$$ [...]
##$SW_h= 4401.40845070422
##$TD= 16384
##$TD0= 1
##$TE= 300
##$TE2= 300
##$TE3= 300
##$TEG= 300
##$TL= (0..7)
0 120 120 120 120 120 120 120 
##$TP= (0..7)
150 150 150 150 150 150 150 150 
##$TP07= 0
##$TPNAME0= <>
##$TPNAME1= <>
##$TPNAME2= <>
##$TPNAME3= <>
##$TPNAME4= <>
##$TPNAME5= <>
##$TPNAME6= <>
##$TPNAME7= <>
##$TPOAL= (0..7)
0.5 0.5 0.5 0.5 0.5 0.5 0.5 0.5 
##$TPOFFS= (0..7)
0 0 0 0 0 0 0 0 
##$TUNHIN= 0
##$TUNHOUT= 0
##$TUNXOUT= 0
##$USERA1= <user>
##$USERA2= <user>
##$USERA3= <user>
##$USERA4= <user>
##$USERA5= <user>
##$V9= 5
##$VALIST= <valist>
##$VCLIST= <CCCCCCCCCCCCCCC>
##$VD= 0
##$VDLIST= <DDDDDDDDDDDDDDD>
##$VPLIST= <PPPPPPPPPPPPPPP>
##$VTLIST= <TTTTTTTTTTTTTTT>
##$WBST= 1024
##$WBSW= 25
##$XGAIN= (0..3)
0 0 0 0 
##$XL= 0
##$YL= 0
##$YMAX_a= 331966
##$YMIN_a= -521120
##$ZGOPTNS= <>
##$ZL1= 120
##$ZL2= 120
##$ZL3= 120
##$ZL4= 120
##$ABSF1= 17.95386
##$ABSF2= -4.038887
##$ABSG= 5
##$ABSL= 3
##$ALPHA= 0
##$AQORDER= 0
##$ASSFAC= 0
##$ASSFACI= 0
##$ASSFACX= 0
##$ASSWID= 0
##$AUNMP= <proc_1d>
##$AXLEFT= 0
##$AXRIGHT= 0
##$AXTYPE= 0
##$AXUNIT= <>
##$AZFE= 0.1
##$AZFW= 0.1
##$BCFW= 0
##$BC_mod= 2
##$BYTORDP= 0
##$COROFFS= 0
##$CY= 7568.61572265625
##$DATMOD= 1
##$DC= 0
##$DFILT= <>
##$DTYPP= 0
##$F1P= 17.9538593292236
##$F2P= -4.03888763876832
##$FCOR= 0.5
##$FTSIZE= 32768
##$FT_mod= 6
##$GAMMA= 0
##$GB= 0
##$INTBC= 0
##$INTSCL= 1.483618e-010
##$ISEN= 128
##$LB= 0.02
##$LEV0= 0
##$LPBIN= 0
##$MAXI= 945.577
##$MC2= 0
##$MEAN= 0
##$ME_mod= 0
##$MI= -402.1523
##$NCOEF= 0
##$NC_proc= -7
##$NLEV= 6
##$NOISF1= 8.587773
##$NOISF2= 6.764455
##$NSP= 0
##$NTH_PI= 0
##$NZP= 0
##$OFFSET= 17.95386
##$PC= 1
##$PHC0= 302.1777
##$PHC1= 10.37082
##$PH_mod= 1
##$PKNL= yes
##$PPARMOD= 0
##$PPDIAG= 0
##$PPIPTYP= 0
##$PPMPNUM= 100
##$PPRESOL= 1
##$PSCAL= 0
##$PSIGN= 0
##$REVERSE= no
##$SF= 200.13
##$SI= 32768
##$SIGF1= 16.12182
##$SIGF2= -4.496377
##$SINO= 3.521527
##$SIOLD= 32768
##$SREGLST= <1H.CDCl3>
##$SSB= 0
##$STSI= 32768
##$STSR= 0
##$SW_p= 4401.40845070423
##$SYMM= 0
##$S_DEV= 0
##$TDeff= 16384
##$TDoff= 0
##$TI= <>
##$TILT= no
##$TM1= 0
##$TM2= 0
##$TOPLEV= 0
##$USERP1= <user>
##$USERP2= <user>
##$USERP3= <user>
##$USERP4= <user>
##$USERP5= <user>
##$WDW= 1
##$XDIM= 32768
##$YMAX_p= 390509081
##$YMIN_p= -784725
$$ End of Bruker specific parameters
$$ ---------------------------------
##NTUPLES= NMR SPECTRUM
##VAR_NAME=  FREQUENCY,     SPECTRUM/REAL,   SPECTRUM/IMAG
##SYMBOL=    X,             R,               I
##VAR_TYPE=  INDEPENDENT,   DEPENDENT,       DEPENDENT
##VAR_FORM=  AFFN,          ASDF,            ASDF
##VAR_DIM=   32768,         32768,           32768
##UNITS=     HZ,            ARBITRARY UNITS, ARBITRARY UNITS
##FACTOR=    0.134324425510551, 1,           1
##FIRST=     4401.40845070423, -17910,       -2024205
##LAST=      0,             84340,           -2437686
##MIN=       0,             -784725,         0
##MAX=       4401.40845070423, 390509081,    0
$$ Real data points
##PAGE= N=1
##DATA TABLE= (X++(R..R)), XYDATA
$$ [...]
11209E895380N6604J69556K4345j16897r4899j2712J5956k2024j26155k24969
11199E564185j30316J81458L75962J70539j93818k66960o0661L7730n2188l3557
11189E592374J31822R4836k08392l17728J8875L70862K75244n8746j58576n3867
11179E686704r0341k27224j32263J30426J38689j31938k03953R6822L08955Q5500
11169E661377k36120k02547L5127M5874j36123j24589J19922K39860R6169n6684
11159E442266n5424m2523j03578j00068Q355N3319M282M2011J41102J4456l13811
11148E090387l62247M8019L66836J18092l01272k29669J89736K77709l6710j59135
11138E001746Q8876J77283j43955l59448p2523L05292K47940n2601j14073R720
$$ plain form
11209 5895380 5951984 6121540 6145885 6028988 5934089 5921377 5937333 5915309 5789154 5564185
11199 5564185 5433869 5615327 5991289 6161828 5968010 5701050 5640389 5678119 5625931 5592374
11189 5592374 5724196 5819032 5610640 5292912 5311787 5682649 5957893 5899147 5740571 5686704
11179 5686704 5596363 5369139 5236876 5367302 5505991 5374053 5170100 5266922 5575877 5661377
11169 5661377 5425257 5222710 5257837 5303711 5167588 5042999 5162921 5402781 5498950 5442266
11159 5442266 5386842 5344319 5240741 5140673 5149028 5202347 5206629 5248640 5389742 5404198 5090387
11148 5090387 4728140 4776159 5142995 5261087 4959815 4730146 4919882 5197591 5160881 5001746
11138 5001746 5090622 5267905 5123950 4764502 4691979 4997271 5245211 5192610 5078537 5088257
11128E088257n0366k36402j83037Q5295J82608K4704q2442j2867K2693o9051j13851
11117D655541n0818m3961j14551n4235J69133K80667J26513q5290j30767p0338
11107D681894m3914l2983M849L485m7410l0816N6243L0506j42451j98018K4468
11096D305853K67498K15173k5994j15077r354L3512o9613j05265L5065J49950
11086D681748O3335q3077o8580M7672M4045p6937q7463O8796J51062J1625j33779
11075D618447m7292J14340M5161j62300j23682J77749K97336L7640k12213j16467
11065D628719P1498O808j19646K2959K12561K7690l13139k06843K91331M63342
11055E085280P6379k46115o6480K01455Q5643j56367r2654R2871L791j93796q1427
$$ plain form
11128 5088257 5037891 4801489 4618452 4703747 4886355 4911059 4828617 4815750 4838443 4769392 4655541
11117 4655541 4604723 4560762 4446211 4391976 4561109 4841776 4968289 4882999 4752232 4681894
11107 4681894 4637980 4604997 4609846 4613331 4565921 4535105 4591348 4621854 4479403 4281385 4305853
11096 4305853 4573351 4788524 4762530 4647453 4638099 4671611 4601998 4496733 4531798 4681748
11086 4681748 4745083 4662006 4593426 4641098 4685143 4608206 4520743 4589539 4740601 4752226 4618447
11075 4618447 4571155 4685495 4730656 4568356 4444674 4622423 4919759 4957399 4745186 4628719
11065 4628719 4700217 4707025 4587379 4610338 4822899 4850589 4537450 4330607 4621938 5085280
11055 5085280 5161659 4915544 4849064 5050519 5136162 4979795 4887141 4980012 4983803 4790007 4708580
11044D708580K14318K23627l9520j24144O2413J54080K5750k5401J14843J63952
11034E478498o914j16214K6721J99481J72499O0580L7178L4702k8844k8968J00231
11023E928950J47632m6111k57379j76093J15542K56616J20363o0826p2031J7640
11013E974303K5024o9491j22134n3416K6322k4997j43668j12540J07004K55181
11003E861588J20104j36331j94885j5615J71022K27493K03311J22692l1038j39294
10993F189047o0616P7295J9326j61894j15234K10087M22809K76048K0311l6684
10983F840495L5014N7305J13354L08299M30653K42517o7584j10335J28816L08003
10973H286537K68055J91091K09300J95409L7447j41409j74358r4410n8179j19567
$$ plain form
11044 4708580 4922898 5146525 5107005 4982861 5045274 5199354 5225104 5199703 5314546 5478498
11034 5478498 5471584 5355370 5382091 5581572 5754071 5814651 5851829 5886531 5857687 5828719 5928950
11023 5928950 6076582 6030471 5773092 5596999 5712541 5969157 6089520 6028694 5956663 5974303
11013 5974303 5999327 5929836 5807702 5754286 5780608 5755611 5611943 5499403 5606407 5861588
11003 5861588 5981692 5845361 5650476 5634861 5805883 6033376 6236687 6359379 6328341 6189047
10993 6189047 6128431 6205726 6225052 6063158 5947924 6158011 6580820 6856868 6877179 6840495
10983 6840495 6875509 6932814 7046168 7354467 7785120 8027637 7960053 7849718 7978534 8286537
10973 8286537 8554592 8745683 8954983 9150392 9187839 9046430 8872072 8777662 8719483 8599916
10963H599916j80686j37236j4564N7105L288r8025j37202j38910j86664k27813
10953G539209j41909Q049K6824q2935j06773M763M6900m9057p4997M3784O6923
10942G280781r7959j38081J30402L47836J57753j63656j35599J39144J98394M2934
10932G761949Q3258L39635L75008Q1066j19524k048J40049J10019J49492L77904
10922I296808M50254J55463j27350j2150K55020K17908n0334j38728l152L7400
10912A0081139j13509k29658k04228j69791j81346j49981r9893j49368k22780
10903H560585j21385Q3092P4780j93413l46032j13155K56020L26551M8194k31902
10893H343335k34750k6737J43627J25448m1092k01589k12452n3323J36677J73004
$$ plain form
10963 8599916 8419230 8281994 8267430 8324535 8327823 8229798 8092596 7953686 7767022 7539209
10953 7539209 7397300 7405349 7432173 7349238 7242465 7247228 7294128 7245071 7170074 7213858 7280781
10942 7280781 7182822 7044741 7175143 7522979 7680732 7517076 7381477 7520621 7719015 7761949
10932 7761949 7845207 8184842 8559850 8640916 8521392 8519344 8659393 8769412 8918904 9296808
10922 9296808 9747062 9902525 9775175 9763025 10018045 10235953 10185619 10046891 10043739 10081139
10912 10081139 9967630 9737972 9533744 9363953 9182607 9032626 8932733 8783365 8560585
10903 8560585 8439200 8522292 8597072 8403659 8057627 7944472 8200492 8527043 8575237 8343335
10893 8343335 8108585 8081848 8225475 8350923 8309831 8108242 7895790 7842467 7979144 8152148
10883H152148K7180j13970o0377J29350K17327J17629L118J3245M4196j7361m4286
10872H468199J03973K65655K04226L2215L1874J37421N3473j35357k8096L27619
10862I461202L56468j04976m21470j37128K50687R3598l24911k70468J95936L18757
10852I417695q7903l41377m313M56446M34722K7696k51934j88469N3867K56421
10842I772851K73828P4581j46907j28055P1372J23700k4169l8097K13227L71292
10832A0563623J54303j67770j97434J771J01958M8651K9655Q5030J02313Q0403
10822A0802503R3673R8732L9525K2349J33059K16569J03112p6952p6588Q5794
10812A1441776J93716J75110J22121P5833L6113P1412J86343K21684J17740Q4887
$$ plain form
10883 8152148 8179328 8065358 8004981 8134331 8351658 8469287 8472405 8485650 8529846 8512485 8468199
10872 8468199 8572172 8837827 9042053 9074268 9106142 9243563 9297036 9161679 9133583 9461202
10862 9461202 9817670 9712694 9291224 9154096 9404783 9498381 9173470 8903002 9098938 9417695
10852 9417695 9329792 8988415 8984102 9440548 9875270 9902966 9651032 9462563 9516430 9772851
10842 9772851 10046679 10121260 9974353 9846298 9917670 10041370 10017201 9979104 10192331 10563623
10832 10563623 10717926 10550156 10352722 10354493 10456451 10505102 10534757 10619787 10722100 10802503
10822 10802503 10896176 10994908 11034433 11056782 11189841 11406410 11509522 11432570 11355982 11441776
10812 11441776 11635492 11810602 11932723 12008556 12044669 12116081 12302424 12524108 12641848 12726735
10802A2726735K41861L23598J02741j43399l6229K46346K53057M6008P6144L27456
10792A4164318K94445q2365j89470K57853O49898L77589k24910l83230K1965M32032
10782A5318125M79847L30068K13145J15497N423l789J44195L01613K89231J14485
10772A7307840l4105K4212K55858M00739K76298P2700J26474L83882M14901Q2019
10762A9310818j83875k7741K79266L07805J67284K44310M68558M20650R9601j5215
10752B1071461K56128N01910L88929J46649J24274K61403L06390K53505K41451
10743B3552100K47684J93864J76096K95398M08398L38801K10799K65004M33678
10734B6121822M30609K36052J52614L22200N00225M48392K97566L13318M65233
$$ plain form
10802 12726735 12968596 13292194 13394935 13251536 13215307 13461653 13714710 13760718 13836862 14164318
10792 14164318 14458763 14376398 14186928 14444781 15094679 15472268 15247358 14864128 14886093 15318125
10782 15318125 15797972 16128040 16341185 16456682 16462105 16458316 16602511 16904124 17193355 17307840
10772 17307840 17273735 17297947 17553805 17954544 18230842 18303542 18430016 18813898 19228799 19310818
10762 19310818 19126943 19099202 19378468 19686273 19853557 20097867 20566425 20987075 21086676 21071461
10752 21071461 21327589 21829499 22218428 22365077 22489351 22750754 23057144 23310649 23552100
10743 23552100 23799784 23993648 24169744 24465142 24873540 25212341 25423140 25688144 26121822
10734 26121822 26552431 26788483 26941097 27263297 27763522 28211914 28509480 28822798 29288031
10725B9288031M78134K69221J01206K21236M99343N80735L59335J27117J77355
10716C2101713M03531M71657L23128K50559M18259N78865M62766K39431K85459
10707C5535368N83836P07300M49007J37633J55225M06497N24859M32681L79646
10698C9312052M78489N33181M04144K64377L23536M94448N46224M65354M30921
10689D3252726M90546N10003M52875M58324N61431N73325L91269K29271L26044
10680D7245814N59865O05416M09577K51006L23082N01965N82341N26979M02677
10671E1408722K67163K17845L59679N98833O54480M35570K31585L26446N72452
10662E5072775O00449L58819J60084K11258L75298M45045M07113L43155K76190
$$ plain form
10725 29288031 29766165 30035386 30136592 30357828 30857171 31437906 31797241 31924358 32101713
10716 32101713 32505244 32976901 33300029 33550588 33968847 34547712 35010478 35249909 35535368
10707 35535368 36119204 36826504 37275511 37413144 37568369 37974866 38499725 38932406 39312052
10698 39312052 39790541 40323722 40727866 40992243 41315779 41810227 42356451 42821805 43252726
10689 43252726 43743272 44253275 44706150 45164474 45725905 46299230 46690499 46919770 47245814
10680 47245814 47805679 48411095 48820672 49071678 49394760 49896725 50479066 51006045 51408722
10671 51408722 51675885 51893730 52253409 52852242 53506722 53942292 54173877 54500323 55072775
10662 55072775 55673224 56032043 56192127 56403385 56778683 57223728 57630841 57973996 58250186
10653E8250186K29599K71572L83807M27344L47841K73725K94166K91804J52014
10644F0922058K737M7665K47496L73996L33426K31913J44546L8313n8609l1002
10634F2252539J12687J95416J28081L9726M7447O7943L78o0716J2720J18758M5855
10623F2960834j89187l38487k62915q7831N728k2460j18651k17406k32021j19486
10613F1378118p366r1031l34726m52931k97389q8728j10621l19075m39880l53629
10603E8882742j96915j41912k38470m23740n52886m94781l25205l03584m98140
10594E5707109o06193l92777j26708k18577n49869o24068l67122k51922n02165
10585E2067708p07459n10819k05226k41345n06628n67200l79933k72519l59306
$$ plain form
10653 58250186 58479785 58751357 59135164 59562508 59910349 60184074 60478240 60770044 60922058
10644 60922058 60924795 60972460 61219956 61593952 61927378 62159291 62303837 62342150 62283541 62252539
10634 62252539 62365226 62560642 62688723 62728449 62775896 62843839 62844217 62783501 62796221 62914979 62960834
10623 62960834 62771647 62433160 62170245 62082414 62088142 62065682 61947031 61729625 61497604 61378118
10613 61378118 61370752 61279721 60944995 60492064 60194675 60105947 59995326 59676251 59236371 58882742
10603 58882742 58685827 58543915 58305445 57881705 57328819 56834038 56508833 56205249 55707109
10594 55707109 55100916 54708139 54581431 54362854 53812985 53188917 52821795 52569873 52067708
10585 52067708 51360249 50849430 50644204 50402859 49896231 49329031 48949098 48676579 48317273
10576D8317273m52596m84230n65605o50246n64458l87529l90831n59506n82399
10567D3679873l88161k80402m20454n73758n37279m47358m58542m59507l48390
10558C9766022k87077m15579n66738n31788l95738l53960l87554l67754l11996
10549C6147838l07857l41435l92483n10705o22101n10610k05092q7303l32535
10540C2837717n60402m12405j64454k80322o04121n85715j93208K3471j92961
10531B9867600m57454m07541k05700j65234k88074m05221m55012m26432l00086
10522B6756846j87501k56005m18740m09613k43544k28486m15613m69395k56615
10513B3871334j07529k38297l64723k19596l0812r0710k35298k00748j50502l38079
$$ plain form
10576 48317273 47864677 47380447 46814842 46164596 45600138 45212609 44821778 44262272 43679873
10567 43679873 43291712 43011310 42590856 42017098 41479819 41032461 40573919 40114412 39766022
10558 39766022 39478945 39063366 38496628 37964840 37569102 37215142 36827588 36459834 36147838
10549 36147838 35839981 35498546 35106063 34595358 33973257 33462647 33257555 33170252 32837717
10540 32837717 32277315 31864910 31700456 31420134 30816013 30230298 30037090 30060561 29867600
10531 29867600 29410146 29002605 28796905 28631671 28343597 27938376 27483364 27056932 26756846
10522 26756846 26569345 26313340 25894600 25484987 25241443 25012957 24597344 24127949 23871334
10513 23871334 23763805 23525508 23160785 22941189 22910377 22819667 22584369 22383621 22233119 21895040
10503B1895040n39453l91249p8120p2310l18970l23138k1107Q9946k07180m91762
10493A9541697l99667j50544j03708k18521k64727k27825j97480j24515K1021
10484A7875731P2549q5299k81345l09314k32490k08368j97519j01295k1608j00624
10474A6410418k24516j81716m2902q0981l16321m28221k02737J43855K23983m2234
10464A5258628l30575k91237L5345K38247J3293m30770n77727k35131K08773K66268
10454A4155114n4919l12482k11941P1020J70557k5533k97621l82979k44888n0102
10444A2816226N0850N2378J4303m9905j43201k10102j81162o4718O4841J25171
10434A2474681L9471j91944l69098k29098J45140K78915o6434m41175k82569K13409
$$ plain form
10503 21895040 21355587 20964338 20886218 20813908 20494938 20171800 20150693 20240639 20033459 19541697
10493 19541697 19142030 18991486 18887778 18669257 18404530 18176705 17979225 17854710 17875731
10484 17875731 17948280 17862981 17581636 17272322 17039832 16831464 16633945 16532650 16511042 16410418
10474 16410418 16185902 16004186 15961284 15880303 15563982 15135761 14933024 15076879 15300862 15258628
10464 15258628 14928053 14636816 14672161 14910408 14923701 14492931 13915204 13680073 13888846 14155114
10454 14155114 14100195 13787713 13575772 13646792 13817349 13791816 13494195 13111216 12866328 12816226
10444 12816226 12867076 12919454 12933757 12883852 12740651 12530549 12349387 12284669 12349510 12474681
10434 12474681 12514152 12322208 11953110 11724012 11869152 12148067 12081633 11640458 11357889 11571298
10424A1571298L23800j15393m53924k23401J90801K08595r3640k36053j00818
10415A1071265L2398J5888l7403m8936m8684l4092j3343o3139j34200j9415K47027
10404A0967366K65808j16932m09979j46141L44693L91497l509k31977m6728J90065
10394A1204163K15179J83649K08474J72935J11382K24064M06454L22307M8425
10385A3097032L5979K88357K53290k27844n68861l95136j61967l37711o05715
10376A1377424m75781j51273j14312k71871k21397m5359j19341l46753k97353
10367I333984J0895J35291m2706k01784j83481j43113j23016j8948N7181q1679
10357H742624k42435j01435J52854O0063k62647k31182J89091L54564J4282k75658
$$ plain form
10424 11571298 11895098 11779705 11325781 11102380 11293181 11501776 11408136 11172083 11071265
10415 11071265 11103663 11119551 11082148 11033212 10984528 10950436 10937093 10873954 10739754 10720339 10967366
10404 10967366 11233174 11116242 10706263 10560122 10904815 11296312 11292803 11060826 11014098 11204163
10394 11204163 11419342 11602991 11811465 11984400 12095782 12319846 12726300 13048607 13097032
10385 13097032 13133011 13421368 13674658 13446814 12877953 12482817 12320850 11983139 11377424
10376 11377424 10901643 10750370 10636058 10364187 10142790 10097431 9978090 9631337 9333984
10367 9333984 9344879 9480170 9437464 9235680 9052199 8909086 8786070 8767122 8824303 8742624
10357 8742624 8500189 8398754 8551608 8611671 8349024 8117842 8306933 8661497 8675779 8400121
10347H400121j21996Q1025o0704k28775l3771K24796R2831k09746j87399N2520
10337H008902L2776k16609k34178K8917J32184p7312k34715r9262J07512J42832
10327G591047P2745J8102l9901o7023N2616K24180J67597j24452k89695j22923
10317G482293J17810J30700Q236J3060J39926J69119K9066j24286j32253J2807
10307G846478J88493K31558Q2343j09550j33299J616Q9396O2211P9628K04458
10297H543332K47521J00033k1593R7516K89927K44145P755o5092J53693L84269
10287I981506L51530J45939O5222K46365N54310P49088P03185N10227L89395M26390
10277A4123157M53349K84265m366j96364k76915m08323n73852n52766l44204k91989
$$ plain form
10347 8400121 8278125 8359150 8298446 8069671 8035900 8260696 8353527 8143781 7956382 8008902
10337 8008902 8041678 7825069 7590891 7619808 7751992 7674680 7439965 7340703 7448215 7591047
10327 7591047 7663792 7681894 7641993 7574970 7627586 7851766 8019363 7894911 7605216 7482293
10317 7482293 7600103 7730803 7739039 7752099 7892025 8061144 8090210 7965924 7833671 7846478
10307 7846478 8034971 8266529 8348872 8239322 8106023 8107639 8197035 8259246 8338874 8543332
10297 8543332 8790853 8890886 8869293 8966809 9256736 9500881 9508636 9443544 9597237 9981506
10287 9981506 10333036 10478975 10544197 10790562 11344872 12093960 12797145 13307372 13696767 14123157
10277 14123157 14576506 14860771 14856405 14660041 14383126 13974803 13400951 12848185 12503981 12211992
10267A2211992n74134q51975p37342l91477k71830m18127m47268k38457j26059
10258H155323k87377m18583k71937q8809j44960k31432m1226K07692P5766l30894
10248F623563m77562k44191n6552j13575j01814J26807K05133p9252l12772j18070
10238E451715J72030O1688k50519k14477J03995J23881k41800m13871j08663K05281
10228D889260Q9184j97969j97524K2117Q1600n9937j19933k50J12902R1025m557
10217D705918r7719j61226j39654r813J19628J29833N0914l4779j34904k37591
10207D190607k09856j5251J14013j4850j96117q8351K30708L23061K5011l15566
10197D043409l35309r9383R4880J23270O8829J6725j2192j8814l7592j12721j92276
$$ plain form
10267 12211992 11637858 10785883 10048541 9657064 9385234 8967107 8519839 8281382 8155323
10258 8155323 7867946 7449363 7177426 7088617 6943657 6712225 6670999 6878691 6954457 6623563
10248 6623563 6146001 5901810 5845258 5731683 5629869 5756676 5961809 5882557 5569785 5451715
10238 5451715 5623745 5685433 5434914 5220437 5324432 5448313 5206513 4792642 4683979 4889260
10228 4889260 4978444 4780475 4582951 4605068 4686668 4626731 4506798 4506548 4619450 4710475 4705918
10217 4705918 4608199 4446973 4307319 4297506 4417134 4546967 4597881 4563102 4428198 4190607
10207 4190607 3980751 3965500 4079513 4064663 3868546 3780195 4010903 4333964 4358975 4043409
10197 4043409 3708100 3608717 3703597 3826867 3895696 3912421 3900229 3881415 3843823 3731102 3538826
10186C538826j52394R532J34499J28936Q9750J08066J00801k4254j65244j58334
10176C610184l1458M1935k083o1960n0314M362L7577K7513j3831n9898q4739r4855
10164C322433j05107o4694R0002K62404K29533l8683k56707j93305o752K5104
10154C264228l7466O2621K60469K01452j56774l84569j91757J54015K49710R0811
10144C512740q5416k06570k87912j95630J19837L34892J34685k25468k08501J90613
10134C083270M13577J75192j66478k23258q6736K134N7673J29862O7498j57292
10124C295442k31047J6382K26240M1399k64730k00665J23340J79186q3772j68433
10114B933342J02033K75054K7468l06017k69535N6168K66577K09388L2621j23733
$$ plain form
10186 3538826 3386432 3395964 3530463 3659399 3749149 3857215 3958016 3933762 3768518 3610184
10176 3610184 3578726 3620661 3618578 3556618 3506304 3510666 3548243 3575756 3561925 3502027 3417288 3322433
10164 3322433 3217326 3152632 3242634 3505038 3734571 3695888 3439181 3245876 3239124 3264228
10154 3264228 3226762 3289383 3549852 3751304 3594530 3209961 3018204 3172219 3421929 3512740
10144 3512740 3427324 3220754 2932842 2737212 2857049 3191941 3326626 3101158 2892657 3083270
10134 3083270 3496847 3672039 3505561 3282303 3195567 3197701 3255374 3385236 3452734 3295442
10124 3295442 3064395 3080777 3307017 3348416 3083686 2883021 3006361 3185547 3101775 2933342
10114 2933342 3035375 3310429 3337897 3031880 2762345 2818513 3085090 3294478 3327099 3203366
10104C203366j96484j20610O9000J75082P1527j06254j48056k8632J25819J91985
10094C236743R3022j40273k94619j75744O9521J05730o8109j02967R7443J90551
10084C011298K779j42861n931J27431k0023j75587j1721K06308O2541k31923j74988
10073B647323J27906J31650j78432k43176J01555L46522J65371j12568j29587
10064B856564k0346k0830n4948m553L1863O858N4043J42811L0083k44954k91945
10053B484646j9272J61300M3704k4067J58436K04691j25562l53891n7842L13314
10043B785457J32765l20688l07008J36305K96829L611j69657L8463J88555N138
10033B789770j54792q633J46543J1737j83648j26596N4822R6828N0664O5218N5285
$$ plain form
10104 3203366 3006882 2886272 2955272 3130354 3201881 3095627 2947571 2918939 3044758 3236743
10094 3236743 3329765 3189492 2894873 2719129 2788650 2894380 2826271 2723304 2820747 3011298
10084 3011298 3014077 2871216 2865285 2992716 2972693 2797106 2785385 2991693 3054234 2822311 2647323
10073 2647323 2775229 2906879 2728447 2485271 2586826 2933348 3098719 2986151 2856564
10064 2856564 2836218 2815388 2760440 2755887 2787750 2794608 2848651 2991462 3021545 2776591 2484646
10053 2484646 2465374 2626674 2670378 2646311 2804747 3009438 2883876 2529985 2472143 2785457
10043 2785457 2918222 2597534 2290526 2426831 2723660 2727271 2557614 2596077 2784632 2789770
10033 2789770 2634978 2626345 2772888 2784625 2600977 2474381 2529203 2626031 2676695 2741913 2797198
10022B797198o5999j27516l654J10508M4667k3148P7400J38135n2069k44856r9119
10011B551547K08087K27037m6851j96781o0110J05841J27516J13043J01638k3674
10001C107293j77721q3304K08062K60223n3367k46971M4967M31020L24876j37693
9991C677385k98999K5313L33014K57100L9444j0200k5502k14937l70829j88026
9981C223763J63364K48126L3460j07724k6596K7380q4017j57296p5855m8250j89496
9970C006859k43587k3034K03221J21364r5633p8479J14313J15720j14270k37673
9960B768801j08787M2834M9909K4916M7906J1125r6243r1933N6693J12000l5065
9949B782156j45435k1609J54151J19169n1469r5743J9025R4097K7412q1617j16654
$$ plain form
10022 2797198 2731199 2603683 2600029 2710537 2755204 2732056 2809456 2947591 2895522 2650666 2551547
10011 2551547 2759634 2986671 2939820 2743039 2682929 2788770 2916286 3029329 3130967 3107293
10001 3107293 2929572 2846268 3054330 3314553 3261186 3014215 3059182 3490202 3815078 3677385
9991 3677385 3378386 3403699 3736713 3993813 4033257 4023057 3997555 3782618 3411789 3223763
9981 3223763 3387127 3635253 3668713 3560989 3534393 3561773 3477756 3320460 3244605 3196355 3006859
9970 3006859 2763272 2740238 2943459 3064823 2969190 2890711 3005024 3120744 3006474 2768801
9960 2768801 2660014 2702848 2752757 2777673 2825579 2836704 2740461 2648528 2705221 2817221 2782156
9949 2782156 2636721 2615112 2769263 2888432 2836963 2741220 2760245 2854342 2881754 2800137 2683483
9938B683483o6978J1527N0343J4705m8071o3422m2856l8710n522J20070K15553
9927B830122R1342j57236k00535L5503K22929J12576j21334j88544p0581Q3173
9917B637415J92217J90646k68k49394k47172K9976J99110N4852q7819M7493J87757
9906B954813J739k49145j14593K34873K35577j40779l28979o6019K51337K35462
9896C014286K3928o7033k425O0145K5288j15023k74831k47330N4754L46253K77036
9885C095048l5333j56711L02J01544j998p8730j2535L100q8927n9953J20798J40442
9873C027047q9484k02668N630K06311J11296l9131M2944J52180r039k49005k09443
9862B746638R444N7852m2453J930J80283K03141L2313p0457m842N0098k1512j35730
$$ plain form
9938 2683483 2616505 2628032 2678375 2693080 2645009 2581587 2538731 2500021 2494499 2614569 2830122
9927 2830122 2921464 2764228 2563693 2599196 2822125 2934701 2813367 2624823 2554242 2637415
9917 2637415 2829632 3020278 3020010 2770616 2523444 2553420 2752530 2807382 2719563 2767056 2954813
9906 2954813 2956552 2707407 2592814 2827687 3063264 2922485 2593506 2527487 2778824 3014286
9896 3014286 3038214 2971181 2968756 3028901 3054189 2939166 2664335 2417005 2471759 2818012 3095048
9885 3095048 3059715 2903004 2903306 3004850 3002852 2924122 2911587 2914687 2825760 2765807 2886605 3027047
9873 3027047 2937563 2734895 2740525 2946836 3058132 3019001 3061945 3214125 3205086 2956081 2746638
9862 2746638 2756082 2813934 2771481 2773411 2953694 3156835 3189148 3118691 3113849 3163947 3142435 3006705
9850C006705j96680j53907N0898L32679L92853R9289k22283k14673k6517k2672
9840C045692j41433m0912K28141K62321J3557j10827N5412J83967N9243p0049
9830C485112J4698J08576j4331j76515j09623Q8819J42407L6089l7971k8243l5075
9819C473943o6038k7585P6201J23952N1571o5266r7866O373J47965J45507l5151
9808C733606j76510q2033J12217J18660n0974r8975P7578K30193J67667K1712
9798D053141l0403l5889q9775j20639l6307R6650J72367J82825J28286j5591j42756
9787D161909o2696J76301K62831P1827j26341q7857M9590O3123K4876R6937J78193
9776D808693Q9370n6563j0798J92760K97043K25986J27438O7519k2283j18694
$$ plain form
9850 3006705 2810025 2656118 2707016 3039695 3432548 3531837 3309554 3094881 3068364 3045692
9840 3045692 2904259 2863347 3091488 3353809 3367366 3256539 3311951 3495918 3555161 3485112
9830 3485112 3499810 3608386 3594055 3417540 3307917 3396736 3539143 3575232 3537261 3509018 3473943
9819 3473943 3407905 3380320 3456521 3580473 3632044 3566778 3468912 3475285 3623250 3768757 3733606
9808 3733606 3557096 3475063 3587280 3705940 3654966 3555991 3633569 3863762 4031429 4053141
9798 4053141 4022738 3986849 3897074 3776435 3740128 3836778 4009145 4191970 4320256 4304665 4161909
9787 4161909 4099213 4275514 4538345 4610172 4483831 4395974 4445564 4508687 4533563 4630500 4808693
9776 4808693 4898063 4841500 4830702 5023462 5320505 5546491 5673929 5741448 5719165 5600471
9766E600471j07118j2662J4243m7319o8633j2390J6945k2204m9774l2521l5926
9755E243112q0899r8504n3959k2L523n5480j36307j37481J3436J96475J81096
9744E074990k4959j17140M9711J93701N1013j63288j02011J16594J15218o9446
9734E124383n1036J87684K11202j11742l20008q5519K52386K32238l1304j11881
9724E296403L8001J12141J6999k9041O9552J36363N6583m6782n0581l949K1885
9713E617574N1291Q1356K7850r5260j12225N1320J84375O7979j53495j32375J46410
9702E734800K76581J8026k87761j74226K41050L95242J11243j52625l3787J87638
9692F316181R6243j57636j31224J45775K22241n698j31455N1970K01571K9342
$$ plain form
9766 5600471 5493353 5480691 5494934 5447615 5378982 5366592 5383537 5361333 5311559 5279038 5243112
9755 5243112 5162213 5063709 5009750 5009728 5013251 4957771 4821464 4683983 4697419 4893894 5074990
9744 5074990 5050031 4932891 4982602 5176303 5227316 5064028 4962017 5078611 5193829 5124383
9734 5124383 5073347 5261031 5472233 5360491 5040483 4954964 5207350 5439588 5408284 5296403
9724 5296403 5334404 5446545 5463544 5434503 5504055 5640418 5697001 5650219 5599638 5595689 5617574
9713 5617574 5668865 5750221 5778071 5682811 5570586 5621906 5806281 5874260 5720765 5588390 5734800
9702 5734800 6011381 6029407 5741646 5567420 5808470 6203712 6314955 6162330 6128543 6316181
9692 6316181 6412424 6254788 6123564 6269339 6491580 6485882 6354427 6406397 6607968 6637310
9682F637310j88249p0955K16084K10881j12960l04838j15456J69499J83979j5427
9672F609868r4283O0799K04145R4500j60650k36305k0344K32433K34730K6872
9662F951765j26990j06663j8818L5988O7471O9204L176n9818J871J19704Q6246
9651G023136q1987r9505J32237K94125J05208k08004k06345J09229K75828K2465
9641G366387l44601l52213J9434L27152K43027n0028j47460J8733J37135L1114
9631G248680p4196M3460K06437J37785m9254m4268J11039J10672l8546k4087J66872
9620G794594J85729k5126q4169J21718J72757j19234k76315M9869L94655K00234
9610H414712k28299k09628J79585K59399r6585k80166J4200L26053K21828p3943
$$ plain form
9682 6637310 6449061 6378106 6594190 6805071 6692111 6387273 6271817 6441316 6625295 6609868
9672 6609868 6515585 6576384 6780529 6875029 6714379 6478074 6457730 6690163 6924893 6951765
9662 6951765 6824775 6718112 6699294 6735282 6802753 6871957 6875133 6815315 6817186 6936890 7023136
9651 7023136 6941149 6841644 6973881 7268006 7373214 7165210 6958865 7068094 7343922 7366387
9641 7366387 7021786 6669573 6689007 7016159 7259186 7209158 7061698 7080431 7217566 7248680
9631 7248680 7174484 7217944 7424381 7562166 7512912 7468644 7579683 7690355 7651809 7627722 7794594
9620 7794594 7980323 7955197 7871028 7992746 8165503 8046269 7769954 7819823 8214478 8414712
9610 8414712 8186413 7976785 8156370 8415769 8319184 8039018 8053218 8379271 8601099 8527156
9600H527156j42230J8218J58995J98410J77715P6993p7058j31893k5963R3755
9590H874098R3687J6991m3414m5699M7669K01989K23295Q535j77553k5190K80498
9579I454906K83001j387r1958J37408K38093k2069k40517p1793J98880J78605
9569A0063169L980N721J24402J29706R2266J65270J93920K3195q9596J15634L43670
9558A1171337J66228k10623k28435J05564K49548N0560m6115J83493L60728J78299
9548A1980584r2973q5311J04914J71530R4459O0489J16003J73468J97856J79033
9538A2900052P3477o8860q9946L2227J17904Q5712Q9360K07496K50125P8498j12366
9527A3563679p4288J16966K13774J66895R4996L3430k2442L7432K54307L81143
$$ plain form
9600 8527156 8384926 8403144 8562139 8760549 8938264 9015257 8938199 8806306 8780343 8874098
9590 8874098 8967785 8984776 8941362 8895663 8943332 9145321 9368616 9377151 9199598 9174408 9454906
9579 9454906 9737907 9736520 9644562 9781970 10020063 9997994 9757477 9685684 9884564 10063169
9569 10063169 10067149 10072870 10197272 10326978 10419244 10584514 10778434 10801629 10712033 10827667 11171337
9558 11171337 11337565 11126942 10898507 11004071 11253619 11304179 11258064 11441557 11802285 11980584
9548 11980584 11887611 11802300 11907214 12078744 12173203 12233692 12349695 12523163 12721019 12900052
9538 12900052 12973529 12904669 12814723 12846950 12964854 13050566 13139926 13347422 13597547 13676045 13563679
9527 13563679 13489391 13606357 13820131 13987026 14082022 14115452 14093010 14130442 14384749 14765892
9517A4765892J83156j19689r3175K38026L80540J29721j00165O3641L53172K97500
9507A6098619j2787p5723K11801M01622K28192K4912J62150M31911L65518k9070
9497A7807145k58647n2823K82870L30774J09328k8121J04403L25792L69277K17271
9487A9207269Q8348J35429K51581K40970J17514P6746J65987J97793Q8166M2671
9477B0612474K10369L77773K93146J09305J44482L36906L58164J97587J61686
9468B2801892K88677K71928N4573k2451J64590K79969J40878N0782K04391K81315
9458B4516544N1448j07011J77614N55587M67875O0276o9338J69807L24721K17279
9448B6364802J39775K31211K64683J36518M9186J08503J76473J91240K34137K59863
$$ plain form
9517 14765892 14949048 14829359 14736184 14974210 15354750 15484471 15384306 15447947 15801119 16098619
9507 16098619 16085832 16010109 16221910 16623532 16851724 16876636 17038786 17470697 17836215 17807145
9497 17807145 17548498 17495675 17778545 18109319 18218647 18190526 18294929 18620721 18989998 19207269
9487 19207269 19295617 19431046 19682627 19923597 20041111 20117857 20283844 20481637 20569803 20612474
9477 20612474 20822843 21200616 21493762 21603067 21747549 22084455 22442619 22640206 22801892
9468 22801892 23090569 23362497 23417070 23394619 23559209 23839178 23980056 24030838 24235229 24516544
9458 24516544 24567992 24460981 24638595 25194182 25662057 25722333 25652995 25822802 26147523 26364802
9448 26364802 26504577 26735788 27000471 27136989 27186175 27294678 27471151 27662391 27896528 28156391
9438B8156391J62299Q7301K45410M55487L59331N4467k0317J83388K82760J70941
9428C0137458J43360K51319J88214m6566m6584K41753L40088P8315p1152J70781
9418C1386986L95099K50470M0444J09708K37730J57095J05093K96675L87295Q5264
9408C3451859j84961Q7835O08515P11362L74408J14778J30499K14475L05439M67690
9398C6281899N00473K03011j24978n5651K54851L35569K07114K62444M83412M78305
9388C8826449K40720J77946L75009M82351L77662L23388M04794L96522K63002
9379D1867843K42829L64600L97041L27304L77946N27196N35448M51062N41111
9370D5632380P27446O80253M71247M99023P37866P39248M58611L73215O28164
$$ plain form
9438 28156391 28318690 28405991 28651401 29106888 29466219 29520686 29500369 29683757 29966517 30137458
9428 30137458 30280818 30532137 30720351 30673785 30627201 30868954 31209042 31287357 31216205 31386986
9418 31386986 31782085 32032555 32072999 32182707 32420437 32577532 32682625 32979300 33366595 33451859
9408 33451859 33266898 33354733 33963248 34674610 35049018 35163796 35294295 35508770 35814209 36281899
9398 36281899 36782372 36985383 36860405 36804754 37059605 37395174 37602288 37864732 38348144 38826449
9388 38826449 39067169 39245115 39620124 40102475 40480137 40803525 41208319 41604841 41867843
9379 41867843 42110672 42475272 42872313 43199617 43577563 44104759 44640207 45091269 45632380
9370 45632380 46359826 47040079 47511326 48010349 48748215 49487463 49946074 50319289 50947453
9361E0947453P70528N56748L59166M94333P43708Q19466P70345O90858N48523
9352E6701128M83071P29782J095685J108141Q16513P75614J081873J184597Q85301
9343F4861705P21084J020325J359550J356282J254074J299493J274950J091777
9335G4239240J114443J443081J615515J472024J521484J966389K225809J989282
9327H7587267J846183K216416K573829K476786K443669K953252L477607L445287
9319A09020296L302941L637395M097171M205942M366263M990010N582007N825535
9311A45027560O507371Q088025R584150J0381227J1723746J4489711J7116955
9304B22918745J8347824K0335701K5199400K9375417K6199880J4921240K651965
$$ plain form
9361 50947453 51717981 52274729 52633895 53128228 53871936 54691402 55461747 56152605 56701128
9352 56701128 57184199 57913981 59009666 60117807 60934320 61709934 62791807 63976404 64861705
9343 64861705 65582789 66603114 67962664 69318946 70573020 71872513 73147463 74239240
9335 74239240 75353683 76796764 78412279 79884303 81405787 83372176 85597985 87587267
9327 87587267 89433450 91649866 94223695 96700481 99144150 102097402 105575009 109020296
9319 109020296 112323237 115960632 120057803 124263745 128630008 133620018 139202025 145027560
9311 145027560 151534931 159622956 169207106 179588333 191312079 205801790 222918745
9304 222918745 241266569 261602270 286801670 316177087 342376967 357298207 359950172
9297C59950172m514914q271245j3326251j9623509k3267400k2861267k0621910
9290B47463676j8158521j5082770j1708483r649539r147309q524056o982447n683843
9282A62526708n400690n219288m385740l566013l346103l090128k264520j532320
9274A33721906j553873j837370j691641j331529j197048j079818p35351n38085
9266A23757191p41511q39096m21138L5922o469j91057Q3834O17137Q02790O34463
9256A23732066N68313P27381R08463J087480J325375J439688J292845J138880
9248A32220491J223157J344100J255840J161591J336006J596271J635492J563961
9240A43336909J636440J751872J706050J635587J731320J824026J741066J736622
$$ plain form
9297 359950172 355435258 347164013 333837762 314214253 290946853 268085586 247463676
9290 247463676 229305155 214222385 202513902 192864363 183717054 175192998 168210551 162526708
9282 162526708 157126018 151906730 147520990 143954977 140608874 137518746 135254226 133721906
9274 133721906 132168033 130330663 128639022 127307493 126110445 125030627 124295276 123757191
9266 123757191 123015680 122176584 121755446 121791368 121784899 121593842 121677676 122294813 123097603 123732066
9256 123732066 124300379 125027760 125936223 127023703 128349078 129788766 131081611 132220491
9248 132220491 133443648 134787748 136043588 137205179 138541185 140137456 141772948 143336909
9240 143336909 144973349 146725221 148431271 150066858 151798178 153622204 155363270 157099892
9232A57099892K039945K322329K202506J952437K044220K290829K178932J840888
9224A73971978J878179K297536K458067K143147J886806K041317K249828K145733
9216A91072591J942710J947488K000597J833421J603615J637083J872357J947480
9208B05857342J716571J388500J217936J253535J344239J290165J049754Q19345
9200B15937387P86524Q30981O81291L58993J80769K57999L01780P0251k63895
9191B19142080l94983l25626l05827m65163p04252q73940r13708q72385q89892
9182B13396304j081549j366820j516714j448205j351732j432404j645493j804855
9174B01748532j846384j845156j846330j831147j827126j912901k081786k193096
$$ plain form
9232 157099892 159139837 161462166 163664672 165617109 167661329 169952158 172131090 173971978
9224 173971978 175850157 178147693 180605760 182748907 184635713 186677030 188926858 191072591
9216 191072591 193015301 194962789 196963386 198796807 200400422 202037505 203909862 205857342
9208 205857342 207573913 208962413 210180349 211433884 212778123 214068288 215118042 215937387
9200 215937387 216723911 217554892 218236183 218595176 218775945 219033944 219335724 219405975 219142080
9191 219142080 218747097 218421471 218115644 217650481 216946229 216072289 215158581 214286196 213396304
9182 213396304 212314755 210947935 209431221 207983016 206631284 205198880 203553387 201748532
9174 201748532 199902148 198056992 196210662 194379515 192552389 190639488 188557702 186364606
9166A86364606k125897j953610j893473k045925k241225k240695k063880j961898
9158A69838003k037869k096848j987839j877504j965240k105310k016635j766814
9150A53983944j697764j881176k003590j864970j659496j621585j681609j660486
9142A39913268j575848j546468j559412j524871j436217j320455j160570j007638
9134A28781789j014832j194551j299682j146317r12438q82368j009846j008988
9126A20312767q20088o86280p43065q12046p06900n23588m73472n67333o22360
9117A14357635n17069l15489j65323j57049k67056l81606l88359k75908j25354
9108A11764422l056P8603Q8943k1260j84395j98545K4515K78689L04657J65571
$$ plain form
9166 186364606 184238709 182285099 180391626 178345701 176104476 173863781 171799901 169838003
9158 169838003 167800134 165703286 163715447 161837943 159872703 157767393 155750758 153983944
9150 153983944 152286180 150405004 148401414 146536444 144876948 143255363 141573754 139913268
9142 139913268 138337420 136790952 135231540 133706669 132270452 130949997 129789427 128781789
9134 128781789 127766957 126572406 125272724 124126407 123213969 122331601 121321755 120312767
9126 120312767 119492679 118806399 118063334 117251288 116544388 116020800 115547328 114979995 114357635
9117 114357635 113840566 113525077 113359754 113202705 112935649 112554043 112165684 111889776 111764422
9108 111764422 111761366 111839969 111928912 111907652 111723257 111524712 111549227 111827916 112132573 112298144
9098A12298144J64667L76372N17118L88673J95806K21956M00328M78130M50236
9089A15491430N04742O29018O30293N25024N34806O66311O84219N75545O19818
9080A20861206Q57699R39471P29708O04467Q22840J051864R43668P62010Q92578
9071A28465511J099612R37249O33583P86726J292104J412958R89715P33281J056352
9062A37407091J410086J226165Q38600Q78024J250667J381132J165560J032018
9054A46589343J182843J354356J329901J230881J230769J315646J402093J458760
9046A57094592J466209J417965J364289J350141J369083J449912J644195J840141
9038A68996527J804519J551006J419637J596905J820801J807956J697142J749624
$$ plain form
9098 112298144 112462811 112839183 113356301 113744974 113940780 114162736 114563064 115041194 115491430
9089 115491430 115996172 116625190 117255483 117780507 118315313 118981624 119665843 120241388 120861206
9080 120861206 121718905 122658376 123388084 123992551 124815391 125867255 126810923 127572933 128465511
9071 128465511 129565123 130502372 131135955 131922681 133214785 134627743 135617458 136350739 137407091
9062 137407091 138817177 140043342 140881942 141759966 143010633 144391765 145557325 146589343
9054 146589343 147772186 149126542 150456443 151687324 152918093 154233739 155635832 157094592
9046 157094592 158560801 159978766 161343055 162693196 164062279 165512191 167156386 168996527
9038 168996527 170801046 172352052 173771689 175368594 177189395 178997351 180694493 182444117
9030A82444117J865881J795418J636205J692515J945688K089063K035835J995573
9022A97500295K066066K120771K105739K111281K142400K122471K103041K169430
9014B14441494K200037K059061J945343K136958K445218K408094K043507J878595
9006B31558307K110661K282874K040750J713298J771441K088300K173054J907208
8998B47645893J621928J551198J585130J558327J481781J418165J320276J101984
8990B59284682Q07180O25959O92752Q71098Q46464N13668J44313J9831M1400o6467
8980B63780880l00751m45202n03641o88287r83387j116930j031537j007178j213216
8971B56490751j489668j680713j831805j942420j898448j790769j911592k262227
$$ plain form
9030 182444117 184309998 186105416 187741621 189434136 191379824 193468887 195504722 197500295
9022 197500295 199566361 201687132 203792871 205904152 208046552 210169023 212272064 214441494
9014 214441494 216641531 218700592 220645935 222782893 225228111 227636205 229679712 231558307
9006 231558307 233668968 235951842 237992592 239705890 241477331 243565631 245738685 247645893
8998 247645893 249267821 250819019 252404149 253962476 255444257 256862422 258182698 259284682
8990 259284682 260091862 260717821 261410573 262281671 263128135 263641803 263786116 263805947 263847347 263780880
8980 263780880 263480129 263034927 262531286 261842999 260859612 259742682 258711145 257703967 256490751
8971 256490751 255001083 253320370 251488565 249546145 247647697 245856928 243945336 241683109
8963B41683109k463455k359483k295783k539257k834246k850732k693890k621273
8955B21024990k609376k571764k663274k957399l137218k947186k669576k696415
8947A98772782k895647k891175k728545k726877k858542k835217k683097k676511
8939A76477171k784582k735607k576212k604753k766534k691912k374023k232226
8931A55711322k403197k529969k409621k307214k404003k436518k180654j881556
8923A37158590j872815k070716k150195k009685j819563j763505j885628k058717
8915A21527766k052854j806489j591353j653789j787027j638770j351825j382165
8907A08263494j694142j753116j422764j202960j345738j427550j177410j050604
$$ plain form
8963 241683109 239219654 236860171 234564388 232025131 229190885 226340153 223646263 221024990
8955 221024990 218415614 215843850 213180576 210223177 207085959 204138773 201469197 198772782
8947 198772782 195877135 192985960 190257415 187530538 184671996 181836779 179153682 176477171
8939 176477171 173692589 170956982 168380770 165776017 163009483 160317571 157943548 155711322
8931 155711322 153308125 150778156 148368535 146061321 143657318 141220800 139040146 137158590
8923 137158590 135285775 133215059 131064864 129055179 127235616 125472111 123586483 121527766
8915 121527766 119474912 117668423 116077070 114423281 112636254 110997484 109645659 108263494
8907 108263494 106569352 104816236 103393472 102190512 100844774 99417224 98239814 97189210
8899I7189210j428221j828649j605255j011098q25604j172899j445719j294100
8891H6577665j002843q81335q84474r19234j018061j102048r96098p74057p20987
8882G8278528q84308j005824r48643q52459q16252p58094o49668n88545n91760
8873G1182975n92299o35849p81962q51532o40979l63629m46079q47716j044546
8864F4978384q02446n05345n27095p13138p45491o43928n98873o07880n86205
8855E9247983n98501o97495p42439o35419n32329n74954o31658n57631m79454
8846E3798103n33783n60001l93559k49104m08293o85631o56608l41241j90095
8837D9779788l74360n52130m51533k65405k71005m00417m29062l37260k49445
$$ plain form
8899 97189210 95760989 93932340 92327085 91315987 90490383 89317484 87871765 86577665
8891 86577665 85574822 84693487 83809013 82889779 81871718 80769670 79773572 78999515 78278528
8882 78278528 77394220 76388396 75439753 74587294 73771042 73012948 72363280 71774735 71182975
8873 71182975 70590676 69954827 69172865 68321333 67680354 67316725 66870646 66022930 64978384
8864 64978384 64175938 63670593 63143498 62430360 61684869 61040941 60442068 59834188 59247983
8855 59247983 58649482 57951987 57209548 56574129 56041800 55466846 54835188 54277557 53798103
8846 53798103 53264320 52704319 52310760 52061656 51653363 50967732 50311124 49969883 49779788
8837 49779788 49405428 48853298 48401765 48136360 47865355 47464938 47035876 46698616 46449171
8828D6449171k09125k22609l43882n09630m75754j62334R8448n5405m89274p28330
8818D3351276n90096l52943k89275l44901l62159l38843l29565l15310l10417
8809D0117767l94915n05072m19520j30376J5176k04043m83817m09330r9314k7098
8799C7459458k79371m53663l30846j80426k36336l01819j47054N1709R989j81265
8789C5410376k30638j36484j42475k96906l95592l34674k27940j74563j59121
8780C3311983j80379k49810k65229j11304J04635J31416q3809l16152l53179k12792
8770C1775380o2528m9135j85288k95924j60503J59350K78687k0257m15385m44593
8760C0579804j43821N6514k1826j54246j76136j77117j90709r5751P4476R4888
$$ plain form
8828 46449171 46240046 46017437 45673555 45163925 44688171 44525837 44624285 44568880 44079606 43351276
8818 43351276 42761180 42408237 42118962 41774061 41411902 41073059 40743494 40428184 40117767
8809 40117767 39722852 39217780 38798260 38667884 38683060 38479017 37995200 37585870 37486556 37459458
8799 37459458 37180087 36726424 36395578 36215152 35978816 35676997 35529943 35581652 35591641 35410376
8789 35410376 35179738 35043254 34900779 34603873 34208281 33873607 33645667 33471104 33311983
8780 33311983 33131604 32881794 32616565 32505261 32609896 32741312 32657503 32341351 31988172 31775380
8770 31775380 31712852 31663717 31478429 31182505 31022002 31181352 31460039 31439782 31024397 30579804
8760 30579804 30435983 30492497 30470671 30316425 30140289 29963172 29772463 29676712 29751188 29846076
8750B9846076o2681j49957p1177m3571j89126l06926k18315l0137R8510J53375
8740B9026071J10515q0198k45337j07741K11914K51539o1635k31902K671K22407
8730B9098304M6450k16707j19622J66911J94241k0591j48586j47085j51912n4384
8720B8647019K38715L90326R3403k93553k24526J35544J99515l4349n3337J88613
8710B9287370K17574j0445P367L32325L62760r9777l95687n2075M47739M60040
8700C0557191J34362N277J21603J62915O6122P233K2278O7541J94656L28557K06153
8689C1873888j31395j95533K06905N34363L02507j18562q9521K87891M20258K13155
8679C3303956R4398J95272K21855J08712J33428L30063L85059K08085P9860J40101
$$ plain form
8750 29846076 29783395 29633438 29562261 29518690 29329564 29022638 28804323 28774186 28872696 29026071
8740 29026071 29136586 29056388 28811051 28703310 28915224 29166763 29105128 28873226 28875897 29098304
8730 29098304 29144754 28928047 28808425 28975336 29169577 29148986 29000400 28853315 28701403 28647019
8720 28647019 28885734 29276060 29369463 29075910 28851384 28986928 29186443 29152094 29098757 29287370
8710 29287370 29504944 29494499 29501866 29834191 30196951 30097174 29701487 29649412 30097151 30557191
8700 30557191 30691553 30696830 30818433 30981348 31047470 31054703 31076981 31144522 31339178 31667735 31873888
8689 31873888 31742493 31546960 31753865 32288228 32590735 32472173 32382652 32670543 33090801 33303956
8679 33303956 33398354 33593626 33815481 33924193 34057621 34387684 34772743 34980828 35060688 35200789
8669C5200789K15743K37021L38605M61431L51745P6904M7091L60690O05232N08734
8659C8403985L29113L53973M49065M00526L24377M01751N14476M78402L90192
8650D2045860M23180M91803M33267L45299M28003O18305O83111N96438N49117
8641D6614383O20175O79554O26245N39991N58776P08201Q74912R12893P96941
8632E2932071O72847O94185Q29001R27881R44520R39698R09413Q12544P45947
8623F0408107Q48528J027644J052322R44074R67817J171308J271498J117731R24122
8614F9733151Q74976Q46895P43522P60660J022683J253118J151575Q70314P70210
8605G8027104Q89806J001007J031442J077056J116483J060627R95571J048469
$$ plain form
8669 35200789 35416532 35653553 35992158 36453589 36805334 36882238 36929329 37290019 37895251 38403985
8659 38403985 38733098 39087071 39536136 39936662 40261039 40662790 41177266 41655668 42045860
8650 42045860 42469040 42960843 43394110 43739409 44167412 44785717 45468828 46065266 46614383
8641 46614383 47234558 47914112 48540357 49080348 49639124 50347325 51222237 52135130 52932071
8632 52932071 53604918 54299103 55128104 56055985 57000505 57940203 58849616 59662160 60408107
8623 60408107 61256635 62284279 63336601 64280675 65248492 66419800 67691298 68809029 69733151
8614 69733151 70608127 71455022 72198544 72959204 73981887 75235005 76386580 77256894 78027104
8605 78027104 78916910 79917917 80949359 82026415 83142898 84203525 85199096 86247565
8597H6247565J100495R65733P70875P93981R73134R60744O86665M98399O52745
8588I3650336R75740J145768J077539R16209Q31266Q96427J038312J078489R47593
8579A02557679Q19429Q86250J083090J223665J300723J406891J469955J373677
8571A12121359J257448J348610J548999J567375J440707J500431J784353J934015
8563A24503297J794508J675357J826938K064361K149841K180742K319722K460683
8555A40975449K467450K476725K655727K881467K955884K941361L001859L103914
8547A63459836L156835L258557L506313L743375L802840L830727M036002M283253
8539A93077738M308964M219062M357964M734735M998423N007569N026717N259441
$$ plain form
8597 86247565 87348060 88313793 89084668 89878649 90851783 91812527 92499192 92997591 93650336
8588 93650336 94626076 95771844 96849383 97765592 98596858 99493285 100531597 101610086 102557679
8579 102557679 103377108 104263358 105346448 106570113 107870836 109277727 110747682 112121359
8571 112121359 113378807 114727417 116276416 117843791 119284498 120784929 122569282 124503297
8563 124503297 126297805 127973162 129800100 131864461 134014302 136195044 138514766 140975449
8555 140975449 143442899 145919624 148575351 151456818 154412702 157354063 160355922 163459836
8547 163459836 166616671 169875228 173381541 177124916 180927756 184758483 188794485 193077738
8539 193077738 197386702 201605764 205963728 210698463 215696886 220704455 225731172 230990613
8531B30990613N531747N596352N495853N457640N594229N832451O027730O079111
8523B76605726O014944N969840N998086N985402N868178N799734N886303N913981
8515C24042194N652058N302963N243926N377756N225813M717426M351039M373635
8507C64286810M333367L810797L137761K878672K911386K632375J948519J421231
8499C87360918J335330J219010N93823k42150o37939n74470p11479j421674k240103
8490C84681266k533077k408450k550030l232435l955645m201612m156085m345520
8482C57298412m818600n143373n142164n152375n454697n850843o021651n993160
8474C13721549n990015o056954o098962o133098o228039o300478o224890o076352
$$ plain form
8531 230990613 236522360 242118712 247614565 253072205 258666434 264498885 270526615 276605726
8523 276605726 282620670 288590510 294588596 300573998 306442176 312241910 318128213 324042194
8515 324042194 329694252 334997215 340241141 345618897 350844710 355562136 359913175 364286810
8507 364286810 368620177 372430974 375568735 378447407 381358793 383991168 385939687 387360918
8499 387360918 388696248 389915258 390509081 390266931 389628992 389054522 388343043 386921369 384681266
8490 384681266 382148189 379739739 377189709 373957274 370001629 365800017 361643932 357298412
8482 357298412 352479812 347336439 342194275 337041900 331587203 325736360 319714709 313721549
8474 313721549 307731534 301674580 295575618 289442520 283214481 276914003 270689113 264612761
8466B64612761o034739o097545o100894n987915n849892n723067n548922n345312
8458B17924475n231268n237456n229186n072599m801541m586529m556044m627277
8450A78582575m539357m165654l763994l695826l875608l825625l408381l103351
8442A48204779l258376l471292l204599k698590k622896k971090l045673k594130
8434A24338133k204850k320686k553242k400016k061577j999602k119924k012920
8426A06665316j725142j656648j826563j848890j619438j465655j540424j572280
8418I3410276j372615j162669j185926j331080j364417j278424j194799j124635
8410H3395711j027433r54271r55812r68858r34327r10011r44311r63860r12454
$$ plain form
8466 264612761 258578022 252480477 246379583 240391668 234541776 228818709 223269787 217924475
8458 217924475 212693207 207455751 202226565 197153966 192352425 187765896 183209852 178582575
8450 178582575 174043218 169877564 166113570 162417744 158542136 154716511 151308130 148204779
8442 148204779 144946403 141475111 138270512 135571922 132949026 129977936 126932263 124338133
8434 124338133 122133283 119812597 117259355 114859339 112797762 110798160 108678236 106665316
8426 106665316 104940174 103283526 101456963 99608073 97988635 96522980 94982556 93410276
8418 93410276 92037661 90874992 89689066 88357986 86993569 85715145 84520346 83395711
8410 83395711 82368278 81414007 80458195 79489337 78555010 77644999 76700688 75736828 74824374
8401G4824374q76101r29417r72103q81162p43029p54789r22078j023183r04522
8392F6817990o88213o14197p35339q56901p95178o23500n68511o82744p70726
8383F0482681p01796o23041p02643q13716p23950n15923n10232p59732r36954
8374E4194694q23023o19002o04005p25317p45008o23240n25575n45906o21980
8365D8361638o75894o86605o57990o16598n97607n82561n37506n30422o50268
8356D2826187p79941o85366m13872l17565n20370o76809n15214l03851m06924
8347C8206275o45506n80615k69724j95385m67385o48591m79615k65569l27516
8338C4326369n02462m79310l04822k41020l40509m45857m58427l85729k59218
$$ plain form
8401 74824374 73948273 73018856 72046753 71165591 70422562 69667773 68745695 67722512 66817990
8392 66817990 66129777 65515580 64780241 63923340 63128162 62504662 61936151 61253407 60482681
8383 60482681 59780885 59157844 58455201 57641485 56917535 56401612 55891380 55131648 54194694
8374 54194694 53371671 52752669 52148664 51423347 50678339 50055099 49529524 48983618 48361638
8365 48361638 47685744 46999139 46341149 45724551 45126944 44544383 44006877 43476455 42826187
8356 42826187 42046246 41360880 40947008 40629443 40109073 39432264 38917050 38613199 38206275
8347 38206275 37560769 36980154 36710430 36515045 36047660 35399069 34919454 34653885 34326369
8338 34326369 33823907 33344597 33039775 32798755 32458246 32012389 31553962 31168233 30909015
8329C0909015j77586k70642m66564m95183k93735j72271l48953n65237m67993
8320B7650851j72483p8911k53012l78898k88794j61017j55028j90581j81375j99675
8310B5591077k86097l29113k63587k00788k36723k88817k43697j40753r8859j56241
8300B3346402k64280l54063l56067k49704j32828j33311k19802k29762j23637
8291B1282948n8385j41762k69293l00449k50371j91257j05365J5197M4955j11442
8281A9914776l06522l03468j22062k9314j49754k80557k06107m3959q3200l24769
8271A8065064m14349j36465K04480J31015l28333n99632l15686J62652K35490
8262A7004236j11144l39317j70126O5127Q730j86018j84019m2332o9249k57529
$$ plain form
8329 30909015 30731429 30460787 29994223 29499040 29205305 29033034 28684081 28118844 27650851
8320 27650851 27478368 27399457 27146445 26767547 26478753 26317736 26162708 25972127 25790752 25591077
8310 25591077 25304980 24975867 24712280 24511492 24274769 23985952 23742255 23601502 23502643 23346402
8300 23346402 23082122 22728059 22371992 22122288 21989460 21856149 21636347 21406585 21282948
8291 21282948 21224563 21082801 20813508 20513059 20262688 20071431 19966066 19981263 20026218 19914776
8281 19914776 19608254 19304786 19182724 19153410 19003656 18723099 18516992 18473033 18389833 18065064
8271 18065064 17650715 17514250 17718730 17849745 17521412 16921780 16606094 16768746 17004236
8262 17004236 16893092 16553775 16383649 16448776 16457506 16271488 16087469 16045137 15975888 15718359
8252A5718359k77721l8506J33776m096k45795k65623q8373P407q1153j93808j96832
8241A4467635j38833j06936j04187j07284j08222o4725N6128J48260L9861k23319
8231A3858378l34705j15993J85285J94140p6849k61800j80372n8000j15694k14395
8221A2879995j15939R7264J38068l7904j78662j30189l5932p7314k13026k76880
8211A2049481j98051l3514J13251J36809L1j73338j87761l1366P7925k484j19198
8200A1631785n8150J01632Q2616j58854l22009j74637J02697J59490l3579j63811
8190A1167180n9218N6182o1964k53625j83192J03713K05930j0758j88899n0975
8180A0724374J52223O3641j88884k17817j3428Q5410k1458r0245j8961P061p4985
$$ plain form
8252 15718359 15440638 15402132 15535908 15531812 15286017 15020394 14932021 14939428 14858275 14664467 14467635
8241 14467635 14328802 14221866 14117679 14010395 13902173 13837448 13893576 14041836 14081697 13858378
8231 13858378 13523673 13407680 13592965 13787105 13710256 13448456 13268084 13210084 13094390 12879995
8221 12879995 12764056 12861320 12999388 12961484 12782822 12652633 12616701 12539387 12326361 12049481
8211 12049481 11851430 11817916 11931167 12067976 12068007 11894669 11706908 11675542 11753467 11750983 11631785
8200 11631785 11573635 11675267 11757883 11599029 11277020 11102383 11205080 11364570 11330991 11167180
8190 11167180 11107962 11164144 11102180 10848555 10665363 10769076 10975006 10964248 10775349 10724374
8180 10724374 10876597 10940238 10751354 10533537 10520109 10605519 10584061 10493816 10474855 10481916 10406931
8169A0406931p6791M4450P1386m7580o9242P3745J01768r1117j93223l8858M7217
8158A0228686j53035k71089K8271L53447J40680l78707m65149J147L78392K58415
8148A0121058n2993j64114j13582o7299l313P4936K6217j20951j19943N7955J14055
8137I752026p0232k00344n9986J29847R6313o2416j05969l1403K8494N2356N6393
8126I585079p489j02820r1803p007n6069k20043j95469Q3957K53926Q7189j35809
8115I193642j10856K6248M9389N8020J56526J13647j97728l88404j08886L00348
8105I091946K90547l3353j51792p077L3883o2687Q17J59684L9659k69616k43264
8094H848747J59510L45276N8858k19278j36535j8808j63536k51180K5352L19694
$$ plain form
8169 10406931 10330140 10374590 10445976 10398396 10329154 10402899 10504667 10413550 10220327 10181469 10228686
8158 10228686 10075651 9804562 9832833 10186280 10326960 9948253 9483104 9484251 9862643 10121058
8148 10121058 10068065 9903951 9790369 9723070 9719757 9794693 9820910 9699959 9580016 9637971 9752026
8137 9752026 9681794 9481450 9421464 9551311 9647624 9585208 9479239 9447836 9476330 9528686 9585079
8126 9585079 9577590 9474770 9382967 9375960 9319891 9099848 8904379 8988336 9242262 9329451 9193642
8115 9193642 9082786 9109034 9158423 9216443 9372969 9486616 9288888 8900484 8791598 9091946
8105 9091946 9382493 9349140 9197348 9190271 9224154 9161467 9162284 9321968 9361627 9092011 8848747
8094 8848747 9008257 9353533 9412391 9193113 9056578 9037770 8874234 8623054 8648406 8968100
8084H968100K12438l8703K8817K36013Q7734l05642l64240j060K56957J45446
8074I225860N167R8773J79176J0246j68632n8240J69158J50363p3589j44294K7021
8063I421009J49177N6105l1493R5704K54116J50259j14947j61925O9804K02206
8053A0090015J3865j95678q7416J70061J99567M1364K6029J46598Q5006j38882
8043A0350529j15245K21547L70986N6048k74073j24541K77598L68034R5530j13281
8033A1113132m9183J06134J97100K36301J80798k5440k05710j20082J25104J86332
8023A1744486K553j35216n2351J03259J66918J58103J12791k049j28707j17652
8013A1852135L7241J59603J30651J396j24856j53956j1166K13884K47788M046
$$ plain form
8084 8968100 9180538 9141835 9170652 9406665 9494399 9188757 8824517 8823457 9080414 9225860
8074 9225860 9231027 9329800 9508976 9519222 9350590 9292350 9461508 9611871 9538282 9393988 9421009
8063 9421009 9570186 9626291 9594798 9690502 9944618 10094877 9979930 9818005 9887809 10090015
8053 10090015 10103880 9908202 9820786 9990847 10190414 10231778 10257807 10404405 10489411 10350529
8043 10350529 10235284 10456831 10827817 10883865 10609792 10485251 10762849 11130883 11226413 11113132
8033 11113132 11063949 11170083 11367183 11603484 11784282 11758842 11553132 11433050 11558154 11744486
8023 11744486 11747039 11611823 11559472 11662731 11829649 11987752 12100543 12098494 11969787 11852135
8013 11852135 11889376 12048979 12179630 12181026 12056170 11902214 11891048 12104932 12352720 12356766
8003A2356766j86703m1677J69683L8884k28485p9513M03435M96779k7200m66256
7993A2435713k40326K51801L24103M2563l6743J69226K28614j5822k13991r3831
7983A2851307J78586L07968K13341Q98j57653r7082J76948M01797L28626M6377
7973A4251113j43009j05400N5286K12326K89029K13323K7405n3117Q1469K19688
7963A5048113J52080N2896J94401M17544L32221r94q9033K18685M73262L39968
7953A7139143J08770J80791M20021M19933J73085M3384J80675L63542M10091L92079
7943A9831514L90684L47968K65690K93460M74085O08886N48698M49282N27295
7934B3737562O86765O48552M04543K49010L00447K85469k4179l98960m54212k27981
$$ plain form
8003 12356766 12170063 12128386 12298069 12336953 12108468 12028955 12432390 12929169 12901969 12435713
7993 12435713 12195387 12447188 12771291 12813854 12777111 12946337 13174951 13159129 12945138 12851307
7983 12851307 13029893 13337861 13551202 13552100 13394447 13297365 13474313 13876110 14204736 14251113
7973 14251113 14108104 14002704 14057990 14270316 14559345 14772668 14800073 14746956 14828425 15048113
7963 15048113 15200193 15253089 15447490 15865034 16197255 16196261 16107228 16325913 16799175 17139143
7953 17139143 17247913 17428704 17848725 18268658 18441743 18485127 18665802 19029344 19439435 19831514
7943 19831514 20222198 20570166 20835856 21129316 21603401 22212287 22760985 23210267 23737562
7934 23737562 24424327 25072879 25477422 25726432 26026879 26312348 26288169 25889209 25434997 25207016
7924B5207016j25507l07968m75335l55919j17810r8530l22805n14974m91518l41593
7914B2055057k52366l03828m33245n15388m84795m07804l89339m16149l94776
7905A8457367l30431l07183k91165j73234m1470j34456m21506n34895l02596m6521
7895A5873910r4410k77505k44757m0576K4914p7455r8685J5731O0537l4316j04439
7884A5002949o0654J6868R3188J87400J93877J8069j40261J426L22424M10611
7874A6045897J88684K9491J73821M26747N42526N31556M47626K35724m1360j54631
7864A8426081n6306J7596p6058k12711l07045m44430n85332n24114k98397k39529
7854A5699755m30879n30068l42925j40200j52450k01903j34993j54017l58720
$$ plain form
7924 25207016 25081509 24773541 24298206 23942287 23824477 23725947 23403142 22888168 22396650 22055057
7914 22055057 21802691 21498863 21065618 20550230 20065435 19657631 19268292 18852143 18457367
7905 18457367 18126936 17819753 17528588 17355354 17313884 17179428 16757922 16223027 15920431 15873910
7895 15873910 15779500 15501995 15257238 15216662 15241576 15164121 15065436 15081167 15141704 15107388 15002949
7884 15002949 14942295 14959163 15052351 15239751 15433628 15451697 15311436 15312862 15635286 16045897
7874 16045897 16234581 16264072 16437893 16864640 17407166 17938722 18386348 18622072 18580712 18426081
7864 18426081 18369775 18387371 18311313 18098602 17791557 17347127 16761795 16237681 15939284 15699755
7854 15699755 15268876 14738808 14395883 14255683 14103233 13901330 13766337 13612320 13253600
7845A3253600m24127j58003P1305o1965k54282j26310P3610n3192k72593j33979
7835A1914064J53433O0397k71702k34690J64863L09968N9470n8820J47821K23054
7825A2467858j8404j06494K05337M62818L38741K14738M34915O39317M25135R9444
7815A5163405J24981K87544J07556k82915l91722k42979k81034n35303n85604
7806A3363929l43843k13225l77080n07857l58216j58083j90951l47251l55950
7797A0511473k06354r9020j23738j75658j31895o573N9834l5022j88147j80951
7787I423949N216J18688O733j34104p8377N1370J4852r8043j3003K18286K59453
7776I775020N6196m2637J55434L66747K67949k5478j57012k8065J33335J09810
$$ plain form
7845 13253600 12829473 12671470 12742775 12680810 12426528 12300218 12373828 12320636 12048043 11914064
7835 11914064 12067497 12127894 11856192 11621502 11786365 12096333 12155803 12096983 12244804 12467858
7825 12467858 12449454 12342960 12548297 13011115 13349856 13564594 13999509 14638826 15063961 15163405
7815 15163405 15288386 15575930 15683486 15400571 15008849 14765870 14484836 13949533 13363929
7806 13363929 13020086 12806861 12429781 11921924 11563708 11405625 11214674 10867423 10511473
7797 10511473 10305119 10206099 10082361 9906703 9774808 9768235 9828069 9793047 9604900 9423949
7787 9423949 9429165 9547853 9554586 9420482 9342105 9393475 9408327 9310284 9297281 9515567 9775020
7776 9775020 9831216 9788579 9944013 10310760 10578709 10553231 10396219 10368154 10501489 10611299
7766A0611299r0823l18458m36180m03268k95355k42302k99745l90776l92064k56657
7756G485671n0545J00717J06597j2078j43824j98063j74200j21889q8870j05874
7746F797642j43451j01631L3932O4997j72848m45372l26073J37235L50375O591
7736F201397l98037k73213J75346K92519r867k11952r5865k2824j88346k53182
7726E215976j963J93256j9128l33540k47849J31908K68836K8352j81683r8285
7716D955880L9745m2678k03303j40956J02178J82060l7921k61826j57432J62679
7706D598426K63094j5222l15713k61824J8566J18947l2852j27172j0135J00488
7696D336603K4417r4061p5425j379j7074o4108l1006J4376l1575q1629k854J24079
$$ plain form
7766 10611299 10520476 10202018 9765838 9362570 9067215 8824913 8525168 8134392 7742328 7485671
7756 7485671 7435126 7535843 7642440 7630362 7486538 7288475 7114275 6992386 6903516 6797642
7746 6797642 6654191 6552560 6586492 6651489 6478641 6033269 5707196 5844431 6194806 6201397
7736 6201397 5803360 5530147 5705493 5998012 5988145 5776193 5680328 5657504 5469158 5215976
7726 5215976 5214013 5407269 5388141 5054601 4806752 4938660 5207496 5235848 5054165 4955880
7716 4955880 4995625 4952947 4749644 4608688 4710866 4892926 4855005 4593179 4435747 4598426
7706 4598426 4861520 4846298 4530585 4268761 4287327 4406274 4373422 4246250 4236115 4336603
7696 4336603 4361020 4266959 4191534 4190155 4173081 4108973 4077967 4092343 4060768 3979139 3976285 4100364
7684D100364J13202l1918j30332q5789K7016J03475J04871M4683k6692o2437q9698
7673D066745j56580j91390o7794J49026K18763O6224j08882j57946j71090k07518
7663C439558j25189J13713K48038J00551r3056m9171R6427M5165j32744j35312
7653C507980K8455P1071m8878p3605N9834R3061q6726k21771q5353J69633K32997
7642C646698K5545k54513l46901j48587J61528K45988O440k29883j32647J44765
7632C118433K04918K7681m5461Q2282J23986m9069j72249o0932P8447K9739q4008
7621C253767p6654k4187n5311p8486J2723Q6185k849j20185n8925J14245J76605
7610C226928Q7920k6021j10559j70728j31635M9763K12168J61135l5997j36244
$$ plain form
7684 4100364 4213566 4181648 4051316 3965527 3992543 4096018 4200889 4245572 4218880 4156443 4066745
7673 4066745 3910165 3718775 3650981 3800007 4018770 4084994 3976112 3818166 3647076 3439558
7663 3439558 3314369 3428082 3676120 3776671 3683615 3634444 3730871 3776036 3643292 3507980
7653 3507980 3536435 3607506 3558628 3485023 3544857 3637918 3551192 3329421 3244068 3413701 3646698
7642 3646698 3672243 3417730 3070829 2922242 3083770 3329758 3336198 3106315 2973668 3118433
7632 3118433 3323351 3351032 3305571 3387853 3511839 3462770 3290521 3229589 3308036 3337775 3253767
7621 3253767 3177113 3152926 3097615 3019129 3031852 3118037 3115188 2995003 2936078 3050323 3226928
7610 3226928 3314848 3288827 3178268 3007540 2875905 2925668 3137836 3298971 3262974 3126730
7600C126730o8973K073l7440q7559n128J68572K27257M8338k06496k29186K9316
7589B967504K23227O2415k30296k13906R0104K14902j6708k25220j05265J14078
7579B880835J07329l4573o4119k7288q3691j38662l5540R7575O4611k6372K4886
7568B764991J14258L3632j06242o2615P7501N0853q3004m0402J61541K21324O5812
7557C197649o9072o2305k7169j7071K4722M7361k7197p2052L5799R4086j13418
7546C011333l29798j65761J97977K53093K7041J1032K30925J73322k32466l80809
7536B795889j9582K82063J02353j45100p289K11091O6906j95893j30610Q7553
7526C047381M4557j03719M1099K96639J83086j82582k52507J3438J32937k1588
$$ plain form
7600 3126730 3057757 3059830 3022390 2934831 2929703 3098275 3325532 3373870 3167374 2938188 2967504
7589 2967504 3190731 3253146 3022850 2808944 2899048 3113950 3097242 2872022 2766757 2880835
7579 2880835 2988164 2953591 2889472 2862184 2778493 2639831 2604291 2701866 2766477 2740105 2764991
7568 2764991 2879249 2912881 2806639 2744024 2821525 2872378 2789374 2748972 2910513 3131837 3197649
7557 3197649 3128577 3066272 3039103 3022032 3046754 3094115 3066918 2994866 3030665 3124751 3011333
7546 3011333 2681535 2515774 2713751 2966844 2993885 3004917 3235842 3409164 3176698 2795889
7536 2795889 2776307 3058370 3160723 3015623 3008334 3219425 3286331 3090438 2959828 3047381
7526 3047381 3091938 2988219 3029318 3325957 3509043 3326461 3073954 3087392 3220329 3198741
7516C198741p0482J15919K07240N9958o0328k4200j6285n4229P6753K78865J50501
7505C862453k72750m10983l6295L27736K33588m0567p4569J694r7317j86263L2975
7494C339702L12906J83586k44198l93807q1851K71700L14240J65222N7406j3957
7484C910949j16084j61501o4768P4337J10761N6366J6354J1813k0548r1996j19223
7473C606460l6113R4021J30681M1022k9821M6352J69592J37136l5989j05747M4527
7462D062121K21635K00116K9440p1745k3082N7003M9009k1748l8649M5700J17188
7451D626988K9157j39892j03595K09198M21954J82162k64377l56889k7706K27283
7441D804283J27664m4649k7539J3322p3227p0934J43504K35481m1127l21470j65833
$$ plain form
7516 3198741 3128259 3244178 3451418 3511376 3451048 3426848 3410563 3356334 3433087 3711952 3862453
7505 3862453 3589703 3178720 3142425 3470161 3703749 3663182 3588613 3590307 3492990 3306727 3339702
7494 3339702 3652608 3836194 3591996 3198189 3116338 3388038 3702278 3867500 3924906 3910949
7484 3910949 3794865 3633364 3568596 3642933 3753694 3810060 3826414 3838227 3817679 3725683 3606460
7473 3606460 3570347 3664368 3795049 3836071 3806250 3852602 4022194 4159330 4123341 4017594 4062121
7462 4062121 4283756 4483872 4513312 4441567 4418485 4475488 4524497 4502749 4464100 4509800 4626988
7451 4626988 4656145 4516253 4412658 4621856 5043810 5225972 4961595 4604706 4577000 4804283
7441 4804283 4931947 4887298 4859759 4873081 4799854 4728920 4872424 5107905 5066778 4745308 4579475
7430D579475K09084K95384J18254P8406J73223N3472k33019k51641L9036J87126
7420E248800L5658l2917J72780K93736P2139j83520j32398N4074N5029o3336n2085
7409E467960P0466J27767J16525J22015R9446m0p4112n1932k4548k3122O8054
7398E898479K08110J41995j35081k27169N8738L36129K25881m5014o0808J02563
7388F503823J13869K1306R2721K28102J22067j15458j01251J22463J40537q0535
7378G047644j09613J85701L91012K38130J614k9391J5012m9622j03410l2707j8187
7367G536183j90559l21356j82719N3411R0104m6349j27896j01993p4811p6480
7357F557535p2631o5553k1510J13932K07460K5683l18452l65773J0879L21642
$$ plain form
7430 4579475 4788559 5083943 5202197 5280603 5453826 5507298 5274279 5022638 5061674 5248800
7420 5248800 5284458 5251541 5424321 5718057 5790196 5606676 5474278 5528352 5583381 5520045 5467960
7409 5467960 5538426 5666193 5782718 5904733 6004179 6004139 5930027 5878095 5853547 5830425 5898479
7398 5898479 6106589 6248584 6113503 5886334 5945072 6281201 6507082 6462068 6401260 6503823
7388 6503823 6617692 6638998 6731719 6959821 7081888 6966430 6865179 6987642 7128179 7047644
7378 7047644 6938031 7123732 7514744 7752874 7754488 7725097 7740109 7690487 7587077 7554370 7536183
7367 7536183 7345624 7024268 6841549 6894960 6985064 6938715 6810819 6708826 6634015 6557535
7357 6557535 6484904 6419351 6397841 6511773 6719233 6744916 6426464 6060691 6071570 6393212
7347F393212J78682j00182m2391J96576J59879q0548o9003K00467K69634K8486
7337G134812j08966N4774J87181M6172j20247n0777J04123J13530M5064M2317
7327G447983N5641M2862J13680K34608J38050k00452l57262p5527K57695J68532
7317G825810j58243j86534J08568K29785l7810l29114k89631l9672J05809O7624
7307G296592j5788k6341M6652J20635O4874j39021k88194j79849P9211J90274
7297G149045P9673l5333j3380K8757l7455j53828k12146j98949j29466j6084M3026
7286F503860n9828k23500k15000l3271M8057r3858k22772j26508L2113k3371k46508
7275E339414l47980k18623m0551l793q8311j39390o5873M4901J0978j85119k87396
$$ plain form
7347 6393212 6571894 6471712 6429321 6625897 6785776 6705228 6636225 6836692 7106326 7134812
7337 7134812 7025846 7080620 7267801 7313973 7193726 7142949 7247072 7360602 7405666 7447983
7327 7447983 7503624 7546486 7660166 7894774 8032824 7832372 7475110 7399583 7657278 7825810
7317 7825810 7667567 7481033 7589601 7819386 7781576 7452462 7162831 7123159 7228968 7296592
7307 7296592 7280804 7254463 7301115 7421750 7486624 7347603 7059409 6879560 6958771 7149045
7297 7149045 7228718 7193385 7180005 7208762 7171307 7017479 6805333 6606384 6476918 6460834 6503860
7286 6503860 6444032 6220532 6005532 5972261 6020318 5926460 5703688 5577180 5609293 5585922 5339414
7275 5339414 4991434 4772811 4732260 4728467 4640156 4500766 4434893 4479794 4490772 4305653 4018257
7264D018257r7225J52029O3019k78515l46175N889K48358J428l25632j91086J90040
7253C440387K32387l0490p6723J13838J3248m38522n90479j37131L20235K11116
7243C057866j31808r9270J95546K07500q2019k02459m0365K8306j48072k57512
7233B527713j07186P0138O4330J2760P0392J12638K212j28270j03550q840l4383
7222B477954j59181j96621p4202Q9093J41825M6692r1321j15089L464R6644K5124
7211B244382r2695n9919N3209J4050j37737j02385J57588K73024K5457k85873
7201B089101k87508n8348Q3027P6106O7405N3326n7200j51382n8556R3426M4055
7190A893452j28638j04302J13015J59180o9741j97906K5410K83216J59488k19431
$$ plain form
7264 4018257 3921032 4073061 4136080 3857565 3511390 3517279 3765637 3767065 3441433 3250347 3440387
7253 3440387 3672774 3642284 3565561 3679399 3692647 3254125 2663646 2526515 2846750 3057866
7243 3057866 2926058 2826788 3022334 3229834 3147815 2945356 2904991 2933297 2785225 2527713
7233 2527713 2420527 2490665 2554995 2567755 2638147 2750785 2752997 2624727 2521177 2512337 2477954
7222 2477954 2318773 2122152 2047950 2137043 2278868 2325560 2234239 2119150 2122614 2219258 2244382
7211 2244382 2151687 2091768 2144977 2159027 2021290 1918905 2076493 2349517 2374974 2089101
7201 2089101 1801593 1743245 1826272 1902378 1969783 2023109 1965909 1814527 1755971 1849397 1893452
7190 1893452 1764814 1660512 1773527 1932707 1862966 1665060 1690470 1973686 2133174 1913743
7180A913743l67751j29465J54725J54657m7924j40146J098J77723J34417j03315
7170A747762k30931o2005J75890J23321j79695l09810n8966K68955L04021R0349
7160A868891q8900j38955j43580j04935J2126R4049K8808m8480M2211J59176J7216
7149A697627k96758l64809n8193K41779J84901q8231k13958r5245P9445J38287
7139A224845O4111n5118q8424J6845J13970J9211j65979j41558J01925J94447
7129A284275m2678k70853j52445J14700J47483N354J9487J68543J34024q5460
7119A322430j42502L4261R6242j09167k60033j14198R0545P3354k7799L4464J54969
7108A152566R3395p9821j27826o0262m0411l1778Q9878J96004P3840j43116j25277
$$ plain form
7180 1913743 1545992 1416527 1571252 1725909 1677985 1537839 1538937 1716660 1851077 1747762
7170 1747762 1516831 1454826 1630716 1754037 1574342 1264532 1205566 1474521 1778542 1868891
7160 1868891 1779991 1641036 1497456 1392521 1404647 1498696 1527504 1479024 1521235 1680411 1697627
7149 1697627 1400869 1036060 977867 1219646 1404547 1316316 1102358 1007113 1086558 1224845
7139 1224845 1288956 1233838 1145414 1162259 1276229 1295440 1129461 987903 1089828 1284275
7129 1284275 1241597 970744 818299 932999 1080482 1085836 1105323 1273866 1407890 1322430
7119 1322430 1179928 1214189 1310431 1201264 941231 827033 917578 990932 963133 997597 1152566
7108 1152566 1245961 1166140 1038314 978052 937641 905863 995741 1191745 1265585 1122469 997192
7097I97192J00271J68242k6870j76247r1864J6716l9739j12527k9758R4860J06860
7086A007136Q2863J08217M7835j77498l22539j51595J39410J81869q146q9249
7076H18303N1324J63400O9954q4808j04754j3049M4365R84r0248j10198K5435
7065G70708K11923J90261r6443l09013j31509K31219L14866Q1356p2361Q789L4137
7054A233933j41319k22322k4343J39803j2544k08594o8991K21938K07071q1770
7044A042862j99492l5284O7212m8239j23456j4687M4941q8098j69426L42K00090
7033F76765J50211k9420n0061O1789M9394j20888k09647q2108J11731J58743L1955
7022G48464j00565n3440J51356K37396m613l44106l18889R8131L70565J46545
$$ plain form
7097 997192 1097463 1265705 1238835 1062588 970724 987440 947701 835174 805416 900276 1007136
7086 1007136 1089999 1198216 1246051 1068553 746014 594419 733829 915698 907552 818303
7076 818303 869627 1033027 1102981 1018173 913419 900370 944735 945719 855471 745273 770708
7065 770708 982631 1172892 1076449 767436 635927 867146 1182012 1263368 1191007 1199796 1233933
7054 1233933 1092614 870292 845949 985752 973208 764614 695623 917561 1124632 1042862
7044 1042862 843370 808086 875298 827059 703603 688916 733857 645759 476333 476675 676765
7033 676765 826976 797556 747495 809284 858678 737790 528143 446035 557766 716509 748464
7022 748464 647899 594459 745815 983211 978598 634492 315603 413734 784299 930844
7012I30844k07299j67204J44908J97832q0740k26831k5247J74737P6241j03143
7002G14098m3800J51721J54241q3728k93113k55839j2922K26688K70992J10254
6992I38592n4489m5542M5710J4673j01191q6272N0883P3733m8503q4006K680l0186
6980F76082j76960p9204K94997M01343l7562m46670k20317K95401L32613r2051
6970I47672k89183o1937Q3624q0885j52123P8914K13186j2272k25887p2329J92379
6959F21159J87108R623q0239j42161k67805k30265Q2767K72736J9746k74602n6862
6948A41205M32996M78862P405l29863j90856L8781m042j22655l2771J31283J05200
6937F55545n6624j18807k3977J06868J63947J01018m5468j26452m4799N2447k3047
$$ plain form
7012 930844 723545 556341 701249 899081 818341 591510 566263 741000 817241 714098
7002 714098 670298 822019 976260 892532 599419 343580 330658 557346 828338 938592
6992 938592 884103 838561 884271 898944 797753 711481 762364 836097 787594 703588 706268 676082
6980 676082 499122 419918 714915 1116258 1078696 632026 411709 707110 1039723 947672
6970 947672 658489 596552 680176 599291 447168 526082 739268 726996 501109 428780 621159
6959 621159 808267 817890 737651 595490 327685 97420 180187 452923 472669 198067 141205
6948 141205 574201 1053063 1060468 730605 539749 578530 574488 451833 419062 550345 655545
6937 655545 598921 480114 456137 563005 726952 827970 782502 656050 611251 663698 640651
6926F40651j47447n3415J73657J71123q7525k02378K508J90007P9879j16314j04466
6915E46280K2320L7143j3918J6882O5530K2921k2184J3720R681r0285r2133P6137
6903E92094J29004r5267k59301n9440J97959P6538k16495j55470J92969K70216
6893F72807k1976j75318L9686K17084M6702j97223j84709m1448p388r712Q1104
6882D19609J27269O055q3366N2675K16219J14438j47987k25045n5849Q9445L4207
6871E47670j02029j20344J5498J54643J05297j31399k68643m8729L37392M18172
6861I07528J01102j73564r4796P9571J4475j38043o2389J17382M1698k33468k92345
6850B67151l5807J66136O8046j08105p0048J15034J76796L7028j23533j13944
$$ plain form
6926 640651 493204 439789 613446 784569 697044 494666 497174 687181 767060 650746 546280
6915 546280 568600 605743 591825 608707 674237 697158 674974 688694 698375 608090 515957 592094
6903 592094 721098 625831 366530 307090 505049 581587 365092 209622 402591 672807
6893 672807 650831 475513 515199 732283 778985 581762 397053 355605 348217 338505 419609
6882 419609 546878 552933 469567 522242 738461 852899 704912 479867 424018 513463 547670
6871 547670 445641 325297 340795 495438 600735 469336 200693 151964 489356 907528
6861 907528 1008630 835066 740270 819841 834316 696273 633884 751266 792964 559496 267151
6850 267151 231344 397480 465526 357421 287373 402407 579203 616231 492698 378754
6840C78754N0197J68759R9104l9044k1070J10540P1002j70670k44938K7792K41947
6829F72373O60l79544k90232K06045M41314J54194j77029j30767J00011J66792
6819G63817Q3661M341j00645k41964k39809m7952O9805l4910j17555J9907J53005
6808C11701M4261r9741O419J88144J06965j20426j10058J14660J67492k0419r4977
6797D94021Q2558J89545K789k16019j44810R6881J53782l7730j94191r8606J24753
6786D52973J83088j2583k15821j48833R3668J32389j31976l02456n5592L22603
6776C17460L30364P432j53684J1190J47310K9831j01018l3728M2519o7714j83576
6765C46386q7610O0702R047j29806q0919J01880J29604l3452j34914n1421P8969
$$ plain form
6840 378754 428951 597710 696814 657770 636700 747240 818242 647572 402634 430426 672373
6829 672373 673033 293489 3257 209302 650616 804810 627781 497014 597025 763817
6819 763817 847478 851819 751174 509210 269401 221449 291254 256344 138789 158696 311701
6808 311701 355962 256221 262640 450784 557749 437323 327265 441925 609417 588998 494021
6797 494021 576579 766124 768913 552894 408084 504965 658747 621017 426826 328220 452973
6786 452973 636061 623478 407657 258824 352492 484881 352905 50449 -5143 317460
6776 317460 647824 655256 501572 512762 660072 689903 588885 555157 597676 529962 346386
6765 346386 258776 319478 328525 198719 117800 219680 349284 315832 180918 129497 208466
6754B08466J35568J43074J12542J1381q9566p0526K2231L4000k9615k7127L1380
6743D81808n590j07084n2260J63112K26377j5205k60623j83278O9836J11181r1352
6732C36922j89836m772K22144K06947K896j44034j44353r3033m7404L1046J23433
6721B99956J10103n2189k11476j77195L7874K21072K13303Q3176N592K4917K4621
6710E79754p1689j66479j23244J9003P8282o440o2090O8626K44642J69594j66974
6699E62985l87848j97618J92190L14167N7384k10492j58546J02790K38282J22120
6689F35414r5535k25065j80699J8482K31649K49642K1618k23906k32697m5411
6679A53492R2133P8216K0614q775n2690q6601J29J66633J90256k293j70705r2119
$$ plain form
6754 208466 344034 487108 599650 611031 521465 450939 473170 507170 477555 450428 481808
6743 481808 476218 369134 316874 479986 706363 691158 430535 247257 317093 428274 336922
6732 336922 147086 142314 364458 571405 574301 430267 285914 192881 145477 176523 299956
6721 299956 410059 357870 146394 -30801 7073 228145 441448 524624 530216 555133 579754
6710 579754 508065 341586 218342 237345 315627 309187 247097 315723 560365 729959 562985
6699 562985 175137 -22481 169709 483876 541260 330768 172222 275012 513294 635414
6689 635414 539879 314814 134115 152597 384246 633888 655506 431600 198903 153492
6679 153492 245625 323841 344455 335680 282990 196389 196518 363151 553407 551114 380409 288290
6667B88290J02833J22974o0051j96036j23206M9757J41604J11451K7764m6669
6657D18711p2818k6434N7956Q3076p186j36205j57847k5687J28547J27360l2517
6646C56956j49728o5772J11071J42864L15r9108l1195M4623l9442j61085r3963
6635A5536J05649J55580j2767j30866K096K11520K09141J3109j02783k0542P7047
6624E22720Q033j40472j58188k4250P1374L652j21568j26603M673J34651J61525
6613C35547J06842L4474j8538k4361K5644O9289K3895p8672j04011q395Q3414
6602D45128N9377k6254o6663o3437o2791l2769N6317J13826M9922n2529n6115
6591C64012K988m238m6267J2168J25513J02584n2173j11239m938O1348j2617l2378
$$ plain form
6667 288290 391123 514097 454046 258010 134804 184561 326165 437616 465380 418711
6657 418711 345893 319459 377415 460491 453305 317100 159253 133566 262113 389473 356956
6646 356956 207228 141456 252527 395391 395706 296598 265403 310026 270584 109499 15536
6635 15536 121185 276765 263998 133132 135228 346748 555889 568998 466215 445673 522720
6624 522720 530753 390281 232093 207843 279217 282869 161301 34698 39371 174022 335547
6613 335547 442389 476863 458325 433964 459608 528897 552792 474120 370109 361714 445128
6602 445128 504505 478251 411588 348151 285360 252591 308908 422734 472656 420127 364012
6591 364012 367000 362762 316495 328663 454176 556760 504587 393348 388410 449758 437141 404763
6579D04763J09259J65873n7244k85679j42328K25386L09490q836k96630k19161
6569B04893L7410J42759Q4389L1364j015q1283j28480k6029J21230J01484o4634
6558D22088j33712n226J31565Q4270p4713j35489m2768O3779O6320J1878O663
6547C94655M0142k556j49158k46564j36621J10538K46908J48807l2890p8095L6107
6536C31273J56500J71555J00719J836r1149j32314p6517L0343O1084k9981j19120
6525D04229o9391O7652J13553K4364l7831M0557J19748K145k30352k75172l3801
6514A25701K23299K22337M2167n7401k0292R092j4987O778Q5317J05308M7491
6503G74810K7999P1656O1368k7726o3259k810J6702o4687j10445m3138J1550k4790
$$ plain form
6579 404763 514022 679895 622651 336972 194644 420030 729520 720684 424054 204893
6569 204893 242303 385062 469451 500815 499800 418517 290037 264008 385238 486722 422088
6558 422088 288376 283150 414715 498985 424272 288783 246015 309794 376114 387992 394655
6547 394655 434797 432241 283083 36519 -100102 10436 257344 406151 373261 295166 331273
6536 331273 487773 659328 760047 761883 670734 538420 461903 492246 553330 523349 404229
6525 404229 334838 402490 516043 540407 502576 543133 662881 665026 434674 159502 125701
6514 125701 349000 571337 613504 556103 535811 544903 529916 536694 622011 727319 774810
6503 774810 802809 874465 935833 908107 844848 842038 858740 794053 683608 640470 652020 627230
6491F27230l0712N4775P8904k0460m0147J07709J46065j00046k91956p8308K50324
6480G03378J59511k41523l41389j3040K13922N9487j06584j934P8454j22150k84208
6469A03924o4086K67055K56892l296j14384m4950k8384j9684J64512L27657J27232
6458I72488k50268k73152O7592K08105o2794k63945m8351K20149R6717k12591
6448D53950k24051L9187J44246l0598j55670j6055J85918J87616L8879k8113N8527
6437F53836J44014P8443q4769j62085q6434N963q266m2772L2376J17555J3958
6426F61819j98699k09505L5427K01239P2117j04043j8633J94607J77153q2991
6416G28491k46259j47747l62j7783j07238o7040R1370J76997R3367n5604j22402
$$ plain form
6491 627230 596518 651293 730197 709737 669590 777299 923364 823318 531362 453054 703378
6480 703378 862889 621366 279977 266937 480859 540346 433762 431828 510282 388132 103924
6469 103924 39838 306893 563785 560489 446105 401155 372771 353087 517599 845256 972488
6458 972488 722220 449068 516660 724765 661971 398026 349675 569824 666541 453950
6448 453950 229899 269086 413332 382734 227064 211009 396927 584543 623422 595309 653836
6437 653836 797850 876293 791524 629439 543005 548968 540702 497930 530306 647861 661819
6426 661819 463120 253615 289042 490281 562398 458355 439722 634329 811482 728491
6416 728491 482232 334485 334123 316340 209102 142062 233432 410429 503796 448192 325790
6405C25790q1010J33Q2021J59949J63358R37k25633k30291N9644K78561Q0415
6394F13874k90547k76627J55374M14366J57870k04445j65446J30812J99663k2081
6384G12813j84837j22024J1653J05012J78696J59411m3032k55131k08003J9541
6374C74099Q8859o4075j56104n1482N3519K1530j4468M7674R1719L5387j3444
6363D13214J6605L4101o132j6777J5056o826n6431r796N9265m0582j90589m8920
6351A62188L14947L68949o2988m31727k63911J29733J98611M433j7400J48409
6341E51244J51777l3038p9093P0255J08711o0750j61473m3985Q8749P3011J2008
6330F77416m031m0993p2277M6157K27470J65194j39154k56089K2191K92399J34265
$$ plain form
6405 325790 244780 244913 326934 486883 650241 651178 425545 195254 254898 533459 613874
6394 613874 323327 46700 202074 616440 774310 569865 404419 535231 734894 712813
6384 712813 527976 405952 417605 522617 701313 860724 817692 562561 354558 374099
6374 374099 462958 398883 242779 191297 244816 266346 251878 299552 391271 426658 413214
6363 413214 429819 463920 457788 441011 456067 449241 392810 383014 442279 401697 211108 162188
6351 162188 477135 846084 783096 351369 87458 217191 415802 420235 402835 551244
6341 551244 703021 669983 590890 661145 769856 709106 547633 503648 592397 665408 677416
6330 677416 673385 632392 560115 606272 833742 998936 859782 603693 625884 918283 1052548
6319A052548k26831k71792J2979J64833j831j53617k8339J57603J04589q2537
6309G27605j02235L1227K7852j64518k32149Q373K72300J97128j11583k27266
6299D26734k8438J52075N4844j41736j41121L3911J38010P5588l6713p8045j8675
6288D36434J05362J77777P6465j18611j54596K1480J33846Q105j24049j8200J45551
6277F89564P9638q5903l6411J44540J29161l1815j653J68406P7680k49567k88327
6266E95313R1762L12168Q982l34361j59757K59798K78609j00412k97394p5963
6256E78745K09243K47496J28975J8487q8153j79444j45808J597Q8853M6022K666
6245I08679N3072J19077J04520K1804p9317j67125j86592r4632M3889J07664P3183
$$ plain form
6319 1052548 825717 553925 566904 731737 729906 576289 547950 705553 810142 727605
6309 727605 625370 656597 684449 519931 287782 296155 568455 765583 654000 426734
6299 426734 398296 550371 605215 463479 322358 356269 494279 569867 533154 455109 436434
6288 436434 541796 719573 796038 677427 522831 544311 678157 686262 562213 544013 689564
6277 689564 769202 683299 646888 791428 920589 888774 887121 1055527 1133207 883640 595313
6266 595313 687075 999243 1008225 673864 514107 773905 1052514 952102 654708 578745
6256 578745 787988 1035484 1164459 1182946 1094793 915349 769541 771138 859991 906013 908679
6245 908679 961751 1080828 1185348 1207152 1127835 960710 774118 679486 723375 831039 904222
6234I04222K3605J6989L3350L2925q32m2974j7970J12518K32026J73555k3377
6223A444037j35480q6964l9743p6935o3933N0064R0460o781l7217P2027O1715
6212A271250j60027k05278J80881N51168L50942j79686l30465k366K11612J5343
6202A703374j97088p2991J73922K08420P0038l1747n5460m4566K54K2572m1072
6191A735656n6147J41012L58753K48616q6079j71192P4302K06908L5421p3497
6181B413753Q4828J48093j20682l15426n2976L33061L20173K4094q4857K6124
6171B776185N0137j1094P8787K21081J06892j53645j23262K26857M29321K51548
6161C852807J1072J8200J43105J33256J2921m7815j2293N8419J36867J84336J24105
$$ plain form
6234 904222 927827 944816 978166 1011091 1010259 967285 949315 1061833 1293859 1467414 1444037
6223 1444037 1308557 1221593 1181850 1104915 1040982 1091046 1181506 1174725 1137508 1209535 1271250
6212 1271250 1111223 905945 1086826 1637994 1988936 1809250 1478785 1476419 1688031 1703374
6202 1703374 1506286 1433295 1607217 1815637 1885675 1853928 1798468 1753902 1754156 1776728 1735656
6191 1735656 1679509 1820521 2179274 2427890 2341811 2170619 2244921 2451829 2487250 2413753
6181 2413753 2498581 2646674 2525992 2210566 2157590 2490651 2810824 2834918 2750061 2776185
6171 2776185 2826322 2815228 2894015 3115096 3221988 3068343 2945081 3171938 3601259 3852807
6161 3852807 3863879 3882079 4025184 4158440 4171361 4123546 4111253 4169672 4306539 4490875 4614980
6150D614980k7246j17181l3900J49833K58359J94182L3839l7170O8022J98840
6140E302558J54064L15m45J88173L01905K11613J18655J62732J77704N7152J0351
6129F684777J72723L06835K13067Q9973J31769J45762j2576l3563K99442N60981
6119H559190L09938r8013m9807K85703K92499M9391J79537O36148O70560J39419
6109A0974565j69711J73618N63605M12666O0749Q1097L58112M54138L69240L64244
6099A3642323M33750M52309M98489O21863O32234M70714M16443O05388P59579
6090A8533092P08759P16994R44963J076073Q70183O18858O48302Q28170R51829
6081B5897223J108591J300860J242487R43483R04620J313814J708840J863690
$$ plain form
6150 4614980 4587734 4470553 4436653 4586486 4844845 5039027 5072866 5035696 5103718 5302558
6140 5302558 5456622 5456937 5456492 5644665 5946570 6158183 6276838 6439570 6617274 6674426 6684777
6129 6684777 6857500 7164335 7377402 7467375 7599144 7744906 7732330 7698767 7998209 8559190
6119 8559190 8869128 8771115 8721308 9007011 9299510 9348901 9528438 10164586 10835146 10974565
6109 10974565 10804854 10978472 11542077 11954743 12015492 12096589 12454701 12908839 13278079 13642323
6099 13642323 14076073 14528382 15026871 15648734 16280968 16751682 17168125 17773513 18533092
6090 18533092 19241851 19958845 20903808 21979881 22850064 23468922 24117224 24945394 25897223
6081 25897223 27005814 28306674 29549161 30492644 31397264 32711078 34419918 36283608
6073C6283608K207915K858517L211869L186969L736386N151157O142536O030577
6065F8809534O515186R123189J1784396J0684259N529918K67403k113588k952049
6057A07648248m863663p631011r108217q679309p608551o702130n643942m420383
6049E2991042l672675l510786l294709k771970k377930k272350k044606j560859
6041C1485157j246260j288019j289055r76576o51346o66636r27907j127677j118923
6032B2192758r25762o87934o36111q35821r99470q55841n86167n31847o30598
6023A5503207n86641m45378m76805n94946m68284j73121j42658m21887n54388
6014A1639099l24338o8041q4337k29396k89203l09551l49441l00524j55130j10008
$$ plain form
6073 36283608 38491523 41350040 44561909 47748878 51485264 56636421 62778957 68809534
6065 68809534 75324720 84447909 96232305 106916564 112446482 112713885 110600297 107648248
6057 107648248 102784585 95153574 86045357 77366048 69757497 63055367 57411425 52991042
6049 52991042 49318367 45807581 42512872 39740902 37362972 35090622 33046016 31485157
6041 31485157 30238897 28950878 27661823 26685247 26033901 25367265 24439358 23311681 22192758
6032 22192758 21266996 20579062 19942951 19107130 18107660 17251819 16665652 16133805 15503207
6023 15503207 14916566 14471188 13994383 13399437 12931153 12758032 12615374 12193487 11639099
6014 11639099 11314761 11246720 11162383 10932987 10643784 10334233 9984792 9684268 9529138 9419130
6004I419130k32331l41262l44526l52315l56876j85998R8776J62860q3336l21399
5994G462723l39018k93008k88797j62726P8116Q6064k25809l80261n8297K94812
5984F173799J08636l92209n08110j23447J79161M4448k02165j65650L3962M7716
5974E196141j41774k42459j05358Q6653Q3670j14729k71483k09560k1692P3140
5964D332549K0733m7832o0467r0274j65842j85380j00984j8161j6249k8563L037
5953C642567J6007k9878o1730m6981o4889j24646j05582R214N4239l3697r0512
5942C164112l9262n4863k01285k03569J04885L75855J97339k31349l44176n3459
5932B714228J44064m1306k73841j63996J29702J83968l6492j62604K378K04641
$$ plain form
6004 9419130 9186799 8845537 8501011 8148696 7791820 7605822 7704598 7867458 7784122 7462723
5994 7462723 7123705 6830697 6541900 6379174 6457290 6543354 6317545 5937284 5878987 6173799
5984 6173799 6282435 5890226 5382116 5258669 5437830 5482278 5280113 5114463 5148425 5196141
5974 5196141 5054367 4811908 4706550 4793203 4876873 4762144 4490661 4281101 4259409 4332549
5964 4332549 4353282 4305450 4244983 4154709 3988867 3803487 3702503 3684342 3668093 3639530 3642567
5953 3642567 3658574 3628696 3566966 3519985 3455096 3330450 3224868 3234082 3288321 3254624 3164112
5942 3164112 3124850 3069987 2868702 2665133 2770018 3145873 3343212 3111863 2767687 2714228
5932 2714228 2858292 2816986 2543145 2379149 2508851 2692819 2656327 2493723 2496101 2700742
5922B700742J30152j39893k57853j14985K3617m6237j42844k0724J75310J21644
5912B428929j09509j19806J33417K04607j08642l77878k12817J02151Q4081j61873
5902A862660j59162J35290K94462J20475j26394k04852j54603n3001Q4646J30455
5892A929976m1231k36137j30285J89677K88830M2410j97050j82890q6911r0740
5882A485649r3829j3904J8517l3275J2840J75802J89452j9835j36560N909J06868
5871A697634o5777k34182r6811J23828Q0958p3896R098K03990J06427k35148l58713
5860A157408j23543J21715J30746L5169l1641j25386k02090p2744K01341K59659
5850A350634k0206k75665j65004J61600L18709J85645o2576k40560k72191j65314
$$ plain form
5922 2700742 2830894 2691001 2433148 2318163 2341780 2295543 2152699 2131975 2307285 2428929
5912 2428929 2319420 2199614 2333031 2537638 2428996 2051118 1838301 1940452 2024533 1862660
5902 1862660 1703498 1838788 2133250 2253725 2127331 1922479 1767876 1714875 1799521 1929976
5892 1929976 1888745 1652608 1522323 1712000 2000830 2043240 1846190 1663300 1576389 1485649
5882 1485649 1391820 1377916 1396433 1363158 1375998 1551800 1741252 1721417 1584857 1590766 1697634
5871 1697634 1631857 1397675 1300864 1424692 1505650 1431754 1440852 1644842 1751269 1516121 1157408
5860 1157408 1033865 1155580 1286326 1321495 1289854 1164468 962378 889634 1090975 1350634
5850 1350634 1330428 1054763 889759 1051359 1370068 1555713 1493137 1252577 980386 815072
5840H15072k5778J5727j7562J1213Q4739L2897j17234q8538J80389L27690R8067
5829A316682j97663j22791J86614K14382j24200l52462j81517P7628N7965j04415
5819G70223p9759P4092N1284j23550j04516J67555K90330Q977l36317k63326J55005
5808F09998L88876J83721j42418j93739k014J23352N4564n9853p8365m1074m5094
5797G97954q3752p2761J9320J17872J19140R296j09322j28815n3739K6192N6107
5786F97492N3196M6616M7826N9010M3940o0736k13160k27548k4912J60468N9366
5775F41558j95008k11862N8391K29642R1969p0813N388J15389j1151j79899m9474
5764D24130K40693K56993k0527j81712o5919L8577m7202j06771K9126J59155O3233
$$ plain form
5840 815072 789294 805021 787459 798672 883411 916308 799074 710536 890925 1218615 1316682
5829 1316682 1119019 996228 1182842 1397224 1273024 920562 739045 816673 874638 770223
5819 770223 690464 764556 815840 692290 587774 755329 1045659 1054636 718319 454993 609998
5808 609998 998874 1182595 1040177 846438 844424 967776 1022340 962487 884122 843048 797954
5797 797954 714202 641441 660761 778633 897773 907069 797747 668932 615193 641385 697492
5786 697492 750688 797304 845130 904140 948080 887344 674184 446636 421724 582192 641558
5775 641558 446550 234688 293079 522721 614690 543877 549265 664654 653503 473604 424130
5764 424130 664823 921816 901289 719577 653658 692235 645033 538262 567388 726543 789776
5753G89776j35984k00717j22776k8079M9985J05820O6719n2157q1390M1920J33507
5742E66624N3214n9569l3455M5702J4136p0339m8264N4184R4450O3675M1858L29
5730G22545j20834k16905j35943N2617J26356K6218q8631q9944j1923N9997Q3359
5719D06912M8179r614j0920N1254O0453n2367j69492j41739L511J34968J95655
5708E16800J76657M1647j59968k38420j07785N0704O3643L4335R7362J05802r9220
5697D81557k80726j01127K66467L10246l0600k57890j01549R7983J1080j57886
5687B37555r7489O2048L5550q0075m718J83018J64123n3371j34077J9063J19381
5676D51008N08j11394O43J71247J18007j11681k16256q4023P0878L5345j12271
$$ plain form
5753 789776 653792 453075 330299 302220 352205 458025 524744 472587 391197 433117 566624
5742 566624 619838 560269 526814 572516 586652 516313 468049 522233 616683 680358 722216 722545
5730 722545 601711 384806 248863 301480 427836 454054 365423 275479 263556 323553 406912
5719 406912 455091 445477 434557 485811 546264 493897 324405 182666 186177 321145 516800
5708 516800 693457 735104 575136 336716 228931 279635 343278 377613 474975 580777 481557
5697 481557 200831 99704 366171 676417 645817 387927 286378 384361 395441 237555
5687 237555 140066 202114 237664 157589 152871 335889 500012 446641 312564 331627 451008
5676 451008 451516 340122 340765 512012 630019 518338 302082 218059 288937 324282 212011
5665B12011j28887N5049K35054J89559l6007j82271j03123N8311P5739n7587j41166
5654A76682n9640O5921P2349M36K6489J70809K20988K5520k44644k82581n8169
5643A14160J40482J10860j6151l2136L9716N9585K8011J3019l6300j46651j24368
5632A50227J69392M40975K72767j95477l58189k5714K70731R6925k27487j78542
5622D15608J42882K36995K8361r1208L1357J00263o6077k28730j51667L0989P8233
5611E27006O863j8453K5243L4653k5818r2515j00649l7992L6288J4374j17135
5600B51865j80343j5602K26456K22221n8997k63853j26455J82572L10348J51442
5590F99654j11954k55079j73696O5886K37241J52100p0017j06167J06018K36798
$$ plain form
5665 212011 83124 138173 373227 562786 526779 344508 241385 299696 375435 317848 176682
5654 176682 117042 182963 255312 255748 282237 453046 674034 699554 454910 172329 114160
5643 114160 254642 365502 349351 317215 356931 416516 444527 457546 421246 274595 150227
5632 150227 319619 760594 1033361 837884 479695 453981 724712 821637 594150 415608
5622 415608 558490 795485 823846 732638 763995 864258 798181 569451 417784 448773 527006
5611 527006 533869 515416 540659 575312 549494 456979 356330 318338 354626 369000 251865
5600 251865 71522 55920 282376 504597 445600 181747 55292 237864 548212 699654
5590 699654 587700 332621 158925 224811 462052 614152 544135 437968 543986 780784
5580G80784M7697k36996k71557q9272K6511Q684J2446N4391P47j06421n9245J34959
$$ plain form
5580 780784 828481 591485 319928 230656 257167 265851 278297 332688 333435 227014 167769 302728
$$ [...]
##END NTUPLES=NMR SPECTRUM
##END=
