##TITLE=1H ikalashn
EC-3331(II-1)x21
19.9.2024
##JCAMPDX= 6.0         $$ Bruker NMR JCAMP-DX V2.0
##DATA TYPE= NMR SPECTRUM
##DATA CLASS= NTUPLES
##ORIGIN= UXNMR, Bruker Analytische Messtechnik GmbH
##OWNER= root
$$ TOPSPIN		Version 1.3
$$ 2024-09-19 11:08:49.734 +0400  Irina@DPX200
$$ Compression mode = diff/dup
##.OBSERVE FREQUENCY= 200.131392401
##.OBSERVE NUCLEUS= ^1H
##.ACQUISITION MODE= SIMULTANEOUS
##.ACQUISITION SCHEME= undefined
##.AVERAGES= 16
##.DIGITISER RES= 18
##SPECTROMETER/DATA SYSTEM= spect
##.PULSE SEQUENCE= zg
##.SOLVENT NAME= CDCl3
##.SHIFT REFERENCE= INTERNAL, CDCl3, 1, 17.95386
##AUDIT TRAIL= $$ (NUMBER, WHEN, WHO, WHERE, WHAT)
$$ ##TITLE= Audit trail, TOPSPIN		Version 1.3
$$ ##JCAMPDX= 5.01
$$ ##ORIGIN= Bruker BioSpin GmbH
$$ ##OWNER= Irina
$$ $$ F:/spectra/data/iren/nmr/1H/4/pdata/1/auditp.txt
$$ ##AUDIT TRAIL=  $$ (NUMBER, WHEN, WHO, WHERE, VERSION, WHAT)
(   1,<2024-09-19 11:08:11.171 +0400>,<Irina>,<DPX200>,<TOPSPIN 1.3>,
      <created by zg
	started at 2024-09-19 11:07:03.312 +0400,
	POWCHK disabled, PULCHK disabled
       configuration hash MD5:
       BE 6D 3F 07 2A EA 11 49 91 17 2B D3 AF B3 58 0D
       data hash MD5: 16K
       03 65 D2 7D 21 A0 64 34 29 E4 6B 09 38 92 27 0A>)
(   2,<2024-09-19 11:08:20.171 +0400>,<Irina>,<DPX200>,<TOPSPIN 1.3>,
      <Start of raw data processing
       efp BC_mod = 2 LB = 0.02 FT_mod = 6 PKNL = 1 PHC0 = 302.1777 PHC1 = 10.37082 SI = 32K 
       data hash MD5: 32K
       2C D1 FE 8A B7 0A 19 96 2E D5 05 99 2B 36 05 DF>)
(   3,<2024-09-19 11:08:24.515 +0400>,<Irina>,<DPX200>,<TOPSPIN 1.3>,
      <apk 
       data hash MD5: 32K
       6D BA 82 9C B1 37 27 F3 4C 80 26 0D 4A 5D E7 86>)
(   4,<2024-09-19 11:08:38.531 +0400>,<Irina>,<DPX200>,<TOPSPIN 1.3>,
      <pk fgphup PHC0 = 8.903918 PHC1 = -13.2 
       data hash MD5: 32K
       20 01 84 0D 9D 2F C9 A3 68 9C 82 85 07 1B 7B F7>)
(   5,<2024-09-19 11:08:41.375 +0400>,<Irina>,<DPX200>,<TOPSPIN 1.3>,
      <abs n ABSG = 5 
       data hash MD5: 32K
       59 6A 04 71 87 65 7D C0 C9 AD 4C FF 43 49 1E 12>)
$$ ##END=
$$ 
$$ $$ hash MD5
$$ $$ 6F E2 39 83 5B 09 8F 80 C3 3D 55 6C 25 88 92 BD
##$RELAX= 
##$RELAX= 
##$RELAX= 
##$RELAX= 
##$RELAX= 
##$RELAX= 
##$RELAX= 
##$RELAX= 
##$RELAX= 
$$ Bruker specific parameters
$$ --------------------------
##$DU= <F:/spectra>
##$EXPNO= 4
##$NAME= <1H>
##$PROCNO= 1
##$TYPE= <nmr>
##$USER= <iren>
##$AMP= (0..31)
100 100 100 100 100 100 100 100 100 100 100 100 100 100 100 100 100 100 
100 100 100 100 100 100 100 100 100 100 100 100 100 100 
##$ANAVPT= -1
##$AQSEQ= 0
##$AQ_mod= 1
##$AUNM= <au_zg>
##$AUTOPOS= <>
##$BF1= 200.13
##$BF2= 200.13
##$BF3= 200.13
##$BF4= 200.13
##$BF5= 200.13
##$BF6= 200.13
##$BF7= 200.13
##$BF8= 200.13
##$BYTORDA= 1
##$CFDGTYP= 0
##$CFRGTYP= 5
##$CHEMSTR= <none>
##$CNST= (0..63)
1 1 145 1 1 1 1 1 1 1 1 1 1 1 1 1 1 1 1 1 1 1 1 1 1 1 1 1 1 1 1 1 1 1 
1 1 1 1 1 1 1 1 1 1 1 1 1 1 1 1 1 1 1 1 1 1 1 1 1 1 1 1 1 1 
##$CPDPRG= <>
##$CPDPRG1= <>
##$CPDPRG2= <>
##$CPDPRG3= <>
$$ [...]
##$SW_h= 4401.40845070422
##$TD= 16384
##$TD0= 1
##$TE= 300
##$TE2= 300
##$TE3= 300
##$TEG= 300
##$TL= (0..7)
0 120 120 120 120 120 120 120 
##$TP= (0..7)
150 150 150 150 150 150 150 150 
##$TP07= 0
##$TPNAME0= <>
##$TPNAME1= <>
##$TPNAME2= <>
##$TPNAME3= <>
##$TPNAME4= <>
##$TPNAME5= <>
##$TPNAME6= <>
##$TPNAME7= <>
##$TPOAL= (0..7)
0.5 0.5 0.5 0.5 0.5 0.5 0.5 0.5 
##$TPOFFS= (0..7)
0 0 0 0 0 0 0 0 
##$TUNHIN= 0
##$TUNHOUT= 0
##$TUNXOUT= 0
##$USERA1= <user>
##$USERA2= <user>
##$USERA3= <user>
##$USERA4= <user>
##$USERA5= <user>
##$V9= 5
##$VALIST= <valist>
##$VCLIST= <CCCCCCCCCCCCCCC>
##$VD= 0
##$VDLIST= <DDDDDDDDDDDDDDD>
##$VPLIST= <PPPPPPPPPPPPPPP>
##$VTLIST= <TTTTTTTTTTTTTTT>
##$WBST= 1024
##$WBSW= 25
##$XGAIN= (0..3)
0 0 0 0 
##$XL= 0
##$YL= 0
##$YMAX_a= 617986
##$YMIN_a= -1062314
##$ZGOPTNS= <>
##$ZL1= 120
##$ZL2= 120
##$ZL3= 120
##$ZL4= 120
##$ABSF1= 17.95386
##$ABSF2= -4.038887
##$ABSG= 5
##$ABSL= 3
##$ALPHA= 0
##$AQORDER= 0
##$ASSFAC= 0
##$ASSFACI= 0
##$ASSFACX= 0
##$ASSWID= 0
##$AUNMP= <proc_1d>
##$AXLEFT= 0
##$AXRIGHT= 0
##$AXTYPE= 0
##$AXUNIT= <>
##$AZFE= 0.1
##$AZFW= 0.1
##$BCFW= 0
##$BC_mod= 2
##$BYTORDP= 0
##$COROFFS= 0
##$CY= 7568.61572265625
##$DATMOD= 1
##$DC= 0
##$DFILT= <>
##$DTYPP= 0
##$F1P= 17.9538593292236
##$F2P= -4.03888763876832
##$FCOR= 0.5
##$FTSIZE= 32768
##$FT_mod= 6
##$GAMMA= 0
##$GB= 0
##$INTBC= 0
##$INTSCL= 1.483618e-010
##$ISEN= 128
##$LB= 0.02
##$LEV0= 0
##$LPBIN= 0
##$MAXI= 945.577
##$MC2= 0
##$MEAN= 0
##$ME_mod= 0
##$MI= -402.1523
##$NCOEF= 0
##$NC_proc= -6
##$NLEV= 6
##$NOISF1= 8.587773
##$NOISF2= 6.764455
##$NSP= 0
##$NTH_PI= 0
##$NZP= 0
##$OFFSET= 17.95386
##$PC= 1
##$PHC0= 315.2211
##$PHC1= -8.448975
##$PH_mod= 1
##$PKNL= yes
##$PPARMOD= 0
##$PPDIAG= 0
##$PPIPTYP= 0
##$PPMPNUM= 100
##$PPRESOL= 1
##$PSCAL= 0
##$PSIGN= 0
##$REVERSE= no
##$SF= 200.13
##$SI= 32768
##$SIGF1= 16.12182
##$SIGF2= -4.496377
##$SINO= 3.521527
##$SIOLD= 32768
##$SREGLST= <1H.CDCl3>
##$SSB= 0
##$STSI= 32768
##$STSR= 0
##$SW_p= 4401.40845070423
##$SYMM= 0
##$S_DEV= 0
##$TDeff= 16384
##$TDoff= 0
##$TI= <>
##$TILT= no
##$TM1= 0
##$TM2= 0
##$TOPLEV= 0
##$USERP1= <user>
##$USERP2= <user>
##$USERP3= <user>
##$USERP4= <user>
##$USERP5= <user>
##$WDW= 1
##$XDIM= 32768
##$YMAX_p= 346051035
##$YMIN_p= -520558
$$ End of Bruker specific parameters
$$ ---------------------------------
##NTUPLES= NMR SPECTRUM
##VAR_NAME=  FREQUENCY,     SPECTRUM/REAL,   SPECTRUM/IMAG
##SYMBOL=    X,             R,               I
##VAR_TYPE=  INDEPENDENT,   DEPENDENT,       DEPENDENT
##VAR_FORM=  AFFN,          ASDF,            ASDF
##VAR_DIM=   32768,         32768,           32768
##UNITS=     HZ,            ARBITRARY UNITS, ARBITRARY UNITS
##FACTOR=    0.134324425510551, 1,           1
##FIRST=     4401.40845070423, 593220,       -2526093
##LAST=      0,             -295265,         -2531983
##MIN=       0,             -520558,         0
##MAX=       4401.40845070423, 346051035,    0
$$ Real data points
##PAGE= N=1
##DATA TABLE= (X++(R..R)), XYDATA
$$ [...]
11658D3935985r42271q10148r30334j012438q54385o61043o69286p68219p35593
11649C6552268o06615n54619n85026n84378n43448n27990n26816m91604m39646
11640C1692126l98993l55065l36080m09373n14006m80191l13148k44555l72227
11631B8268488m83213m10075l19735m12065n53429n02865l32287k98339m07477
11622B4549003m37663l35267k71372l14853l44791l07231k91906l19235k95227
11613B1631458k18694k04608k58937k52259j63210j25753j78448j90877j11271
11604A9927401o4551j12163j31860m9553J6548k4494o9745k9110j4272j37989
11594A9310212k81626k68904j52023j10791j55087j50095q4584q6734j80719k39999
$$ plain form
11658 43935985 42993714 42183566 41253232 40240794 39386409 38725366 38056080 37287861 36552268
11649 36552268 35945653 35391034 34806008 34221630 33678182 33150192 32623376 32131772 31692126
11640 31692126 31293133 30938068 30601988 30192615 29678609 29198418 28885270 28640715 28268488
11631 28268488 27785275 27375200 27055465 26643400 26089971 25587106 25254819 24956480 24549003
11622 24549003 24111340 23776073 23504701 23189848 22845057 22537826 22245920 21926685 21631458
11613 21631458 21412764 21208156 20949219 20696960 20533750 20407997 20229549 20038672 19927401
11604 19927401 19862850 19750687 19618827 19569274 19585822 19561328 19491583 19462473 19448201 19310212
11594 19310212 19028586 18759682 18607659 18496868 18341781 18191686 18107102 18020368 17839649 17599650
11584A7599650k09195j81244k06929k06512j41744j09247j62716j90250j00061
11575A6091752o342o5215k05782k16341p5023O449r0851k10800j67108j8186M8298
11564A5090851n4m2536l3136m0842p3614m7799L4256M9584l8569r7438l4711N4309
11552A4820301N6359K3181N6894J27578J45464J17982R2957L9124o5716j21906
11542A5292218n2568K9720r435q0737j6950J11134R2157m5920m9856J41180K90022
11531A5700965K46033J49596J45399J68101J53813J96479L16135L25348J39936
11522A7541805j0199P5844K30591K00988P8702J21350K88740L22436K09572J88128
11512A9247957L01317L24180J87285J10914K02314K53525J11513m1858M462J43247
$$ plain form
11584 17599650 17390455 17209211 17002282 16795770 16654026 16544779 16382063 16191813 16091752
11575 16091752 16085410 16020195 15814413 15598072 15523049 15529498 15438647 15227847 15060739 15042553 15090851
11564 15090851 15090797 15048261 15015125 14974283 14900669 14852870 14887126 14936710 14898141 14800703 14765992 14820301
11552 14820301 14876660 14899841 14956735 15084313 15229777 15347759 15440716 15479840 15414124 15292218
11542 15292218 15239650 15269370 15259935 15179198 15162248 15273382 15365539 15319619 15269763 15410943 15700965
11531 15700965 15946998 16096594 16241993 16410094 16563907 16760386 17076521 17401869 17541805
11522 17541805 17531606 17607450 17838041 18039029 18117731 18239081 18527821 18850257 19059829 19247957
11512 19247957 19549274 19873454 20060739 20171653 20373967 20627492 20739005 20697147 20701609 20844856
11502B0844856J52816O9286R2789K34737L13060K44655J19551J1371q3035j23559
11492B1876527m0167J14472J97978J96805K50050M05614N13962M53435L22916
11483B4291592K86264L26106L04276K15158K07475L35269M44831L96095K85999
11474B7093065L22071N22981O88301O75896N72263N26712N33486M83779L55087
11465C1773641K18638R5578n6567k13137k72473k14377j52869j71044j98151j24202
11455C0685037L8999J92602K88570L45648L65531L23405K31585J36331M6235p7800
11445C2576143k52580m39653n93415p04698p82519q21246q06173p40488o48794
11436B6786577n47489m21274k52109p7607J8368R131j5910M4430J63188K25236
$$ plain form
11502 20844856 20997672 21066958 21159747 21394484 21707544 21952199 22071750 22083121 22000086 21876527
11492 21876527 21836360 21950832 22148810 22345615 22595665 23001279 23515241 23968676 24291592
11483 24291592 24577856 24903962 25208238 25423396 25630871 25966140 26410971 26807066 27093065
11474 27093065 27415136 27938117 28626418 29302314 29874577 30401289 30934775 31418554 31773641
11465 31773641 31992279 32087857 32031290 31818153 31545680 31331303 31178434 31007390 30809239 30685037
11455 30685037 30724036 30916638 31205208 31550856 31916387 32239792 32471377 32607708 32653943 32576143
11445 32576143 32323563 31883910 31290495 30585797 29803278 28982032 28175859 27435371 26786577
11436 26786577 26239088 25817814 25565705 25488098 25506466 25515597 25499687 25544117 25707305 25932541
11426B5932541J94455J45838J22210O8123n0740j61808j82007j17648o506J53990
11416B6098448L48107M97990N64612O08101O53605N96017L67540J06702j0091
11407B9831031m0363j81756m40597o19455o49215o89738q18883q55736o44843
11398B4890445l29796j52731j14533m1360J02675J94312K01218K20598K49023
11389B5219851J35337j53111l97019l86580j99382q0068j11557j47097n5155R3036
11379B3918255J21153l7140k73393m32290m61965m27013m00490l88031l71127
11370B1247959l73137m25715m95548n14539m78287m43556m23838l67963k63465
11361A7461911j77633j57078j65890j71869k10048k91491l29486k51151j23375
$$ plain form
11426 25932541 26126996 26272834 26395044 26463167 26412427 26250619 26068612 25950964 25944458 26098448
11416 26098448 26446555 26944545 27509157 28117258 28770863 29366880 29734420 29841122 29831031
11407 29831031 29790668 29608912 29168315 28548860 27899645 27209907 26391024 25535288 24890445
11398 24890445 24560649 24407918 24293385 24252025 24354700 24549012 24750230 24970828 25219851
11389 25219851 25355188 25202077 24805058 24418478 24219096 24139028 24027471 23880374 23825219 23918255
11379 23918255 24039408 24002268 23728875 23296585 22834620 22407607 22007117 21619086 21247959
11370 21247959 20874822 20449107 19953559 19439020 18960733 18517177 18093339 17725376 17461911
11361 17461911 17284278 17127200 16961310 16789441 16579393 16287902 15958416 15707265 15583890
11352A5583890o5671q2324q7322n9826n7865r7854j40381j87288k71034l48428
11342A4185897l33140k42722j80266j58090r1974N645Q537q7753j12836j2487
11332A2980811R381j94046m38451m70038l54880l40738m28110l89344j95417r9129
11322A0080039k21591l48004k73874j13544q4312j69862k04528j65054j62759
11313H336511k09274j93545q8764j8087p6647j94626k26142j24984J126Q352j09600
11302G104320j93073j13784L3995M8192q5811j67244q3292K9750J6080o9959r0827
11291F428347m5223j3611J634K8270J8123n3983q4475j857O6946j9630j61395
11280F163146j59767m1607n41o5498q5977k9273k3554q7561q4835M920K8358n8600
$$ plain form
11352 15583890 15518219 15435895 15348573 15288747 15230882 15133028 14992647 14805359 14534325 14185897
11342 14185897 13852757 13610035 13429769 13271679 13179705 13185350 13193887 13106134 12993298 12980811
11332 12980811 12990192 12796146 12357695 11887657 11532777 11192039 10763929 10374585 10179168 10080039
11322 10080039 9858448 9510444 9236570 9123026 9038714 8868852 8664324 8499270 8336511
11313 8336511 8127237 7933692 7844928 7826841 7750194 7555568 7329426 7204442 7205568 7213920 7104320
11302 7104320 6911247 6797463 6831458 6879650 6793839 6626595 6543303 6573053 6589133 6519174 6428347
11291 6428347 6383124 6369513 6371147 6399417 6417540 6363557 6279082 6277225 6344171 6324541 6163146
11280 6163146 6003379 5961772 5961231 5895733 5809756 5780483 5756929 5669368 5584533 5589453 5617811 5559211
11268E559211j02769l5749N233n5292q9080j7391L4391j7516n0769J5297M1668
11257E287234o7437j52043o9071L8669m458q9438l8603N1226Q81q1700J2720J63963
11245E051943Q1804j65428k09268J9372J75535O7489p2323l2512M3367j7802r0711
11234D851466j2602R2203L4213r4322q1438M1364P5699n554n8930m2299m3019
11223D756781p4266o3930k2729k4793m4176k905M3198k7587j57519j51295Q401
11212D239180J04726J6079r9016n8326O9892R7349N714n9192k9632P688j6757
11201D277705m1444R628Q2589N9178n6281j15625l1842P9473N7625n6964p5854
11190D188188L7518R3584k4039j54192j00351N3535P0238o8694j45930o0420L1724
$$ plain form
11268 5559211 5456442 5420693 5425926 5370634 5281554 5264163 5298554 5281038 5230269 5245566 5287234
11257 5287234 5219797 5067754 4998683 5037352 5032894 4943456 4904853 4956079 4956960 4875260 4887980 5051943
11245 5051943 5133747 4968319 4759051 4778423 4953958 5021447 4949124 4916612 4959979 4942177 4851466
11234 4851466 4838864 4931067 4965280 4870958 4789520 4830884 4906583 4901029 4842099 4799800 4756781
11223 4756781 4682515 4618585 4595856 4571063 4526887 4523982 4567180 4539593 4382074 4230779 4239180
11212 4239180 4343906 4359985 4260969 4202643 4272535 4369884 4375598 4316406 4286774 4294462 4277705
11201 4277705 4236261 4245889 4328478 4387656 4331375 4215750 4183908 4263381 4321006 4264042 4188188
11190 4188188 4225706 4319290 4295251 4141059 4040708 4094243 4164481 4095787 3949857 3889437 3921161
11179C921161p303q2345m7861M3997L2027r7058j87256j26191K9792J43665J36712
11168C759340L6868n9712p2006r139M3853K9557j8577l6010j5065l51j9828n1183
11156C587747m6879J7208J01467J18457K9129q3627r8478j7673L1871j5853o8758
11145C554611k5001O2695O6957j6967o6966k3850K3481j6613r2335q4845Q404
11134C389571O0227j261p9563m8180N5067Q0224r91m9061J2308O4860K897o2430
11122C423668J9727J52404J09383q7365j64208j3568J39410R6570k4397k7811
11112C623813M0912L3580m300O7338J89743J82580O5241K8443R1476O5284r7274
11101D286836j86797p7321O1294M0792n7799n7962P776j9313j28992j46278r220
$$ plain form
11179 3921161 3913858 3831513 3783652 3827649 3859676 3762618 3575362 3449171 3478963 3622628 3759340
11168 3759340 3796208 3736496 3664490 3655351 3699204 3728761 3710184 3674174 3659109 3658758 3638930 3587747
11156 3587747 3540868 3558076 3659543 3778000 3807129 3723502 3625024 3607351 3639222 3623369 3554611
11145 3554611 3529610 3592305 3659262 3642295 3575329 3551479 3574960 3558347 3466012 3381167 3389571
11134 3389571 3449798 3448537 3368974 3320794 3375861 3456085 3455094 3406033 3418341 3483201 3486098 3423668
11122 3423668 3443395 3595799 3705182 3617817 3453609 3440041 3579451 3676021 3651624 3623813
11112 3623813 3664725 3698305 3694005 3761343 3951086 4133666 4198907 4227350 4318826 4384110 4286836
11101 4286836 4100039 4022718 4084012 4124804 4067005 4009043 4016819 3997506 3868514 3722236 3713016
11090C713016J36846J41569J7943j12525j46357n7834Q3932J48497O8401o4872
11080C928616r7494n657Q2747O6309q403l3499J5331O9507P2412M4222L6608N1978
11068D222677M1193j1263m2444J214O4809N7420J0686M6538J60227J78849K5317
11057D755223j10635j7159K12617K86023J15300p7278q7589J7785O0810K0205
11047E175302J3019Q3576J39688R3951j3400n6474L4770J85302K41946J50486
11037F048166L6557N5170J86048K64890K11364J19478R8186J34207J69344K12667
11027G536077K90561L58435L59268L29346L57276M57530N59103O11319O37862
11018A1496777O80602P32410P38630O54475M99360L37607J83856k9202l20156
$$ plain form
11090 3713016 3849862 3991431 4009374 3896849 3750492 3692658 3776590 3925087 3993488 3928616
11080 3928616 3831122 3825465 3908212 3974521 3966118 3932619 3947950 4017457 4089869 4134091 4170699 4222677
11068 4222677 4263870 4252607 4210163 4211377 4276186 4333606 4344292 4390830 4551057 4729906 4755223
11057 4755223 4644588 4627429 4840046 5126069 5241369 5164091 5076502 5094287 5155097 5175302
11047 5175302 5188321 5271897 5411585 5505536 5492136 5435662 5470432 5655734 5897680 6048166
11037 6048166 6084723 6139893 6325941 6590831 6802195 6921673 7019859 7154066 7323410 7536077
11027 7536077 7826638 8185073 8544341 8873687 9230963 9688493 10247596 10858915 11496777
11018 11496777 12177379 12909789 13648419 14302894 14802254 15139861 15323717 15294515 14974359
11009A4974359n43654n36907l74614l13336m37782n37960m30414k24877j25509
11000A1449306j25386r3208m1132p5337j51628j22740l595M5735K802J3983J16802
10989A1015602J68712J12944Q4225J58800K18451J79992J53868K34103L21558
10980A2648255L17013L12398M07505N00847M73578M40293N78158Q11516R22043
10971A7411606R09393R83354J222262J492254J711452J945022K194046K316790
10963C0186179K225240J962204J530213Q61943M3942o51536j083973j398372j722802
10954C1953038j914329j805694j540573j408477j427046j345881j056362p57859
10946B0696817o55693o85695o49706n02733l76391l63342l91811l36062j90225
$$ plain form
11009 14974359 14430705 13893798 13519184 13205848 12768066 12230106 11799692 11574815 11449306
11000 11449306 11323920 11230712 11189580 11114243 10962615 10839875 10836280 10882015 10884817 10898800 11015602
10989 11015602 11184314 11297258 11381483 11540283 11758734 11938726 12092594 12326697 12648255
10980 12648255 12965268 13277666 13685171 14186018 14659596 15099889 15678047 16489563 17411606
10971 17411606 18320999 19304353 20526615 22018869 23730321 25675343 27869389 30186179
10963 30186179 32411419 34373623 35903836 36765779 36809721 36158185 35074212 33675840 31953038
10954 31953038 30038709 28233015 26692442 25283965 23856919 22511038 21454676 20696817
10946 20696817 20041124 19355429 18705723 18202990 17826599 17463257 17071446 16735384 16545159
10937A6545159p6661q1034j34538j13033j8528L0658o978k6537N1843J51457J66216
10926A6488024J31720J59710K63729L69700M60159N81131P21076Q11356Q60463
10917B0847068R71964J193594J444059J636834J799944K010460K246588K351706
10909C4502217K142034J554445P19967j10915p51920j194177j525340j779230
10901C3557081j919088j931366j851681j704285j493463j260673j079109r74498
10893B1342918r02712q13768o96062n66456m63970m35131m73552n01659m67504
10884A6022104m12003l71257k90810j53135j01743k52121m32277l53853n5398
10875A3599507R3033q0959k83173j86359R4331K04645P6262l4130L4519J66503
$$ plain form
10937 16545159 16468498 16387464 16252926 16139893 16121365 16152023 16145045 16118508 16170351 16321808 16488024
10926 16488024 16619744 16779454 17043183 17412883 17873042 18454173 19175249 19986605 20847068
10917 20847068 21819032 23012626 24456685 26093519 27893463 29903923 32150511 34502217
10909 34502217 36644251 38198696 38918663 38807748 38055828 36861651 35336311 33557081
10901 33557081 31637993 29706627 27854946 26150661 24657198 23396525 22317416 21342918
10893 21342918 20440206 19626438 18930376 18363920 17899950 17464819 16991267 16489608 16022104
10884 16022104 15610101 15238844 14948034 14794899 14693156 14441035 14008758 13654905 13599507
10875 13599507 13692540 13611581 13328408 13142049 13236380 13441025 13517287 13483157 13517676 13684179
10865A3684179K24670K48650L27004M46092N50460O32642O92410O96758O32435
10856A8135300N26864L90738K12952K1754j35934k81888m72093o61574p17125
10847A7018994o02395m48798l93369m28325m52792l98126k68616j29933p5604
10838A3821036j26017j62421p0262N9278K7416j53475k39059j29303m9266j99074
10828A2778853m18850m28666k61627j84695k60188k84699j72603j02774j91263
10819A0473488k79703k07439q7834j11637k19025j98406m2780K7970q9245k20800
10809I044589j74420n626Q3632K3059o6497n8275L7504J22656J29093O1886k5654
10798I171947o4940j1444J08072K00012J93067J21451Q7020J40505K37313L09860
$$ plain form
10865 13684179 13908849 14157499 14484503 14930595 15481055 16113697 16806107 17502865 18135300
10856 18135300 18662164 19052902 19265854 19287608 19151674 18869786 18397693 17736119 17018994
10847 17018994 16416599 15967801 15574432 15146107 14693315 14295189 14026573 13896640 13821036
10838 13821036 13695019 13532598 13462336 13521614 13549030 13395555 13156496 13027193 12977927 12778853
10828 12778853 12360003 11931337 11669710 11485015 11224827 10940128 10767525 10664751 10473488
10819 10473488 10193785 9986346 9898512 9786875 9567850 9369444 9326664 9354634 9265389 9044589
10809 9044589 8870169 8864543 8948175 8971234 8904737 8846462 8883966 9006622 9135715 9197601 9171947
10798 9171947 9107007 9095563 9203635 9403647 9596714 9718165 9805185 9945690 10183003 10492863
10788A0492863L31810L01691K31365J82823K37087L60727L80565J96146l8743
10779A2676334q3901N9673J47199L4278j44066k07464j82318j97308k53383k57509
10769A1591535k11509k03127k40513k44896j97502j58727j45856j23059j09782
10760I956564j57584k12624j57985k2193K1272p8572j53349q0747J6785k3718
10750I107849j39423j51614m9653J8942m465k8255J5454Q8643J42642J64441J29141
10739I293702L4896j7945P7958K53151L15710K13301R7758R1478J37863J44830
10729A0642702J34007J60069K02002K29369K73200L35391L24843J89443K9239
10720A2520265l1138j5339l4075j10276j73763j86530j72468j54196j43250j57403
$$ plain form
10788 10492863 10824673 11126364 11357729 11540552 11777639 12138366 12518931 12715077 12676334
10779 12676334 12592433 12652106 12799305 12833583 12689517 12482053 12299735 12102427 11849044 11591535
10769 11591535 11380026 11176899 10936386 10691490 10493988 10335261 10189405 10066346 9956564
10760 9956564 9798980 9586356 9428371 9406178 9427450 9348878 9195529 9114782 9131567 9107849
10750 9107849 8968426 8816812 8767159 8786101 8781636 8753381 8768835 8857478 9000120 9164561 9293702
10739 9293702 9328598 9310653 9388611 9641762 9957472 10170773 10268531 10360009 10497872 10642702
10729 10642702 10776709 10936778 11138780 11368149 11641349 11976740 12301583 12491026 12520265
10720 12520265 12489127 12473788 12439713 12329437 12155674 11969144 11796676 11642480 11499230 11341827
10710A1341827j78728j46677n9755j1255m5654p0536j3122L6715k4703j17938
10700A0710174j00240q296R226m6785l8770N0777Q9757L8700J4391P0558J11726
10689A0901218Q2894N8973P9521P7269M5719R0870K22834K82590J92185J00009
10679A2134082J42137K28745K25121J89920K50705L66148M02952L59264L32756
10670A4631830L38896L25373L00988K99546K85731K35280K18815K65232K59784
10661A7161475J45104Q3293K04132L35116K53973Q7369J27467L28077L64574J90453
10651A9281033J26517L14887M85469M27239L21611L80041M76909M23402L35681
10642B2572789M13666N62678N67077M84858N31193O78585P15839O42301O61302
$$ plain form
10710 11341827 11163099 11016422 10956667 10945412 10899758 10829222 10816100 10852815 10828112 10710174
10700 10710174 10609934 10601638 10610864 10564079 10525309 10576086 10665843 10704543 10718934 10789492 10901218
10689 10901218 10984112 11043085 11122606 11199875 11245594 11336464 11559298 11841888 12034073 12134082
10679 12134082 12276219 12504964 12730085 12920005 13170710 13536858 13939810 14299074 14631830
10670 14631830 14970726 15296099 15597087 15896633 16182364 16417644 16636459 16901691 17161475
10661 17161475 17306579 17389872 17594004 17929120 18183093 18270462 18397929 18726006 19090580 19281033
10651 19281033 19407550 19722437 20207906 20635145 20956756 21336797 21813706 22237108 22572789
10642 22572789 22986455 23549133 24116210 24601068 25132261 25810846 26526685 27168986 27830288
10633B7830288P98932Q66379Q26955Q70167J048047J154365J088072J046238J186314
10624C6715757J350527J337171J241238J283319J444502J527085J496642J513100
10616D7909341J642692J764435J787150J767552J758561J698996J532262J316780
10608F1177769J133192R62875P36956M49114J51699j17007l40188m91234n55224
10599F3107952n63821n62380n57229n30369m80947m11205l01255j51073j8943
10590E9530730N0124J11711K49783M27214N23081N41372O45568R07041J151533
10581F4138157J196714J147239J266762J593423J889471J998198K045707K202324
10573G7477995K424887K571104K630069K675909K684396K561121K293947J923237
$$ plain form
10633 27830288 28629220 29495599 30322554 31192721 32240768 33395133 34483205 35529443 36715757
10624 36715757 38066284 39403455 40644693 41928012 43372514 44899599 46396241 47909341
10616 47909341 49552033 51316468 53103618 54871170 56629731 58328727 59860989 61177769
10608 61177769 62310961 63273836 64010792 64459906 64611605 64494598 64154410 63663176 63107952
10599 63107952 62544131 61981751 61424522 60894153 60413206 60002001 59700746 59549673 59530730
10590 59530730 59580854 59692565 59942348 60369562 60892643 61434015 62079583 62986624 64138157
10581 64138157 65334871 66482110 67748872 69342295 71231766 73229964 75275671 77477995
10573 77477995 79902882 82473986 85104055 87779964 90464360 93025481 95319428 97242665
10565I7242665J413875P28098p287n96298j040612j519957k071031k485286k613414
10556H9050753k589069k613423k661481k573665k346318k142266k042079j957788
10548G0124664j808766j637802j508340j400796j270748j128453j003130q90718
10540E9475911p86796p12060o53396n41408l53734j83417j15616q0522N4710K63512
10530E6367184L70965L20119K78677L87603N32020N07705L25168J62935N7724
10521E9310100j45457n05017q54045j051619j183488j380289j583929j660114
10513E0946142j635893j642786j688399j666739j563797j478729j446152j396218
10505C8427429j298426j200915j119410j027490r60878r81199j026975r65139
$$ plain form
10565 97242665 98656540 99384638 99377351 98781053 97740441 96220484 94149453 91664167 89050753
10556 89050753 86461684 83848261 81186780 78613115 76266797 74124531 72082452 70124664
10548 70124664 68315898 66678096 65169756 63768960 62498212 61369759 60366629 59475911
10540 59475911 58689115 57977055 57323659 56782251 56428517 56245100 56129484 56048962 56103672 56367184
10530 56367184 56738149 57058268 57336945 57724548 58256568 58764273 59089441 59252376 59310100
10521 59310100 59164643 58659626 57805581 56753962 55570474 54190185 52606256 50946142
10513 50946142 49310249 47667463 45979064 44312325 42748528 41269799 39823647 38427429
10505 38427429 37129003 35928088 34808678 33781188 32820310 31839111 30812136 29846997
10497B9846997q15812p50031q15237q44729p21641n61237n20351n73386o00652
10488B3643921n73318n25733m56993l85148l91384m80561n05434l73967k29177
10479A9722206k54075l81731l92913k55994j64858k32972l39427l33577k44363
10470A7122296k01668k41092k76155k36211j69087j79745k71958l05566j82207
10461A5058607k9501n7129k28990k75692j02281M1739m9304k00670j46984K1828
10451A4031623J5925j58071k07005m2274Q9322L0240n6136p556O4291L836j02596
10440A3661599p5896O4645J48506J02169j930p8166r0770m1256J8400J5425m6294
10429A3676432q9682r1830j00198j02321k9066P5065O6411m6000o4608P7894J78673
$$ plain form
10497 29846997 29031185 28281154 27465917 26621188 25899547 25338310 24817959 24244573 23643921
10488 23643921 23070603 22544870 22087877 21702729 21311345 20830784 20325350 19951383 19722206
10479 19722206 19468131 19086400 18693487 18437493 18272635 18039663 17700236 17366659 17122296
10470 17122296 16920628 16679536 16403381 16167170 15998083 15818338 15546380 15240814 15058607
10461 15058607 15029106 14971977 14742987 14467295 14365014 14406753 14357449 14156779 14009795 14031623
10451 14031623 14047548 13889477 13682472 13640198 13729520 13759760 13703624 13696068 13760359 13764195 13661599
10440 13661599 13585703 13650348 13798854 13901023 13899093 13820927 13730157 13688901 13707301 13722726 13676432
10429 13676432 13586750 13494920 13394722 13292401 13263335 13338400 13404811 13358811 13294203 13372097 13550770
10418A3550770R2804j3397N8798J99469J83555O2052O8413K11604K62991J43374
10408A4820433M4798J11589K31633K39208J54510J13170J63947K32826K43619
10399A6355733K17238K48570L76742M97127M84094M01349M47832O56254Q34016
10390B0518955Q87877R76802J197503J385426J456426J660442K164845K664352
10382C2912628K850136L006634L518463L911421L167053J153199r79671k168743
10374D7371120k583870k965689l407257l444179k986599k440142k025679j608248
10366B5909457j182180r63344r42736q42631o14052n34395o88733p76505o07184
10357A8757697m09853m33818n60570n50908m19291l22674k83443k47219k44471
$$ plain form
10418 13550770 13643574 13630177 13688975 13888444 14071999 14134051 14202464 14414068 14677059 14820433
10408 14820433 14865231 14976820 15208453 15447661 15602171 15715341 15879288 16112114 16355733
10399 16355733 16572971 16821541 17198283 17695410 18179504 18580853 19028685 19684939 20518955
10390 20518955 21406832 22383634 23581137 24966563 26422989 28083431 30248276 32912628
10382 32912628 35762764 38769398 42287861 46199282 49366335 50519534 49539863 47371120
10374 47371120 44787250 41821561 38414304 34970125 31983526 29543384 27517705 25909457
10366 25909457 24727277 23763933 22821197 21978566 21364514 20830119 20141386 19364881 18757697
10357 18757697 18347844 17914026 17353456 16802548 16383257 16060583 15777140 15529921 15285450
10348A5285450k90491k78908j61454q1787j48928k33145j78976o7155n2808q5655
10338A3706143k7475O7438M2068p1390j00643k6842J3439p470J9084J04357J32095
10327A3850804Q2235O9858J27021J47266R0847N4635Q8729J26446J46660K18532
10317A5003033L25128L36652K40412K05695L16332M21838L78731K67789K26449
10308A7722059K24520J79135J59725K78986M59424N02047L58153J79433J12302
10299B0175784J61273K39903K64255K18251J88511K84456M78751O17862O43950
10290B3272996O81260Q27752J006258J114795J159128J130482R55503P09854O47369
10281C1505397Q31374J000895J032412J211493J720035K223671K441801K750697
$$ plain form
10348 15285450 14994959 14716051 14554597 14472810 14323882 14090737 13911761 13844606 13791798 13706143
10338 13706143 13678668 13746106 13788174 13716784 13616141 13589299 13602738 13595268 13614352 13718709 13850804
10327 13850804 13933039 14002897 14129918 14277184 14368031 14422666 14511395 14637841 14784501 15003033
10317 15003033 15328161 15664813 15905225 16110920 16427252 16849090 17227821 17495610 17722059
10308 17722059 17946579 18125714 18285439 18564425 19023849 19525896 19884049 20063482 20175784
10299 20175784 20337057 20576960 20841215 21059466 21247977 21532433 22011184 22629046 23272996
10290 23272996 23954256 24782008 25788266 26903061 28062189 29192671 30148174 30858028 31505397
10281 31505397 32336771 33337666 34370078 35581571 37301606 39525277 41967078 44717775
10273D4717775L567000M478980M885812N267400O588097Q275366Q182568N309023
10265I1272021J418073j119054k218801l528518n579132p088099p080102o196538
10257E9879850n453180m894847m139485l341795k849288k515497k061317j670890
10249C2953551j607261j627422j384826j079283j100341j298156j226392r12784
10241B2717086p72564q73213q82326p03211n98150o57965o64621n45454m98374
10232A6521208n78928n87743m64518l96121m32943l86997k28184j95779l64753
10223A2885242m68097l34845j68678j83276k66681k37853j65421j81950k09093
10214A0669348j25879l1635q9931k42653l05215k45516j74524j45787j30555j15125
$$ plain form
10273 44717775 48284775 52763755 57649567 62916967 69505064 77780430 85962998 91272021
10265 91272021 92690094 91571040 89352239 85823721 80244589 73156490 66076388 59879850
10257 59879850 54426670 49531823 45392338 42050543 39201255 36685758 34624441 32953551
10249 32953551 31346290 29718868 28334042 27254759 26154418 24856262 23629870 22717086
10241 22717086 21944522 21071309 20188983 19485772 18887622 18229657 17565036 17019582 16521208
10232 16521208 15942280 15354537 14890019 14493898 14060955 13673958 13445774 13249995 12885242
10223 12885242 12417145 12082300 11913622 11730346 11463665 11225812 11060391 10878441 10669348
10214 10669348 10543469 10511834 10421903 10179250 9874035 9628519 9453995 9308208 9177653 9062528
10204I062528q9443k3140M2896n448j63019k46915j49670j3522k3001j55549k66434
10193G969283k88694k24862q5457L5354j7227k16428l03930j42768N8304N7368
10183F840943p1136j21038j03963j43608j76015o6012Q1415M9629j08713j41927
10173F039575k5937P285j12246j71106m7043Q6489N1303p7473j37407j13253p8201
10162E421986n4179m5720q8959j69640j92829j06861K4512J07662R3735k3417
10152D966290j72361j99703m9866R1047K0026j54130j47981M3895J24645k9857
10142D492005j82599j36326k3426k4809p0533l2649J8617j4029l4808M2958O5997
10131D100398j03684k67721j52453J21164J84478p444j20528P679J23549o606
$$ plain form
10204 9062528 8973085 8949945 8992841 8987393 8824374 8577459 8427789 8414267 8391266 8235717 7969283
10193 7969283 7680589 7455727 7370270 7405624 7388397 7171969 6868039 6725271 6783575 6840943
10183 6840943 6769807 6648769 6544806 6401198 6225183 6159171 6240586 6290215 6181502 6039575
10173 6039575 6013638 6020923 5908677 5737571 5690528 5777017 5828320 5750847 5613440 5500187 5421986
10162 5421986 5367807 5322087 5233128 5063488 4870659 4763798 4788310 4895972 4989707 4966290
10152 4966290 4793929 4594226 4544360 4635407 4655433 4501303 4353322 4397217 4521862 4492005
10142 4492005 4309406 4173080 4149654 4124845 4054312 4021663 4040280 4026251 3991443 4034401 4100398
10131 4100398 3996714 3728993 3576540 3697704 3882182 3874738 3754210 3761889 3885438 3878832
10121C878832k21634k31858m9772P4967L3808m4529l7312J4523J7384k6074l7482
10110C370853J5143O6786L5974o2716j23378q2031j720J7563k8231o6738o4888
10099C076617m6208j9595J7942K5366l1155p7823p677J26459J33635l8185j83607
10088B975769j11717P2118J14668j5221r7775j4069P7574J5867q9886m4474Q6532
10077B969386O1612j23526j84066L595J67521N2404j56332j12184J29348J88251
10067B996009k9782j88709p4889P8722J6432j16542o0623R2806O9291j01753j34782
10056B546180K7064J27902L0288q7342n6849K6088J1767n2149m0062K9740N1554
10045B614181J4541j0001l025m158j9274j1540L0792P4479P9418L3410l1503n6862
$$ plain form
10121 3878832 3657198 3425340 3375568 3450535 3484343 3439814 3402502 3417025 3434409 3408335 3370853
10110 3370853 3385996 3452782 3488756 3426040 3302662 3220631 3218911 3236474 3208243 3141505 3076617
10099 3076617 3030409 3010814 3028756 3054122 3022967 2945144 2937467 3063926 3197561 3159376 2975769
10088 2975769 2864052 2936170 3050838 3035617 2937842 2923773 3001347 3017214 2927328 2882854 2969386
10077 2969386 3030998 2907472 2723406 2727001 2894522 2946926 2790594 2678410 2807758 2996009
10067 2996009 2966227 2777518 2702629 2781351 2797783 2681241 2620618 2713424 2782715 2680962 2546180
10056 2546180 2573244 2701146 2731434 2644092 2587243 2613331 2625098 2572949 2532887 2562627 2614181
10045 2614181 2628722 2618721 2615696 2611538 2592264 2580724 2611516 2685995 2765413 2798823 2767320 2710458
10033B710458k4852Q516n800k9153n971K7028L287l8491r138O1780N7018k8360
10021B726322p2356k8556J6675K1118M9911J07092Q1531n0160j32763n9345N5771
10010B715240N8822j6037m0915p515L798j1263O414N3480P5029O0409L2656k704
9998B927414j6825N1582J71820J89580L9089j15415r2747M6941J20213J07551
9988C429203J29112J96849K07070J57872J58267K11058J95544J01240P4977J69694
9978E030886K33551J39783l4102j55284k16822k59787k50326j68039j10181j62508
9968D047171k41016k07215r0080m4180j07042j48250q2447j507l0787j42842j97281
9957B754524j26608o853N2105K6091l1337o9506p3311m2073R789L4438p109p0713
$$ plain form
10033 2710458 2685606 2694122 2688322 2659169 2653198 2680226 2683513 2645022 2635884 2697664 2754682 2726322
10021 2726322 2653966 2625410 2642085 2663203 2713114 2820206 2901737 2851577 2718814 2659469 2715240
10010 2715240 2774062 2758025 2717110 2709595 2713393 2702130 2708544 2762024 2837053 2897462 2930118 2927414
9998 2927414 2910589 2962171 3133991 3323571 3362660 3247245 3154498 3201439 3321652 3429203
9988 3429203 3558315 3755164 3962234 4120106 4278373 4489431 4684975 4786215 4861192 5030886
9978 5030886 5264437 5404220 5370118 5214834 4998012 4738225 4487899 4319860 4209679 4047171
9968 4047171 3806155 3598940 3508860 3464680 3357638 3209388 3126941 3125434 3094647 2951805 2754524
9957 2754524 2627916 2621063 2673168 2699259 2667922 2598416 2525105 2483032 2492821 2527259 2520150 2449437
9945B449437o3741J2836L4263o7717j67342r9945Q4103J60589L9949j04750q2283
9934B195399N9341J24713M8688m4176m1937J4490L0385M173k04J9806J35o4882
9922B345931q2904k18Q8750N3692q0002j51032p9524L2753N4476r578o1977n4418
9910B055949j8283M362J036j4087p724L6652P5564N1805p912k2758K438k1608
9898B135434r8556j15936m1984M098l2483k9691P8966J42130M0513p5945k8835
9887A977711P0138J7791r8354m6759J09180R4214q4014j26302K9960Q9430p6047
9876A956948j89097m8726J26733R6638K147O2655J55632N8489j10969q2778Q4692
9865B112364J01821n7658j36428m0411M8537K4192l725K9596L3583j8864k1393
$$ plain form
9945 2449437 2385696 2398532 2432795 2365078 2197736 2097791 2181894 2342483 2382432 2277682 2195399
9934 2195399 2254740 2379453 2428141 2383965 2342028 2356518 2386903 2391076 2390872 2410678 2410813 2345931
9922 2345931 2263027 2262809 2351559 2405251 2325249 2174217 2094693 2127446 2181922 2172344 2110367 2055949
9910 2055949 2037666 2042028 2043064 2028977 2021253 2057905 2133469 2185274 2177362 2154604 2157042 2135434
9898 2135434 2036878 1920942 1878958 1883056 1850573 1820882 1899848 2041978 2082491 2006546 1977711
9887 1977711 2047849 2065640 1967286 1920527 2029707 2123921 2039907 1913605 1943565 2032995 1956948
9876 1956948 1767851 1719125 1845858 1942496 1944643 2007298 2162930 2221419 2110450 2027672 2112364
9865 2112364 2214185 2156527 2020099 1979688 2028225 2052417 2048692 2078288 2111871 2093007 2071614
9854B071614M1886M1268n1244q8029p666M7864j9280j01262q3851j9104J9835
9843A852031P3180J48975J20857o1412k07299j22188R4503J79781O9368n8344
9833B089452o8189j4553Q844L099r09j7501m8324l8232L5059Q8069L4382o9350
9821B001847p4679N2362J67530J36365O048q5213r8157q2222l6021O6281J36722
9810B190863N4047j00162j01130O1575J24742l1080j58909l5893J62708J50443
9800B317204o789m1509M3219K1555j09133j16152L8578J29449O9558K5940O5058
9789B436978L7459q3702j00250M0475J12972J2226n0792N8088J43844N3761k5389
9778B635670P8897J76687M9045j29677o6911J52053K17382R6117J2917L8057N0723
$$ plain form
9854 2071614 2113500 2154768 2103524 2015495 2007829 2055693 2036413 1935151 1851300 1832196 1852031
9843 1852031 1925211 2074186 2195043 2133631 1926332 1804144 1898647 2078428 2147796 2089452
9833 2089452 2021263 2006710 2015554 2018653 2017744 2000243 1951919 1913687 1948746 2036815 2071197 2001847
9821 2001847 1927168 1979530 2147060 2283425 2289473 2204260 2106103 2023881 1987860 2054141 2190863
9810 2190863 2244910 2144748 2043618 2105193 2229935 2198855 2039946 2004053 2166761 2317204
9800 2317204 2310415 2268906 2312125 2333680 2224547 2108395 2146973 2276422 2345980 2371920 2436978
9789 2436978 2474437 2390735 2290485 2330960 2443932 2456158 2405366 2463454 2607298 2661059 2635670
9778 2635670 2714567 2891254 2940299 2810622 2743711 2895764 3113146 3209263 3222180 3260237 3310960
9767C310960L8431R5486J74943J52715Q5129J06214J41596L8469j00018n9654
9757C984271P0813J5743j87217k16572k0115Q5088m9896j79262j12098p927m1132
9746C341696j08133p5449k8022o1492q3743k1513J4380m3789o6846J4865M7767
9735B929721n7559j28479l6809N1314k0651r5666R452J41783O7993r5780p1445
9724B693874R7066J24440k4675r9806q481N7577j5897q9537l8404N9733R6283
9713B852173Q4195N6584p681q4066q4407j937O0246M9248K3574K6957L0449K3474
9701C028809L6492N4707K9444j6646j3680L1180N3260N2869O7913O0947j3363
9690C371932o9352K111J23153J26801L6353J8888P5594M3177p4806o9682J02215
$$ plain form
9767 3310960 3349391 3444877 3619820 3772535 3857664 3963878 4105474 4143943 4043925 3984271
9757 3984271 4055084 4070827 3883610 3667038 3646923 3732011 3682115 3502853 3390755 3382828 3341696
9746 3341696 3233563 3158114 3130092 3068600 2984857 2963344 2977724 2933935 2867089 2881954 2929721
9735 2929721 2872162 2743683 2706874 2758188 2737537 2641871 2651323 2793106 2861099 2765319 2693874
9724 2693874 2790940 2915380 2890705 2790899 2782418 2839995 2824098 2734561 2696157 2755890 2852173
9713 2852173 2936368 2992952 2985271 2901205 2816798 2814861 2875107 2924355 2947929 2974886 3005335 3028809
9701 3028809 3065301 3120008 3149452 3132806 3119126 3150306 3203566 3256435 3324348 3385295 3371932
9690 3371932 3302580 3304691 3427844 3554645 3590998 3609886 3685480 3728657 3653851 3584169 3686384
9679C686384K01945R0251m4893j4432O8064K2481p2275l9805O5278N5326o3219
9668C955105j14776n4400j1703n2216r5160p6317l1685o778o280l0166o0135m2152
9656C373337K1216K4759p5772j36437j9685J55082J50753l2363j51406p8430M5585
9645C276639O2395R093q382M905p656k6723k336M1754M2799k906m2645l7584Q598
9632C317951N8448N9065m609o6737m7326L3629P7510M7246M136o916j4330l4016
9620C424051k4076K8302O3535M8479L5830O2035O5943j0892j06496j11833k3767
9609C451111N9346P3161M2956J4484o45l386J5024N2940Q2183P1419K4076j5619
9597C867050j1468P103k3626q8133p5078N5108J55989P5711r2531j14124L2876
$$ plain form
9679 3686384 3888329 3978580 3933687 3919255 3987319 4009800 3937525 3897720 3962998 4018324 3955105
9668 3955105 3840329 3785929 3774226 3722010 3626850 3550533 3518848 3512070 3505790 3475624 3415489 3373337
9656 3373337 3394553 3419312 3343540 3207103 3187418 3342500 3493253 3460890 3309484 3231054 3276639
9645 3276639 3339034 3348127 3339745 3344650 3336994 3310271 3307935 3349689 3392488 3389582 3346937 3309353 3317951
9632 3317951 3376399 3435464 3430855 3364118 3316792 3350421 3427931 3475177 3479313 3472397 3458067 3424051
9620 3424051 3399975 3428277 3491812 3540291 3576121 3638156 3704099 3693207 3586711 3474878 3451111
9609 3451111 3510457 3583618 3626574 3641058 3640413 3637027 3652051 3704991 3787174 3858593 3882669 3867050
9597 3867050 3855582 3862685 3839059 3750926 3675848 3730956 3886945 3962656 3870125 3756001 3788877
9586C788877J14211J0372r1232j1232J19820Q3578n6592o6416O5755J23535L0995
9575D111671m6657p659L6836N94k1563M4549R4149L2211m4592j2528O9616P9102
9563D335729L9701M1569N2000o615o7305q113J14583J27845K2683l2121K7498
9552D647454O8486N241n3343K435R6244R3548J0040k9355K4084J00965J20205
9541E086004O3459k5739o6574k534J21149J84110J27210J4642o1365p3261l2867
9530E334234M4412J10728J03666M2120K5361Q7903J41695J18457P4717Q3743J17043
9519F284079J18573J08350J19646J18365Q2366P2778J20798J39278P0999K3544
9509G258776J01767J99075J44052j1087n8890L8851J13274P5888K6015L9083N5889
$$ plain form
9586 3788877 3903088 3913460 3822228 3810996 3930816 4014394 3957802 3891386 3957141 4080676 4111671
9575 4111671 4065014 4057355 4094191 4094785 4073222 4117771 4211920 4244131 4199539 4187011 4256627 4335729
9563 4335729 4375430 4416999 4468999 4462384 4395079 4386966 4501549 4629394 4652077 4619956 4647454
9552 4647454 4715940 4721181 4667838 4670273 4766517 4860065 4870105 4840750 4864834 4965799 5086004
9541 5086004 5149463 5123724 5057150 5054616 5175765 5359875 5487085 5501727 5440362 5367101 5334234
9530 5334234 5378646 5489374 5593040 5635160 5660521 5748424 5890119 6008576 6083293 6167036 6284079
9519 6284079 6402652 6511002 6630648 6749013 6831379 6904157 7024955 7164233 7235232 7258776
9509 7258776 7360543 7559618 7703670 7692583 7633693 7672544 7785818 7861706 7887721 7926804 7982693
9498G982693L9222M7261Q2338N1969m1080n4260N7462J44840J15290R2797J86082
9487H704614K79436K36901J59072K17857L46668L35237J79190R6977J93392L14687
9477A1064031K87100J38688J7506j922K7335k184j48383l38174m06975k88445
9467A0348577j29958j21590k40815k91205j87635o3021n6645j23655j29187m7128
9457H957738K1373o255r5321j40367q1727L0893R2841O1010o131l1335k840M2377
9445H842256P1262O1257P351m2213j8031O1940Q9924K6950k4710J6701P5156M9056
9433I216899j0047Q264O8501M3835n7731r4300j9943N1447M3936K9425P9534J34779
9421I494599J05667J9789j6450L9484J23259J45996Q6892J0649q33O2920J37373
$$ plain form
9498 7982693 8021915 8069176 8151514 8203483 8162403 8108143 8165605 8310445 8425735 8518532 8704614
9487 8704614 8984050 9220951 9380023 9597880 9944548 10279785 10458975 10555952 10749344 11064031
9477 11064031 11351131 11489819 11507325 11505403 11532738 11530554 11382171 11043997 10637022 10348577
9467 10348577 10218619 10097029 9856214 9565009 9377374 9314353 9257708 9134053 9004866 8957738
9457 8957738 8979111 8972856 8877535 8737168 8655441 8686334 8779175 8840185 8834054 8802719 8799879 8842256
9445 8842256 8913518 8974775 8982126 8939913 8921882 8983822 9073746 9100696 9075986 9092687 9167843 9216899
9433 9216899 9206852 9215116 9283617 9327452 9269721 9175421 9155478 9206925 9250861 9280286 9359820 9494599
9421 9494599 9600266 9620055 9603605 9643089 9766348 9912344 9999236 10009885 10009052 10071972 10209345
9410A0209345J69109J62013J30266P4315K5992L3883P2220O3293K4465O2718J72369
9399A1199988K03205J15072P4659J70704K38447J46514M9606J22202K38175J99679
9389A2758251J07312J68127K80256J90014l0639p0315R8345J92340J16440P5079
9379A3885210J47813J62365O7117L8940J26596J60652J06289J27122K19889J93721
9369A5235714R3819J90730M39444M52339J71670L2024K26876L71065J95706J9317
9359A7428704J42409L05818K02322L6892Q8571J74812P0543J4629K41678M42200
9349A9148578K90612Q9490K33809M47552K87529K4307J93068N75605N33458J50147
9339B1974155R6486M50355O01719L48587J66831K91943M01650L50350L94981N42492
$$ plain form
9410 10209345 10378454 10540467 10670733 10745048 10771040 10804923 10877143 10940436 10964901 11027619 11199988
9399 11199988 11403193 11518265 11592924 11763628 12002075 12148589 12198195 12320397 12558572 12758251
9389 12758251 12865563 13033690 13313946 13503960 13473321 13403006 13501351 13693691 13810131 13885210
9379 13885210 14033023 14195388 14262505 14301445 14428041 14588693 14694982 14822104 15041993 15235714
9369 15235714 15329533 15520263 15959707 16412046 16583716 16615740 16842616 17213681 17409387 17428704
9359 17428704 17571113 17876931 18079253 18116145 18204716 18379528 18450071 18464700 18706378 19148578
9349 19148578 19439190 19528680 19762489 20210041 20497570 20521877 20714945 21290550 21824008 21974155
9339 21974155 22070641 22520996 23122715 23471302 23638133 23930076 24331726 24682076 25077057 25619549
9329B5619549M73949K58391L36172O63347P15439M71872M88344Q26776Q94450
9320C0748289N80996N21696R12062J126606R12412Q63897J234722J411607J136061
9311C9448348J083361J567203J872218J632665J618697K276220K808457K729725
9303E5036894K917992L903151M630065M428801M598324O138425P607007P703533
9295I6964192Q280477J1330929J4041007J1168132K678154n216098p991012p902970
9287A23352811r035162j0922454j0458884p623538n367137m876476m532192l349952
9279F7187016k352267k201757k064207j453699j125497j440784j579743j078807
9271E3890255o57300q25568r89385o39154k70862m09487o99232o43235m12458
$$ plain form
9329 25619549 26093498 26351889 26688061 27351408 28066847 28538719 29027063 29853839 30748289
9320 30748289 31329285 31850981 32763043 33889649 34802061 35665958 36900680 38312287 39448348
9311 39448348 40531709 42098912 43971130 45603795 47222492 49498712 52307169 55036894
9303 55036894 57954886 61858037 66488102 70916903 75515227 81653652 89260659 96964192
9295 96964192 105244669 116575598 130616605 141784737 144462891 139246793 131255781 123352811
9287 123352811 114317649 103395195 92936311 85312773 79945636 75069160 70536968 67187016
9279 67187016 64834749 62632992 60568785 59115086 57989589 56548805 54969062 53890255
9271 53890255 53232955 52407387 51418002 50778848 50507986 50098499 49399267 48756032 48343574
9262D8343574l19619k38706o8536o1043k28353j31870L14591N59353L46922J80956
9252D8697269M07139O13077M56316L17547N35818P28354N35682L61568O41574
9243E3294344R89227Q59580N33607O07085R31648R30911O49827O16942Q67731
9234F0280902R52223Q10698Q38249J095825J203500J069877J047527J263347J409465
9225F9971613J333536J285171J419659J546385J535286J540420J656826J736017
9217H2024913J689786J638819J646453J631925J631094J794029K032993K041480
9209I6131492J791372J650567J836598K085332K070604J869291J773836J856123
9201A11065215J953360J953029J894411J854812J858238J859915J790339J671980
$$ plain form
9262 48343574 48023955 47785249 47716713 47655670 47427317 47295447 47610038 48169391 48516313 48697269
9252 48697269 49104408 49717485 50173801 50491348 51027166 51755520 52291202 52652770 53294344
9243 53294344 54283571 55143151 55676758 56283843 57215491 58146402 58796229 59413171 60280902
9234 60280902 61233125 62043823 62882072 63977897 65181397 66251274 67298801 68562148 69971613
9225 69971613 71305149 72590320 74009979 75556364 77091650 78632070 80288896 82024913
9217 82024913 83714699 85353518 86999971 88631896 90262990 92057019 94090012 96131492
9209 96131492 97922864 99573431 101410029 103495361 105565965 107435256 109209092 111065215
9201 111065215 113018575 114971604 116866015 118720827 120579065 122438980 124229319 125901299
9193A25901299J644650J755123J808138J623053J354306J293560J409713J402414
9185A38192256J205258J083301J168446J248166J139993R58401Q54439P77280
9177A46627540O65654O10179O37996N77482L32809P5435k8369o8482j76832k81329
9167A48972083k93227l33119n20544p16955p45502p15687q42953j061869j125503
9158A42616724j026585j010768j172869j329009j346042j347915j485885j687023
9150A32210628j767418j696008j624643j685411j839319j944440j941769j919424
9142A17792196j961103k000173j934642j843169j910364k120883k230182k114715
9134A01676965j948837j915246j941542j892034j833779j891494j978940j919505
$$ plain form
9193 125901299 127545949 129301072 131109210 132732263 134086569 135380129 136789842 138192256
9185 138192256 139397514 140480815 141649261 142897427 144037420 144995821 145850260 146627540
9177 146627540 147293194 147903373 148541369 149118851 149451660 149527095 149498726 149430244 149253412 148972083
9167 148972083 148678856 148345737 147825193 147108238 146362736 145647049 144804096 143742227 142616724
9158 142616724 141590139 140579371 139406502 138077493 136731451 135383536 133897651 132210628
9150 132210628 130443210 128747202 127122559 125437148 123597829 121653389 119711620 117792196
9142 117792196 115831093 113830920 111896278 110053109 108142745 106021862 103791680 101676965
9134 101676965 99728128 97812882 95871340 93979306 92145527 90254033 88275093 86355588
9126H6355588j746573j649257j677480j720009j725115j725822j690084j570460
9118G2850788j469369j521210j630837j577547j378905j283178j362278j392623
9110F1234841j236499j076260j111719j239259j225871j057028r18104r14396
9102E2455705r75525r93629r29890q11796p12548p01920p58725p79397p17201
9093D5075074o43748o26082o26748n86158n21070m73152m36328m02246m01430
9084D0358112m32303m27829l60939l01000k95580k89166k40659k17022k62186
9075C7531428k77043j71578n1384q1235k12972k37978j05169K856m7824j55297
9065C6193804j57292n4617M4803R9923J35385J36828P4956M087J8115J09086J73622
$$ plain form
9126 86355588 84609015 82959758 81282278 79562269 77837154 76111332 74421248 72850788
9118 72850788 71381419 69860209 68229372 66651825 65272920 63989742 62627464 61234841
9110 61234841 59998342 58922082 57810363 56571104 55345233 54288205 53370101 52455705
9102 52455705 51480180 50486551 49556661 48744865 48032317 47330397 46571672 45792275 45075074
9093 45075074 44431326 43805244 43178496 42592338 42071268 41598116 41161788 40759542 40358112
9084 40358112 39925809 39497980 39137041 38836041 38540461 38251295 38010636 37793614 37531428
9075 37531428 37254385 37082807 37031423 36950188 36737216 36499238 36394069 36396925 36349101 36193804
9065 36193804 36036512 35981895 36026698 36126621 36262006 36398834 36473790 36477877 36495992 36605078 36778700
9054C6778700J72681J79708K33875K55111J85699J25361J99471L39682L49030
9045C8819318J94165P3705J31989K55271K71323K24990K80136M21821M66505L64308
9035D1503531K80073L18024L60644K88698J96004K34612L65603M35026M22774
9026D4404989M37077M97694N08454M54080M49491N42244O18943N92711N57389
9017D9063072O39390P83858Q26020P39124O72527P30397Q36936Q78218Q78857
9008E6048399R39265J049213J085390J003638R22881R62163J077994J146788J149310
8999F5385041J165408J212744J216243J155046J120192J172252J240745J239567
8991G4907238J203602J223085J299996J362076J379688J378656J368261J349345
$$ plain form
9054 36778700 36951381 37131089 37364964 37620075 37805774 37931135 38130606 38470288 38819318
9045 38819318 39013483 39087188 39219177 39474448 39745771 39970761 40250897 40672718 41139223 41503531
9035 41503531 41783604 42101628 42462272 42750970 42946974 43181586 43547189 43982215 44404989
9026 44404989 44842066 45339760 45848214 46302294 46751785 47294029 47912972 48505683 49063072
9017 49063072 49702462 50486320 51312340 52051464 52723991 53454388 54291324 55169542 56048399
9008 56048399 56987664 58036877 59122267 60125905 61048786 62010949 63088943 64235731 65385041
8999 65385041 66550449 67763193 68979436 70134482 71254674 72426926 73667671 74907238
8991 74907238 76110840 77333925 78633921 79995997 81375685 82754341 84122602 85471947
8983H5471947J371004J480379J624497J698786J693028J693479J739646J787740
8975I8560506J829054J918818K044712K095880K041535K025402K173905K401413
8967A15091225K533194K553667K589236K690542K796656K906081L103752L376787
8959A37641140L575931L648807L761780M063114M444556M698727M835574N059115
8951A71728744N452946N871013O169734O392282O663716P027517P450925P885733
8943B24642610Q258180Q497204Q638551Q801438Q994273R055957Q875653Q546917
8935B94310783Q186475P727782P060052O267650N524021M809133L962506L004012
8927C40852414K162827J548319J020553M66922q986k97608m93929p38027r86781
$$ plain form
8983 85471947 86842951 88323330 89947827 91646613 93339641 95033120 96772766 98560506
8975 98560506 100389560 102308378 104353090 106448970 108490505 110515907 112689812 115091225
8967 115091225 117624419 120178086 122767322 125457864 128254520 131160601 134264353 137641140
8959 137641140 141217071 144865878 148627658 152690772 157135328 161834055 166669629 171728744
8951 171728744 177181690 183052703 189222437 195614719 202278435 209305952 216756877 224642610
8943 224642610 232900790 241397994 250036545 258837983 267832256 276888213 285763866 294310783
8935 294310783 302497258 310225040 317285092 323552742 329076763 333885896 337848402 340852414
8927 340852414 343015241 344563560 345584113 346051035 346042049 345744441 345250512 344512485 343525704
8918C43525704j118014j165821j282113j519826j803686k084844k401798k808552
8910C29341050l331603l962379m620858n190816n669053o194664o835720p447870
8902B86088087p868893q149011q425921q658483q682562q490252q256165q090569
8894B19466231p938861p724772p431125p046115o597101o224940o038020n900365
8886A64564932n578610n110778m784706m696565m593823m271955l876105l635709
8878A28016681l515873l349003l143913l017836k931467k747193k502168k382156
8870A04427072k419766k429062k281757k077417j975628j988175k011479j979272
8862H7264516j911497j851596j805108j741200j651272j591090j615873j672339
$$ plain form
8918 343525704 342407690 341241869 339959756 338439930 336636244 334551400 332149602 329341050
8910 329341050 326009447 322047068 317426210 312235394 306566341 300371677 293535957 286088087
8902 286088087 278219194 270070183 261644262 252985779 244303217 235812965 227556800 219466231
8894 219466231 211527370 203802598 196371473 189325358 182728257 176503317 170465297 164564932
8886 164564932 158986322 153875544 149090838 144394273 139800450 135528495 131652390 128016681
8878 128016681 124500808 121151805 118007892 114990056 112058589 109311396 106809228 104427072
8870 104427072 102007306 99578244 97296487 95219070 93243442 91255267 89243788 87264516
8862 87264516 85353019 83501423 81696315 79955115 78303843 76712753 75096880 73424541
8854G3424541j641068j515465j429270j443529j431591j284880j113329j086295
8846F2479114j162960j161686j044409r41920r18088r01905q62103q58821q84696
8837E3742526q36161p07452o46910p30270q19886p58425n93548m95135n24198
8828D7630541n91779o03638n56743n09859n11886n48610n50140m83978m22482
8819D2851426m44910m95547m55742l53664l50277m78895n63958m84212l62175
8810C8862046l66532m55319m70896l99324l65746m15182m54878m09113l11109
8801C5213947k38438k41228l17119l89234l56839k42830k12576l40525m53852
8792C2421306l64794j75543j44739k91726l73808k74650j66697k06696k99840
$$ plain form
8854 73424541 71783473 70268008 68838738 67395209 65963618 64678738 63565409 62479114
8846 62479114 61316154 60154468 59110059 58168139 57250051 56348146 55486043 54627222 53742526
8837 53742526 52906365 52198913 51552003 50821733 50001847 49243422 48649874 48154739 47630541
8828 47630541 47038762 46435124 45878381 45368522 44856636 44308026 43757886 43273908 42851426
8819 42851426 42406516 41910969 41455227 41101563 40751286 40272391 39708433 39224221 38862046
8810 38862046 38495514 38040195 37569299 37169975 36804229 36389047 35934169 35525056 35213947
8801 35213947 34975509 34734281 34417162 34027928 33671089 33428259 33215683 32875158 32421306
8792 32421306 32056512 31880969 31736230 31444504 31070696 30796046 30629349 30422653 30122813
8783C0122813k98533k40895k28963k30674j86080j78032k91673m02777l30580
8774B7734606j43842q0987j83074k47149j72982j12674j87135k75297k29697j26976
8764B5974793j26467k02576k09890j40390j19746j73841j87896j18449p9078j55102
8754B4461358k61510k65760j66460p2205n7183j04918j62131j91818j83728j46889
8744B2848756r6480m9459l5707q0552j48700j54716q3212l8650r0969j40635o8129
8733B1861547M2948J5708j14621j32519k851N8549l9580r5314J8293R4390m9016
8722B1657534k00198p9988J50497J18125j25848j58923J10099K68238O6108j84057
8712B1621587j25730R6351J30709j8684q4397m768N8373N9625Q7415J06587Q487
$$ plain form
8783 30122813 29824280 29583385 29354422 29123748 28937668 28759636 28467963 28065186 27734606
8774 27734606 27590764 27509777 27326703 27079554 26906572 26793898 26606763 26331466 26101769 25974793
8764 25974793 25848326 25645750 25435860 25295470 25175724 25001883 24813987 24695538 24616460 24461358
8754 24461358 24199848 23934088 23767628 23695423 23638240 23533322 23371191 23179373 22995645 22848756
8744 22848756 22752276 22702817 22667110 22586558 22437858 22283142 22199930 22161280 22070311 21929676 21861547
8733 21861547 21904495 21920203 21805582 21673063 21670212 21728761 21689181 21593867 21612160 21706550 21657534
8722 21657534 21457336 21377348 21527845 21645970 21520122 21361199 21471298 21739536 21805644 21621587
8712 21621587 21495857 21592208 21722917 21704233 21619836 21615068 21673441 21733066 21820481 21927068 21935555
8701B1935555j10911m0368J70902K34773O9102p2714m405J33413J44381P0086
8691B2529814N1573Q3817P9810M5163L4951M0836M7368R6610J81168J87429P3173
8680B3451712j1922O9234K15105K28464J09813L2836P3269J39625J58157J56143
8670B4622436J50257J09518O0589Q6819J75329J96330J00640K1129Q8297K33561
8660B5844905K81824J89897Q7351R1614J72375K20819J92950J43885J40704J78223
8650B7544547J96021J67610J41823J74155K40580K64698K27149J92748K09159
8641B9358490K36089K22715K08680K70475L81900M18543L28439K20286K27151
8632C1872768L41068M51965N03597N23455N29471N14744N19836O02294P13605
$$ plain form
8701 21935555 21824644 21784276 21955178 22189951 22259053 22186339 22181934 22315347 22459728 22529814
8691 22529814 22581387 22665204 22745014 22790177 22825128 22865964 22913332 23009942 23191110 23378539 23451712
8680 23451712 23439790 23509024 23724129 23952593 24062406 24095242 24168511 24308136 24466293 24622436
8670 24622436 24772693 24882211 24942800 25029619 25204948 25401278 25501918 25523047 25611344 25844905
8660 25844905 26126729 26316626 26403977 26495591 26667966 26888785 27081735 27225620 27366324 27544547
8650 27544547 27740568 27908178 28050001 28224156 28464736 28729434 28956583 29149331 29358490
8641 29358490 29594579 29817294 30025974 30296449 30678349 31096892 31425331 31645617 31872768
8632 31872768 32213836 32665801 33169398 33692853 34222324 34737068 35256904 35859198 36572803
8623C6572803P30940O57352O56902Q08159R53866R19104P64614O65374O29499
8614D3358613N33563L87685L46608M48718N49713N58981N53310N94940O20583
8605D7952714N96339O09715P01761P67964P46366P49161Q62394R56577Q69772
8596E4812763O67440N34166M89942M07760K61257J61524J64502K13014K66308
8587E7978676L33806L82612L58641L03135L12379L82082M23597M23502M42166
8578F1340596M64718M19279L50094L92966N43149O27132N68726N12491N91023
8569F5810174P21470P51790O93884O82079P68050Q68118Q84759Q14164P54177
8560G2748665Q18109R88735J078019R42491P29248P44922J041490J312992J297779
$$ plain form
8623 36572803 37303743 37961095 38617997 39426156 40380022 41299126 42063740 42729114 43358613
8614 43358613 43892176 44279861 44626469 45075187 45624900 46183881 46737191 47332131 47952714
8605 47952714 48549053 49158768 49860529 50628493 51374859 52124020 52986414 53942991 54812763
8596 54812763 55480203 56014369 56504311 56912071 57173328 57334852 57499354 57712368 57978676
8587 57978676 58312482 58695094 59053735 59356870 59669249 60051331 60474928 60898430 61340596
8578 61340596 61805314 62224593 62574687 62967653 63510802 64137934 64706660 65219151 65810174
8569 65810174 66531644 67283434 67977318 68659397 69427447 70295565 71180324 71994488 72748665
8560 72748665 73566774 74555509 75633528 76576019 77305267 78050189 79091679 80404671 81702450
8551H1702450J116161J069356J235842J434967J510761J487450J474455J543995
8543I2575437J691123J836868J902177J925914K033673K237124K380431K374061
8535A08956808K353307K479255K703670K882840L010906L161981L302388L369746
8527A32220901L463007L721278M054311M236790M262827M355988M600025M817101
8519A65732228M887945M946256N129427N346544N450057N471009N518912N580816
8511B08063194N587211N571755N596790N600447N486128N308318N202593N160800
8503B51577236N040132M798131M567051M456340M401427M270146M041153L809262
8495B86960878L645835L507238L290851K967265K630408K386755K213093J987288
$$ plain form
8551 81702450 82818611 83887967 85123809 86558776 88069537 89556987 91031442 92575437
8543 92575437 94266560 96103428 98005605 99931519 101965192 104202316 106582747 108956808
8535 108956808 111310115 113789370 116493040 119375880 122386786 125548767 128851155 132220901
8527 132220901 135683908 139405186 143459497 147696287 151959114 156315102 160915127 165732228
8519 165732228 170620173 175566429 180695856 186042400 191492457 196963466 202482378 208063194
8511 208063194 213650405 219222160 224818950 230419397 235905525 241213843 246416436 251577236
8503 251577236 256617368 261415499 265982550 270438890 274840317 279110463 283151616 286960878
8495 286960878 290606713 294113951 297404802 300372067 303002475 305389230 307602323 309589611
8487C09589611J660315J309077R90153O47754K37693j58298m51018o99627j018939
8478C12106721j385839j689404j947515k297874k748030l112201l282637l415078
8470B92228143l711235m117907m404096m493717m551150m718621m925618n033512
8462B56272287n046915n065477n100771n080386n012394n003483n084187n140529
8454B15738145n084377m991444m983062n046362n071568n015837m928045m847209
8446A75770241m778262m740967m739124m702967m567762m387444m256912m149935
8438A39446868l972470l754010l613600l531886l354304l064019k843134k777524
8430A12535921k709803k513229k311343k253145k246725k126101j941467j851275
$$ plain form
8487 309589611 311249926 312559003 313549156 314196910 314434603 314276305 313825287 313125660 312106721
8478 312106721 310720882 309031478 307083963 304786089 302038059 298925858 295643221 292228143
8470 292228143 288516908 284399001 279994905 275501188 270950038 266231417 261305799 256272287
8462 256272287 251225372 246159895 241059124 235978738 230966344 225962861 220878674 215738145
8454 215738145 210653768 205662324 200679262 195632900 190561332 185545495 180617450 175770241
8446 175770241 170991979 166251012 161511888 156808921 152241159 147853715 143596803 139446868
8438 139446868 135474398 131720388 128106788 124574902 121220598 118156579 115313445 112535921
8430 112535921 109826118 107312889 105001546 102748401 100501676 98375575 96434108 94582833
8422I4582833j831250j736538j581753j506042j498642j414559j254661j177095
8414H2582293j210509j201965j090733r93698r61977q96382p84967p76140q99666
8405G3766256r56728q40002p36618q23165r61356r25662p71548p19557p80390
8396F6251230p65562o27812n34463n85247o69801o55792n58076m66560m26427
8387F0961490m37613m84997n34159n53848n49585n37473n17980n15771n74473
8378E6255591o52539o26503m90095m26943n47027o78312o11894m43578m27547
8369E1351153n59535n88612m37627l21357l91077n31162o01128o31151o58910
8360D6630594o05391m59451l79682m54286n45931n32834n11749n82097o27440
$$ plain form
8422 94582833 92751583 91015045 89433292 87927250 86428608 85014049 83759388 82582293
8414 82582293 81371784 80169819 79079086 78085388 77123411 76227029 75442062 74665922 73766256
8405 73766256 72809528 71969526 71232908 70409743 69448387 68522725 67751177 67031620 66251230
8396 66251230 65485668 64857856 64323393 63738146 63068345 62412553 61854477 61387917 60961490
8387 60961490 60523877 60038880 59504721 58950873 58401288 57863815 57345835 56830064 56255591
8378 56255591 55603052 54976549 54486454 54059511 53512484 52834172 52222278 51778700 51351153
8369 51351153 50791618 50203006 49765379 49444022 49052945 48521783 47920655 47289504 46630594
8360 46630594 46025203 45565752 45186070 44731784 44185853 43653019 43141270 42559173 41931733
8351D1931733n36036m56098n59715o99431o13859l83092l34367n14689o11688
8342C7222758m61628l01664l71800n43037n44464l65986k17723k08308k66475
8333C3941673l18598l64801l96729l80500l30091l02740l14241l25155l10028
8324C0898790k86639k76904k77091k68219k39165k05368k01733k35788k62913
8315B8644970k44636k06006j81816j43727o3042o640n5180j50356j61536r5424
8305B7336607q2086j47178j80809j60304j93049k75720k47909r8691o7714k61786
8295B5621361m14420k75188k6126k463j64725k09506j02137r5938k39072k76798
8285B3814988j17222n484r4063j90317j18334j7813n7800j29905q2341k0998r8441
$$ plain form
8351 41931733 41395697 40939599 40379884 39680453 39066594 38683502 38349135 37834446 37222758
8342 37222758 36761130 36459466 36087666 35544629 35000165 34634179 34416456 34208148 33941673
8333 33941673 33623075 33258274 32861545 32481045 32150954 31848214 31533973 31208818 30898790
8324 30898790 30612151 30335247 30058156 29789937 29550772 29345404 29143671 28907883 28644970
8315 28644970 28400334 28194328 28012512 27868785 27805743 27799103 27743923 27593567 27432031 27336607
8305 27336607 27254521 27107343 26926534 26766230 26573181 26297461 26049552 25950861 25883147 25621361
8295 25621361 25206941 24931753 24905627 24903164 24738439 24528933 24426796 24330858 24091786 23814988
8285 23814988 23697766 23692282 23598219 23407902 23289568 23271755 23213955 23084050 23001709 22980711 22882270
8274B2882270k04423j62959o8055j08444j98176j23618M0589L0041j38557j75058
8264B1773610j4380P1399n3183j61047o6760O0187k209j64864k04416j17694o1522
8253B1059121p0902o2120k6737k1934l2909j6178j5706p8639j27547p7772o717
8242B0521960l1069q7660l6885O9423N2277p5487r8211N0950J60930O6060j00006
8231B0492282j18123n311M6415l1070j12304q5816O257N6599K9295k5375m2110
8220B0210739K72O5726R2456N1593j7368l7172L1958J42618J94095J36253L5773
8209B0906943J431L9136M1531m9748j45848j38256n6775q453j0564L799M4816
8198B0628012N3811K3523Q897J4668o475l7703j2441M1947K4901m4014k4560R3562
$$ plain form
8274 22882270 22677847 22514888 22446833 22338389 22140213 22016595 22057184 22087225 21948668 21773610
8264 21773610 21759230 21830629 21777446 21616399 21549639 21609826 21607617 21442753 21238337 21120643 21059121
8253 21059121 20988219 20926099 20899362 20877428 20844519 20828341 20812635 20733996 20606449 20528677 20521960
8242 20521960 20490891 20403231 20366346 20435769 20488046 20412559 20314348 20365298 20526228 20592288 20492282
8231 20492282 20374159 20368848 20415263 20384193 20271889 20186073 20192330 20248929 20278224 20252849 20210739
8220 20210739 20211011 20276737 20369193 20420786 20403418 20366246 20398204 20540822 20734917 20871170 20906943
8209 20906943 20908374 20947510 20989041 20939293 20793445 20655189 20598414 20589961 20579397 20583196 20628012
8198 20628012 20681823 20705346 20714243 20728911 20722436 20684733 20672292 20714239 20739140 20695126 20670566 20764128
8186B0764128J31873K1062m1899R5035K49689J65592o2597j09410Q0666K14991
8176B1509130J15522k7978J2175J62027K18143J77997J78480K16772J71954O7014
8166B2801236P2843K16657K98728J97196Q2643J73890L90956M43893K36890r291
8156B4905641p6899j7616m74l9375l0798K4690K8624j0728K8271J53599K07387
8145B5172322J10925l816q082L1551N992l1872J5746Q2182M2002m9632l6838O1207
8133B5391687Q1624J4353K4489J44337J91581Q1817j1420N7613J68523J52157
8123B6296761P2656R3884J95298K32369J90855J72880J90636J76779J57468K12073
8113B7991659K86991K57347J64819J76153K90794L22368K22031J76690K79824
$$ plain form
8186 20764128 20896001 20917063 20875164 20970199 21219888 21385480 21322883 21213473 21294139 21509130
8176 21509130 21624652 21596674 21608849 21770876 21989019 22167016 22345496 22562268 22734222 22801236
8166 22801236 22874079 23090736 23389464 23586660 23669303 23843193 24234149 24678042 24914932 24905641
8156 24905641 24828742 24811126 24810652 24771277 24740479 24765169 24793793 24783065 24811336 24964935 25172322
8145 25172322 25283247 25279431 25271349 25302900 25308892 25277020 25292766 25374948 25416950 25367318 25330480 25391687
8133 25391687 25473311 25487664 25512153 25656490 25848071 25929888 25918468 25976081 26144604 26296761
8123 26296761 26369417 26463301 26658599 26890968 27081823 27254703 27445339 27622118 27779586 27991659
8113 27991659 28278650 28535997 28700816 28876969 29167763 29490131 29712162 29888852 30168676
8104C0168676L40583J92038n396R878K01403L03777K25337J38277J70463K36634
8094C1981670K32685K04902K27037K52848K08796J35808J19470J41951J21490
8085C3626657O6158P1657J63183K41623K19942J37485R2115J12484J53062J81293
8075C5065659K04797K21104K05473J65791J56480K05153K65261K81666K70601
8066C7041985K84628L24199L46717L49258L66606L85889L53540K94552L23637
8057D0071011M69013N76593N00989L32198K92574M26723N50534N37591M91457
8048D4248683N40459O07814N46716M16730M25365O02549P31986O66602N37122
8039D9324026N32598O15702O19245N34608N09180N84844O40551O24694O49746
$$ plain form
8104 30168676 30509259 30701297 30695901 30705779 30907182 31210959 31436296 31574573 31745036 31981670
8094 31981670 32214355 32419257 32646294 32899142 33107938 33243746 33363216 33505167 33626657
8085 33626657 33692815 33764472 33927655 34169278 34389220 34526705 34618820 34731304 34884366 35065659
8075 35065659 35270456 35491560 35697033 35862824 36019304 36224457 36489718 36771384 37041985
8066 37041985 37326613 37650812 37997529 38346787 38713393 39099282 39452822 39747374 40071011
8057 40071011 40540024 41116617 41617606 41949804 42242378 42669101 43219635 43757226 44248683
8048 44248683 44789142 45396956 45943672 46360402 46785767 47388316 48120302 48786904 49324026
8039 49324026 49856624 50472326 51091571 51626179 52135359 52720203 53360754 53985448 54635194
8030E4635194P71837Q52803P77292O63517O78560P43814O41646L79327K13675
8021F0357665K74395L79212L27061J98486K10275L84426N33025N28462M41702
8012F3634709M14563N02183O48487P42351P05032N85094N39431O47787P86312
8003F9205949P82426O60173O06116P00150Q21239Q49307Q22724Q30708Q69368
7994G6148160Q96299R34797J016103J081748J057975R94478J018352J156021J298888
7985H5602821J356858J357354J363754J373187J346099J286975J239353J226289
7977I6152690J245648J307543J419333J533633J577136J561104J600886J764854
7969A08162827J955916K038346K050645K156481K373441K521000K518393K557437
$$ plain form
8030 54635194 55407031 56259834 57037126 57700643 58379203 59123017 59764663 60143990 60357665
8021 60357665 60632060 61011272 61338333 61536819 61747094 62131520 62664545 63193007 63634709
8012 63634709 64049272 64551455 65199942 65942293 66647325 67232419 67771850 68419637 69205949
8003 69205949 69988375 70648548 71254664 71954814 72776053 73625360 74448084 75278792 76148160
7994 76148160 77044459 77979256 78995359 80077107 81135082 82129560 83147912 84303933 85602821
7985 85602821 86959679 88317033 89680787 91053974 92400073 93687048 94926401 96152690
7977 96152690 97398338 98705881 100125214 101658847 103235983 104797087 106397973 108162827
7969 108162827 110118743 112157089 114207734 116364215 118737656 121258656 123777049 126334486
7961A26334486K818513L160581L318655L313788L394746L612066L763413L795215
7953A53511463L919227M206112M396409M325018M228725M345610M471191M270486
7945A87674241L829755L480992L204229K670413J850563J098971N58189m3840
7937B04323513q36011j490641j731098j775959j958812k220631k343408k432258
7929A89534695k747308l208076l474034l442760l294642l091833k710884k177878
7921A65387280j707484j353779r44469m28872J5509K97374N13713O26883L65029
7912A62771184l68731j251958j912183k325106k651766k895794k960101k882791
7904A45522754k776358k643234k457985k320006k313174k312551k146287j869885
$$ plain form
7961 126334486 129152999 132313580 135632235 138946023 142340769 145952835 149716248 153511463
7953 153511463 157430690 161636802 166033211 170358229 174586954 178932564 183403755 187674241
7945 187674241 191503996 194984988 198189217 200859630 202710193 203809164 204367353 204323513
7937 204323513 203487502 201996861 200265763 198489804 196530992 194310361 191966953 189534695
7929 189534695 186787387 183579311 180105277 176662517 173367875 170276042 167565158 165387280
7921 165387280 163679796 162326017 161381548 160952676 160968185 161265559 161779272 162406155 162771184
7912 162771184 162402453 161150495 159238312 156913206 154261440 151365646 148405545 145522754
7904 145522754 142746396 140103162 137645177 135325171 133011997 130699446 128553159 126683274
7896A26683274j667859j556883j411968j232804j142081j133452j058399q88407
7888A16591421p74119p90563q13031p21717n73800m83519m46594l73093k26073
7879A11388912o1733L6001L7932Q538M9155J85653L63437N63561Q11820J043806
7869A14427082J145449J219854J578673K285846K966285L344248L685221M251229
7861A34903887M536543L695192J758933k14619j413128k104605k895247l731315
7853A34535641m153417m131135m029935l948860l665708l164393k705254k375520
7845A06361419k017570j625248j398387j361067j311850j200314j169483j170849
7837I5106651r49897n18573k28239k19714k05544R693K08677K20986K96656O70609
$$ plain form
7896 126683274 125015415 123458532 122046564 120813760 119671679 118538227 117479828 116591421
7888 116591421 115817302 115026739 114213708 113491991 112918191 112434672 111988078 111614985 111388912
7879 111388912 111327179 111363180 111401112 111409650 111458805 111644458 112007895 112571456 113383276 114427082
7869 114427082 115572531 116792385 118371058 120656904 123623189 126967437 130652658 134903887
7861 134903887 139440430 143135622 144894555 144679936 143266808 141162203 138266956 134535641
7853 134535641 130382224 126251089 122221154 118272294 114606586 111442193 108736939 106361419
7845 106361419 104343849 102718601 101320214 99959147 98647297 97446983 96277500 95106651
7837 95106651 94156754 93638181 93409942 93190228 92984684 92994377 93203054 93424040 93720696 94391305
7827I4391305J107865J302506J441786J897553K574670L099693L516870M163354
7819A13495602M797090M485033K681230K8669k230650l388139l562863l163584
7811A13142388k466170j650608r09379m19789l15133o51793j294345j911876k252099
7802A01271196k386448k546346k765954k853137k692854k397379k124454j900252
7794H1604372j678088j446337j208946r54201p07676n38733m58508l82878k46573
7785G3982432q0794O9951K24780M05889N96345Q27388J197033J705248K198557
7776H1126829K616463L124512L727108L850307K732622L76214k211250l953512
7768I1389293m656484m804156m701887m260470l517253k846493k494657k272334
$$ plain form
7827 94391305 95499170 96801676 98243462 100141015 102715685 105815378 109332248 113495602
7819 113495602 118292692 122777725 125458955 125487624 123256974 119868835 116305972 113142388
7811 113142388 110676218 109025610 108116231 107696442 107381309 106729516 105435171 103523295 101271196
7802 101271196 98884748 96338402 93572448 90719311 88026457 85629078 83504624 81604372
7794 81604372 79926284 78479947 77271001 76316800 75609124 75070391 74611883 74229005 73982432
7785 73982432 73901638 73971589 74196369 74602258 75198603 76025991 77223024 78928272 81126829
7776 81126829 83743292 86867804 90594912 94445219 97177841 97554055 95342805 91389293
7768 91389293 86732809 81928653 77226766 72966296 69449043 66602550 64107893 61835559
7760F1835559j924413j535443j327230j268107j164389j011275r70649j054617
7752E1579436j090029r98482q91370q56072q32718p50908o39926n54791n11198
7743D4453942n21568n81317o07945n24358m16429m57133o38954p42622o39241
7734C9324375m68767m19687m69250m70885l93981l29408l16967l08902k83807
7725C5862721k78342l03444l18174k97668k65963k54792k69352k91676k94405
7716C3288905k68189k44352k51587k51275j90601j27626j85349l32734l55074
7707C1082118j56649L8433l4268k83372l66500j78388K162p3569k71909k91126
7697B9466932r3703O6823J0059j58922k38561j99155j71080k28193k92329k67167
$$ plain form
7760 61835559 59911146 58375703 57048473 55780366 54615977 53604702 52634053 51579436
7752 51579436 50489407 49490925 48599555 47743483 46910765 46159857 45519931 44965140 44453942
7743 44453942 43932374 43351057 42743112 42218754 41802325 41345192 40706238 39963616 39324375
7734 39324375 38855608 38435921 37966671 37495786 37101805 36772397 36455430 36146528 35862721
7725 35862721 35584379 35280935 34962761 34665093 34399130 34144338 33874986 33583310 33288905
7716 33288905 33020716 32776364 32524777 32273502 32082901 31955275 31769926 31437192 31082118
7707 31082118 30925469 30963902 30929634 30646262 30279762 30101374 30103536 30029967 29758058 29466932
7697 29466932 29373229 29440052 29450111 29291189 29052628 28853473 28682393 28454200 28161871 27894704
7687B7894704j83777j48225j81584j97606j47226r9191j29998k02376k23751j78634
7677B6202336j25477r6270q4126j05542j78086k43638k16382j18662o8545j07943
7667B4857665j45542j11461o4834q2040j30395j38972j21673j33299j59187j52376
7657B3617886j39147j74777k18265j75180o7019k8786j04698j71238j29152n8505
7647B2351119q1481j59308j59152p6534m1716j03162j51718j05782l9969m8948
7637B1383349r4347r6625r1026j53777k27616j80127k5990O8206K5639m6484n2633
7626B0508569m5269q3426j01795m1496J0725m0816j20923j01034k3040k9049j14583
7615A9817863j40159p1513j6592j6603L291M3995k793j35247j87818r4722j4778
$$ plain form
7687 27894704 27710927 27562702 27381118 27183512 27036286 26937095 26807097 26604721 26380970 26202336
7677 26202336 26076859 25980589 25896463 25790921 25612835 25369197 25152815 25034153 24965608 24857665
7667 24857665 24712123 24600662 24535828 24453788 24323393 24184421 24062748 23929449 23770262 23617886
7657 23617886 23478739 23303962 23085697 22910517 22843498 22814712 22710014 22538776 22409624 22351119
7647 22351119 22269638 22110330 21951178 21874644 21832928 21729766 21578048 21472266 21432297 21383349
7637 21383349 21289002 21192377 21101351 20947574 20719958 20539831 20513841 20582047 20607686 20561202 20508569
7626 20508569 20463300 20379874 20278079 20236583 20247308 20206492 20085569 19984535 19961495 19932446 19817863
7615 19817863 19677704 19606191 19589599 19572996 19576287 19620282 19617489 19482242 19294424 19199702 19184924
7604A9184924o5258j17108k6427R3305M5622j17508j75223q5580j5894m5503p3722
7593A8601628m8372o2140j52601k01834j35609o1447r0002j48609j06232R216
7583A7603998N9704J2012k9847K967N0203K4145o6596j31873j10081l4614J4850
7572A7394868J6322K6403P6415R8815K5410p8910q4401R053O6205K7351o267M2981
7560A7614245Q9965L6120m7651k5172Q0355J15301L2487m2085l163R0068J16981
7549A8057451O1555J0096K2894O7858Q0765N6646N6517J18807J91120J92039J31326
7538A9047074J03650J48542J93509J75117J36576J41905J67595J61881J47271
7529B0423120J69984K04357K11260K35994L26822M06895L73522K91111L14971
$$ plain form
7604 19184924 19119666 19002558 18976131 19069436 19115058 18997550 18822327 18736747 18720853 18675350 18601628
7593 18601628 18553256 18491116 18338515 18136681 18001072 17939625 17849623 17701014 17594782 17603998
7583 17603998 17663702 17675714 17645867 17648834 17699037 17723182 17656586 17524713 17414632 17380018 17394868
7572 17394868 17411190 17437593 17514008 17612823 17638233 17559323 17474922 17483975 17550180 17577531 17571264 17614245
7560 17614245 17704210 17740330 17692679 17667507 17747862 17863163 17895650 17853565 17850402 17940470 18057451
7549 18057451 18119006 18129102 18151996 18219854 18300619 18357265 18413782 18532589 18723709 18915748 19047074
7538 19047074 19150724 19299266 19492775 19667892 19804468 19946373 20113968 20275849 20423120
7529 20423120 20593104 20797461 21008721 21244715 21571537 21978432 22351954 22643065 22958036
7520B2958036M28984M47129L08658J78512J78588K01704J08802m3701j14378r3787
7510B4558547o5536m6998j2393R362L586N5379K12007L37800K83481J39473J20528
7499B5595236K30148K57109J14392l8386o2748k7827m3571q4417q5023o4339m4586
7488B5745988K4159J47952K17599J70024J12393J64234K74142L16831K79642K25769
7478B7678733J65320J02860J23958K75220M30347M43864L80782M18883N70967
7469C0590934O92721P33726P75221Q23358P76502O24837M81933L77942K20781
7460C6097955J4334r5203o9615o3156j47422j60901J7023K30640K72923J99299
7450C6295877K18952L80840N58570O62853O87456O16524M60292L18520K49769
$$ plain form
7520 22958036 23387020 23834149 24142807 24321319 24499907 24701611 24810413 24766712 24652334 24558547
7510 24558547 24493011 24446013 24433620 24442982 24446568 24501947 24713954 25051754 25335235 25474708 25595236
7499 25595236 25825384 26082493 26196885 26158499 26095751 26067924 26024353 25939936 25854913 25790574 25745988
7488 25745988 25770147 25918099 26135698 26305722 26418115 26582349 26856491 27173322 27452964 27678733
7478 27678733 27844053 27946913 28070871 28346091 28776438 29220302 29601084 30019967 30590934
7469 30590934 31283655 32017381 32792602 33615960 34392462 35017299 35499232 35877174 36097955
7460 36097955 36112289 36017086 35947471 35884315 35736893 35575992 35593015 35823655 36096578 36295877
7450 36295877 36514829 36895669 37454239 38117092 38804548 39421072 39881364 40199884 40449653
7441D0449653J60678q612j01470L4963K48265K68382J34809J33774L20731M33189
7431D2074362L37151K35682L04379M10169L73611K69299K56898L04604K96579
7422D4862734K65285L04094L66590L54701L09172L24363L65852L56456L49483
7413D7858730M24920N06052M84861M37924M86128N24946L73052J46122J65663
7404E1408398M63572O91069O21917M59143M82931O43968P22767P08072P66061
7395E6967898R29987J057814J073224J056102J083734J132058J158951J169091
7387F5628859J164511J116060J013710Q87909P65428O47112N27677L92186K00232
7378G2343684p3830l81644o26279p56731q08840q50061r08510r58777r57910q87828
$$ plain form
7441 40449653 40610331 40601719 40500249 40535212 40783477 41051859 41186668 41320442 41641173 42074362
7431 42074362 42411513 42647195 42951574 43361743 43735354 44004653 44261551 44566155 44862734
7422 44862734 45128019 45432113 45798703 46153404 46462576 46786939 47152791 47509247 47858730
7413 47858730 48283650 48789702 49274563 49712487 50198615 50723561 51096613 51242735 51408398
7404 51408398 51871970 52563039 53184956 53644099 54127030 54770998 55493765 56201837 56967898
7395 56967898 57897885 58955699 60028923 61085025 62168759 63300817 64459768 65628859
7387 65628859 66793370 67909430 68923140 69811049 70576477 71223589 71751266 72143452 72343684
7378 72343684 72269854 71888210 71261931 70505200 69696360 68846299 67937789 66979012 66021102 65133274
7368F5133274p65317o13743m43128k74659j54920r9761m7022O7433J97740K37852
7358F3237749J90977J89931L11771M69392N48184N61597N88996O33280O43077
7349F7374954O30597O58813P24761P51563P05654O46820O39883O66409O49007
7340G3448461N43333L93249K86773K40561J52028p0707l44773m87412m81400n29072
7330G3151041p55173r90488j004395q60471q43514j056127j286780j316188j180195
7321F3857710j048507r82859r27143q45983p54095o51495n31690m38605m28833
7312E7248500m69639m44849k96313j19601o8017j61317k41656j62135J6152R4157
7302E5395282k924j39061j81240j80852k48470l53545l93666l97022m81648o30622
$$ plain form
7368 65133274 64367957 63754214 63311086 63036427 62881507 62781746 62734724 62802157 62999897 63237749
7358 63237749 63428726 63618657 63930428 64399820 64948004 65509601 66098597 66731877 67374954
7349 67374954 68005551 68664364 69389125 70140688 70846342 71493162 72133045 72799454 73448461
7340 73448461 73991794 74385043 74671816 74912377 75064405 74993698 74648925 74161513 73680113 73151041
7330 73151041 72395868 71405380 70400985 69540514 68697000 67640873 66354093 65037905 63857710
7321 63857710 62809203 61826344 60899201 60053218 59299123 58647628 58115938 57677333 57248500
7312 57248500 56778861 56334012 56037699 55918098 55850081 55688764 55447108 55284973 55301125 55395282
7302 55395282 55392358 55253297 55072057 54891205 54642735 54289190 53895524 53498502 53016854 52386232
7292E2386232o90265o24234n99757p46047r64010j072404j041704r82554r73137
7283D4692120r93896r93189r44660q62838p99820p93127q04365p70459p20213
7274C7009553p43560q23234q20031o84509n58794n73663o53655o44622n50487
7265C0956998n03257n44461n75523n17740m09266l33187l28669l78003m23229
7256B6943663m03746l24892k67003k85073l39386l69715l80761l95689l90143
7247B3787255l47119l16379l38864l72655l74858l84621m30149m34825l36188
7238B0451597k24401k23866k98851l24590k94911k96106l22833l00584k56902
7229A7908553k75735l03756k17558q2044j02785k84393l84189k83859j61273j75672
$$ plain form
7292 52386232 51695967 51071733 50471976 49725929 48761919 47689515 46647811 45665257 44692120
7283 44692120 43698224 42705035 41760375 40897537 40097717 39304590 38500225 37729766 37009553
7274 37009553 36265993 35442759 34622728 33938219 33379425 32805762 32152107 31507485 30956998
7265 30956998 30453741 29909280 29333757 28816017 28406751 28073564 27744895 27366892 26943663
7256 26943663 26539917 26215025 25948022 25662949 25323563 24953848 24573087 24177398 23787255
7247 23787255 23440136 23123757 22784893 22412238 22037380 21652759 21222610 20787785 20451597
7238 20451597 20227196 20003330 19704479 19379889 19084978 18788872 18466039 18165455 17908553
7229 17908553 17632818 17329062 17111504 17029460 16926675 16642282 16258093 15974234 15812961 15637289
7219A5637289k23220j71855j20724k08964l32641k94500j31555n8028j37433k23824
7209A3734545k05926j27340p2509q2530j67531k71741k64020j00948M9872N340
7199A2497212j61658k22095j25839l9093n7770r5639q5175q2475j13731j08362
7189A1405375o0779p7692j73800j98910q4385Q113o8316k01805k00833r9060p6135
7178A0171773j49602j71549j13280j20833k35460k71595r8731J09404Q3031j56863
7168I046295l06339j85794K6996N6117j03143k17605j62893o1514n0629q4760
7158G956731o8852m6307r9096j54664q3667N0291M7655j06752j92844r2187K7650
7147G237958j2757j23628j11791Q34K8870p0218j45738j04643l3302l2658p4659
$$ plain form
7219 15637289 15414069 15242214 15121490 14912526 14579885 14285385 14153830 14095802 13958369 13734545
7209 13734545 13528619 13401279 13328770 13246240 13078709 12806968 12542948 12442000 12491872 12497212
7199 12497212 12335554 12113459 11987620 11948527 11890757 11795118 11709943 11627468 11513737 11405375
7189 11405375 11344596 11266904 11093104 10894194 10809809 10817922 10749606 10547801 10346968 10247908 10171773
7178 10171773 10022171 9850622 9737342 9616509 9381049 9109454 9010723 9120127 9203158 9046295
7168 9046295 8739956 8554162 8581158 8637275 8534132 8316527 8153634 8092120 8041491 7956731
7158 7956731 7887879 7841572 7742476 7587812 7504145 7554436 7602091 7495339 7302495 7210308 7237958
7147 7237958 7225201 7101573 6989782 6990616 7019486 6949268 6803530 6698887 6665585 6632927 6558268
7136F558268q2002n0658l1726n2288r6897j29213j15554o1283j9045k3537m2285
7125E853780l9257m4102q5142j04044m2288K7395j1726j21273j48242p0844l4213
7114E180044r7739j26668k8881O6809J0685j19186j40073n1797j5269q0735j22315
7103D474875n6771L3160M0307k6211r5136j28819j14101m5295L1304L4689l5735
7092D112267p7622l5049Q798l5347j10441r7605o455L9169n392m9085k5940L286
7080C720584k9706p6565n8041o416j0766n5715m2659K6824K8643p3146j30349
7069C292688k9724J03655P4347q0287j40398m2070L9517r241o6109j2974M2170
7058C171574l4922j31919n4957J17150J16076q4214j98292o6079J02239O5761
$$ plain form
7136 6558268 6476266 6425608 6393882 6341594 6244697 6115484 5999930 5938647 5919602 5896065 5853780
7125 5853780 5814523 5770421 5685279 5581235 5538947 5566342 5554616 5433343 5285101 5214257 5180044
7114 5180044 5082305 4955637 4926756 4993565 5004250 4885064 4744991 4693194 4677925 4597190 4474875
7103 4474875 4418104 4451264 4491571 4465360 4370224 4241405 4127304 4082009 4113313 4148002 4112267
7092 4112267 4034645 3999596 4008394 3973047 3862606 3765001 3758546 3797715 3792323 3743238 3717298 3720584
7080 3720584 3690878 3614313 3556272 3549856 3539090 3483375 3440716 3467540 3496183 3423037 3292688
7069 3292688 3262964 3366619 3440966 3360679 3220281 3178211 3217728 3208487 3142378 3129404 3171574
7058 3171574 3136652 3004733 2949776 3066926 3183002 3098788 2900496 2834417 2936656 3002417
7048C002417q2112r7787J8414O1186k1358o3871J4601P3832q464j33370j28108
7037B635380O234J04717N4448p9075j38638n6182O2715N7998p1564j43059l7504
7026B395470J11874J01526l8608r7313j5105M1223k7462r6739n0749K3260J0328
7015B357705k7493J0265N5005o587j01148p0890N3457R2682O077o4663l8622Q349
7003B274137Q870j1696l9477q9912j00744J0051J51243J26775n0969j36773k8272
6992B113233O7739j7097j30342o6856P7644P7244l9436o1123K6095K9217q9790
6981A986528j32672l957J23105Q5126l4243p4551m0133k7754l7552p301M3698
6970A880294M4251j40k4730k1105l2661n4569l4865K5341N5735J7075m3072n7814
$$ plain form
7048 3002417 2920305 2822518 2840932 2902118 2880760 2816889 2831490 2905322 2896858 2763488 2635380
7037 2635380 2641614 2746331 2800779 2721704 2583066 2526884 2589599 2647597 2576033 2432974 2395470
7026 2395470 2507344 2608870 2570262 2472949 2457844 2499067 2471605 2374866 2324117 2347377 2357705
7015 2357705 2330212 2340477 2395482 2388895 2287747 2216857 2270314 2362996 2369073 2304410 2265788 2274137
7003 2274137 2283007 2271311 2231834 2141922 2041178 2051229 2202472 2329247 2278278 2141505 2113233
6992 2113233 2180972 2163875 2033533 1966677 2044321 2121565 2082129 2021006 2047101 2076318 1986528
6981 1986528 1853856 1849899 1973004 2058130 2023887 1949336 1909203 1881449 1843897 1836596 1880294
6970 1880294 1924545 1924405 1899675 1878570 1845909 1791340 1756475 1781816 1837551 1854626 1811554 1753740
6958A753740k2367J8551L9118N3342O6564M2614m1124j19976r1378L6639J18671
6947A854394N3363p2446j05113l4300K6795K9445K3254J7934l6974j14305j02124
6936A539923J4255R7922N3952m2905q1538n6670o574O4836J18449O5859o7256
6925A700253r9189M7936J75321P2307j48001j91079p913J45891Q7843o1596r0663
6914A631110J9896J14065O9552q0507j89396j38156K8600J31376P1816l8686n1204
6903A568466J381n392n2596k2422N8249L6119r3757j48875m6475P3972Q7330M6750
6891A502750K4592j5411p8181o0306N5226J07349P620r2891n3380J7510k8270
6880A386608r8327l1819R0380Q2704m696J4683R3813J7935j71949j80783M7568
$$ plain form
6958 1753740 1731373 1749924 1789042 1842384 1908948 1951562 1910438 1790462 1699084 1735723 1854394
6947 1854394 1907757 1835311 1730198 1695898 1722693 1752138 1775392 1793326 1756352 1642047 1539923
6936 1539923 1554178 1652100 1706052 1663147 1581609 1524939 1518365 1583201 1701650 1767509 1700253
6925 1700253 1601064 1649000 1824321 1896628 1748627 1557548 1549635 1695526 1783369 1721773 1631110
6914 1631110 1651006 1765071 1834623 1754116 1564720 1426564 1455164 1586540 1658356 1619670 1568466
6903 1568466 1569847 1564455 1511859 1489437 1547686 1583805 1490048 1341173 1294698 1368670 1456000 1502750
6891 1502750 1527342 1511931 1433750 1373444 1428670 1536019 1543639 1450748 1397368 1414878 1386608
6880 1386608 1288281 1256462 1346842 1429546 1424850 1439533 1533346 1551281 1379332 1198549 1246117
6869A246117J88631L4813j76826j42949N5484J33405M3789l3403k4578j5008k8368
6858A281107k684L2733j8768j13748r3030N4924J45509O8931n8420q7688l6608
6847A172258n072j2146j7113j2902m631L1645Q3743O9465m0616j33111q9301L7955
6835A080174R5534M2286k8002n3641o4267o9559k6765M3748M2934m0440p0408
6824I51594L2527J35796P3268r6659j65607p2521L5411M2073J448l882N916p289
6812I32075q709K3280K4912l7285p1340L244J00867Q3534k6601q7468n4841j6358
6800H65310k1954k5721o631j0134m2044m3300j437K6858L0318N8441R3694M6789
6788I70189p1535j19504m0345L3056j0328p7737l1327Q1931J07574J6519q0592
$$ plain form
6869 1246117 1434748 1469561 1292735 1149786 1205270 1338675 1382464 1349061 1324483 1309475 1281107
6858 1281107 1278423 1311156 1292388 1178640 1085610 1140534 1286043 1354974 1296554 1208866 1172258
6847 1172258 1167186 1155040 1137927 1125025 1120394 1152039 1235782 1305247 1264631 1131520 1042219 1080174
6835 1080174 1175708 1217994 1189992 1136351 1072084 1002525 975760 1019508 1062442 1022002 951594
6824 951594 984121 1119917 1193185 1096526 930919 858398 893809 935882 937330 933448 939364 932075
6812 932075 923366 946646 971558 934273 862933 866177 967044 1050578 1023977 936509 881668 865310
6800 865310 843356 817635 811004 800870 758826 715526 714089 740947 771265 829706 923400 970189
6788 970189 898654 779150 738805 771861 761533 683796 652469 734400 841974 858493 777901
6777G77901j00231m5255M9101J15961O9832o4807j21019j9152P4269o239j28107
6766F02254n4766J36854J38810q4902k10242o0206J22068Q1686n4451m0787O1085
6755F37403K9385r2655o0492J31483K05135L3624j65581j68737m1654L1061K3013
6744E61985J7126J7427k2407o3320l0367M1423M6762j8683m8455N086O0053L9446
6732F06076j1829o963L9450K9377o1986j25038n7978P5008J07496n441j14919
6721D73253p8443M3122P8191j0630q8640n4542L1975O5845M0509J0699j5306o2923
6709D33110j08011q7097R991J09858J28314N2680m7522q4754l9155K2529L3206
6698D23149J1182J4721L4481J0650m7514o0371j6863l414m8441n7391K0569P9963
$$ plain form
6777 777901 677670 632415 681516 797477 867309 802502 681483 662331 736600 730361 602254
6766 602254 547488 684342 823152 738250 528008 467802 589870 671556 617105 576318 637403
6755 637403 666788 574133 513641 645124 850259 883883 718302 549565 507911 538972 561985
6744 561985 579111 596538 574131 510811 480444 521867 568629 549946 501491 506577 566630 606076
6732 606076 594247 587284 626734 656111 594125 469087 411109 486117 593613 588172 473253
6721 473253 394810 437932 516123 505493 416853 362311 394286 460131 500640 511339 496033 433110
6709 433110 325099 238002 247993 357851 486165 538845 491323 406569 367414 389943 423149
6698 423149 434331 449052 483533 494183 446669 386298 369435 366021 317580 260189 280758 360721
6686C60721K3863o3618m8063L6237N6482P147j0665N332l1310r1121m2761J00855
6674C03099J59328O8782j5064J1521K9796o6473j54430q1147O7469J00537K1344
6663D44762j7857Q491j4445j05546j42899o8203L4694Q5897Q8211M9270l1292
6652C31083q6713l8850N8073P0277j0890o4218m2118j4570k472M5898Q9839J7932
6640C53271j17184j14992L9307J00870m6769j77058p8359J03303J17479J1169
6630A91037k906O6566M4271n8428o4019L0665M4591m8618p1091K6150O8162k5179
6618B01201r3625k3050O3217L5219l1669k3576J4709P79k4025j546J5097k1048
6606A11683l9485J0327M8838K4046K5890R6834R6105o2109j95445j04697R0863
$$ plain form
6686 360721 384584 320966 272903 309140 365622 372769 362104 367436 336126 245005 202244 303099
6674 303099 462427 531209 516145 527666 557462 490989 336559 255412 322881 423418 444762
6663 444762 426905 435396 420951 315405 172506 104303 138997 224894 313105 362375 331083
6652 331083 244370 205520 263593 333870 322980 258762 216644 202074 199602 245500 335339 353271
6640 353271 236087 121095 160402 261272 214503 37445 -40914 62389 179868 191037
6630 191037 188131 254697 298968 240540 176521 207186 251777 203159 132068 158218 226380 201201
6618 201201 107576 84526 147743 182962 151293 127717 142426 143205 119180 117634 132731 111683
6606 111683 72198 82525 131363 155409 181299 278133 374238 312129 116684 11987 102850
6595A02850J21720j9835j01662l4129L9302K4533p985j4324m6139q6166l5226
6584e7061Q0465R7577j8551r2496q076J18797J30924L7176o2097j14054r4305
6573A8299J0591J21258J05753k3169r7872n2387j6531o6506q0188K5815J11035
6562E6098M1607o7103m7462K8061r729j04044n9111J08949J76808O3957o7439
6551A20592q6995m6763j5738K5943O6157K8617o2056o1941N7858J28238L7151
6540A91063r0912r4938j5384J3328q760P354M6360J7698n7896o0214K8178Q1053
6528E6930K3937n4466m3871L0320O5444L4297k472q544j5010m3236n3458j0850
6516b0979M0531L1070k2183k8403L7793Q6693M8573j3392l135M9787L6228n1866
$$ plain form
6595 102850 224570 204735 103073 68944 108246 132779 124794 110470 64331 -21835 -57061
6584 -57061 23404 120981 102430 9934 1858 120655 251579 288755 226658 112604 18299
6573 18299 28890 150148 255901 232732 134860 82473 65942 -564 -80752 -54937 56098
6562 56098 97705 30602 -16860 11201 1472 -102572 -161683 -52734 124074 188031 120592
6551 120592 33597 -13166 -28904 -2961 63196 91813 29757 -32184 25674 153912 191063
6540 191063 100151 5213 -10171 3157 -5603 1751 48111 65809 7913 -52301 -24123 56930
6528 56930 80867 26401 -17470 12850 78294 112591 110119 101575 86565 43329 -10129 -20979
6516 -20979 19552 50622 28439 36 37829 124522 173095 159703 156568 206355 242583 190717
6504A90717j02451n4838J8064L0942n168l6961m6447k8123K9844Q9835P1900k2512
6492A34802p7033k6801K5336l6619j39036j07025O7259J87492J15408m5908r8544
6481f69o736P7646K6602j03251j53219o7607M5553P2054M1332M9146Q0634L4460
6469I5945p4711q9672M3798J47357N3765j29358j67231m2921L9643j8075q5625
6458b27085m9319J3243K331k1790L6018J13227Q0249l9177r2316k1705O9631Q0770
6446e5923K5463l4598o8529o2158j1301M1617L9401K678J0904O4271N9801m2288
6434c0662j24588p1183N3934R4565K1826n0343m8162j4628M291L0277P1397P3873
6422A0597J4071l9827k1049L9290O2300J7084p2085j52256j44145o147J57550
$$ plain form
6504 190717 88266 33428 51492 82434 77266 40305 -6142 -34265 -4421 85414 157314 134802
6492 134802 57769 30968 56304 19685 -119351 -226376 -159117 28375 143783 97875 -669
6481 -669 -7405 70241 96843 -6408 -159627 -227234 -181681 -109627 -68295 -19149 61485 95945
6469 95945 21234 -68438 -24640 122717 176482 47124 -120107 -163028 -123385 -141460 -227085
6458 -227085 -276404 -263161 -260830 -282620 -246602 -133375 -53126 -92303 -184619 -206324 -136693 -55923
6446 -55923 -30460 -65058 -133587 -195745 -207046 -165429 -126028 -123350 -112446 -48175 11626 -30662
6434 -30662 -155250 -226433 -172499 -77934 -56108 -106451 -154613 -169241 -164950 -134673 -63276 10597
6422 10597 24668 -15159 -36208 3082 65382 82466 10381 -141875 -286020 -292167 -134617
6411a34617J62711o214j34537p0956N1340M2156l2383J0671J17822P3856r8899
6400a9050j36569K0373J03937l0035j43043j6763J62720J07709r2939j28588K8856
6389a43392J18996L8065m5150k8230j7658p1332p7208J3988P3727K5273k0801
6378a33722K1236N7044M77n6903j1439O4481N2723j3512l3106j3461j4693q191
6366h9066N6317J13358O4391m8871r5220m7715O14n405k5594j8062N161J6772
6354g3320L280l2268n4069j9123M5190N6840J3410J2182P4729P7464l9498j27006
6342f2189m2717J01278R7971k6808o4636L1453Q3912n776j05802p7789K2714O3688
6330A5299K4230k8933n5891n1991j4843L0651L4396k896j4482K9901O3543J0122
$$ plain form
6411 -134617 28094 21880 -112657 -183613 -132273 -90117 -122500 -111829 5993 79849 -19050
6400 -19050 -155619 -135246 -31309 -61344 -204387 -221150 -58430 49279 -43660 -172248 -143392
6389 -143392 -24396 13669 -31481 -59711 -77369 -148701 -225909 -211921 -138194 -112921 -133722
6378 -133722 -112486 -55442 -54965 -111868 -123307 -58826 -6103 -19615 -52721 -66182 -80875 -89066
6366 -89066 -32749 80609 145000 96129 909 -46806 -46192 -51597 -77191 -95253 -90092 -73320
6354 -73320 -70040 -102308 -156377 -175500 -130310 -73470 -60060 -47878 26851 104315 64817 -62189
6342 -62189 -104906 -3628 94343 67535 2899 34352 118264 112488 6686 -71103 -48389 15299
6330 15299 39529 10596 -45295 -97286 -112129 -81478 -47082 -49978 -64460 -34559 28984 39106
6318C9106j05467j67673q2525J10672K29893J13961j55127k80583j01576J71628
6308b27691K20413M2746q1134j4831P6726L2899o6392p0677J2165P6197P6635
6297G7056K5871n6911j07337m4337Q2157R9267m1066j53721p2581J08095J73480
6286H9973P4244n7990j10127q1107k3709J0822N768Q941P0758J30603P4322o5301
6274A27197j14342j9232O7279M0323o089J0822P775o4312p7472L1794Q9113k7663
6262F5193j32139k8288J31273R9799k6926L327J14898L1134j85030j79648Q4082
6251b2325K26631O1514j28363q5454M7198N6422J1820M0062M8965n4631j24426
6240G7413k2680J06042P1661m3000n7345n610j4191l5589K6457P9686M690q8031
$$ plain form
6318 39106 -66361 -234034 -316559 -205887 24006 137967 -17160 -297743 -399319 -227691
6308 -227691 -7278 35468 -45666 -60497 16229 49128 -17264 -87941 -75776 421 77056
6297 77056 102927 46016 -61321 -105658 -23501 75766 34700 -119021 -191602 -83507 89973
6286 89973 164217 106227 -3900 -85007 -108716 -97894 -92126 -83185 -12427 118176 192498 127197
6274 127197 12855 -6377 60902 101225 95136 105958 113733 49421 -28051 3743 92856 65193
6262 65193 -66946 -95234 36039 135838 108912 112239 227137 258271 73241 -106407 -22325
6251 -22325 204306 265820 137457 52003 99201 155623 167443 207505 256470 201839 77413
6240 77413 54733 160775 232436 189436 132091 126481 112290 76701 103158 182844 187534 99503
6228I9503m0402N1419J0602p8591k4502R3553N7055o6981k2756J50652J48738
6217C78290n8129j39246L8389J76964N2451j16444n1331J33253J47674j7204j39772
6206D04895j27507o2767J0082J01999J49585Q1180k9279n2796o804l183m2638
6195D22767k9218M2013P7043N0115K8851L4894J8435k1148j7407M1264Q1423N9926
6183G88958J8514K522K846k589j3030k2193k2538K793M7899O6794L7823R737K5540
6170I43076M8891L9344M1037R6063J28091M6015p3495o4999O7683J39303O0711
6159A471720l7722k7478K9398J7652l5530l4808P447J2596p938J8505P6946Q8106
6147A578894O4075R1515J50990J11950m1249j29461k2401J56660J96132Q4928
$$ plain form
6228 99503 59101 110520 121122 42531 18029 111582 168637 101656 78900 229552 378290
6217 378290 320161 180915 219304 396268 448719 332275 280944 414197 561871 544667 404895
6206 404895 277388 214621 224703 326702 476287 557467 528188 475392 468588 465405 422767
6195 422767 393549 435562 512605 562720 591571 626465 644900 623752 606345 647609 729032 788958
6183 788958 807472 809994 812840 810251 797221 775028 752490 755283 803182 869976 907799 917536 943076
6170 943076 991967 1031311 1072348 1168411 1296502 1342517 1269022 1204023 1271706 1411009 1471720
6159 1471720 1433998 1406520 1435918 1453570 1418040 1383232 1390679 1403275 1395337 1413842 1490788 1578894
6147 1578894 1642969 1734484 1885474 1997424 1956175 1826714 1804313 1960973 2157105 2242033
6137B242033n506J7460P6168Q8790P8576P9873O2498J3475n705M4613J07681J20173
6125B920129J02367R0378N9010k110j4242Q0081J93338J99166J16658O4586P0840
$$ plain form
6137 2242033 2236527 2253987 2330155 2418945 2497521 2577394 2639892 2653367 2647662 2692275 2799956 2920129
6125 2920129 3022496 3112874 3171884 3169774 3155532 3235613 3428951 3628117 3744775 3809361 3880201
$$ [...]
##END NTUPLES=NMR SPECTRUM
##END=
