##TITLE=1H ikalashn
EC-3331(II-1)x2
18.9.2024
##JCAMPDX= 6.0         $$ Bruker NMR JCAMP-DX V2.0
##DATA TYPE= NMR SPECTRUM
##DATA CLASS= NTUPLES
##ORIGIN= UXNMR, Bruker Analytische Messtechnik GmbH
##OWNER= root
$$ TOPSPIN		Version 1.3
$$ 2024-09-18 08:49:06.593 +0400  Irina@DPX200
$$ Compression mode = diff/dup
##.OBSERVE FREQUENCY= 200.131392401
##.OBSERVE NUCLEUS= ^1H
##.ACQUISITION MODE= SIMULTANEOUS
##.ACQUISITION SCHEME= undefined
##.AVERAGES= 32
##.DIGITISER RES= 18
##SPECTROMETER/DATA SYSTEM= spect
##.PULSE SEQUENCE= zg
##.SOLVENT NAME= CDCl3
##.SHIFT REFERENCE= INTERNAL, CDCl3, 1, 17.95386
##AUDIT TRAIL= $$ (NUMBER, WHEN, WHO, WHERE, WHAT)
$$ ##TITLE= Audit trail, TOPSPIN		Version 1.3
$$ ##JCAMPDX= 5.01
$$ ##ORIGIN= Bruker BioSpin GmbH
$$ ##OWNER= Irina
$$ $$ F:/spectra/data/iren/nmr/1H/4/pdata/1/auditp.txt
$$ ##AUDIT TRAIL=  $$ (NUMBER, WHEN, WHO, WHERE, VERSION, WHAT)
(   1,<2024-09-18 08:46:41.359 +0400>,<Irina>,<DPX200>,<TOPSPIN 1.3>,
      <acquisition in progress>)
(   2,<2024-09-18 08:48:51.437 +0400>,<Irina>,<DPX200>,<TOPSPIN 1.3>,
      <Start of raw data processing
       efp BC_mod = 2 LB = 0.02 FT_mod = 6 PKNL = 1 PHC0 = 106.1883 PHC1 = 3.555002 SI = 32K 
       data hash MD5: 32K
       24 A2 DF F8 E8 15 75 50 D4 01 BF 2C D8 F3 FE 00>)
(   3,<2024-09-18 08:48:53.781 +0400>,<Irina>,<DPX200>,<TOPSPIN 1.3>,
      <apk 
       data hash MD5: 32K
       0A 1D EA BD DD 72 0F A1 5F 7C 71 07 28 D2 D5 B8>)
(   4,<2024-09-18 08:48:55.750 +0400>,<Irina>,<DPX200>,<TOPSPIN 1.3>,
      <abs n ABSG = 5 
       data hash MD5: 32K
       15 40 62 C0 C2 0F AE 54 61 C2 64 72 02 09 0F 59>)
$$ ##END=
$$ 
$$ $$ hash MD5
$$ $$ 65 E3 D8 4A 58 05 A2 59 34 40 CB D3 A8 91 45 5B
##$RELAX= 
##$RELAX= 
##$RELAX= 
##$RELAX= 
##$RELAX= 
##$RELAX= 
##$RELAX= 
##$RELAX= 
##$RELAX= 
$$ Bruker specific parameters
$$ --------------------------
##$DU= <F:/spectra>
##$EXPNO= 4
##$NAME= <1H>
##$PROCNO= 1
##$TYPE= <nmr>
##$USER= <iren>
##$AMP= (0..31)
100 100 100 100 100 100 100 100 100 100 100 100 100 100 100 100 100 100 
100 100 100 100 100 100 100 100 100 100 100 100 100 100 
##$ANAVPT= -1
##$AQSEQ= 0
##$AQ_mod= 1
##$AUNM= <au_zg>
##$AUTOPOS= <>
##$BF1= 200.13
##$BF2= 200.13
##$BF3= 200.13
##$BF4= 200.13
##$BF5= 200.13
##$BF6= 200.13
##$BF7= 200.13
##$BF8= 200.13
##$BYTORDA= 1
##$CFDGTYP= 0
##$CFRGTYP= 5
##$CHEMSTR= <none>
##$CNST= (0..63)
1 1 145 1 1 1 1 1 1 1 1 1 1 1 1 1 1 1 1 1 1 1 1 1 1 1 1 1 1 1 1 1 1 1 
1 1 1 1 1 1 1 1 1 1 1 1 1 1 1 1 1 1 1 1 1 1 1 1 1 1 1 1 1 1 
##$CPDPRG= <>
##$CPDPRG1= <>
##$CPDPRG2= <>
##$CPDPRG3= <>
##$CPDPRG4= <mlev>
##$CPDPRG5= <mlev>
##$CPDPRG6= <mlev>
##$CPDPRG7= <mlev>
##$CPDPRG8= <mlev>
##$CPDPRGB= <>
##$CPDPRGT= <>
##$D= (0..63)
0 2 0 0 0 0 0 0 0 0.06 0 0.03 0 0 0 0 0.0002 0 0 0 0 0 0 0 0 0 0 0 0 0 
0 0 0 0 0 0 0 0 0 0 0 0 0 0 0 0 0 0 0 0 0 0 0 0 0 0 0 0 0 0 0 0 0 0 
##$DATE= 1726634928
##$DBL= (0..7)
120 120 120 120 120 120 120 120 
##$DBP= (0..7)
150 150 150 150 150 150 150 150 
##$DBP07= 0
##$DBPNAM0= <>
##$DBPNAM1= <>
$$ [...]
##$SW_h= 4401.40845070422
##$TD= 16384
##$TD0= 1
##$TE= 300
##$TE2= 300
##$TE3= 300
##$TEG= 300
##$TL= (0..7)
0 120 120 120 120 120 120 120 
##$TP= (0..7)
150 150 150 150 150 150 150 150 
##$TP07= 0
##$TPNAME0= <>
##$TPNAME1= <>
##$TPNAME2= <>
##$TPNAME3= <>
##$TPNAME4= <>
##$TPNAME5= <>
##$TPNAME6= <>
##$TPNAME7= <>
##$TPOAL= (0..7)
0.5 0.5 0.5 0.5 0.5 0.5 0.5 0.5 
##$TPOFFS= (0..7)
0 0 0 0 0 0 0 0 
##$TUNHIN= 0
##$TUNHOUT= 0
##$TUNXOUT= 0
##$USERA1= <user>
##$USERA2= <user>
##$USERA3= <user>
##$USERA4= <user>
##$USERA5= <user>
##$V9= 5
##$VALIST= <valist>
##$VCLIST= <CCCCCCCCCCCCCCC>
##$VD= 0
##$VDLIST= <DDDDDDDDDDDDDDD>
##$VPLIST= <PPPPPPPPPPPPPPP>
##$VTLIST= <TTTTTTTTTTTTTTT>
##$WBST= 1024
##$WBSW= 25
##$XGAIN= (0..3)
0 0 0 0 
##$XL= 0
##$YL= 0
##$YMAX_a= 1123224
##$YMIN_a= -751977
##$ZGOPTNS= <>
##$ZL1= 120
##$ZL2= 120
##$ZL3= 120
##$ZL4= 120
##$ABSF1= 17.95386
##$ABSF2= -4.038887
##$ABSG= 5
##$ABSL= 3
##$ALPHA= 0
##$AQORDER= 0
##$ASSFAC= 0
##$ASSFACI= 0
##$ASSFACX= 0
##$ASSWID= 0
##$AUNMP= <proc_1d>
##$AXLEFT= 0
##$AXRIGHT= 0
##$AXTYPE= 0
##$AXUNIT= <>
##$AZFE= 0.1
##$AZFW= 0.1
##$BCFW= 0
##$BC_mod= 2
##$BYTORDP= 0
##$COROFFS= 0
##$CY= 7568.61572265625
##$DATMOD= 1
##$DC= 0
##$DFILT= <>
##$DTYPP= 0
##$F1P= 17.9538593292236
##$F2P= -4.03888763876832
##$FCOR= 0.5
##$FTSIZE= 32768
##$FT_mod= 6
##$GAMMA= 0
##$GB= 0
##$INTBC= 0
##$INTSCL= 1.483618e-010
##$ISEN= 128
##$LB= 0.02
##$LEV0= 0
##$LPBIN= 0
##$MAXI= 945.577
##$MC2= 0
##$MEAN= 0
##$ME_mod= 0
##$MI= -402.1523
##$NCOEF= 0
##$NC_proc= -6
##$NLEV= 6
##$NOISF1= 8.587773
##$NOISF2= 6.764455
##$NSP= 0
##$NTH_PI= 0
##$NZP= 0
##$OFFSET= 17.95386
##$PC= 1
##$PHC0= 106.1883
##$PHC1= 2.633538
##$PH_mod= 1
##$PKNL= yes
##$PPARMOD= 0
##$PPDIAG= 0
##$PPIPTYP= 0
##$PPMPNUM= 100
##$PPRESOL= 1
##$PSCAL= 0
##$PSIGN= 0
##$REVERSE= no
##$SF= 200.13
##$SI= 32768
##$SIGF1= 16.12182
##$SIGF2= -4.496377
##$SINO= 3.521527
##$SIOLD= 32768
##$SREGLST= <1H.CDCl3>
##$SSB= 0
##$STSI= 32768
##$STSR= 0
##$SW_p= 4401.40845070423
##$SYMM= 0
##$S_DEV= 0
##$TDeff= 16384
##$TDoff= 0
##$TI= <>
##$TILT= no
##$TM1= 0
##$TM2= 0
##$TOPLEV= 0
##$USERP1= <user>
##$USERP2= <user>
##$USERP3= <user>
##$USERP4= <user>
##$USERP5= <user>
##$WDW= 1
##$XDIM= 32768
##$YMAX_p= 501141609
##$YMIN_p= -1159679
$$ End of Bruker specific parameters
$$ ---------------------------------
##NTUPLES= NMR SPECTRUM
##VAR_NAME=  FREQUENCY,     SPECTRUM/REAL,   SPECTRUM/IMAG
##SYMBOL=    X,             R,               I
##VAR_TYPE=  INDEPENDENT,   DEPENDENT,       DEPENDENT
##VAR_FORM=  AFFN,          ASDF,            ASDF
##VAR_DIM=   32768,         32768,           32768
##UNITS=     HZ,            ARBITRARY UNITS, ARBITRARY UNITS
##FACTOR=    0.134324425510551, 1,           1
##FIRST=     4401.40845070423, 40725,        -2818723
##LAST=      0,             609203,          -2793307
##MIN=       0,             -1159679,        0
##MAX=       4401.40845070423, 501141609,    0
$$ Real data points
##PAGE= N=1
##DATA TABLE= (X++(R..R)), XYDATA
$$ [...]
$$ plain form
11204 17782622 17836008 18005284 18071084 17928559 17765866 17765904 17843400 17823554 17697764 17565847 17480846
11193 17480846 17459243 17498748 17517303 17436805 17355062 17418877 17515654 17389483 17108362 17040487 17242194
11182 17242194 17293577 16975206 16675581 16771234 16996866 16901480 16614449 16592130 16801907 16785221
11172 16785221 16479217 16341393 16559060 16717623 16477014 16090962 15959879 16053724 16105203 16075974
11162 16075974 16085104 16087538 15970947 15848954 15938471 16187338 16282703 16041086 15619330 15330805
11152 15330805 15354535 15592734 15740439 15567880 15201174 15013211 15164056 15405363 15446092 15317414
11142 15317414 15203305 15114656 14991973 14964708 15167826 15382837 15243655 14818225 14598717 14796418
11132 14796418 15017957 14867317 14545267 14507056 14736450 14786605 14500636 14270318 14454820 14869840
$$ packed form
11204A7782622N3386J69276O5800j42525j62693L8P7496j9846j25790j31917q5001
11193A7480846k1603L9505J8555q0498q1743O3815R6777j26171k81121o7875K01707
11182A7242194N1383l18371k99625R5653K25632r5386k87031k2319K09777j6686
11172A6785221l06004j37824K17667J58563k40609l86052j31083R3845N1479k9229
11162A6075974R130K434j16591j21993Q9517K48867R5365k41617m21756k88525
11152A5330805K3730K38199J47705j72559l66706j87963J50845K41307M0729j28678
11142A5317414j14109q8649j22683k7265K03118K15011j39182m25430k19508J97701
11132A4796418K21539j50640l22050l8211K29394N0155k85969k30318J84502M15020
$$ plain form
11122 14869840 15069433 14917877 14641803 14461022 14431804 14575396 14866434 15080863 14945534
11113 14945534 14544464 14328535 14550322 14884230 14826904 14343205 13872450 13765242 13963514
11104 13963514 14221426 14394943 14467336 14493658 14582103 14763522 14853389 14648130 14293103 14191762
11094 14191762 14443017 14651545 14493036 14203196 14211940 14489906 14629177 14486441 14351102 14440878
11084 14440878 14593710 14591178 14495005 14478368 14534078 14538163 14449601 14283972 14037437 13806558 13830562
11073 13830562 14195798 14605571 14680849 14428844 14181446 14120056 14134284 14149873 14279677 14538802
11063 14538802 14689922 14564787 14339922 14284289 14386255 14448105 14424138 14426789 14491106 14584484
11053 14584484 14773954 15097950 15319948 15153578 14764552 14682107 15087188 15542284 15629900 15520710
$$ packed form
11122A4869840J99593j51556k76074j80781k9218J43592K91038K14429j35329
11113A4945534m01070k15929K21787L33908n7326m83699m70755j07208J98272
11104A3963514K57912J73517P2393K6322Q8445J81419Q9867k05259l55027j01341
11094A4191762K51255K08528j58509k89840Q744K77966J39271j42736j35339Q9776
11084A4440878J52832k532r6173j6637N5710M085q8562j65629k46535k30879K4004
11073A3830562L65236M09773P5278k52005k47398o1390J4228J5589J29804K59125
11063A4538802J51120j25135k24865n5633J01966O1850k3967K651O4317R3378
11053A4584484J89470L23996K21998j66370l89026q2445M05081M55096Q7616j09190
$$ plain form
11043 15520710 15612163 15893083 16058232 16068020 16161546 16385939 16535526 16575992 16741732 17129491
11033 17129491 17527871 17754542 17864909 17916739 17824525 17596197 17449217 17517679 17653832 17660661
11023 17660661 17514321 17247870 16872031 16546010 16534059 16799805 16932167 16705113 16419531
11014 16419531 16410898 16517144 16401433 16150664 16117932 16337876 16546401 16669828 16836578 16970936
11004 16970936 16860326 16628982 16659246 16975125 17178161 17115163 17134522 17480664 17880922 18015937
10994 18015937 18025829 18222461 18595325 18942595 19261713 19669239 20103902 20439238 20777497 21332995
10984 21332995 22097229 22871628 23561035 24203106 24774213 25186821 25427494 25510047 25361479
10975 25361479 24937400 24374806 23854399 23396742 22956354 22585761 22302687 21937117 21365048
$$ packed form
11043A5520710R1453K80920J65149R788R3526K24393J49587M0466J65740L87759
11033A7129491L98380K26671J10367N1830r2214k28328j46980O8462J36153O829
11023A7660661j46340k66451l75839l26021j1951K65746J32362k27054k85582
11014A6419531q633J06246j15711k50769l2732K19944K08525J23427J66750J34358
11004A6970936j10610k31344L0264L15879K03036o2998J9359L46142M00258J35015
10994A8015937R892J96632L72864L47270L19118M07526M34663L35336L38259N55498
10984B1332995P64234P74399O89407O42071N71107M12608K40673Q2553j48568
10975B5361479m24079n62594n20407m57657m40388l70593k83074l65570n72069
$$ plain form
10966 21365048 20778982 20451294 20327793 20151043 19894748 19735664 19652024 19432715 19093405
10957 19093405 18893869 18881294 18809032 18616507 18579049 18793833 18920778 18715958 18465025 18526289
10947 18526289 18741713 18744543 18643438 18877305 19446300 19826862 19764398 19668128 19965384 20448135
10937 20448135 20631662 20532675 20668138 21328160 22225555 22947267 23459802 24007743 24710486
10928 24710486 25456622 26097913 26562908 26804364 26778071 26494965 26027648 25477777 24972354
10919 24972354 24612029 24339003 23945572 23335316 22689359 22224005 21881948 21471826 21026920
10910 21026920 20743731 20598388 20358702 20014876 19832186 19860725 19779312 19434257 19150524 19201189
10900 19201189 19320426 19149054 18871492 18911025 19180140 19186969 18828504 18536851 18597206 18820355
$$ packed form
10966B1365048n86066l27688j23501j76750k56295j59084q3640k19309l39310
10957A9093405j99536j2575p2262j92525l7458K14784J26945k04820k50933O1264
10947A8526289K15424K830j01105K33867N68995L80562o2464r6270K97256M82751
10937B0448135J83527r8987J35463O60022Q97395P21712N12535N47941P02743
10928B4710486P46136O41291M64995K41456k6293k83106m67317n49871n05423
10919B4972354l60325k73026l93431o10256o45957m65354l42057m10122m44906
10910B1026920k83189j45343k39686l43826j82690K8539q1413l45055k83733N0665
10900A9201189J19237j71372k77562L9533K69115O829l58465k91653O0355K23149
$$ plain form
10890 18820355 18984315 19120478 19216214 19098843 18830063 18800976 19180919 19631358 19823001 19887910
10880 19887910 20075125 20302488 20400460 20510020 20839437 21229213 21358651 21261052 21266864 21501792
10870 21501792 21755406 21810269 21651381 21392670 21183267 21096677 20972978 20567870 20031329 19929375
10860 19929375 20476097 21060743 20993163 20466002 20216633 20404589 20502604 20298362 20266676 20706835
10850 20706835 21155447 21083411 20721042 20692452 21092753 21418810 21330143 21064023 21040678 21332362
10840 21332362 21647919 21730798 21657251 21698595 21916881 22046492 21894256 21692139 21798004 22155645
10830 22155645 22393269 22421353 22531734 22845694 23085289 23053760 22959907 23046780 23236267 23383092
10820 23383092 23565603 23857280 24099102 24179010 24268429 24508599 24752955 24914635 25234767 25828143
$$ packed form
10890A8820355J63960J36163R5736j17371k68780k9087L79943M50439J91643O4909
10880A9887910J87215K27363R7972J09560L29417L89776J29438r7599N812K34928
10870B1501792K53614N4863j58888k58711k09403q6590j23699m05108n36541j01954
10860A9929375N46722N84646o7580n27161k49369J87956R8015k04242l1686M40159
10850B0706835M48612p2036l62369k8590M00301L26057q8667k66120k3345K91684
10840B1332362L15557Q2879p3547M1344K18286J29611j52236k02117J05865L57641
10830B2155645K37624K8084J10381L13960K39595l1529r3853Q6873J89487J46825
10820B3383092J82511K91677K41822P9908Q9419K40170K44356J61680L20132N93376
$$ plain form
10810 25828143 26298719 26289637 26135011 26403653 27004547 27377901 27455376 27726773 28330399 28804282
10800 28804282 28929362 29137204 29744981 30376362 30591320 30624897 30978700 31601449 32022007
10791 32022007 32118630 32232104 32565010 32932985 33163768 33368501 33702794 34126452 34523189
10782 34523189 34875022 35210701 35504449 35714756 35862255 36029770 36316568 36774902 37349062
10773 37349062 37916229 38427766 38943585 39483461 39947859 40264803 40513755 40812952 41184646
10764 41184646 41618994 42143935 42720199 43208093 43578573 44010344 44612861 45220295 45680011
10755 45680011 46171893 46931844 47779478 48306188 48517565 48886521 49675057 50578024 51222995
10746 51222995 51697938 52314373 53081019 53734063 54187648 54660684 55353515 56207236 57024388
$$ packed form
10810B5828143M70576r082j54626K68642O00894L73354P7475K71397O03626M73883
10800B8804282J25080K07842O07777O31381K14958L3577L53803O22749M20558
10791C2022007R6623J13474L32906L67975K30783K04733L34293M23658L96737
10782C4523189L51833L35679K93748K10307J47499J67515K86798M58334N74160
10773C7349062N67167N11537N15819N39876M64398L16944K48952K99197L71694
10764D1184646M34348N24941N76264M87894L70480M31771O02517O07434M59716
10755D5680011M91882P59951Q47634N26710K11377L68956P88536R02967O44971
10746E1222995M74943O16435P66646O53044M53585M73036O92831Q53721Q17152
$$ plain form
10737 57024388 57702234 58311260 58999945 59815776 60603734 61158054 61507055 61920508 62554030
10728 62554030 63231538 63718286 64076332 64554528 65209695 65856117 66366447 66813638 67295645
10719 67295645 67803840 68310921 68836963 69375742 69878904 70353419 70862731 71407982 71925450
10710 71925450 72411646 72913686 73389605 73749186 74056526 74487179 75023948 75428225 75632657
10701 75632657 75916279 76484520 77089873 77358161 77357989 77515471 77999224 78518244 78783016 78871536
10691 78871536 79012147 79243477 79469973 79695466 80004621 80381140 80700307 80881910 80951382
10682 80951382 80968421 80966141 80941498 80856987 80677910 80445427 80281721 80285074 80427048 80552502
10672 80552502 80473513 80121036 79663206 79399881 79432629 79514740 79375030 79095282 78931294 78825120
$$ packed form
10737E7024388O77846O09026O88685Q15831P87958N54320L49001M13453O33522
10728F2554030O77508M86748L58046M78196O55167O46422N10330M47191M82007
10719F7295645N08195N07081N26042N38779N03162M74515N09312N45251N17468
10710G1925450M86196N02040M75919L59581L07340M30653N36769M04277K04432
10701G5632657K83622N68241O05353K68288j72J57482M83753N19020K64772Q8520
10691G8871536J40611K31330K26496K25493L09155L76519L19167J81603O9472
10682H0951382J7039k280k4643q4511j79077k32483j63706L353J41974J25454
10672H0552502p8989l52477m57830k63325L2748Q2111j39710k79748j63988j06174
$$ plain form
10662 78825120 78436222 77712618 77069813 76825575 76768792 76527335 76089537 75667048 75269360
10653 75269360 74761670 74194518 73727985 73324517 72836463 72300832 71821036 71272062 70508391
10644 70508391 69766377 69395291 69214517 68657506 67632035 66702716 66235802 65889459 65249391
10635 65249391 64480808 63931732 63487315 62827733 62060280 61545699 61220359 60627040 59631558
10626 59631558 58643142 58017329 57611144 57086847 56382270 55697454 55171767 54724365 54162102
10617 54162102 53392637 52548767 51851926 51310450 50679143 49816905 48917712 48224095 47695431
10608 47695431 47188809 46776567 46559277 46301738 45649659 44673506 43817329 43291708 42885301
10599 42885301 42421706 42009727 41711326 41318728 40663237 39885087 39209163 38657681 38136183
$$ packed form
10662G8825120l88898p23604o42805k44238n6783k41457m37798m22489l97688
10653G5269360n07690n67152m66533m03468m88054n35631m79796n48974p63671
10644G0508391p42014l71086j80774n57011j025471r29319m66914l46343o40068
10635F5249391p68583n49076m44417o59582p67453n14581l25340n93319r95482
10626E9631558r88416o25813m06185n24297p04577o84816n25687m47402n62263
10617E4162102p69465q43870o96841n41476o31307q62238q99193o93617n28664
10608D7695431n06622m12242k17290k57539o52079r76153q56177n25621m06407
10599D2885301m63595m11979k98401l92598o55491p78150o75924n51482n21498
$$ plain form
10590 38136183 37615495 37098173 36575221 36109272 35788988 35554172 35269739 34976356 34788104
10581 34788104 34544193 33947239 33115334 32551575 32406973 32243290 31769084 31309142 31170475
10572 31170475 31026004 30457380 29740721 29469792 29613186 29577662 29118486 28583959 28253794
10563 28253794 28000972 27695006 27435244 27243060 26950302 26545568 26263350 26188757 26104409 25849813
10553 25849813 25521272 25225772 24960329 24802914 24853022 24897018 24549496 23872547 23428502 23514972
10543 23514972 23765234 23753976 23572199 23473788 23354953 23012336 22615395 22464355 22482935 22382415
10533 22382415 22164588 22030721 21918002 21578554 21072323 20755149 20755613 20826214 20750216 20574409
10523 20574409 20399403 20237858 20128641 20123516 20121196 19962341 19705314 19554183 19515934 19414153
$$ packed form
10590C8136183n20688n17322n22952m65949l20284k34816k84433k93383j88252
10581C4788104k43911n96954q31905n63759j44602j63683m74206m59942j38667
10572C1170475j44471n68624p16659k70929J43394l5524m59176n34527l30165
10563B8253794k52822l05966k59762j92184k92758m04734k82218p4593q4348k54596
10553B5849813l28541k95500k65443j57415N0108M3996l47522o76949m44045Q6470
10543B3514972K50262j1258j81777r8411j18835l42617l96941j51040J8580j00520
10533B2382415k17827j33867j12719l39448n06231l17174M64P0601p5998j75807
10523B0574409j75006j61545j09217n125k320j58855k57027j51131l8249j01781
$$ plain form
10513 19414153 19243277 19176871 19180227 18981492 18554699 18281323 18423239 18717578 18741289 18470186
10503 18470186 18221089 18170737 18169083 17983672 17578056 17171150 17066607 17334769 17655587 17638934
10493 17638934 17312034 17062322 17066089 17087495 16964281 16934558 17221689 17592550 17667961 17463298
10483 17463298 17269364 17163359 17020871 16899001 16991097 17228363 17321259 17217684 17148273 17181697
10473 17181697 17131532 16990862 17038030 17330975 17495780 17288507 17030067 17151297 17568885 17876517
10463 17876517 17957813 18021259 18159457 18281720 18428741 18754644 19193092 19521381 19780138 20215128
10453 20215128 20719806 20807215 20368257 20017374 20297093 20860573 20924413 20357077 19794052 19683613
10443 19683613 19724508 19411279 18745942 18153067 17924071 17981113 18049386 17883073 17435446 16947237
$$ packed form
10513A9414153j70876o6406L356j98735m26793k73376J41916K94339K3711k71103
10503A8470186k49097n0352j654j85411m05616m06906j04543K68162L20818j6653
10493A7638934l26900k49712L767K1406j23214k9723K87131L70861P5411k04663
10483A7463298j93934j06005j42488j21870R2096K37266R2896j03575o9411L3424
10473A7181697n0165j40670M7168K92945J64805k07273k58440J21230M17588L07632
10463A7876517Q1296O3446J38198J22263J47021L25903M38448L28289K58757M34990
10453B0215128N04678Q7409m38958l50883K79719N63480O3840n67336n63025j10439
10443A9683613M0895l13229o65337n92875k28996N7042O8273j66313m47627m88209
$$ plain form
10433 16947237 16752572 16883124 17010620 16906565 16768736 16887750 17157086 17199920 16915560
10424 16915560 16616024 16603716 16845527 17109969 17232541 17184574 17036483 16919136 16917279 16983005
10414 16983005 17052170 17198718 17504862 17825855 17933608 17913759 18129859 18673019 19121276 19071267
10404 19071267 18724903 18674887 19177870 19894848 20374511 20593085 20920440 21660175 22748642
10395 22748642 23912312 25012770 26095274 27079574 27598313 27338366 26452507 25397658 24399605
10386 24399605 23341947 22184485 21155625 20409417 19796741 19163722 18616258 18275876 18016700
10377 18016700 17690059 17386539 17202584 16961601 16486158 15963939 15688866 15588968 15397392
10368 15397392 15168273 15176892 15356968 15314813 14953666 14632856 14590641 14628672 14535803 14433832
$$ packed form
10433A6947237j94665J30552J27496j04055j37829J19014K69336M2834k84360
10424A6915560k99536j2308K41811K64442J22572m7967j48091j17347j857O5726
10414A6983005O9165J46548L06144L20993J07753j9849K16100N43160M48257n0009
10404A9071267l46364n0016N02983P16978M79663K18574L27355P39735J088467
10395B2748642J163670J100458J082504R84300N18739k59947q85859j054849r98053
10386B4399605j057658j157462j028860p46208o12676o33019n47464l40382k59176
10377A8016700l26641l03520j83955k40983m75443n22219k75073r9898j91576
10368A5397392k29119Q619J80076m2155l61147l20810m2215L8031r2869j01971
$$ plain form
10358 14433832 14476770 14534981 14426935 14205593 13994963 13790022 13628295 13694670 14001226 14197933
10348 14197933 13989165 13566040 13354916 13475691 13695254 13791472 13734336 13619812 13616354 13839318
10338 13839318 14110634 14048815 13611052 13302272 13551104 14104282 14396755 14324085 14222180 14221286
10328 14221286 14116636 13869380 13760547 13949647 14257176 14484708 14622087 14665598 14578043 14520887
10318 14520887 14766387 15243450 15515328 15376813 15146808 15173931 15374257 15506113 15610476
10309 15610476 15870739 16246697 16562033 16816349 17128836 17484495 17804190 18172794 18723541
10300 18723541 19352595 19823479 20148014 20601122 21308084 22055624 22641664 23249520 24275398
10291 24275398 25797732 27402433 28685194 29861610 31616734 34196923 36852349 38466187
$$ packed form
10358A4433832M2938N8211j08046k21342k10630k04941j61727O6375L06556J96707
10348A4197933k08768m23125k11124J20775K19563R6218n7136j14524l458K22964
10338A3839318K71316o1819m37763l08780K48832N53178K92473p2670j01905q94
10328A4221286j04650k47256j08833J89100L07529K27532J37379M3511q7555n7156
10318A4520887K45500M77063K71878j38515k30005K7123K00326J31856J04363
10309A5610476K60263L75958L15336K54316L12487L55659L19695L68604N50747
10300A8723541O29054M70884L24535M53108P06962P47540N86040O07856J025878
10291B4275398J522334J604701J282761J176416J755124K580189K655426J613838
$$ plain form
10283 38466187 38655036 37951176 36973406 35838623 34445079 32855724 31149313 29262754
10275 29262754 27283448 25587693 24355582 23226627 21819026 20353434 19319940 18696569
10267 18696569 17999197 17056888 16238746 15835783 15643701 15308324 14758095 14135187 13554732
10258 13554732 13089302 12804316 12675916 12585848 12441909 12199897 11818775 11367549 11090168
10249 11090168 11111068 11147365 10825168 10242552 9861900 9842904 9880516 9757701 9618191 9550983
10239 9550983 9359477 8996082 8816246 9055348 9373319 9302195 8905439 8594256 8470998 8294109
10229 8294109 8019841 7930550 8144967 8349422 8192407 7755556 7461402 7577320 7927119 8113637
10219 8113637 7972478 7711796 7572424 7511301 7393847 7332450 7496973 7671855 7455905 6947685
$$ packed form
10283C8466187J88849p03860r77770j134783j393544j589355j706411j886559
10275B9262754j979306j695755j232111j128955j407601j465592j033494o23371
10267A8696569o97372r42309q18142m02963j92082l35377n50229o22908n80455
10258A3554732m65430k84986j28400r0068j43939k42012l81122m51226k77381
10249A1090168K0900L6297l22197n82616l80652j8996L7612j22815j39510o7208
10239I550983j91506l63395j79836K39102L17971p1124l96756l11183j23258j76889
10229H294109k74268q9291K14417K04455j57015m36851k94154J15918L49799J86518
10219H113637j41159k60682j39372o1123j17454o1397J64523J74882k15950n08220
$$ plain form
10209 6947685 6717350 6923009 7012549 6633895 6276498 6482796 6906534 6853001 6426302 6331728
10199 6331728 6677226 6825572 6502712 6223356 6359009 6523951 6295970 5944150 5942531 6211732
10189 6211732 6363535 6365288 6436993 6520467 6374417 6077307 5956639 6060367 6122040 6048486
10179 6048486 6041993 6180711 6241018 6064221 5815171 5719437 5749175 5726021 5591897 5432782
10169 5432782 5325617 5285653 5314434 5401090 5493501 5531823 5509590 5473879 5472039 5511691 5563742
10158 5563742 5595836 5605560 5618276 5645324 5644530 5533225 5270996 4958681 4816748 4971864 5259605
10147 5259605 5361400 5183779 4960682 4899976 4909092 4823896 4715808 4724020 4741265 4589069 4405509
10136 4405509 4483182 4751204 4825743 4621567 4495092 4658073 4855334 4810539 4616872 4466626
$$ packed form
10209F947685k30335K05659Q9540l78654l57397K06298M23738n3533m26699r4574
10199F331728L45498J48346l22860k79356J35653J64942k27981l51820j619K69201
10189F211732J51803J753P1705Q3474j46050k97110j20668J03728O1673p3554
10179F048486o493J38718O0307j76797k49050r5734K9738k3154j34124j59115
10169E432782j07165l9964K8781Q6656R2411L8322k2233l5711j840L9652N2051
10158E563742L2094R724J2716K7048p94j11305k62229l12315j41933J55116K87741
10147E259605J01795j77621k23097o0706R116q5196j08088Q212J7245j52196j83560
10136D405509P7673K68022P4539k04176j26475J62981J97261m4795j93667j50246
$$ plain form
10126 4466626 4353603 4289105 4443386 4770815 4856371 4501647 4133285 4211895 4538041 4620832
10116 4620832 4462543 4414303 4449921 4232674 3852776 3833871 4292835 4677729 4551335 4151285
10106 4151285 3926333 3930731 3960194 3954183 3962933 3951815 3903236 3938371 4126256 4323599 4374785
10095 4374785 4324033 4283297 4235338 4105447 3906786 3710169 3576004 3560806 3655250 3712421
10085 3712421 3625051 3558411 3749969 4073587 4126283 3817688 3529979 3559106 3733652 3774156
10075 3774156 3711292 3702851 3699106 3562834 3342967 3202919 3218690 3394703 3691022 3909954
10065 3909954 3803265 3445785 3236150 3361272 3557834 3586980 3586928 3696183 3708525 3462992
10055 3462992 3234267 3308269 3462683 3343568 3109251 3168076 3451074 3514970 3288876 3150438
$$ packed form
10126D466626j13023o4498J54281L27429Q5556l54724l68362P8610L26146Q2791
10116D620832j58289m8240L5618k17247l79898j8905M58964L84894j26394m00050
10106D151285k24952M398K9463o011Q750j1118m8579L5135J87885J97343N1186
10095D374785n0752m0736m7959j29891j98661j96617j34165j5198R4444N7171
10085C712421q7370o6640J91558L23618N2696l08595k87709K9127J74546M0504
10075C774156o2864q441l745j36272k19867j40048J5771J76013K96319K18932
10065C909954j06689l57480k09635J25122J96562K9146n2J09255J2342k45533
10055C462992k28725P4002J54414j19115k34317N8825K82998O3896k26094j38438
$$ plain form
10045 3150438 3252379 3318530 3196861 3117247 3245117 3400602 3402537 3345531 3361502 3398080 3390204
10034 3390204 3400603 3456773 3465721 3388091 3299907 3231615 3152057 3124220 3239978 3398168 3404642
10023 3404642 3287664 3241581 3279113 3245322 3152237 3157519 3225841 3183121 3098803 3203539 3418077
10012 3418077 3416563 3197334 3103784 3212917 3242691 3175810 3361205 3778034 3846008 3330915
10002 3330915 2842033 2962474 3405128 3560471 3423698 3380021 3439293 3334595 3138594 3149930
9992 3149930 3314347 3334948 3246647 3333786 3559997 3611521 3459967 3378697 3427309 3400866 3278299
9981 3278299 3260446 3365322 3417134 3412275 3463756 3441796 3159640 2873853 3048776 3594342 3894322
9970 3894322 3677521 3319985 3174829 3163783 3191025 3378382 3640195 3575538 3105796 2735577
$$ packed form
10045C150438J01941O6151j21669p9614J27870J55485J935n7006J5971L6578p876
10034C390204J0399N6170Q948p7630q8184o8292p9558k7837J15758J58190O474
10023C404642j16978m6083L7532l3791r3085N282O8322m2720q4318J04736K14538
10012C418077j514k19229r3550J09133K9774o6881J85395M16829O7974n15093
10002C330915m88882J20441M42654J55343j36773m3677N9272j04698j96001J1336
9992C149930J64417K0601q8301Q7139K26211N1524j51554q1270M8612k6443j22567
9981C278299j7853J04876N1812m859N1481k1960k82156k85787J74923N45566K99980
9970C894322k16801l57536j45156j1046K7242J87357K61813o4657m69742l70219
$$ plain form
9960 2735577 2837072 3122667 3184395 3106009 3117951 3073354 2788763 2574877 2847541 3402537
9950 3402537 3638346 3411457 3150574 3137521 3168717 3015205 2800444 2753600 2874250 3010237
9940 3010237 3085844 3119735 3131105 3125042 3117614 3129962 3163271 3158380 3007605 2720752 2561446
9929 2561446 2803917 3297522 3536097 3306968 3004807 3072263 3373226 3436924 3155462 2874287
9919 2874287 2848287 2954662 2986682 2960195 3025176 3220572 3397034 3349845 3060601 2815823
9909 2815823 2937221 3334932 3548245 3363214 3128454 3224841 3479146 3452990 3144565 2998195
9899 2998195 3254890 3646310 3768534 3508519 3088903 2878651 3100459 3540081 3673962 3309376
9889 3309376 2910018 2980737 3346092 3462773 3262128 3139613 3197127 3120597 2862555 2806422
$$ packed form
9960B735577J01495K85595O1728p8386J1942m4597k84591k13886K72664N54996
9950C402537K35809k26889k60883j3053L1196j53512k14761m6844J20650J35987
9940C010237P5607L3891J1370o063p428J2348L3309m891j50775k86853j59306
9929B561446K42471M93605K38575k29129l02161O7456L00963O3698k81462k81175
9919B874287k6000J06375L2020k6487O4981J95396J76462m7189k89244k44778
9909B815823J21398L97711K13313j85031k34760R6387K54305k6156l08425j46370
9899B998195K56695L91420J22224k60015m19616k10252K21808M39622J33881l64586
9889C309376l99358P0719L65355J16681k00645j22515N7514p6530k58042n6133
$$ plain form
9879 2806422 3058585 3174789 2892578 2602196 2706567 2981723 3034394 3005866 3271577 3690042
9869 3690042 3738594 3330116 2974939 3068659 3423954 3627075 3553983 3383131 3294672 3304935
9859 3304935 3313451 3230352 3081867 2993017 3045865 3198186 3361026 3473573 3477562 3338190 3136731
9848 3136731 3013844 2979130 2930527 2894882 3030642 3309894 3449279 3313019 3155113 3258236
9838 3258236 3518157 3602413 3381085 3016000 2759746 2813908 3202114 3623607 3657897 3310881
9828 3310881 3102406 3363646 3730243 3675260 3291046 3109997 3316869 3602155 3713114 3693336
9818 3693336 3595926 3395194 3213923 3246233 3412216 3446149 3343761 3347336 3476964 3493367 3367490
9807 3367490 3344529 3464926 3490369 3423277 3589373 4004938 4192571 3935225 3704605 3917080
$$ packed form
9879B806422K52163J16204k82211k90382J04371K75156N2671k8528K65711M18465
9869C690042M8552m08478l55177R3720L55295K03121p3092j70852q8459J0263
9859C304935Q516q3099j48485q8850N2848J52321J62840J12547L989j39372k01459
9848C136731j22887l4714m8603l5645J35760K79252J39385j36260j57906J03123
9838C258236K59921Q4256k21328l65085k56254N4162L88206M21493L4290l47016
9828C310881k08475K61240L66597n4983l84214j81049K06872K85286J10959j9778
9818C693336r7410k00732j81271L2310J65983L3933j02388L575J29628J6403j25877
9807C367490k2961J20397K5443o7092J66096M15565J87633k57346k30620K12475
$$ plain form
9797 3917080 4216289 4039262 3562335 3455483 3857101 4223917 4200395 4058611 4133745 4301876
9787 4301876 4269461 4060657 3943703 4040802 4226030 4333535 4329332 4309931 4388846 4552957 4641775
9776 4641775 4543766 4383973 4399111 4631696 4873691 4935534 4862095 4841234 4971105 5156276
9766 5156276 5207132 5041929 4795537 4678720 4724325 4774891 4748859 4760948 4886903 4983047 4903996
9755 4903996 4755220 4726561 4790092 4789875 4734202 4735890 4731864 4572843 4384707 4497124 4920702
9744 4920702 5216400 5066303 4716523 4615646 4798921 4912815 4764137 4553521 4532197 4665977
9734 4665977 4762635 4784514 4860401 5020603 5091057 4928088 4653731 4528885 4633940 4821853
9724 4821853 4980968 5155417 5342167 5375187 5168706 4920024 4874342 4995174 5064801 5010007
$$ packed form
9797C917080K99209j77027m76927j06852M01618L66816k3522j41784P5134J68131
9787D301876l2415k08804j16954R7099J85228J07505m203j9401P8915J64111Q8818
9776D641775r8009j59793J5138K32585K41995O1843p3439k0861J29871J85171
9766E156276N0856j65203k46392j16817M5605N0566k6032J2089J25955R6144p9051
9755D903996j48776k8659O3531k17n5673J688m026j59021j88136J12417M23578
9744D920702K95698j50097l49780j00877J83275J13894j48678k10616k1324J33780
9734D665977R6658K1879P5887J60202P0454j62969k74357j24846J05055J87913
9724D821853J59115J74449J86750L3020k06481k48682m5682J20832O9627n4794
$$ plain form
9714 5010007 4906459 4758483 4548710 4443782 4630158 4943680 4997407 4738253 4538731 4623543
9704 4623543 4755109 4678554 4539124 4570923 4653807 4549167 4390240 4519390 4900652 5112687
9694 5112687 4986828 4876605 5116548 5499587 5562470 5249716 4997469 5132519 5425916 5405346
9684 5405346 5002138 4661703 4765356 5146431 5344553 5198234 4942894 4790384 4713090 4674952
9674 4674952 4760966 4948928 5029064 4924092 4840927 4912802 4954500 4823146 4753730 4992388 5315316
9663 5315316 5331177 5121838 5115743 5371073 5474483 5216678 4908489 4875481 5037229 5173537
9653 5173537 5250494 5275814 5166755 4995442 5046919 5367886 5561147 5336960 4988763 4962873
9643 4962873 5200074 5319079 5264235 5293596 5413318 5331812 5022948 4876532 5140882 5574532
$$ packed form
9714E010007j03548j47976k09773j04928J86376L13522N3727k59154j99522Q4812
9704D623543J31566p6555j39430L1799Q2884j04640j58927J29150L81262K12035
9694E112687j25859j10223K39943L83039O2883l12754k52247J35050K93397k0570
9684E405346m03208l40435J03653L81075J98122j46319k55340j52510p7294l8138
9674D674952Q6014J87962Q0136j04972q3165P1875M1698j31354o9416K38658L22928
9663E315316J5861k09339o095K55330J03410k57805l08189l3008J61748J36308
9653E173537P6957K5320j09059j71313N1477L20967J93261k24187l48197k5890
9643D962873K37201J19005n4844K9361J19722q1506l08864j46416K64350M33650
$$ plain form
9633 5574532 5820304 5830435 5751478 5654672 5577114 5615079 5771529 5869245 5796920 5710033 5822194
9622 5822194 6108381 6365837 6476540 6478099 6453911 6458858 6484290 6441829 6286773 6175229 6311882
9611 6311882 6596764 6676517 6457438 6280056 6398923 6599388 6615180 6618107 6875887 7161194
9601 7161194 7038355 6641263 6573761 6973321 7264586 7065143 6794736 7007098 7539656 7811060
9591 7811060 7699239 7601583 7725522 7825357 7702332 7556354 7677650 8045753 8384223 8455231
9581 8455231 8218287 7847680 7648136 7795426 8109994 8254309 8200461 8287011 8697732 9104153
9571 9104153 9053564 8597889 8275321 8456036 8925206 9212498 9177174 9090642 9189785 9367100
9561 9367100 9413660 9413088 9653671 10149708 10508142 10419693 10101882 10034951 10354116 10745174 10913654
$$ packed form
9633E574532K45772J0131p8957r6806p7558L7965J56450R7716p2325q6887J12161
9622E822194K86187K57456J10703J559k4188M947K5432m2461j55056j11544J36653
9611F311882K84882P9753k19079j77382J18867K00465J5792K927K57780K85307
9601G161194j22839l97092o7502L99560K91265j99443k70407K12362N32558K71404
9591G811060j11821r7656J23939R9835j23025j45978J21296L68103L38470P1008
9581H455231k36944l70607j99544J47290L14568J44315n3848Q6550M10721M06421
9571I104153n0589m55675l22568J80715M69170K87292l5324q6532R9143J77315
9561I367100M6560n72K40583M96037L58434q8449l17811o6931L19165L91058J68480
$$ plain form
9550 10913654 10905133 10912415 10989675 11067075 11093870 11062672 11006217 11039867 11279190 11647315 11909013
9539 11909013 11980396 12048719 12274467 12540022 12654382 12666772 12776216 13018853 13252926 13409241
9529 13409241 13557531 13735343 13893690 14025701 14188177 14369916 14481863 14511356 14561840 14708283
9519 14708283 14926092 15184829 15489655 15793905 15987545 16024894 15979041 15947056 15997764 16214507
9509 16214507 16640464 17137124 17456721 17546044 17635659 17910388 18229480 18341781 18276951 18309704
9499 18309704 18565624 18879928 19082286 19219460 19403413 19612963 19789572 19998944 20318560
9490 20318560 20652711 20871036 21088090 21547616 22191109 22626854 22681695 22725160 23180639 23899363
9480 23899363 24368779 24463822 24592743 25041565 25560235 25781262 25738978 25727130 25871131 26106537
$$ packed form
9550A0913654q521P282P7260P7400K6795l1198n6455L3650K39323L68125K61698
9539A1909013P1383O8323K25748K65555J14360J2390J09444K42637K34073J56315
9529A3409241J48290J77812J58347J32011J62476J81739J11947K9493N0484J46443
9519A4708283K17809K58737L04826L04250J93640L7349m5853l1985N0708K16743
9509A6214507M25957M96660L19597Q9323Q9615K74729L19092J12301o4830L2753
9499A8309704K55920L14304K02358J37174J83953K09550J76609K09372L19616
9490B0318560L34151K18325K17054M59526O43493M35745N4841M3465M55479P18724
9480B3899363M69416R5043J28921M48822N18670K21027m2284j1848J44001K35406
$$ plain form
9470 26106537 26405566 26745852 26977900 26997220 26963766 27102389 27372400 27581532 27716620 27866603
9460 27866603 27922992 27724983 27463512 27541820 27994894 28431114 28621881 28748853 28947934 29042746
9450 29042746 28951655 28949566 29215338 29470902 29435671 29335186 29525759 29846154 29839301 29503194
9440 29503194 29311482 29481977 29699635 29669152 29528538 29537453 29686097 29825727 29938784 30060941
9430 30060941 30108662 29984583 29747865 29542424 29456715 29540610 29805361 30088308 30091919 29741078
9420 29741078 29370861 29341581 29545551 29540599 29171172 28805914 28853060 29233182 29525232 29546144
9410 29546144 29545505 29774084 30076330 30103819 29830497 29605465 29675816 29904078 30067456 30200912
9400 30200912 30430541 30643881 30626748 30469117 30523746 30911383 31331947 31481902 31454594 31579170
$$ packed form
9470B6106537K99029L40286K32048J9320l3454J38623K70011K09132J35088J49983
9460B7866603N6389j98009k61471P8308M53074M36220J90767J26972J99081R4812
9450B9042746r1091k089K65772K55564l5231j00485J90573L20395o853l36107
9440B9503194j91712J70495K17658l0483j40614Q915J48644J39630J13057J22157
9430C0060941M7721j24079k36718k05441q5709Q3895K64751K82947L611l50841
9420B9741078l70217k9280K03970m952l69427l65258M7146L80122K92050K0912
9410B9546144o39K28579L02246K7489k73322k25032P0351K28262J63378J33456
9400C0200912K29629K13340j7133j57631N4629L87637M20564J49955k7308J24576
$$ plain form
9390 31579170 32004271 32593527 33146651 33584704 33955487 34364263 34898336 35567133 36314314
9381 36314314 37087338 37867584 38657917 39486543 40356767 41099713 41382875 41070399 40525532
9372 40525532 40285299 40402248 40404146 40018053 39611734 39666476 40071699 40310749 40228732 40214016
9362 40214016 40583936 41154501 41584203 41878594 42309316 42967250 43648983 44167272 44562986
9353 44562986 44959684 45382445 45833216 46418695 47227684 48122693 48845162 49363899 49937408
9344 49937408 50737772 51592714 52273023 52891408 53760670 54905043 55994972 56827708 57624248
9335 57624248 58700057 60008231 61206400 62128321 63019894 64249741 65857571 67495362
9327 67495362 68868467 70140750 71724116 73691772 75687807 77517872 79476089 81824664
$$ packed form
9390C1579170M25101N89256N53124M38053L70783M08776N34073O68797P47181
9381C6314314P73024P80246P90333Q28626Q70224P42946K83162l12476n44867
9372D0525532k40233J16949J898l86093m06319N4742M05223K39050q2017j4716
9362D0214016L69920N70565M29702K94391M30722O57934O81733N18289L95714
9353D4562986L96698M22761M50771N85479Q08989Q95009P22469N18737N73509
9344D9937408Q00364Q54942O80309O18385Q69262J144373J089929Q32736P96540
9335E7624248J075809J308174J198169R21921Q91573J229847J607830J637791
9327F7495362J373105J272283J583366J967656J996035J830065J958217K348575
$$ plain form
9319 81824664 84305674 86594890 88934527 91752748 94905090 98015986 101411139 105785080
9311 105785080 110919878 115871639 120793389 127290128 135988104 144685634 150198152 151581797
9303 151581797 150372822 148109534 145145152 141886291 139512734 138727945 138900262 139237032
9295 139237032 139997430 141767309 144216257 146441939 148114540 149488370 150603651 151259111
9287 151259111 151598973 152018656 152567163 153048251 153636584 154790208 156555074 158500914 160376113
9278 160376113 162334659 164489239 166730531 169046500 171547659 174102233 176426177 178646280
9270 178646280 181282623 184490330 187786152 190764323 193629953 196707370 199850861 202788779
9262 202788779 205735935 209124127 212852888 216339836 219357582 222359343 225793816 229447000
$$ packed form
9319H1824664K481010K289216K339637K818221L152342L110896L395153M373941
9311A05785080N134798M951761M921750O496739Q697976Q697530N512518J383645
9303A51581797j208975k263288k964382l258861k373557p84789J72317L36770
9295A39237032P60398J769879K448948K225682J672601J373830J115281O55460
9287A51259111L39862M19683N48507M81088N88333J153624J764866J945840J875199
9278A60376113J958546K154580K241292K315969K501159K554574K323944K220103
9270A78646280K636343L207707L295822K978171K865630L077417L143491K937918
9262B02788779K947156L388192L728761L486948L017746L001761L434473L653184
$$ plain form
9254 229447000 232749213 235542426 238214289 241082678 243935587 246332661 248204895 249929860
9246 249929860 251821146 253753718 255394369 256642682 257665223 258567739 259244445 259588982
9238 259588982 259699524 259782864 259924115 260028622 259979627 259809941 259681511 259669145 259611340 259287370
9228 259287370 258740162 258250200 257911755 257429664 256512365 255315924 254264563 253515272 252840691
9219 252840691 251993104 250930579 249689232 248286389 246793421 245288655 243696821 241880248
9211 241880248 239918546 238068884 236400032 234707909 232865190 230992696 229168173 227232419
9203 227232419 225064618 222820572 220682789 218564124 216295411 213950422 211720621 209571918
9195 209571918 207301879 204895536 202561412 200401385 198275911 196047787 193763270 191510779
$$ packed form
9254B29447000L302213K793213K671863K868389K852909K397074J872234J724965
9246B49929860J891286J932572J640651J248313J022541R02516O76706L44537
9238B59588982J10542Q3340J41251J04507m8995j69686j28430j2366n7805l23970
9228B59287370n47208m89962l38445m82091r17299j196441j051361p49291o74581
9219B52840691q47587j062525j241347j402843j492968j504766j591834j816573
9211B41880248j961702j849662j668852j692123j842719j872494j824523j935754
9203B27232419k167801k244046k137783k118665k268713k344989k229801k148703
9195B09571918k270039k406343k334124k160027k125474k228124k284517k252491
$$ plain form
9187 191510779 189258865 186943998 184617354 182391989 180289807 178227112 176132316 174011102
9179 174011102 171902936 169840055 167863905 166009806 164222293 162359494 160396221 158571407
9171 158571407 157139625 155953079 154543096 152758667 151068344 149960557 149245934 148320252
9163 148320252 147001794 145676849 144640578 143778567 142996834 142463534 142185128 141796452 141116976
9154 141116976 140535799 140426075 140488834 140180561 139592234 139345550 139662997 140082329 140186630
9145 140186630 140143476 140315209 140702268 141054871 141319829 141694891 142310309 143058657 143754287
9136 143754287 144362485 145033079 145921798 147017479 148204308 149458993 150834057 152233104
9128 152233104 153436741 154463994 155655850 157205596 158858167 160341551 161839130 163660233
$$ packed form
9187A91510779k251914k314867k326644k225365k102182k062695k094796k121214
9179A74011102k108166k062881j976150j854099j787513j862799j963273j824814
9171A58571407j431782j186546j409983j784429j690323j107787p14623r25682
9163A48320252j318458j324945j036271q62011p81733n33300k78406l88676o79476
9154A41116976n81177j09724O2759l08273n88327k46684L17447M19332J04301
9145A40186630m3154J71733L87059L52603K64958L75062O15418P48348O95630
9136A43754287O08198O70594Q88719J095681J186829J254685J375064J399047
9128A52233104J203637J027253J191856J549746J652571J483384J497579J821103
$$ plain form
9120 163660233 165649147 167390903 168904624 170637334 172776853 175059444 177313172 179696569
9112 179696569 182262077 184754668 187060739 189457659 192179838 195076220 197914618 200698784
9104 200698784 203487425 206257674 209162850 212521679 216262989 219789621 222767654 225674160
9096 225674160 229116298 232949387 236615785 240104483 243933946 248261464 252641651 256756391
9088 256756391 260841914 265196610 269691541 274030097 278214198 282500363 287040860 291752029
9080 291752029 296472761 301155891 305912599 310841458 315793115 320456517 324796704 329205932
9072 329205932 333995659 338930288 343568785 347897965 352238700 356633387 360775705 364536938
9064 364536938 368119040 371632835 374944000 378016763 380989000 383795151 386145258 388031995
$$ packed form
9120A63660233J988914J741756J513721J732710K139519K282591K253728K383397
9112A79696569K565508K492591K306071K396920K722179K896382K838398K784166
9104B00698784K788641K770249K905176L358829L741310L526632K978033K906506
9096B25674160L442138L833089L666398L488698L829463M327518M380187M114740
9088B56756391M085523M354696M494931M338556M184101M286165M540497M711169
9080B91752029M720732M683130M756708M928859M951657M663402M340187M409228
9072C29205932M789727M934629M638497M329180M340735M394687M142318L761233
9064C64536938L582102L513795L311165L072763K972237K806151K350107J886737
$$ plain form
9056 388031995 389819981 391627323 393066422 393876195 394369554 394877555 395139038 394710246 393697129
9047 393697129 392574786 391449410 389991895 388019514 385683311 383104676 380253727 377202043
9039 377202043 374089279 370781429 366944932 362563575 358033957 353607574 349055976 344082885
9031 344082885 338808002 333596624 328559594 323452680 318023603 312301405 306539183 300941693
9023 300941693 295464433 289903342 284205070 278587987 273238093 267995483 262558133 256945019
9015 256945019 251499559 246422111 241561853 236725435 231916720 227158443 222344460 217455098
9007 217455098 212714360 208325419 204191950 200085025 195956767 191909390 187980059 184154581
8999 184154581 180492530 177034653 173662266 170246507 166871525 163707075 160713054 157688243
$$ packed form
9056C88031995J787986J807342J439099Q09773M93359N08001K61483m28792j013117
9047C93697129j122343j125376j457515j972381k336203k578635k850949l051684
9039C77202043l112764l307850l836497m381357m529618m426383m551598m973091
9031C44082885n274883n211378n037030n106914n429077n722198n762222n597490
9023C00941693n477260n561091n698272n617083n349894n242610n437350n613114
9015B56945019n445460n077448m860258m836418m808715m758277m813983m889362
9007B17455098m740738m388941m133469m106925m128258m047377l929331l825478
8999A84154581l662051l457877l372387l415759l374982l164450k994021l024811
$$ plain form
8991 157688243 154593197 151613739 148890703 146363048 143882391 141318768 138580921 135737074
8983 135737074 133097778 130930985 129067889 127050182 124724475 122404025 120334140 118322368
8975 118322368 116126515 113931987 112113537 110674278 109248003 107588219 105766308 103938272
8967 103938272 102210793 100714260 99494608 98303800 96806943 95068613 93527117 92373791
8959 92373791 91278452 89925743 88524347 87481671 86766546 85934374 84713761 83271747
8951 83271747 81907079 80736634 79721640 78797092 77902780 77005850 76125921 75264709 74354296
8942 74354296 73377640 72460545 71696509 70967814 70129097 69278273 68598092 67994128 67200957
8933 67200957 66252711 65509948 65127502 64807488 64220120 63386071 62486874 61598557 60828098
$$ packed form
8991A57688243l095046k979458k723036k527655k480657k563623k737847k843847
8983A35737074k639296k166793j863096k017707k325707k320450k069885k011772
8975A18322368k195853k194528j818450j439259j426275j659784j821911j828036
8967A03938272j727479j496533j219652j190808j496857j738330j541496j153326
8959I2373791j095339j352709j401396j042676p15125q32172j220613j442014
8951H3271747j364668j170445j014994r24548q94312q96930q79929q61212r10413
8942G4354296r76656r17095p64036p28695q38717q50824o80181o03964p93171
8933F7200957r48246p42763l82446l20014n87368q34049q99197q88317p70459
$$ plain form
8924 60828098 60405808 60324788 60131272 59455087 58587836 58112249 58031705 57731054 56865923 55854467
8914 55854467 55283602 55160645 55034630 54647354 54148418 53740083 53403577 53037526 52669489
8905 52669489 52396813 52191305 51892297 51414220 50873847 50446788 50159812 49930105 49761388
8896 49761388 49722377 49713845 49487055 49018830 48655304 48672873 48862759 48819596 48530453 48361395
8886 48361395 48496621 48731939 48883545 49086997 49552012 50260072 51051768 51813091 52429517
8877 52429517 52748007 52765967 52717837 52798565 52905728 52812823 52503142 52167447 51928364 51711049
8867 51711049 51357943 50768636 49956102 49036440 48123562 47195219 46135737 44938899 43758453
8858 43758453 42720168 41817939 41039037 40418366 39889809 39277759 38560240 37953031 37584264
$$ packed form
8924F0828098m22290q1020j93516o76185q67251m75587q0544l00651q65131j011456
8914E5854467n70865j22957j26015l87276m98936m08335l36506l66051l68037
8905E2669489k72676k05508k99008m78077n40373m27059k86976k29707j68717
8896D9761388l9011q532k26790m68225l63526J7569J89886m3163k89143j69058
8886D8361395J35226K35318J51606K03452M65015P08060P91696P61323O16426
8877E2429517L18490J7960m8130Q0728J07163r2905l09681l35695k39083k17315
8867E1711049l53106n89307q12534r19662r12878r28343j059482j196838j180446
8858D3758453j038285r02229p78902o20671n28557o12050p17519o07209l68767
$$ plain form
8849 37584264 37278249 36844102 36379539 36051596 35756880 35293699 34740675 34339390 34079050
8840 34079050 33739978 33323156 33078665 33063188 33014493 32777178 32545964 32522606 32583912 32484603
8830 32484603 32202602 31894037 31650058 31475348 31387710 31360706 31253458 30966287 30611392 30380865
8820 30380865 30289237 30195059 30056037 30000230 30095278 30169957 29980494 29533239 29133175 29047907
8810 29047907 29189424 29243926 29085388 28878883 28736078 28510474 28106818 27778757 27831592 28146545
8800 28146545 28317132 28209124 28061061 28038926 28042977 28007331 28029550 28086396 27967863 27658017
8790 27658017 27453372 27505225 27564911 27417329 27244140 27264383 27325383 27213641 27101417 27257642
8780 27257642 27522682 27540772 27375320 27390542 27587137 27587167 27312545 27153216 27328309 27560263
$$ packed form
8849C7584264l06015m34147m64563l27943k94716m63181n53024m01285k60340
8840C4079050l39072m16822k44491j5477m8695k37315k31214k3358O1306r9309
8830C2484603k82001l08565k43979j74710q7638k7004j07248k87171l54895k30527
8820C0380865r1628r4178j39022n5807R5048P4679j89463m47255m00064q5268
8810B9047907J41517N4502j58538k06505j42805k25604m03656l28061N2835L14953
8800B8146545J70587j08008j48063k2135M051l5646K2219N6846j18533l09846
8790B7658017k04645N1853N9686j47582j73189K0243O1000j11742j12224J56225
8780B7257642K65040J8090j65452J5222J96595L0k74622j59329J75093K31954
$$ plain form
8770 27560263 27583331 27543098 27638360 27750994 27731197 27723599 27882645 28041687 28016897 28003415 28274834
8759 28274834 28655471 28715518 28423183 28198417 28306160 28556509 28672525 28642716 28606979 28652430
8749 28652430 28832676 29165641 29502615 29609595 29498442 29474692 29716729 30010830 30092965 30068762
8739 30068762 30228880 30555644 30732333 30661302 30664788 31019479 31516979 31729453 31610560 31558659
8729 31558659 31854597 32288826 32493186 32461628 32513578 32821694 33235112 33582075 33879239 34135656
8719 34135656 34204141 34038338 33915435 34134448 34588813 34912433 34995994 35059031 35224512 35382011
8709 35382011 35556746 36017749 36781790 37357419 37356479 37124834 37307918 37901062 38255965 38087706
8699 38087706 37937234 38370936 39165921 39711895 39932390 40288596 40961554 41562457 41770332
$$ packed form
8770B7560263K3068m0233R5262J12634j9797p598J59046J59042k4790j3482K71419
8759B8274834L80637O0047k92335k24766J07743K50349J16016k9809l5737M5451
8749B8652430J80246L32965L36974J06980j11153k3750K42037K94101Q2135k4203
8739C0068762J60118L26764J76689p1031L486L54691M97500K12474j18893n1901
8729C1558659K95938M34229K04360l1558N1950L08116M13418L46963K97164K56417
8719C4135656O8485j65803j22903K19013M54365L23620Q3561O3037J65481J57499
8709C5382011J74735M61003P64041N75629r40k31645J83084N93144L54903j68259
8699C8087706j50472M33702P94985N45974K20495L56206O72958O00903K07875
$$ plain form
8690 41770332 41827547 42161935 42805451 43456406 43932411 44298378 44664433 45110548 45742348 46578010
8680 46578010 47406331 47984042 48375894 48886826 49643852 50468816 51205919 51930056 52727822
8671 52727822 53509318 54209787 54985620 55991151 57093341 58043573 58848566 59728923 60760999
8662 60760999 61823773 62897018 64124328 65507299 66814596 67939891 69104617 70501221
8654 70501221 71947725 73175119 74317066 75776173 77627092 79480672 81011839 82339011
8646 82339011 83757363 85347976 87022946 88739891 90452445 92021772 93435418 94989280
8638 94989280 96958509 99151795 101110563 102753007 104478896 106537455 108624729 110327241
8630 110327241 111722497 113258204 115158845 117216932 119132649 120844264 122517474 124357969
$$ packed form
8690D1770332N7215L34388O43516O50955M76005L65967L66055M46115O31800Q35662
8680D6578010Q28321N77711L91852N10932P57026Q24964P37103P24137P97766
8671E2727822P81496P00469P75833J005531J102190R50232Q04993Q80357J032076
8662F0760999J062774J073245J227310J382971J307297J125295J164726J396604
8654G0501221J446504J227394J141947J459107J850919J853580J531167J327172
8646H2339011J418352J590613J674970J716945J712554J569327J413646J553862
8638I4989280J969229K193286J958768J642444J725889K058559K087274J702512
8630A10327241J395256J535707J900641K058087J915717J711615J673210J840495
$$ plain form
8622 124357969 126430410 128556852 130445757 132038319 133641328 135554080 137648711 139540009
8614 139540009 141132957 142753370 144705157 146931939 149206557 151468568 153849642 156473635
8606 156473635 159327123 162265496 165099610 167705988 170010236 171815983 172825046 173050629
8598 173050629 173074522 173552425 174503415 175466589 176356626 177666469 179661388 181895056 183889372
8589 183889372 185883312 188434104 191552409 194748313 197784847 200881376 204230136 207793434
8581 207793434 211592211 215748603 220179998 224655698 229233616 234243856 239738630 245365391
8573 245365391 250941973 256761977 263107611 269815003 276599773 283521143 290812554 298463998
8565 298463998 306273591 314165016 322189333 330330740 338540091 346851764 355269415 363657905
$$ packed form
8622A24357969K072441K126442J888905J592562J603009J912752K094631J891298
8614A39540009J592948J620413J951787K226782K274618K262011K381074K623993
8606A56473635K853488K938373K834114K606378K304248J805747J009063K25583
8598A73050629K3893M77903R50990R63174Q90037J309843J994919K233668J994316
8589A83889372J993940K550792L118305L195904L036534L096529L348760L563298
8581B07793434L798777M156392M431395M475700M577918N010240N494774N626761
8573B45365391N576582N820004O345634O707392O784770O921370P291411P651444
8565B98463998P809593P891425Q024317Q141407Q209351Q311673Q417651Q388490
$$ plain form
8557 363657905 371930315 380189311 388484110 396605773 404379280 412002363 419785997 427641090
8549 427641090 435125074 441981277 448382889 454639865 460859844 466890487 472449599 477361602
8541 477361602 481774580 486004297 490033543 493408189 495862051 497750091 499481346 500796345
8533 500796345 501141609 500581767 499679393 498489920 496403349 493166129 489364974 485543693
8525 485543693 481446840 476610982 471193437 465633143 459865008 453510041 446615922 439569214
8517 439569214 432394518 424785099 416818501 408999337 401462220 393708628 385361704 376681357
8509 376681357 368035949 359313538 350268628 341136982 332424939 324202812 316017532 307507482
8501 307507482 298795729 290242645 282070517 274311592 266920953 259801368 252802782 245813764
$$ packed form
8557C63657905Q272410Q258996Q294799Q121663P773507P623083P783634P855093
8549D27641090P483984O856203O401612O256976O219979O030643N559112M912003
8541D77361602M412978M229717M029246L374646K453862J888040J731255J314999
8533E00796345L45264n59842r02374j189473k086571l237220l801155l821281
8525D85543693m096853m835858n417545n560294n768135o354967o894119p046708
8517D39569214p174696p609419p966598p819164p537117p753592q346924q680347
8509C76681357q645408q722411r044910r131646q712043q222127q185280q510050
8501C07507482q711753q553084q172128p758925p390639p119585o998586o989018
$$ plain form
8493 245813764 238868552 232141856 225813777 219900281 214223747 208616582 203140666 197983454
8485 197983454 193127023 188310381 183416636 178696469 174418854 170467258 166545812 162674535
8477 162674535 159144226 155987815 152857912 149541158 146266224 143300356 140519197 137653482
8469 137653482 134752306 132072676 129644805 127305873 125088043 123161466 121375335 119309387
8461 119309387 116940741 114827748 113333514 112025387 110259005 108112817 106244258 104908479
8453 104908479 103640634 101994998 100147477 98557625 97354859 96291812 95090220 93639893
8445 93639893 92029252 90531484 89388025 88481415 87423347 86087310 84803320 83861200
8437 83861200 83102887 82238835 81281286 80352897 79332283 78090686 76885724 76063833 75472150
$$ packed form
8493B45813764o945212o726696o328079n913496n676534n607165n475916n157212
8485A97983454m856431m816642m893745m720167m277615l951596l921446l871277
8477A62674535l530309l156411l129903l316754l274934k965868k781159k865715
8469A37653482k901176k679630k427871k338932k217830j926577j786131k065948
8461A19309387k368646k112993j494234j308127j766382k146188j868559j335779
8453A04908479j267845j645636j847521j589852j202766j063047j201592j450327
8445I3639893j610641j497768j143459r06610j058068j336037j283990r42120
8437H3861200p58313q64052r57549r28389j020614j241597j204962q21891n91683
$$ plain form
8428 75472150 74625229 73423710 72259691 71396174 70684393 69945984 69190134 68362821 67330553
8419 67330553 66245179 65472433 64982285 64271123 63124481 61994202 61304123 60815493 60070225
8410 60070225 59087538 58185853 57427814 56697410 56061433 55588069 55039106 54216144 53391961
8401 53391961 52896586 52490058 51709878 50661343 49830544 49230461 48434523 47440805 46756456
8392 46756456 46507329 46191375 45535771 44906010 44567976 44214861 43608904 43055229 42769466
8383 42769466 42368364 41548355 40739358 40432939 40298915 39697571 38755050 38160547 38067101 37943227
8373 37943227 37456925 36812331 36211877 35644882 35241931 35184293 35184881 34714309 33865341 33321967
8363 33321967 33284669 33134397 32473618 31798804 31667091 31802122 31615281 31137301 30777869 30509746
$$ packed form
8428G5472150q46921j201519j164019q63517p11781p38409p55850q27313j032268
8419F7330553j085374p72746m90148p11162j146642j130279o90079m88630p45268
8410F0070225r82687r01685p58039p30404o35977m73364n48963q22962q24183
8401E3391961m95375m06528p80180j048535q30799o00083p95938r93718o84349
8392D6756456k49127l15954o55604o29761l38034l53115o05957n53675k85763
8383D2769466m01102q20009q08997l06419j34024o01344r42521n94503r3446j23874
8373C7943227m86302o44594o00454n66995m02951n7638N88m70572q48968n43374
8363C3321967l7298j50272o60779o74814j31713J35031j86841m77980l59432k68123
$$ plain form
8353 30509746 29999564 29360515 29068927 29155246 29107393 28661175 28145790 27901970 27829314 27706651
8343 27706651 27556274 27437962 27193435 26682269 26084407 25718322 25656296 25691397 25604874 25336666
8333 25336666 24963699 24614769 24357100 24115976 23778591 23396291 23161230 23141170 23177930 23116197
8323 23116197 22984540 22848395 22634114 22262998 21864308 21663156 21677781 21694948 21557196 21316682
8313 21316682 21063380 20774629 20455539 20282067 20391212 20583175 20490288 20095200 19816305 19919777
8303 19919777 20097541 19906872 19438203 19159755 19183078 19142308 18854394 18613132 18627049 18621668
8293 18621668 18333149 18015936 18033158 18229760 18193992 17941429 17818424 17840325 17680487 17309534
8283 17309534 17093559 17165138 17215783 17072375 16979687 17073434 17047113 16682852 16319668 16375367
$$ packed form
8353C0509746n10182o39049k91588Q6319m7853m46218n15385k43820p2656j22663
8343B7706651j50377j18312k44527n11166n97862l66085o2026L5101q6523k68208
8333B5336666l72967l48930k57669k41124l37385l82300k35061k0060L6760o1733
8323B3116197j31657j36145k14281l71116l98690k01152J4625J7167j37752k40514
8313B1316682k53302k88751l19090j73472J09145J91963r2887l95088k78895J03472
8303A9919777J77764j90669m68669k78448K3323m0770k87914k41262J3917n381
8293A8621668k88519l17213J7222J96602l5768k52563j23005K1901j59838l70953
8283A7309534k15975P1579N0645j43408r2688R3747k6321l64261l63184N5699
$$ plain form
8273 16375367 16674312 16691935 16322093 15984070 15992617 16161743 16100696 15701276 15256472 15154172
8263 15154172 15443825 15728964 15620844 15261400 15134574 15347573 15480224 15279747 15063138
8254 15063138 15137262 15239277 14995636 14613226 14577458 14859889 14992369 14841935 14738624 14814470
8244 14814470 14779647 14498660 14295310 14448105 14754906 14848695 14672767 14426620 14261803 14216545
8234 14216545 14268329 14304872 14203819 14030847 13974712 14029723 13978974 13766356 13618196 13683022
8224 13683022 13813830 13842025 13809222 13780193 13691777 13564744 13602884 13864082 14065453 13953304
8214 13953304 13669799 13516797 13539019 13584493 13605963 13636411 13603750 13441301 13281512 13282561 13344258
8203 13344258 13248699 13026138 12935862 13102293 13376129 13548383 13535025 13369262 13160686 13046693
$$ packed form
8273A6375367K98945J7623l69842l38023Q547J69126o1047l99420m44804j02300
8263A5154172K89653K85139j08120l59444j26826K12999J32651k00477k16609
8254A5063138P4124J02015k43641l82410l5768K82431J32480j50434j03311P5846
8244A4814470l4823k80987k03350J52795L06801R3789j75928k46147j64817m5258
8234A4216545N1784L6543j01053j72972n6135N5011n0749k12618j48160O4826
8224A3683022J30808K8195l2803k9029q8416j27033L8140K61198K01371j12149
8214A3953304k83505j53002K2222M5474K1470L0448l2661j62449j59789J049O1697
8203A3344258r5559k22561r0276J66431K73836J72254j3358j65763k08576j13993
$$ plain form
8193 13046693 13075382 13171958 13279820 13422112 13550920 13513295 13298377 13127735 13129133 13121415 12940812
8182 12940812 12779756 12919165 13272065 13491068 13432995 13249499 13113570 13113256 13304209 13597282
8172 13597282 13708761 13497680 13224879 13196861 13323982 13360809 13376453 13560730 13754503 13690268
8162 13690268 13558792 13740625 14047814 13909945 13352821 13070592 13356317 13685351 13649889 13587745
8152 13587745 13846939 14088018 13897522 13560778 13570360 13770897 13674653 13328622 13167399 13201155
8142 13201155 13062055 12772150 12762803 13096421 13317868 13206181 13095877 13258110 13465813 13422337
8132 13422337 13218188 13100870 13101932 13129680 13189638 13317879 13486953 13695122 13941297 14051420
8122 14051420 13815077 13390103 13253988 13598437 14068510 14275113 14261934 14250761 14238105 14147456
$$ packed form
8193A3046693K8689R6576J07862J42292J28808l7625k14918j70642J398p718j80603
8182A2940812j61056J39409L52900K19003n8073j83496j35929l14J90953K93073
8172A3597282J11479k11081k72801k8018J27121L6827J5644J84277J93773o4235
8162A3690268j31476J81833L07189j37869n57124k82229K85725L29034l5462o2144
8152A3587745K59194K41079j90496l36744R582K00537r6244l46031j61223L3756
8142A3201155j39100k89905r347L33618K21447j11687j10304J62233K07703m3476
8132A3422337k04149j17318J062K7748N9958J28241J69074K08169K46175J10123
8122A4051420k36343m24974j36115L44449M70073K06603j3179j1173j2656r0649
$$ plain form
8112 14147456 14125698 14321666 14531472 14446820 14183152 14178226 14541852 14864904 14805557 14576309
8102 14576309 14623201 14992046 15289977 15255381 15102681 15174952 15440048 15571480 15469044 15404578
8092 15404578 15572229 15782972 15800108 15723430 15752703 15785456 15638272 15522634 15813394 16361081
8082 16361081 16563010 16237117 15905840 15983113 16191049 16145346 16048986 16284045 16656275 16676162
8072 16676162 16434823 16542026 17153442 17657139 17521880 16984157 16631680 16676325 16938859 17263739
8062 17263739 17600278 17836385 17880309 17845064 17901321 18009676 18045900 18130907 18517086 19096367
8052 19096367 19349495 18988701 18424837 18313641 18751892 19239709 19417475 19469519 19663006 19843714
8042 19843714 19704136 19331011 19104377 19151344 19289968 19479125 19880857 20398470 20613000 20397524
$$ packed form
8112A4147456k1758J95968K09806q4652k63668m926L63626L23052n9347k29248
8102A4576309M6892L68845K97931l4596j52700P2271K65096J31432j02436o4466
8092A5404578J67651K10743J7136p6678K9273L2753j47184j15638K90760N47687
8082A6361081K01929l25893l31277P7273K07936m5703r6360K35059L72230J9887
8072A6676162k41339J07203O11416N03697j35259n37723l52477M4645K62534L24880
8062A7263739L36539K36107M3924l5245N6257J08355L6224Q5007L86179N79281
8052A9096367K53128l60794n63864j11196M38251M87817J77766N2044J93487J80708
8042A9843714j39578l73125k26634M6967J38624J89157M01732N17613K14530k15476
$$ plain form
8032 20397524 20199498 20416837 20828543 20993457 20923472 20943755 21097678 21148170 21049690 20973428
8022 20973428 20937280 20852152 20879904 21260508 21782716 21949272 21750190 21726614 22090817 22351399
8012 22351399 22137345 21870393 22134281 22757663 23087332 22953378 22794913 22914788 23158052
8003 23158052 23364168 23635433 24005558 24247926 24232784 24190084 24403825 24848428 25303376 25647130
7993 25647130 25874344 25998408 26116940 26414815 26900402 27274872 27294381 27161383 27293859 27752758
7983 27752758 28182980 28344098 28409548 28639568 29025999 29429047 29832798 30242543 30525982 30633016
7973 30633016 30819581 31327475 31952387 32315011 32503998 32981199 33797856 34434608 34624892
7964 34624892 34806954 35401092 36133385 36589387 37019520 37921572 39090066 39855696 40191286
$$ packed form
8032B0397524j98026K17339M11706J64914o9985K0283J53923N0492r8480p6262
8022B0973428l6148q5128K7752L80604N22208J66556j99082k3576L64203K60582
8012B2351399k14054k66952K63888O23382L29669j33954j58465J19875K43264
8003B3158052K06116K71265L70125K42368j5142m2700K13741M44603M54948L43754
7993B5647130K27214J24064J18532K97875M85587L74470J9509j32998J32476M58899
7983B7752758M30222J61118O5450K30020L86431M03048M03751M09745K83439J07034
7973C0633016J86565N07894O24912L62624J88987M77201Q16657O36752J90284
7964C4624892J82062N94138P32293M56002M30133R02052J168494P65630L35590
$$ plain form
7955 40191286 40778636 41886063 42978840 43704596 44502303 45791972 47211862 48230885 49019897
7946 49019897 50096919 51481156 52832420 54146758 55652608 57193459 58380834 59297343
7938 59297343 60419433 61829767 63093687 63973378 64683952 65319050 65602309 65450727 65284478
7929 65284478 65446689 65678309 65498362 64845588 64044232 63314001 62566528 61584477 60256806
7920 60256806 58736771 57400866 56463541 55633065 54439659 52934563 51681832 50931512 50221772
7911 50221772 49063755 47660776 46593927 46039785 45662149 45127861 44402071 43622207 42956120
7902 42956120 42533363 42314528 42093989 41774569 41512345 41444461 41445629 41334694 41146436 41001815
7892 41001815 40892053 40807683 40893555 41230752 41636386 41928533 42215481 42664131 43173234 43574787
$$ packed form
7955D0191286N87350J107427J092777P25756P97707J289669J419890J019023P89012
7946D9019897J077022J384237J351264J314338J505850J540851J187375R16509
7938E9297343J122090J410334J263920Q79691P10574O35098K83259j51582j66249
7929F5284478J62211K31620j79947o52774q01356p30231p47473r82051j327671
7920F0256806j520035j335905r37325q30476j193406j505096j252731p50320p09740
7911E0221772j158017j402979j066849n54142l77636n34288p25790p79864o66087
7902D2956120m22757k18835k20539l19420k62224o7884J168j10935j88258j44621
7892D1001815j09762q4370Q5872L37197M05634K92147K86948M48650N09103M01553
$$ plain form
7882 43574787 43979724 44595575 45361110 46105642 46918705 47994270 49248864 50477622 51727806
7873 51727806 53055219 54036092 54071880 53182628 51993868 50917596 49864700 48792144 47904538
7864 47904538 47124508 45966921 44267106 42544064 41284334 40305153 39230473 38199703
7856 38199703 37603471 37372198 37038263 36404401 35734088 35314859 35157800 35110530 35015318 34774400
7846 34774400 34435176 34153339 33955754 33684558 33302562 33039553 33050413 33154837 33142417 33109851
7836 33109851 33240909 33482193 33726816 34090125 34669758 35243252 35573264 35831576 36337789
7827 36337789 37057816 37787938 38672533 40046403 41849737 43687269 45399004 47040954 48321466
7818 48321466 48656021 47909618 46567878 45025558 43215768 41130900 39175466 37674742
$$ packed form
7882D3574787M04937O15851P65535P44532Q13063J075565J254594J228758J250184
7873E1727806J327413R80873L5788q89252j188760j076272j052896j072556q87606
7864D7904538p80030j157587j699815j723042j259730r79181j074680j030770
7856C8199703n96232k31273l33935o33862o70313m19229j57059m7270r5212k40918
7846C4774400l39224k81837j97585k71196l81996k63009J0860J04424j2420l2566
7836C3109851J31058K41284K44623L63309N79633N73494L30012K58312N06213
7827C6337789P20027P30122Q84595J373870J803334J837532J711735J641950J280512
7818D8321466L34555p46403j341740j542320j809790k084868j955434j500724
$$ plain form
7810 37674742 36437771 35137953 33809633 32682880 31822257 31184479 30733695 30264556 29456531
7801 29456531 28384592 27626871 27534761 27718754 27607771 27192581 26816804 26551924 26264489
7792 26264489 26056425 26110414 26249887 26161363 25945789 25946299 26110387 26059403 25789051 25770822 26267273
7781 26267273 27000894 27614511 28066499 28479182 28977256 29753841 30897815 32053091 32629668
7772 32629668 32446906 31795229 30834948 29443062 27766940 26335283 25336255 24325116 23017621
7763 23017621 21867561 21379761 21273451 20887593 20118306 19386584 18893007 18484794 18130876
7754 18130876 17951336 17817002 17455697 16962446 16703464 16687586 16533681 16124189 15782595 15682179
7744 15682179 15580299 15323005 15132158 15141364 15084728 14746730 14338126 14106778 13933047 13656581
$$ packed form
7810C7674742j236971j299818j328320j126753q60623o37778m50784m69139q08025
7801B9456531j071939p57721r2110J83993j10983m15190l75777k64880k87435
7792B6264489k08064N3989J39473q8524k15574N10J64088n0984k70352j8229M96451
7781B6267273P33621O13617M51988M12683M98074P76585J143974J155276N76577
7772C2629668j82762o51677r60281j391886j676122j431657r99028j011139j307495
7763B3017621j150060m87800j06310l85858p69287p31722m93577m08213l53918
7754A8130876j79540j34334l61305m93251k58982j5878j53905m09492l41594j00416
7744A5682179j01880k57294j90847R206n6636l37998m08604k31348j73731k76466
$$ plain form
7734 13656581 13452342 13470909 13425158 13022148 12548516 12467991 12614998 12431742 11961829 11893839
7724 11893839 12444591 12879009 12537763 11814974 11572748 11914811 12154251 11884327 11469563
7715 11469563 11362284 11443636 11335927 11041378 10897785 11024744 11160874 11078691 10889638 10811858
7705 10811858 10819582 10717322 10487550 10345948 10406431 10476910 10328490 10055685 9973757 10179097
7695 10179097 10417931 10453657 10368643 10352594 10345587 10132080 9745801 9512541 9606111 9782055
7685 9782055 9721685 9489875 9422239 9615262 9781740 9665030 9379192 9208033 9225339 9287569
7675 9287569 9301964 9298975 9272892 9156973 8983936 8885570 8871926 8786905 8577809 8435740 8521969
7664 8521969 8703681 8752638 8689252 8692187 8739976 8636227 8405120 8344427 8556399 8705949 8467747
$$ packed form
7734A3656581k04239J8567m5751m03010m73632q0525J47007j83256m69913o7990
7724A1893839N50752M34418l41246p22789k42226L42063K39440k69924m14764
7715A1469563j07279Q1352j07709k94549j43593J26959J36130q2183j89053p7780
7705A0811858P724j02260k29772j41602O0483P0479j48420k72805q1928K05340
7695A0179097K38834L5726q5014j6049p007k13507l86279k33260R3570J75944
7685I782055o0370k31810o7636J93023J66478j16710k85838j71159J7306O2230
7675I287569J4395k989k6083j15919j73037r8366j3644q5021k09096j42069Q6229
7664H521969J81712M8957o3386K935M7789j03749k31107o0693K11972J49550k38202
$$ plain form
7653 8467747 8010808 7767038 7843765 7964541 7941821 7889818 7924878 7956045 7907447 7905614 8055637
7642 8055637 8203985 8136566 7904550 7745586 7750369 7811993 7860320 7923052 7954184 7833721 7599804
7631 7599804 7475472 7564780 7698630 7699898 7630744 7621804 7616435 7500141 7372665 7430425 7614023
7620 7614023 7642414 7433341 7234554 7244886 7341145 7327523 7247786 7249370 7300373 7284441 7271486
7609 7271486 7422635 7661396 7712969 7501034 7255812 7161362 7134461 7053633 6966247 6913153 6778705
7598 6778705 6540168 6473376 6810714 7301381 7443308 7139714 6801502 6739322 6777353 6627872
7588 6627872 6369594 6294356 6438891 6550768 6477830 6354229 6368047 6513575 6635994 6622029
7578 6622029 6490939 6340030 6225734 6103427 5931458 5832023 6017467 6476218 6870821 6902702
$$ packed form
7653H467747m56939k43770P6727J20776k2720n2003L5060L1167m8598j833J50023
7642H055637J48348o7419k32016j58964M783O1624M8327O2732L1132j20463k33917
7631G599804j24332Q9308J33850J268o9154q940n369j16294j27476N7760J83598
7620G614023K8391k09073j98787J0332R6259j3622p9737J584N1003j5932j2955
7609G271486J51149K38761N1573k11935k45222r4450k6901q0828q7386n3094j34448
7598F778705k38537o6792L37338M90667J41927l03594l38212o2180L8031j49481
7588F627872k58278p5238J44535J11877p2938j23601J3818J45528J22419j3965
7578F622029j31090j50909j14296j22307j71969r9435J85444M58751L94603L1881
$$ plain form
7568 6902702 6678137 6529238 6556831 6585331 6532239 6542336 6702292 6878394 6943687 6944191 6915615
7557 6915615 6759978 6482249 6345578 6543995 6848467 6849432 6511724 6244002 6389774 6832674
7547 6832674 7157144 7085007 6725831 6468541 6605608 7002472 7215899 7025594 6716221 6679486
7537 6679486 6895389 7061659 7106328 7210212 7352405 7260212 6931974 6811750 7193013 7749549
7527 7749549 7967729 7835442 7768756 7984321 8292957 8480072 8563477 8626087 8665418 8706945
7517 8706945 8851375 9078338 9159910 8930171 8569192 8463218 8757963 9144889 9176879 8790014
7507 8790014 8406304 8433797 8763866 8952635 8851462 8759241 8869959 8919153 8641266 8294125
7497 8294125 8328445 8682103 8853208 8661130 8482494 8622063 8867228 8890295 8759625 8758714
$$ packed form
7568F902702k24565j48899K7593K8500n3092J0097J59956J76102O5293N04k8576
7557F915615j55637k77729j36671J98417L04472R65l37708k67722J45772M42900
7547F832674L24470p2137l59176k57290J37067L96864K13427j90305l09373l6735
7537F679486K15903J66270M4669J03884J42193r2193l28238j20224L81263N56536
7527G749549K18180j32287o6686K15565L08636J87115Q3405O2610L9331M1527
7517H706945J44430K26963Q1572k29739l60979j05974K94745L86926L1990l86865
7507H790014l83710K7493L30069J88769j01173r2221J10718M9194k77887l47141
7497H294125L4320L53658J71105j92078j78636J39569K45165K3067j30670r11
$$ plain form
7487 8758714 8924269 9068389 9120212 9160281 9199703 9191932 9220414 9416123 9681439 9735983 9504539
7476 9504539 9272531 9354995 9736478 10144162 10394164 10544984 10728935 10950935 11123029 11245238
7466 11245238 11433358 11721672 11938709 11896177 11656735 11479084 11501765 11613671 11652245 11598335
7456 11598335 11544778 11590285 11782610 12044989 12169422 12048367 11896442 12012754 12310320 12374038
7446 12374038 12066552 11750167 11746650 11912065 11988314 12041251 12207623 12303113 12125124 11939160
7436 11939160 12162632 12667875 12919386 12788158 12695859 12872127 13013086 12888228 12792240 13052759
7426 13052759 13453322 13542638 13304672 13154345 13368470 13811056 14175275 14289722 14224718 14229533
7416 14229533 14492943 14883435 15068539 14976903 14927752 15154985 15448774 15508437 15434707 15550412
$$ packed form
7487H758714J65555J44120N1823M0069L9422p771K8482J95709K65316N4544k31444
7476I504539k32008Q2464L81483M07684K50002J50820J83951K22000J72094J22209
7466A1245238J88120K88314K17037m2532k39442j77651K2681J11906L8574n3910
7456A1598335n3557M5507J92325K62379J24433j21055j51925J16312K97566O3718
7446A2374038l07486l16385l517J65415P6249N2937J66372R5490j77989j85964
7436A1939160K23472N05243K51511j31228r2299J76268J40959j24858r5988K60519
7426A3052759M00563Q9316k37966j50327K14125M42586L64219J14447o5004M815
7416A4229533K63410L90492J85104r1636m9151K27233K93789N9663p3730J15705
$$ plain form
7406 15550412 15860652 16040136 15934909 15767431 15792858 15989692 16172359 16250513 16301151 16464429
7396 16464429 16788092 17138689 17331863 17398426 17578213 17942708 18214330 18165897 18026467 18197924
7386 18197924 18670832 19053801 19162492 19246136 19568621 20057284 20481568 20752026 20917576 21039785
7376 21039785 21179584 21372668 21540584 21552473 21424801 21323410 21326773 21328235 21201080 20907536
7366 20907536 20435865 19832442 19335140 19238581 19517272 19781076 19733807 19506477 19408417 19520373
7356 19520373 19697511 19837104 19954516 20064654 20147956 20211761 20293728 20434537 20683323 21050747
7346 21050747 21428578 21673356 21805192 21979224 22224694 22412428 22557059 22898112 23502580
7337 23502580 24021354 24115345 23971116 24075890 24541751 24976158 25050852 24897195 24818300 24848266
$$ packed form
7406A5550412L10240J79484j05227j67478K5427J96834J82667P8154N0638J63278
7396A6464429L23663L50597J93174O6563J79787L64495K71622m8433j39430J71457
7386A8197924M72908L82969J08691Q3644L22485M88663M24284K70458J65550J22209
7376B1039785J39799J93084J67916J1889j27672j01391L363J462j27155k93544
7366B0907536m71671o03423m97302r6559K78691K63804m7269k27330r8060J11956
7356A9520373J77138J39593J17412J10138Q3302O3805Q1967J40809K48786L67424
7346B1050747L77831K44778J31836J74032K45470J87734J44631L41053O04468
7337B3502580N18774R3991j44229J04774M65861M34407P4694j53657p8895K9966
$$ plain form
7327 24848266 24784947 24521287 24142082 23739607 23318808 22910321 22613620 22421769 22111996 21483460
7317 21483460 20684715 20111938 19922437 19842835 19581963 19225864 19005132 18859929 18568307 18203404
7307 18203404 18064116 18145681 18089982 17753565 17418542 17281070 17145509 16874409 16738350 16958863
7297 16958863 17234314 17150152 16819122 16653163 16668912 16518637 16144009 15895652 15946048 16015624
7287 16015624 15811522 15407877 15058391 14885321 14848692 14803057 14536491 13986305 13443703 13279371
7277 13279371 13419727 13376092 12878019 12211424 11810901 11744253 11733605 11519446 11097910 10708520
7267 10708520 10607869 10738838 10696770 10219796 9602969 9337161 9443176 9541004 9494520 9497614
7257 9497614 9519164 9242439 8712969 8471696 8751896 9053503 8881889 8452061 8229045 8181440
$$ packed form
7327B4848266o3319k63660l79205m02475m20799m08487k96701j91851l09773o28536
7317B1483460p98745n72777j89501p9602k60872l56099k20732j45203k91622l64903
7307A8203404j39288Q1565n5699l36417l35023j37472j35561k71100j36059K20513
7297A6958863K75451q4162l31030j65959J5749j50275l74628k48357N0396O9576
7287A6015624k04102m03645l49486j73070l6629m5635k66566n50186n42602j64332
7277A3279371J40356m3635m98073o66595m00523o6648j0648k14159m21536l89390
7267A0708520j00651J30969m2068m76974o16827k65808J06015R7828m6484L094
7257I497614K1550k76725n29470k41273K80200L01607j71614m29828k23016m7605
$$ plain form
7247 8181440 8005357 7765786 7740977 7829545 7688736 7373939 7299527 7561634 7776683 7649870
7237 7649870 7301566 6962869 6710663 6591244 6681504 6901500 6996897 6806734 6406326 5989840
7227 5989840 5760954 5855114 6157494 6293434 6046125 5681661 5590859 5740070 5808929 5739924
7217 5739924 5732631 5765256 5594201 5251110 5080727 5198549 5331342 5296286 5222458 5178411 5012736
7206 5012736 4736530 4645237 4838739 5000294 4890335 4699413 4656642 4646419 4513868 4420777
7196 4420777 4551241 4728275 4673189 4439810 4274927 4240198 4263395 4351979 4450756 4316219
7186 4316219 3885999 3565413 3745873 4194084 4342475 4083437 3835142 3855214 3936723 3850244
7176 3850244 3697801 3685715 3819045 3951426 3952715 3761424 3437894 3188808 3170313 3268129
$$ packed form
7247H181440j76083k39571k4809Q8568j40809l14797p4412K62107K15049j26813
7237G649870l48304l38697k52206j19419R0260K19996R5397j90163m00408m16486
7227E989840k28886R4160L02380J35940k47309l64464r0802J49211O8859o9005
7217E739924p293L2625j71055l43091j70383J17822J32793l5056p3828m4047j65675
7206E012736k76206r1293J93502J61555j09959j90922m2771j0223j32551r3091
7196D420777J30464J77034n5086k33379j64883l4729K3197Q8584R8777j34537
7186D316219m30220l20586J80460M48211J48391k59038k48295K0072Q1509q6479
7176C850244j52443j2086J33330J32381J289j91291l23530k49086j8495R7816
$$ plain form
7166 3268129 3244975 3079675 2966697 3009380 3125298 3237891 3346310 3406437 3343165 3188660
7156 3188660 3049858 2968622 2949590 3020372 3092441 2932796 2527867 2282246 2502955 2858657
7146 2858657 2797889 2388379 2215489 2475189 2742137 2715488 2609052 2622129 2593469 2451404
7136 2451404 2474979 2763141 2925399 2692477 2396702 2418386 2571519 2520793 2414167 2536350
7126 2536350 2667686 2431261 2045618 2051071 2413610 2584311 2405356 2269933 2346355 2336006
7116 2336006 2133324 2052773 2181651 2148405 1827615 1666012 1936486 2234968 2164988 2004177
7106 2004177 2166526 2455823 2452832 2277584 2312122 2442406 2280468 1966958 2008174 2361695
7096 2361695 2435204 2075739 1831042 2026080 2265022 2165831 1975342 2042939 2196926 2108944
$$ packed form
7166C268129k3154j65300j12978M2683J15918J12593J08419O0127o3272j54505
7156C188660j38802q1236j9032P0782P2069j59645m04929k45621K20709L55702
7146B858657o0768m09510j72890K59700K66948k6649j06436J3077k8660j42065
7136B451404K3575K88162J62258k32922k95775K1684J53133n0726j06626J22183
7126B536350J31336k36425l85643N453L62539J70701j78955j35423P6422j0349
7116B336006k02682q0551J28878l3246l20790j61603K70474K98482o9980j60811
7106B004177J62349K89297k991j75248L4538J30284j61938l13510M1216L53521
7096B361695P3509l59465k44697J95038K38942r9191j90489O7597J53987q7982
$$ plain form
7086 2108944 1867298 1720736 1610782 1438615 1459778 1869987 2270694 2145093 1687008 1538836
7076 1538836 1806787 1981525 1829716 1695448 1788583 1807605 1524877 1213268 1178170 1303444
7066 1303444 1382100 1507397 1788102 2007120 1930918 1707198 1623035 1685420 1734117 1742217 1718606
7055 1718606 1558513 1294891 1238069 1523497 1778348 1626333 1287481 1244605 1516180 1726046
7045 1726046 1729015 1669038 1541314 1232811 939844 999290 1295057 1357816 1098396 922072
7035 922072 1038718 1185329 1157220 1101397 1121237 1085410 1009887 1134310 1415470 1454954 1174731
7024 1174731 1039995 1301743 1539214 1342933 971184 879843 1025651 1120446 1201973 1434002
7014 1434002 1645032 1580928 1370108 1271798 1223612 1096415 1093679 1385809 1655595 1571282 1402629
$$ packed form
7086B108944k41646j46562j09954j72167K1163M10209M00707j25601m58085j48172
7076A538836K67951J74738j51809j34268R3135J9022k82728l11609l5098J25274
7066A303444P8656J25297K80705K19018p6202k23720q4163O2385M8697Q100k3611
7055A718606j60093k63622n6822K85428K54851j52015l38852m2876K71575K09866
7045A726046K969n9977j27724l08503k92967N9446K95767O2759k59420j76324
7035I22072J16646J46611k8109n5823J9840l5827p5523J24423K81160L9484k80223
7024A174731j34736K61748K37471j96281l71749r1341J45808R4795Q1527K32029
7014A434002K11030o4104k10820r8310m8186j27197k736K92130K69786q4313j68653
$$ plain form
7003 1402629 1538750 1713276 1460282 1070366 1203121 1689005 1699346 1138026 845641 1209092
6993 1209092 1572810 1419112 1183061 1336501 1511902 1245711 896884 1020914 1352767 1259870
6983 1259870 855276 811805 1248351 1588796 1481591 1173487 953910 835056 838777 1060745
6973 1060745 1363080 1459258 1362129 1326543 1341581 1156449 845512 819383 1141403 1340071
6963 1340071 1116349 784747 743341 904777 968012 916110 890447 841014 687936 641438 954483
6952 954483 1443259 1640267 1427520 1175081 1185511 1312293 1275251 1102163 1029431 1104922
6942 1104922 1145036 1062244 997296 1048973 1061137 839533 483738 319390 512618 904938
6932 904938 1240360 1401896 1387210 1219844 989968 865346 933940 1082265 1110502 940183
$$ packed form
7003A402629J36121J74526k52994l89916J32755M85884J0341n61320k92385L63451
6993A209092L63718j53698k36051J53440J75401k66191l48827J24030L31853r2897
6983A259870m04594m3471M36546L40445j07205l08104k19577j18854L721K21968
6973A060745L02335R6178r7129l5586J5038j85132l10937k6129L22020J98668
6963A340071k23722l31602m1406J61436O3235n1902k5663m9433j53078m6498L13045
6952I54483M88776J97008k12747k52439J0430J26782l7042j73088p2732P5491
6942A104922M0114q2792o4948N1677J2164k21604l55795j64348J93228L92320
6932I04938L35422J61536j4686j67366k29876j24622O8594J48325K8237j70319
$$ plain form
6922 940183 684309 565599 747797 1138326 1382182 1216920 824959 626375 727667 859605
6912 859605 893298 1031229 1324783 1418484 1090559 696624 667824 849025 812840 617689
6902 617689 690843 1043489 1198686 969784 762053 911593 1181800 1177978 920215 730977
6892 730977 788325 1016855 1241509 1278386 1040161 685511 502514 553739 626606 603863 637114
6881 637114 839481 1056276 1102012 1022379 965128 959555 949279 886683 714990 437805 248230
6870 248230 346076 582451 593836 369515 318719 618557 888975 771705 473353 407052
6860 407052 594082 779442 890233 994614 1003662 816198 630740 729880 1030153 1185418
6850 1185418 1077300 896932 801238 776061 780276 762776 614722 350541 215398 351207
$$ packed form
6922I40183k55874j18710J82198L90529K43856j65262l91961j98584J01292J31938
6912H59605L3693J37931K93554R3701l27925l93935k8800J81201l6185j95151
6902F17689P3154L52646J55197k28902k07731J49540K70207l822k57763j89238
6892G30977N7348K28530K24654L6877k38225l54650j82997N1225P2867k2743L3251
6881F37114K02367K16795M5736p9633n7251n573j0276o2596j71693k77185j89575
6870B48230R7846K36375J1385k24321n0796K99838K70418j17270k98352o6301
6860D07052J87030J85360J10791J04381R048j87464j85458R9140L00273J55265
6850A185418j08118j80368r5694k5177M215j7500j48054k64181j35143J35809
$$ plain form
6840 351207 520412 475376 412301 655063 1047700 1146241 934433 827226 961015 1017212
6830 1017212 839935 697487 746787 730836 476423 267766 393282 653110 679637 514070
6820 514070 498871 723411 906122 808154 532483 375325 485082 694578 704612 474659
6810 474659 329624 520499 809353 785193 506317 422616 648144 783104 596924 408606
6800 408606 523424 721729 665206 460417 414103 506776 536336 557706 718954 826246 575407
6789 575407 153495 103339 533882 916554 811184 429800 286135 550762 953060 1149683
6779 1149683 1026347 742085 575133 642442 751350 656811 447209 450702 712662 840721
6769 840721 545628 120733 109839 581478 1017085 963560 562790 299797 391415 631214
$$ packed form
6840C51207J69205m5036o3075K42762L92637R8541k11808j07207J33789N6197
6830A017212j77277j42448M9300j5951k54413k08657J25516K59828K6527j65567
6820E14070j5199K24540J82711r7968k75671j57158J09757K09496J0034k29953
6810D74659j45035J90875K88854k4160k78876q3701K25528J34960j86180j88318
6800D08606J14818J98305n6523k04789m6314R2673K9560K1370J61248J07292k50839
6789E75407m21912n0156M30543L82672j05370l81384j43665K64627M02298J96623
6779A149683j23336k84262j66952O7309J08908r4539k09602L493K61960J28059
6769H40721k95093m24895j0894M71639M35607n3525m00770k62993R1618K39799
$$ plain form
6759 631214 767324 778315 723777 569877 332647 212851 356007 586376 622668 476838
6749 476838 371405 336251 224738 101614 204681 453807 441609 91586 -106272 204820
6739 204820 700744 878097 764290 712199 763026 684556 462205 285938 172886 47892
6729 47892 76596 433703 826236 779736 389264 240830 524359 778200 663268 448644
6719 448644 476099 621808 618359 525826 525396 539202 405536 214771 162098 245723 371574
6708 371574 564544 815147 913264 721527 454205 404842 535564 603176 551596 496741 447900
6697 447900 345731 285714 401432 587330 633092 585628 664064 827543 769542 420137 142318
6686 142318 258434 597169 717358 473113 160306 110931 293981 402537 277886 110453
$$ packed form
6759F31214J36110J0991n4538j53900k37230j19796J43156K30369L6292j45830
6749D76838j05433l5154j11513j23124J03067K49126j2198l50023j97858L11092
6739B04820M95924J77353j13807n2091N0827p8470k22351j76267j13052j24994
6729D7892K8704L57107L92533m6500l90472j48434K83529K53841j14932k14624
6719D48644K7455J45709l449r2533m30J3806j33666j90765n2673Q3625J25851
6708C71574J92970K50603R8117j91737k67322m9363J30722O7612n1580n4855m8841
6697D47900j02169o0017J15718J85898M5762m7464P8436J63479n8001l49405k77819
6686A42318J16116L38735J20189k44245l12807m9375J83050J08556j24651j67433
$$ plain form
6676 110453 151986 347601 430586 332679 260279 328745 381472 283070 140979 76287 23814
6665 23814 -32794 112044 531636 866129 746430 367666 234272 424059 552659 457663
6655 457663 427763 630949 782349 634675 422336 478546 672870 613516 276815 55242
6645 55242 184864 449617 540442 458671 413016 476458 532157 503054 455958 447349 411631 298147
6633 298147 217784 308813 503711 598122 546951 497865 493986 379267 120033 -20617 151638
6622 151638 413001 418259 218628 161737 333088 447615 333660 190495 240349 397166
6612 397166 452620 392165 347396 372406 432268 519827 638271 720401 677341 510048 321602
6601 321602 238312 310737 436842 423371 223766 59692 155100 402719 500862 393617 317933
$$ packed form
6676A10453M1533J95615Q2985r7907p2400O8466N2727r8402j42091o4692n2473
6665B3814n6608J44838M19592L34493j19699l78764j33394J89787J28600r4996
6655D57663k9900K03186J51400j47674k12339N6210J94324n9354l36701k21573
6645E5242J29622K64753R0825q1771m5655O3442N5699k9103m7096q609l5718j13484
6633B98147q0363R1029J94898R4411n1171m9086l879j14719k59234j40650J72255
6622A51638K61363N258j99631n6891J71351J14527j13955j43165M9854J56817
6612C97166N5454o0455m4769K5010N9862Q7559J18444Q2130m3060j67293j88446
6601C21602q3290P2425J26105j3471j99605j64074R5408K47619R8143j07245p5684
$$ plain form
6590 317933 392487 456081 412613 435307 640169 809902 689918 379964 173289 134333 105749
6579 105749 63155 181230 519943 859390 925442 670538 296801 83176 192128 549693
6569 549693 881233 920490 627878 220211 -3685 93650 354001 465028 322753 197322
6559 197322 392121 791784 974323 777937 491234 404676 449012 427572 351014 329095 332637
6548 332637 295102 291568 389207 463943 399379 331099 436880 601585 576037 394386 334143
6537 334143 477893 598642 519068 348197 293969 412275 596086 692846 617776 445131
6527 445131 351475 380925 371926 247376 218897 478111 823522 892114 683445 527535 558388
6516 558388 568756 432443 325854 403234 538825 561749 534922 629438 866909 1126121 1303185
$$ packed form
6590C17933P4554O3594m3468K2694K04862J69733j19984l09954k06675l8956k8584
6579A05749m2594J18075L38713L39447O6052k54904l73737k13625J08952L57565
6569E49693L31540L9257k92612m07667k23896R7335K60351J11027j42275j25431
6559A97322J94799L99663J82539j96386k86703q6558M4336k1440p6558k1919L542
6548C32637l7535l534R7639P4736o4564o8280J05781J64705k5548j81651o0243
6537C34143J43750J20749p9574j70871n4228J18306J83811R6760p5070j72645
6527D45131r3656K9450q999j24550k8479K59214L45411O8592k08669j55910L0853
6516E58388J0368j36313j06589P7380J35591K2924k6827R4516K37471K59212J77064
$$ plain form
6505 1303185 1370686 1362071 1348510 1358868 1333979 1255613 1248142 1387169 1493588 1352866 1073360
6494 1073360 942564 966535 883982 642427 491035 532908 563169 476138 461503 623490 765488
6483 765488 768244 831888 1074573 1216648 992847 617812 490498 628393 731854 655662
6473 655662 493625 322031 170628 150918 329159 554485 652336 670721 703174 642312 404066
6462 404066 225449 382369 728679 880707 772588 660081 649517 618735 559704 581395
6452 581395 580911 350765 48648 94768 492067 715961 477511 161468 227855 554332 719020
6441 719020 644863 572802 583438 547980 479041 556411 774006 864708 681939 446704 469699
6430 469699 736074 921961 819759 608994 595842 755504 741814 408794 85801 140148
$$ packed form
6505A303185O7501q615j3561J0358k4889p8366p471J39027J06419j40722k79506
6494A073360j30796K3971q2553k41555j51392M1873L0261q7031j4635J61987J41998
6483G65488K756O3644K42685J42075k23801l75035j27314J37895J03461p6192
6473F55662j62037j71594j51403j9710J78241K25326R7851J8385L2453o0862k38246
6462D04066j78617J56920L46310J52028j08119j12507j0564l0782n9031K1691
6452E81395m84k30146l02117M6120L97299K23894k38450l16043O6387L26477J64688
6441G19020p4157p2061J0636l5458o8939P7370K17595R0702j82769k35235K2995
6430D69699K66375J85887j02202k10765j3152J59662j3690l33020l22993N4347
$$ plain form
6420 140148 458822 646060 595729 518771 486560 367187 225760 334354 665348 809994
6410 809994 594130 364127 412463 523686 420274 287649 440299 758356 908199 894461
6400 894461 919283 886962 586282 253224 362762 843887 1076580 793648 450855 490570
6390 490570 727139 762900 603838 502486 504576 527442 644563 906438 1063042 864659
6380 864659 523517 477122 745613 917527 776841 549560 455279 403089 296325 290639 497276
6369 497276 695858 641624 477028 517932 738489 805017 596360 359860 302380 342260 384144
6358 384144 538988 863644 1124363 1095689 937876 973323 1172340 1190491 923186 695475
6348 695475 789916 1052607 1140871 976639 769561 710803 813852 983925 1106517 1118190
$$ packed form
6420A40148L18674J87238n0331p6958l2211j19373j41427J08594L30994J44646
6410H09994k15864k30003M8336J11223j03412j32625J52650L18057J49843j3738
6400H94461K4822l2321l00680l33058J09538M81125K32693k82932l42793L9715
6390D90570K36569L5761j59062j01352K090K2866J17121K61875J56604j98383
6380H64659l41142m6395K68491J71914j40686k27281r4281n2190j06764n686K06637
6369D97276J98582n4234j64596M0904K20557O6528k08657k36500n7480L9880M1884
6358C84144J54844L24656K60719k8674j57813L5447J99017J8151k67305k27711
6348F95475R4441K62691Q8264j64232k07078n8758J03049J70073J22592J1673
$$ plain form
6338 1118190 1078799 1098845 1137616 1019507 751383 632295 854144 1158419 1155071 877793
6328 877793 719278 855650 1059591 1112634 1071721 1024523 899934 702090 653242 859685
6318 859685 1056760 970822 768611 823263 1133610 1329701 1236298 1067865 1002073 924748 759022
6307 759022 711060 924410 1150973 1094706 900219 922933 1120234 1106217 819610 673212
6297 673212 890666 1136627 1089326 994238 1226834 1576348 1498182 994966 701456 998375
6287 998375 1514242 1713591 1588934 1480440 1505193 1516167 1461961 1442979 1463232 1411860 1300878
6276 1300878 1301606 1503371 1783429 1950565 1924009 1766922 1616497 1569857 1594711 1590540 1547183
6265 1547183 1539478 1551036 1478688 1377337 1482237 1843617 2146277 2090974 1782805 1535338
$$ packed form
6338A118190l9391K0046L8771j18109k68124j19088K21849L04275l348k77278
6328H77793j58515J36372K03941N3043m0913m7198j24589j97844m8848K06443
6318H59685J97075q5938k02211N4652L10347J96091r3403j68433o5792p7325j65726
6307G59022m7962K13350K26563n6267j94487K2714J97301j4017k86607j46398
6297F73212K17454K45961m7301r5088K32596L49514p8166n03216k93510K96919
6287I98375N15867J99349j24657j08494K4753J0974n4206j8982K0253n1372j10982
6276A300878P28K01765K80058J67136k6556j57087j50425m6640K4854m171m3357
6265A547183p705J1558p2348j01351J04900L61380L02660n5303l08169k47467
$$ plain form
6255 1535338 1467294 1520351 1673286 1849368 1814624 1528124 1405110 1784810 2284728 2243467
6245 2243467 1764578 1664395 2235005 2726129 2426125 1706604 1464564 1885370 2336604 2318948
6235 2318948 1981048 1717361 1709252 1920577 2197659 2304038 2132610 1922260 1996442 2263771
6225 2263771 2291196 1958094 1707645 1946214 2450095 2655180 2405128 2108633 2157053 2453427
6215 2453427 2625823 2521966 2318828 2225117 2263278 2355544 2464174 2575894 2660182 2722636
6205 2722636 2807509 2878122 2816025 2642252 2599796 2850995 3208644 3368532 3314504 3264548 3302291
6194 3302291 3344870 3428581 3696175 4073888 4286384 4265853 4236998 4308341 4309113 4165902 4107126
6183 4107126 4298616 4570840 4716335 4777735 4825072 4745946 4525711 4455426 4740994 5133471
$$ packed form
6255A535338o8044N3057J52935J76082l4744k86500j23014L79700M99918m1261
6245B243467m78889j00183N70610M91124l00004p19521k42040M20806M51234j7656
6235B318948l37900k63687q109K11325K77082J06379j71428k10350P4182K67329
6225B263771K7425l33102k50449K38569N03881K05085k50052k96495M8420K96374
6215B453427J72396j03857k03138r3711L8161R2266J08630J11720Q4288O2454
6205B722636Q4873P0613o2097j73773m2456K51199L57649J59888n4028m9956L7743
6194C302291M2579Q3711K67594L77713K12496k0531k8855P1343P72j43211n8776
6183D107126J91490K72224J45495O1400M7337p9126k20235p0285K85568L92477
$$ plain form
6173 5133471 5276933 5228523 5298078 5543535 5777144 5943936 6150035 6402159 6622502 6838733
6163 6838733 7093740 7282451 7337980 7428206 7689125 7941351 7980455 7951462 8086367 8279549
6153 8279549 8321673 8342657 8567454 8835946 8884202 8918220 9310096 9855151 10001711 9777639
6143 9777639 9782804 10215085 10629755 10799707 11069441 11601107 11984675 11965725 11930908 12250193
6133 12250193 12693554 12941961 13158884 13573207 13969569 14124982 14345999 15002694 15843282
6124 15843282 16343537 16507487 16768641 17254167 17679590 17909490 18159703 18627918 19251562
6115 19251562 19839655 20242608 20466809 20759679 21403947 22297711 23005600 23375206 23750422
6106 23750422 24372929 24998680 25409997 25873381 26693586 27691149 28532478 29232102 29948657
$$ packed form
6173E133471J43462m8410O9555K45457K33609J66792K06099K52124K20343K16231
6163F838733K55007J88711N5529R0226K60919K52226L9104k8993J34905J93182
6153H279549M2124K0984K24797K68492M8256L4018L91876N45055J46560k24072
6143I777639N165M32281M14670J69952K69734N31666L83568j8950l4817L19285
6133A2250193M43361K48407K16923M14323L96362J55413K21017O56695Q40588
6124A5843282N00255J63950K61154M85526M25423K29900K50213M68215O23644
6115A9251562N88093M02953K24201K92870O44268Q93764P07889L69606L75216
6106B3750422O22507O25751M11317M63384Q20205R97563Q41329O99624P16555
$$ plain form
6097 29948657 30670491 31485869 32705726 34282448 35630318 36548936 37753422 39829344 42224458
6088 42224458 44062328 45437775 47016602 48817854 50396520 51882753 53809895 56184160
6080 56184160 58717066 61648792 65280769 69105860 72647410 76732288 82463314 89352240
6072 89352240 96252816 103773648 113495498 124920129 136178206 148479029 166316240 190694340
6064 190694340 214472274 227601472 226127368 213748467 195895165 175621155 154982469
6057 154982469 136617934 122156012 110864199 101226300 92765865 85601670 79493973 74233908
6049 74233908 70015522 66688143 63499139 60171279 57345313 55375074 53605211 51496687
6041 51496687 49568747 48442850 47698097 46476644 44632164 42559109 40443674 38381679
$$ packed form
6097B9948657P21834Q15378J219857J576722J347870R18618J204486K075922K395114
6088D2224458J837870J375447J578827J801252J578666J486233J927142K374265
6080E6184160K532906K931726L631977L825091L541550M084878N731026O888926
6072H9352240O900576P520832R721850J1424631J1258077J2300823J7837211K4378100
6064A90694340K3777934J3129198j474104j2378901j7853302k0274010k0638686
6057A54982469j8364535j4461922j1291813r637899q460435p164195o107697n260065
6049G4233908m218386l327379l189004l327860k825966j970239j769863k108524
6041E1496687j927940j125897p44753j221453j844480k073055k115435k061995
$$ plain form
6033 38381679 36704077 35475604 34144212 32361867 30675127 29706626 29125388 28191689 26912162
6024 26912162 25842109 25064933 24214822 23314669 22765945 22578734 22338412 21902378 21480224
6015 21480224 21067553 20436217 19667299 19086715 18675235 18120317 17443333 16989980 16788067
6006 16788067 16500181 16043298 15665467 15362998 14848110 14199069 13890694 13975869 13866350 13231744
5996 13231744 12551813 12387533 12570395 12552429 12202678 11799796 11480825 11152706 10838042 10713151
5986 10713151 10794329 10846700 10647923 10216347 9774647 9538730 9504926 9451708 9231458 8989334
5976 8989334 8926225 8939871 8774143 8465601 8290967 8269038 8121993 7816589 7705171 7933164
5966 7933164 8115319 7884377 7422285 7129184 7054291 6998111 6929952 6924605 6869659 6626357 6361002
$$ packed form
6033C8381679j677602j228473j331392j782345j686740r68501n81238r33699j279527
6024B6912162j070053p77176q50111r00153n48724j87211k40322m36034m22154
6015B1480224m12671o31336p68918n80584m11480n54918o76984m53353k01913
6006A6788067k87886m56883l77831l02469n14888o49041l08375Q5175j09519o34606
5996A3231744o79931j64280J82862j7966l49751m02882l18971l28119l14664j24891
5986A0713151Q1178N2371j98777m31576m41700k35917l3804n3218k20250k42124
5976H989334o3109J3646j65728l08542j74634k1929j47045l05404j11418K27993
5966G933164J82155k30942m62092k93101p4893n6180o8159n347n4946k43302k65355
$$ plain form
5955 6361002 6340824 6480873 6460748 6242253 6097133 6124666 6124310 6012292 5993242 6167292 6283819
5944 6283819 6104902 5780981 5616601 5618993 5551511 5366548 5297410 5464229 5629079 5507397
5934 5507397 5181490 4982736 4999330 4954816 4664901 4378504 4446607 4795069 5002427 4856691
5924 4856691 4559152 4364558 4300249 4306429 4373947 4421869 4295789 4038602 3917938 4010482 4013269
5913 4013269 3698529 3317934 3258713 3479697 3619051 3541627 3433141 3404848 3346720 3195770
5903 3195770 3064686 3047947 3109771 3187004 3226025 3148886 2974731 2899071 3014177 3059632 2782114
5892 2782114 2453937 2587855 3116307 3357697 2967873 2443047 2377040 2636910 2691441 2450309
5882 2450309 2280605 2342573 2410746 2347528 2306186 2366346 2340364 2111292 1881920 1883935 2031191
$$ packed form
5955F361002k0178J40049k0125k18495j45120K7533l56j12018j9050J74050J16527
5944F283819j78917l23921j64380K392o7482j84963o9138J66819J64850j21682
5934E507397l25907j98754J6594m4514k89915k86397O8103L48462K07358j45736
5924D856691k97539j94594o4309O180O7518M7922j26080k57187j20664R2544K787
5913D013269l14740l80595n9221K20984J39354p7424j08486k8293n8128j50950
5903C195770j31084j6739O1824P7233L9021p7139j74155p5660J15106M5455k77518
5892B782114l28177J33918N28452K41390l89824n24826o6007K59870N4531k41132
5882B450309j69704O1968O8173o3218m1342O0160k5982k29072k29372K015J47256
$$ plain form
5871 2031191 2065153 1918419 1739160 1633418 1582009 1596313 1761822 2057173 2266914 2198734
5861 2198734 1933524 1734927 1716586 1732781 1646212 1560170 1651133 1868166 1988129 1939725 1863616
5850 1863616 1824648 1694160 1427191 1245274 1347853 1575161 1586558 1327920 1109402 1197728
5840 1197728 1499606 1713854 1692621 1574889 1588216 1755977 1838144 1621809 1244927 1081692
5830 1081692 1257705 1469572 1426776 1281046 1367036 1641221 1705811 1388856 983385 817303
5820 817303 854956 878097 850290 902835 1078761 1273542 1382418 1386294 1327596 1276978 1280797
5809 1280797 1299996 1264985 1205460 1219604 1297261 1313830 1232975 1155071 1124347 1080182 1050099
5798 1050099 1142244 1250293 1073617 624941 396536 711863 1191549 1263860 984560 866000
$$ packed form
5871B031191L3962j46734j79259j05742n1409J4304J65509K95351K09741o8180
5861B198734k65210j98597j8341J6195q6569q6042R0963K17033J19963m8404p6109
5850A863616l8968j30488k66969j81917J02579K27308J1397k58638k18518Q8326
5840A197728L01878K14248k1233j17732J3327J67761Q2167k16335l76882j63235
5830A081692J76013K11867m2796j45730Q5990K74185O4590l16955m05471j66082
5820H17303L7653K3141k7807N2545J75926J94781J08876L876n8698n0618L819
5809A280797J9199l5011n9525J4144P7657J6569q0855p7904l0724m4165l0083
5798A050099R2145J08049j76676m48676k28405L15327M79686P2311k79300j18560
$$ plain form
5788 866000 1032310 1108703 940948 834643 949507 1015767 887775 860803 1109442 1276708
5778 1276708 1036831 680773 672033 928341 1047125 993780 1017354 1066346 889686 630833
5768 630833 692627 998512 1030519 719715 646396 1097579 1538715 1420450 993089 820151
5758 820151 886158 769467 451404 342054 574372 817396 829667 744949 722160 703137 646768
5747 646768 677629 842677 966189 896861 717056 595527 592424 690923 858561 997377 982392
5736 982392 821977 656966 574101 561618 636134 805621 903307 725669 399994 328387 635503
5725 635503 948149 911192 667817 583798 709770 811729 786142 727862 664802 535565 406572
$$ packed form
5788H66000J66310P6393j67755j06305J14864O6260j27992k6972K48639J67266
5778A276708k39877l56058q740K56308J18784n3345K3574M8992j76660k58853
5768F30833O1794L05885L2007l10804p3319M51183M41136j18265m27361j72938
5758H20151O6007j16691l18063j09350K32318K43024J2271q4718k2789j9023n6369
5747F46768L0861J65048J23512o9328j79805j21529l103R8499J67638J38816j4985
5736I82392j60415j65011q2865j2483P4516J69487R7686j77638l25675p1607L07116
5725F35503L12646l6957k43375q4019J25972J01959k5587n8280o3060j29237j28993
$$ [...]
##END NTUPLES=NMR SPECTRUM
##END=
