##TITLE=1H ikalashn
EC-3316(II-3)
21.11.2024
##JCAMPDX= 6.0         $$ Bruker NMR JCAMP-DX V2.0
##DATA TYPE= NMR SPECTRUM
##DATA CLASS= NTUPLES
##ORIGIN= UXNMR, Bruker Analytische Messtechnik GmbH
##OWNER= root
$$ TOPSPIN		Version 1.3
$$ 2024-11-21 13:47:05.093 +0400  Irina@DPX200
$$ Compression mode = diff/dup
##.OBSERVE FREQUENCY= 200.131300845
##.OBSERVE NUCLEUS= ^1H
##.ACQUISITION MODE= SIMULTANEOUS
##.ACQUISITION SCHEME= undefined
##.AVERAGES= 32
##.DIGITISER RES= 18
##SPECTROMETER/DATA SYSTEM= spect
##.PULSE SEQUENCE= zg
##.SOLVENT NAME= CDCl3
##.SHIFT REFERENCE= INTERNAL, CDCl3, 1, 17.49637
##AUDIT TRAIL= $$ (NUMBER, WHEN, WHO, WHERE, WHAT)
$$ ##TITLE= Audit trail, TOPSPIN		Version 1.3
$$ ##JCAMPDX= 5.01
$$ ##ORIGIN= Bruker BioSpin GmbH
$$ ##OWNER= Irina
$$ $$ F:/spectra/data/iren/nmr/1H/4/pdata/1/auditp.txt
$$ ##AUDIT TRAIL=  $$ (NUMBER, WHEN, WHO, WHERE, VERSION, WHAT)
(   1,<2024-11-21 13:46:46.781 +0400>,<Irina>,<DPX200>,<TOPSPIN 1.3>,
      <created by zg
	started at 2024-11-21 13:44:34.390 +0400,
	POWCHK disabled, PULCHK disabled
       configuration hash MD5:
       BE 6D 3F 07 2A EA 11 49 91 17 2B D3 AF B3 58 0D
       data hash MD5: 16K
       0D 82 5C B2 0E 87 59 22 C2 51 A2 8D 29 02 8C D2>)
(   2,<2024-11-21 13:46:47.187 +0400>,<Irina>,<DPX200>,<TOPSPIN 1.3>,
      <Start of raw data processing
       efp BC_mod = 2 LB = 0.02 FT_mod = 6 PKNL = 1 PHC0 = 325.0177 PHC1 = 1.140402 SI = 32K 
       data hash MD5: 32K
       FF 94 6C 77 19 00 E9 93 19 46 2A 32 82 B2 1E 54>)
(   3,<2024-11-21 13:46:53.343 +0400>,<Irina>,<DPX200>,<TOPSPIN 1.3>,
      <apk 
       data hash MD5: 32K
       F6 69 13 BC BB 65 8A 96 69 03 7C 57 52 D1 70 CD>)
(   4,<2024-11-21 13:46:56.125 +0400>,<Irina>,<DPX200>,<TOPSPIN 1.3>,
      <abs n ABSG = 5 
       data hash MD5: 32K
       22 12 2D 49 E5 BE 1D 81 34 94 51 E4 EE 98 2D 1C>)
$$ ##END=
$$ 
$$ $$ hash MD5
$$ $$ E9 83 27 BA CA 4F F3 4C F9 13 D9 77 9D 6F C9 B2
##$RELAX= 
##$RELAX= 
##$RELAX= 
##$RELAX= 
##$RELAX= 
##$RELAX= 
##$RELAX= 
##$RELAX= 
##$RELAX= 
$$ Bruker specific parameters
$$ --------------------------
##$DU= <F:/spectra>
##$EXPNO= 4
##$NAME= <1H>
##$PROCNO= 1
##$TYPE= <nmr>
##$USER= <iren>
##$AMP= (0..31)
100 100 100 100 100 100 100 100 100 100 100 100 100 100 100 100 100 100 
100 100 100 100 100 100 100 100 100 100 100 100 100 100 
##$ANAVPT= -1
##$AQSEQ= 0
##$AQ_mod= 1
##$AUNM= <au_zg>
##$AUTOPOS= <>
##$BF1= 200.13
##$BF2= 200.13
##$BF3= 200.13
##$BF4= 200.13
##$BF5= 200.13
##$BF6= 200.13
##$BF7= 200.13
##$BF8= 200.13
##$BYTORDA= 1
##$CFDGTYP= 0
##$CFRGTYP= 5
##$CHEMSTR= <none>
##$CNST= (0..63)
1 1 145 1 1 1 1 1 1 1 1 1 1 1 1 1 1 1 1 1 1 1 1 1 1 1 1 1 1 1 1 1 1 1 
1 1 1 1 1 1 1 1 1 1 1 1 1 1 1 1 1 1 1 1 1 1 1 1 1 1 1 1 1 1 
##$CPDPRG= <>
##$CPDPRG1= <>
##$CPDPRG2= <>
##$CPDPRG3= <>
##$CPDPRG4= <mlev>
##$CPDPRG5= <mlev>
##$CPDPRG6= <mlev>
##$CPDPRG7= <mlev>
##$CPDPRG8= <mlev>
##$CPDPRGB= <>
##$CPDPRGT= <>
##$D= (0..63)
$$ [...]
##$SW_h= 4401.40845070422
##$TD= 16384
##$TD0= 1
##$TE= 300
##$TE2= 300
##$TE3= 300
##$TEG= 300
##$TL= (0..7)
0 120 120 120 120 120 120 120 
##$TP= (0..7)
150 150 150 150 150 150 150 150 
##$TP07= 0
##$TPNAME0= <>
##$TPNAME1= <>
##$TPNAME2= <>
##$TPNAME3= <>
##$TPNAME4= <>
##$TPNAME5= <>
##$TPNAME6= <>
##$TPNAME7= <>
##$TPOAL= (0..7)
0.5 0.5 0.5 0.5 0.5 0.5 0.5 0.5 
##$TPOFFS= (0..7)
0 0 0 0 0 0 0 0 
##$TUNHIN= 0
##$TUNHOUT= 0
##$TUNXOUT= 0
##$USERA1= <user>
##$USERA2= <user>
##$USERA3= <user>
##$USERA4= <user>
##$USERA5= <user>
##$V9= 5
##$VALIST= <valist>
##$VCLIST= <CCCCCCCCCCCCCCC>
##$VD= 0
##$VDLIST= <DDDDDDDDDDDDDDD>
##$VPLIST= <PPPPPPPPPPPPPPP>
##$VTLIST= <TTTTTTTTTTTTTTT>
##$WBST= 1024
##$WBSW= 25
##$XGAIN= (0..3)
0 0 0 0 
##$XL= 0
##$YL= 0
##$YMAX_a= 1214917
##$YMIN_a= -1679044
##$ZGOPTNS= <>
##$ZL1= 120
##$ZL2= 120
##$ZL3= 120
##$ZL4= 120
##$ABSF1= 17.49637
##$ABSF2= -4.496376
##$ABSG= 5
##$ABSL= 3
##$ALPHA= 0
##$AQORDER= 0
##$ASSFAC= 0
##$ASSFACI= 0
##$ASSFACX= 0
##$ASSWID= 0
##$AUNMP= <proc_1d>
##$AXLEFT= 0
##$AXRIGHT= 0
##$AXTYPE= 0
##$AXUNIT= <>
##$AZFE= 0.1
##$AZFW= 0.1
##$BCFW= 0
##$BC_mod= 2
##$BYTORDP= 0
##$COROFFS= 0
##$CY= 7568.61572265625
##$DATMOD= 1
##$DC= 0
##$DFILT= <>
##$DTYPP= 0
##$F1P= 17.9538593292236
##$F2P= -4.03888763876832
##$FCOR= 0.5
##$FTSIZE= 32768
##$FT_mod= 6
##$GAMMA= 0
##$GB= 0
##$INTBC= 0
##$INTSCL= 5.656564e-011
##$ISEN= 128
##$LB= 0.02
##$LEV0= 0
##$LPBIN= 0
##$MAXI= 945.577
##$MC2= 0
##$MEAN= 0
##$ME_mod= 0
##$MI= -402.1523
##$NCOEF= 0
##$NC_proc= -5
##$NLEV= 6
##$NOISF1= 8.587773
##$NOISF2= 6.764455
##$NSP= 0
##$NTH_PI= 0
##$NZP= 0
##$OFFSET= 17.49637
##$PC= 1
##$PHC0= 322.8444
##$PHC1= 4.6935
##$PH_mod= 1
##$PKNL= yes
##$PPARMOD= 0
##$PPDIAG= 0
##$PPIPTYP= 0
##$PPMPNUM= 100
##$PPRESOL= 1
##$PSCAL= 0
##$PSIGN= 0
##$REVERSE= no
##$SF= 200.13
##$SI= 32768
##$SIGF1= 16.12182
##$SIGF2= -4.496377
##$SINO= 3.521527
##$SIOLD= 32768
##$SREGLST= <1H.CDCl3>
##$SSB= 0
##$STSI= 32768
##$STSR= 0
##$SW_p= 4401.40845070422
##$SYMM= 0
##$S_DEV= 0
##$TDeff= 16384
##$TDoff= 0
##$TI= <>
##$TILT= no
##$TM1= 0
##$TM2= 0
##$TOPLEV= 0
##$USERP1= <user>
##$USERP2= <user>
##$USERP3= <user>
##$USERP4= <user>
##$USERP5= <user>
##$WDW= 1
##$XDIM= 32768
##$YMAX_p= 381122492
##$YMIN_p= -516977
$$ End of Bruker specific parameters
$$ ---------------------------------
##NTUPLES= NMR SPECTRUM
##VAR_NAME=  FREQUENCY,     SPECTRUM/REAL,   SPECTRUM/IMAG
##SYMBOL=    X,             R,               I
##VAR_TYPE=  INDEPENDENT,   DEPENDENT,       DEPENDENT
##VAR_FORM=  AFFN,          ASDF,            ASDF
##VAR_DIM=   32768,         32768,           32768
##UNITS=     HZ,            ARBITRARY UNITS, ARBITRARY UNITS
##FACTOR=    0.134324425510551, 1,           1
##FIRST=     4401.40845070422, 57642,        -1087925
##LAST=      0,             -1164,           -1300577
##MIN=       0,             -516977,         0
##MAX=       4401.40845070422, 381122492,    0
$$ Real data points
##PAGE= N=1
##DATA TABLE= (X++(R..R)), XYDATA
$$ [...]
13430C4068626J336067J462016J498723J529381J604087J722103J891258K098902
$$ 34068626 35404693 36866709 38365432 39894813 41498900 43221003 45112261 47211163
13422D7211163K271013K363433K450170K609314K756522K718399K455134K078818
$$ 47211163 49482176 51845609 54295779 56905093 59661615 62380014 64835148 66913966
13414F6913966J656005J142039N34828o4939o04113j132971j628417j921121j927218
$$ 66913966 68569971 69712010 70246838 70181899 69577786 68444815 66816398 64895277 62968059
13405F2968059j812237j761551j705949j471829j111973q46980p12622n23257
$$ 62968059 61155822 59394271 57688322 56216493 55104520 54257540 53544918 53021661
13397E3021661k13578L8402J20068J88475M22693P46080R59250J028920J088626
$$ 53021661 52808083 52846485 52966553 53155028 53577721 54323801 55283051 56311971 57400597
13388E7400597J238190J477988J771019K055505K269754K463191K786463L266502
$$ 57400597 58638787 60116775 61887794 63943299 66213053 68676244 71462707 74729209
13380G4729209L714258L996189M267892M745552N339192N725806N725331N383860
$$ 74729209 78443467 82439656 86707548 91453100 96792292 102518098 108243429 113627289
13372A13627289M730058L709347K387338R79170m03954j847328l377515m768036
$$ 113627289 118357347 122066694 124454032 125433202 125029248 123181920 119804405 115036369
13364A15036369n711303o097965o058498n800829n449563m991025m370273l674533
$$ 115036369 109325066 103227101 97168603 91367774 85918211 80927186 76556913 72882380
13356G2882380l134084k839351k579558k148378j693488j495218j478488j290567
$$ 72882380 69748296 66908945 64329387 62181009 60487521 58992303 57513815 56223248
13348E6223248q66735n38904m88440m68092k43437L9684J72315K62951N08010
$$ 56223248 55356513 54817609 54329169 53861077 53617640 53657324 53829639 54092590 54600600
13339E4600600Q24204J023861J169569J437294J771634J988989K105743K252283
$$ 54600600 55424804 56448665 57618234 59055528 60827162 62816151 64921894 67174177
13331F7174177K353422K208456J826972J381890Q77815J75393o76516j440464
$$ 67174177 69527599 71736055 73563027 74944917 75822732 75998125 75321609 73881145
13323G3881145k030798k567481l069711l377229l423167l330645l187099k955262
$$ 73881145 71850347 69282866 66213155 62835926 59412759 56082114 52895015 49939753
13315D9939753k650306k379691k168604j956802j778734j717764j687346j521229
$$ 49939753 47289447 44909756 42741152 40784350 39005616 37287852 35600506 34079277
13307C4079277j283270j196032j245992j183150r57507q07501q30561q27167o97905
$$ 34079277 32796007 31599975 30353983 29170833 28213326 27405825 26575264 25748097 25050192
13298B5050192o28003p02934p00825m90478l02831l52186m89658m98261m42176
$$ 25050192 24422189 23719255 23018430 22527952 22225121 21872935 21383277 20885016 20442840
13289B0442840m43081l99100k36611j60521l08215m20456k40500N281m5384k73655
$$ 20442840 19999759 19600659 19364048 19203527 18895312 18474856 18234356 18239637 18194253 17920598
13279A7920598k84315p4356P090j17229j81157j10348j25176k64554k88899j53960
$$ 17920598 17636283 17561927 17569017 17451788 17270631 17160283 17035107 16770553 16481654 16327694
13269A6327694j30299l17784m61109m06974l47530m24346m66592l40726k19078
$$ 16327694 16197395 15879611 15418502 15011528 14663998 14239652 13773060 13432334 13213256
13260A3213256k61354l31614k76470k08190k58962l06523k07323q1144j00793
$$ 13213256 12951902 12620288 12343818 12135628 11876666 11570143 11362820 11281676 11180883
13251A1180883j93107k03853j79277k28438k71062j81257m1838r449n3900o0590
$$ 11180883 10987776 10783923 10604646 10376208 10105146 9923889 9882051 9872602 9818702 9758112
13241I758112n7888j12718j38657m7574M2176o762r2237n6261J6426l6121j28779
$$ 9758112 9700224 9587506 9448849 9401275 9443451 9436689 9344452 9288191 9304617 9268496 9139717
13230I139717q4777O151o8560k33933k34699j00366j06930k77084l27126j68390
$$ 9139717 9054940 9061091 8992531 8758598 8523899 8423533 8316603 8039519 7712393 7544003
13220G544003n9665j48965k44709j97617j50430k12062k20155o8578L1613j00442
$$ 7544003 7484338 7335373 7090664 6893047 6742617 6530555 6310400 6241822 6273435 6172993
13210F172993k65158j93231K46J2048j46107j97980p8818m338o7914j03678j6338
$$ 6172993 5907835 5714604 5714850 5726898 5580791 5382811 5303993 5299655 5231741 5128063 5111725
13199E111725M5206l7561j40732j11420j5977q263p2878p5063p43K3798n6717
$$ 5111725 5156931 5119370 4978638 4867218 4851241 4842978 4770100 4695037 4694294 4718092 4661375
13188D661375j41785j35855p9173n5268n4649k2580J0211l6927j32780j35625
$$ 4661375 4519590 4383735 4304562 4249294 4194645 4172065 4182276 4145349 4012569 3876944
13178C876944m029J09623O5641n8654r3371l2903j4608p5687j05648n4973k0182
$$ 3876944 3872915 3982538 4048179 3989525 3896154 3863251 3848643 3772956 3667308 3612335 3592153
13167C592153o4210j01109m3357N4327Q7372M3447k6379q8935j08357m0929O7694
$$ 3592153 3527943 3426834 3383477 3437804 3525176 3568623 3542244 3453309 3344952 3304023 3371717
13156C371717P9715m3258j41635o5719J01402J60062P0178k9391m1429r977n187
$$ 3371717 3451432 3408174 3266539 3200820 3302222 3462284 3532462 3503071 3461642 3451665 3446478
13145C446478k9876n4578n7120k2207K8181K1782o8483j43786r1087M2994R8732
$$ 3446478 3416602 3362024 3304904 3282697 3310878 3332660 3264177 3120391 3029304 3072298 3171030
13134C171030K3462o5493n8718Q776M1598J8833j3981l1634m7674p0274q3446
$$ 3171030 3194492 3128999 3070281 3079057 3120655 3139488 3125507 3093873 3046199 2975925 2892479
13123B892479o8083k3072L1437O6883O6336L1977k0967o2733n4848N628N6638
$$ 2892479 2824396 2801324 2832761 2899644 2965980 2997957 2976990 2914257 2859409 2865037 2921675
13112B921675L9629o596P139P3574Q1518j4903j15067j09303j1638R2824J42620
$$ 2921675 2961304 2954708 2961847 3035421 3116939 3102036 2986969 2877666 2866028 2958852 3101472
13101C101472R8640l9619j61771j22167M0769J12421J9098m8847L3538Q9681m6976
$$ 3101472 3200112 3160493 2998722 2876555 2917324 3029745 3048843 2999996 3033534 3123215 3076239
13090C076239j90926q1059J49629J51343o4524j30448P1064K16662P8223j24918
$$ 3076239 2885313 2804254 2953883 3105226 3040702 2910254 2981318 3197980 3276203 3151285
13080C151285j09300M6361J00952L8505J997J6120J7292K5519P0090O5191l8034
$$ 3151285 3041985 3088346 3189298 3227803 3229800 3245920 3263212 3288731 3358821 3424012 3385978
13069C385978r8593N898J36996R0741o4284r2294L1677J06000M2929k2652J4674
$$ 3385978 3287385 3293283 3430279 3521020 3456736 3364442 3396119 3502119 3545048 3522396 3537070
13058C537070Q9064J20539J29958J39848J12304M4490N344K9579P2739R8897J22534
$$ 3537070 3626134 3746673 3876631 4016479 4128783 4173273 4178617 4208196 4280935 4379832 4502366
13047D502366J50517J68253J82714J97906J70575Q2069J5041M7202J11993R3740
$$ 4502366 4652883 4821136 5003850 5201756 5372331 5454400 5469441 5516643 5628636 5722376
13037E722376J7866j606L3637K0159n3408j00845j10410j37857j40931l0529J07228
$$ 5722376 5740242 5738636 5772273 5792432 5739024 5638179 5527769 5389912 5248981 5218452 5325680
13026E325680P5237j05247j74199k6249J18369O6069n3590k1553J24264J83187
$$ 5325680 5400917 5295670 5121471 5095222 5213591 5279660 5226070 5204517 5328781 5511968
13016E511968J09249L5124N3568J40961K42196K98241K50310J31219P8964J55296
$$ 5511968 5621217 5656341 5709909 5850870 6093066 6391307 6641617 6772836 6851800 7007096
13006G007096K45392K45483K27367K78433L12455K23555J12742J41637K41567
$$ 7007096 7252488 7497971 7725338 8003771 8316226 8539781 8652523 8794160 9035727
12997I035727K06650L4268p1853l3900L667o2170j59212k22346k95383l75769
$$ 9035727 9242377 9276645 9204792 9170892 9174559 9112389 8953177 8730831 8435448 8059679
12987H059679l58853k35754j65617k35690l11576k53957j38181j12964j61310
$$ 8059679 7700826 7465072 7299455 7063765 6752189 6498232 6360051 6247087 6085777
12978F085777j58428q0004l886K9480K5248l0783j14616j14190J5884J19836L5462
$$ 6085777 5927349 5847345 5843459 5872939 5898187 5867404 5752788 5638598 5654482 5774318 5809780
12967E809780j28417j14108R8819K54142K03274R8981J08984J55205J01399K1903
$$ 5809780 5681363 5567255 5666074 5920216 6123490 6222471 6331455 6486660 6588059 6609962
12957F609962O7298J78253J72931O1642K4506Q2185N1574j12573j93842o5688
$$ 6609962 6677260 6855513 7028444 7090086 7114592 7196777 7248351 7135778 6941936 6876248
12947F876248O3784m0183k60768l06018j56155o4529j46984k40039k02661j16331
$$ 6876248 6940032 6899849 6639081 6333063 6176908 6112379 5965395 5725356 5522695 5406364
12937E406364r9111j21181j14435j04097j19313j09224n4708l5486q1306q8003
$$ 5406364 5307253 5186072 5071637 4967540 4848227 4739003 4684295 4648809 4567503 4479500
12927D479500K698P3874J9005p2147o8854k0148m0295p8260r047J15667J27131
$$ 4479500 4482198 4556072 4575077 4502930 4434076 4413928 4373633 4295373 4286326 4401993 4529124
12916D529124J5312o4611m4915l06L9446J14999J65887O5037j27294j72169p13
$$ 4529124 4544436 4479825 4434910 4434604 4474050 4589049 4754936 4819973 4692679 4520510 4519797
12905D519797J56066J01817m9752p9635J1762N5578j0153q2794o8596J2997Q1532
$$ 4519797 4675863 4777680 4727928 4648293 4660055 4715633 4705480 4622686 4554090 4567087 4648619
12894D648619P5430Q42o3218n0754n741j4257m7487j437R6993R2953l7146j12515
$$ 4648619 4724049 4724891 4661673 4610919 4605178 4590921 4543434 4541997 4638990 4731943 4694797 4582282
12882D582282k5757Q4158O0093l7361o9256m4006l9151k9160L3234P8609M1270
$$ 4582282 4556525 4640683 4700776 4663415 4594159 4550153 4511002 4481842 4515076 4593685 4634955
12871D634955R179P0901J24533M3117p4593m9114O9268Q5986j147j7349O5630
$$ 4634955 4644134 4715035 4839568 4882685 4808092 4758978 4828246 4914232 4913085 4895736 4961366
12860D961366R6950M2841L8884J08536J01315j8568q2914j4047M1239p888k3354
$$ 4961366 5058316 5101157 5140041 5248577 5349892 5331324 5248410 5234363 5275602 5267714 5244360
12849E244360R8461K07655J34471l0498q7962k9030J0192j2207l6959n4467q5822
$$ 5244360 5342821 5550476 5684947 5654449 5566487 5537457 5547649 5535442 5498483 5444016 5358194
12838E358194p8209J1170Q0015J404j51892j73592j6630J31616J00007n5458j42385
$$ 5358194 5279985 5291155 5371170 5372574 5220682 5047090 5030460 5162076 5262083 5206625 5064240
12827E064240o5969P7543J26343M8246k2760K2052R4270L9580r0634p7948J17459
$$ 5064240 4998271 5075814 5202157 5250403 5227643 5249695 5343965 5383545 5292911 5214963 5332422
12816E332422K52060J47358m2966p2134M8688J27741R9629M7567N465n0472o9829
$$ 5332422 5584482 5731840 5688874 5616740 5665428 5793169 5892798 5940365 5945830 5895358 5825529
12805E825529P346R6332P6391J0703M8608J48290J32921O569m3888K0890L3592
$$ 5825529 5832875 5929207 6005598 6016301 6064909 6213199 6346120 6352689 6308801 6329691 6363283
12794F363283n0578m9202J07091K02558Q1495p0940j8535J41117J43515j0982
$$ 6363283 6312705 6263503 6370594 6573152 6654647 6583707 6565172 6706289 6849804 6838822
12784F838822p2003N5430J83624J49754L3506n707N1862J19413J46203J37379
$$ 6838822 6766819 6822249 7005873 7155627 7189133 7183426 7235288 7354701 7500904 7638283
12774G638283R7184L0865k3215j4549O8472J78866K34556J79012N1106k2895M4609
$$ 7638283 7735467 7766332 7743117 7728568 7797040 7975906 8210462 8389474 8440580 8417685 8462294
12763H462294J90211K64021K09189J22671J18296J81115K03423J41551P8431J10403
$$ 8462294 8652505 8916526 9125715 9248386 9366682 9547797 9751220 9892771 9971202 10081605
12753A0081605K11818K64513K18451J60274J87127K68066K99168K62493K39414
$$ 10081605 10293423 10557936 10776387 10936661 11123788 11391854 11691022 11953515 12192929
12744A2192929K69047K90988K59012K23937K47182K97040K99575K54247K30846
$$ 12192929 12461976 12752964 13011976 13235913 13483095 13780135 14079710 14333957 14564803
12735A4564803K63905L05043K90805K32072K16673L07871M40813M67739L45436
$$ 14564803 14828708 15133751 15424556 15656628 15873301 16181172 16621985 17089724 17435160
12726A7435160K19889K40777L42159L38030K16140J67115K83591M07960L78792
$$ 17435160 17655049 17895826 18237985 18576015 18792155 18959270 19242861 19650821 20029613
12717B0029613K75715K76831L86368M68307M77434M87181N26074N52086N78386
$$ 20029613 20305328 20582159 20968527 21436834 21914268 22401449 22927523 23479609 24057995
12708B4057995O66625P83835Q15569P53325P30505Q22230R37835R82837J011946
$$ 24057995 24724620 25508455 26324024 27077349 27807854 28630084 29567919 30550756 31562702
12699C1562702J121623J274880J352566J342513J364644J504166J711216J893838
$$ 31562702 32684325 33959205 35311771 36654284 38018928 39523094 41234310 43128148
12691D3128148K037029K176793K305410K378581K404500K440150K472095K384414
$$ 43128148 45165177 47341970 49647380 52025961 54430461 56870611 59342706 61727120
12683F1727120K108868J733829J368245R62502M07928k16514o81469r21385j120872
$$ 61727120 63835988 65569817 66938062 67900564 68308492 68091978 67410509 66489124 65368252
12674F5368252j402509j615045j577833j378559j231786j147386r62723o56841
$$ 65368252 63965743 62350698 60772865 59394306 58162520 57015134 56052411 55395570
12666E5395570m02407k86806j84520K7911K87782M65450N60467O86730R13641
$$ 55395570 54993163 54706357 54521837 54549748 54837530 55302980 55863447 56550177 57463818
12657E7463818J188434J406660J540195J687347J960190K321076K617081K808174
$$ 57463818 58652252 60058912 61599107 63286454 65246644 67567720 70184801 72992975
12649G2992975L037967L403178L796923M101702M379994M692871M875846M726442
$$ 72992975 76030942 79434120 83231043 87332745 91712739 96405610 101281456 106007898
12641A06007898M295365L731382K952014J791128M02468q51982j903178k976770
$$ 106007898 110303263 114034645 116986659 118777787 119180255 118328273 116425095 113448325
12633A13448325m061978m802629n034838n021200m975319m756776m268776l761266
$$ 113448325 109386347 104583718 99548880 94527680 89552361 84795585 80526809 76765543
12625G6765543l432761l086000k533192k023421j859680j857716j634026j229535
$$ 76765543 73332782 70246782 67713590 65690169 63830489 61972773 60338747 59109212
12617E9109212r79535r09069p41551m29930k03207j06985N1962K99643M69101
$$ 59109212 58129677 57220608 56479057 56049127 55845920 55738935 55790897 56090540 56559641
12608E6559641N94759Q86935J274303J437854J383677J500090J898464K171769
$$ 56559641 57154400 58041335 59315638 60753492 62137169 63637259 65535723 67707492
12600F7707492K016261J643321J320965R42038L62811k29140o56857j121394j824462
$$ 67707492 69723753 71367074 72688039 73630077 73992888 73763748 73106891 71985497 70161035
12591G0161035k512309k823553k856278k943821l057944k914512k554135k322209
$$ 70161035 67648726 64825173 61968895 59025074 55967130 53052618 50498483 48176274
12583D8176274k295721k192355j889911j615049j526572j483702j349386j203330
$$ 48176274 45880553 43688198 41798287 40183238 38656666 37172964 35823578 34620248
12575C4620248j123187j034248r06013q45319q68705q21173o49066n23425n53650
$$ 34620248 33497061 32462813 31556800 30711481 29842776 29021603 28372537 27849112 27295462
12566B7295462n99639n24659m28639m50285n15825m83460l99192m05024m87883
$$ 27295462 26695823 26171164 25742525 25292240 24776415 24292955 23893763 23488739 23000856
12557B3000856n12682m46208l76948l45909l05824k36767j85841j91684k44106
$$ 23000856 22488174 22041966 21665018 21319109 21013285 20776518 20590677 20398993 20154887
12548B0154887l03019l08957k20317q9527l8188r7651j47593q4811K3819M7992
$$ 20154887 19851868 19542911 19322594 19233067 19194879 19097228 18949635 18864824 18888643 18936635
12538A8936635j1330l9875J3305P6846O7220j1929p9894n3936O6006J72260J56030
$$ 18936635 18925305 18885430 18898735 18975581 19042801 19030872 18950978 18897042 18963048 19135308 19291338
12527A9291338N1678K755O6323J47985J65800J60211J76424J62095P7913n463
$$ 19291338 19343016 19345771 19412094 19560079 19725879 19886090 20062514 20224609 20302522 20297059
12517B0297059l4870q6324k12842k91968k01364o0860q8755k57322l17334j76333
$$ 20297059 20262189 20175865 19963023 19671055 19469691 19408831 19320076 19062754 18745420 18569087
12507A8569087k8118m1848j25497j10222r442M5640K1703n412P068L5138N9496
$$ 18569087 18540969 18499121 18373624 18263402 18253960 18299600 18321303 18315891 18322959 18358097 18417593
12496A8417593P5571O4829L6410N6607J51830K26873J85585J02020J41701L05736
$$ 18417593 18493164 18557993 18594403 18651010 18802840 19029713 19215298 19317318 19459019 19764755
12486A9764755L91063K65004O6264L3220J99195L69987L79996K64728J69764J78388
$$ 19764755 20155818 20420822 20487086 20520306 20719501 21089488 21469484 21734212 21903976 22082364
12476B2082364K61139L30850L13999K16906J41550J79319K75504K80997J68203
$$ 22082364 22343503 22674353 22988352 23205258 23346808 23526127 23801631 24082628 24250831
12467B4250831Q9988J55753K59768K47276J59516J59353K67726L46986L31092
$$ 24250831 24340819 24496572 24756340 25003616 25163132 25322485 25590211 25937197 26268289
12458B6268289K98792L04840L08846L06128L61918M63247N00808M62849M81024
$$ 26268289 26567081 26871921 27180767 27486895 27848813 28312060 28812868 29275717 29756741
12449B9756741O05201P07435P10134P26731Q42861R41438R17967R00111J042720
$$ 29756741 30361942 31069377 31779511 32506242 33349103 34290541 35208508 36108619 37151339
12440C7151339J246752J319305J301122J378149J549948J662504J725633J908348
$$ 37151339 38398091 39717396 41018518 42396667 43946615 45609119 47334752 49243100
12432D9243100K218958K474620K624363K824770L126806L355135L397723L359137
$$ 49243100 51462058 53936678 56561041 59385811 62512617 65867752 69265475 72624612
12424G2624612L293422L024982K413481J607895Q46690J48405o12310j424732
$$ 72624612 75918034 78943016 81356497 82964392 83811082 83959487 83347177 81922445
12416H1922445k113944k535512k674231k603380k432496k232286j963903j577446
$$ 81922445 79808501 77272989 74598758 71995378 69562882 67330596 65366693 63789247
12408F3789247j190570r93674r38791p57124l83169r4597o0291k6551K85000P07551
$$ 63789247 62598677 61605003 60666212 59909088 59525919 59431322 59371031 59344480 59629480 60337031
12398F0337031Q93619Q77538R94108J327944J638994J823796K063660K452856
$$ 60337031 61230650 62108188 63102296 64430240 66069234 67893030 69956690 72409546
12390G2409546K834824L125959L491702M046822M645245N139479N611117O128033
$$ 72409546 75244370 78370329 81862031 85908853 90554098 95693577 101304694 107432727
12382A07432727O444136O179302N236838L881021K437390J020954m73024k165840
$$ 107432727 113876863 120056165 125293003 129174024 131611414 132632368 132159344 129993504
12374A29993504l941990n407335o211611o404369o314281o090416n603652m847795
$$ 129993504 126051514 120644179 114432568 108028199 101713918 95623502 90019850 85172055
12366H5172055m133981l707317l415591k993118k484278k121025j920909j700204
$$ 85172055 81038074 77330757 73915166 70922048 68437770 66316745 64395836 62695632
12358F2695632j414275j195486j066511q86411o17265m06007l28819k52730m5837
$$ 62695632 61281357 60085871 59019360 58132949 57515684 57109677 56780858 56528128 56482291
12349E6482291K32443M55435O23187Q19908J052638J243709J366162J504712J748853
$$ 56482291 56714734 57170169 57793356 58613264 59665902 60909611 62275773 63780485 65529338
12340F5529338K045004K202010K085972J774726J430651J045782M67842k98073
$$ 65529338 67574342 69776352 71862324 73637050 75067701 76113483 76581325 76283252
12332G6283252j017091j548240k020878k522613k840634k777339k534784k444793
$$ 76283252 75266161 73717921 71697043 69174430 66333796 63556457 61021673 58576880
12324E8576880k443044k207516j761729j488277j495722j440454j136093q90867
$$ 58576880 56133836 53926320 52164591 50676314 49180592 47740138 46604045 45713178
12316D5713178r76179j156978j097045r03516q62302q91604p26884m84995n34041
$$ 45713178 44736999 43580021 42482976 41579460 40717158 39825554 39098670 38613675 38079634
12307C8079634q43308r62804p17230m62867n04732o64743o48512m98513m08841
$$ 38079634 37236326 36273522 35556292 35093425 34588693 33923950 33275438 32776925 32368084
12298C2368084l55905k20707r5561j53843l14401l27988j58921k2012l8382q3904
$$ 32368084 32012179 31791472 31695911 31542068 31227667 30899679 30740758 30718746 30680364 30596460
12288C0596460j8956J20732K25499K61615K56943K41647K50664K99307L26243
$$ 30596460 30577504 30698236 30923735 31185350 31442293 31683940 31934604 32233911 32560154
12279C2560154K46630Q7464j9160r389L2570Q347o1664r3210o3081j7318J1390
$$ 32560154 32806784 32894248 32875088 32865699 32898269 32906616 32844952 32751742 32688661 32671343 32682733
12268C2682733M2916J11520K04634K39007J26509j00423k71138k59217j50060
$$ 32682733 32725649 32837169 33041803 33280810 33407319 33306896 33035758 32776541 32626481
12259C2626481j24794j99810k24303j54480j60449l69334o42299p42544o35037
$$ 32626481 32501687 32301877 32077574 31923094 31762645 31393311 30751012 30008468 29373431
12250B9373431m79250l86112l29168k65379j99174j26651l8255K1216Q647p671
$$ 29373431 28894181 28508069 28178901 27913522 27714348 27587697 27549442 27570658 27579305 27571634
12240B7571634P6132K10398K27186R6387q116L7458J36856J53225J17917J29225
$$ 27571634 27647766 27858164 28085350 28181737 28173621 28211079 28347935 28501160 28619077 28748302
12230B8748302J58615J19162N0368O2253J35962J53232J11110J29893K28721K72718
$$ 28748302 28906917 29026079 29076447 29138700 29274662 29427894 29539004 29668897 29897618 30170336
12220C0170336K04134J60789K64745M31104N15734N44642O35870P53391P19324
$$ 30170336 30374470 30535259 30800004 31231108 31746842 32291484 32927354 33680745 34400069
12211C4400069M84177K32602J59454K47073L39129L54385L28012K80309J60228
$$ 34400069 34884246 35116848 35276302 35523375 35862504 36216889 36544901 36825210 36985438
12202C6985438n1877k64576l59697l23967k40361j64100p2608N1643J57841J92222
$$ 36985438 36933561 36668985 36309288 35985321 35744960 35580860 35508252 35559895 35717736 35909958
12192C5909958J81366J93063K41308K89908L31429L92463M62692M92274M77964
$$ 35909958 36091324 36284387 36525695 36815603 37147032 37539495 38002187 38494461 38972425
12183C8972425M87420N68535O86307P78775Q28750Q51605Q59385Q70492R12973
$$ 38972425 39459845 40028380 40714687 41493462 42322212 43173817 44033202 44903694 45816667
12174D5816667R85775J054670J109352J174345J239081J245541J189022J156425
$$ 45816667 46802442 47857112 48966464 50140809 51379890 52625431 53814453 54970878
12166E4970878J195097J212178J100376R17629Q29364Q84725R57203R19440P83934
$$ 54970878 56165975 57378153 58478529 59396158 60225522 61110247 62067450 62986890 63770824
12157F3770824O45612N66740N56252N97039O46845O54655O17750N97606O51528
$$ 63770824 64416436 64983176 65539428 66136467 66783312 67437967 68055717 68653323 69304851
12148F9304851P68016Q89094R80821J066724J196004J380414J568058J702394
$$ 69304851 70072867 70961961 71942782 73009506 74205510 75585924 77153982 78856376
12140G8856376J803548J941314K117966K254411K327787K424417K581409K684992
$$ 78856376 80659924 82601238 84719204 86973615 89301402 91725819 94307228 96992220
12132I6992220K653634K624555K775392L019277L099473K984429K929180L086615
$$ 96992220 99645854 102270409 105045801 108065078 111164551 114148980 117078160 120164775
12124A20164775L292729L350392L310049L307065L303215L190091L017006K906787
$$ 120164775 123457504 126807896 130117945 133425010 136728225 139918316 142935322 145842109
12116A45842109K838777K721186K606539K625898K760720K891797L037007L313749
$$ 145842109 148680886 151402072 154008611 156634509 159395229 162287026 165324033 168637782
12108A68637782L675530L923355M006845M085105M237040M340677M322438M297085
$$ 168637782 172313312 176236667 180243512 184328617 188565657 192906334 197228772 201525857
12100B01525857M330805M264291L924047L337975K578930J564483K23938j256374
$$ 201525857 205856662 210120953 214045000 217382975 219961905 221526388 221750326 220493952
12092B20493952k583769l689253m695507n605073o250815o562844o673433o710316
$$ 220493952 217910183 214220930 209525423 203920350 197669535 191106691 184433258 177722942
12084A77722942o662442o509987o325922o161433n955052n648435n301480n008652
$$ 177722942 171060500 164550513 158224591 152063158 146108106 140459671 135158191 130149539
12076A30149539m770709m519385m209162l829561l395477k985215k714602k594974
$$ 130149539 125378830 120859445 116650283 112820722 109425245 106440030 103725428 101130454
12068A01130454k477599k228311j911204j697910j622539j546764j381782j219971
$$ 101130454 98652855 96424544 94513340 92815430 91192891 89646127 88264345 87044374
12060H7044374j170820j157392j005300p14706m98754m88959n23069l57762k4255
$$ 87044374 85873554 84716162 83710862 82996156 82497402 82008443 81485374 81127612 81103357
12051H1103357K08174K26745K31300M10645O56168P68442Q01781R65499J251480
$$ 81103357 81311531 81538276 81769576 82180221 82836389 83604831 84406612 85372111 86623591
12042H6623591J425005J399472J364485J461496J560760J492515J313099J179982
$$ 86623591 88048596 89448068 90812553 92274049 93834809 95327324 96640423 97820405
12034I7820405J107846J024092R54949R70239J017413R91191R17015Q89633Q68320
$$ 97820405 98928251 99952343 100907292 101877531 102894944 103886135 104803150 105692783 106561103
12025A06561103P18915M46683J99490K2571k07475n58020r17595j169694j346133
$$ 106561103 107280018 107726701 107926191 107948762 107741287 107183267 106265672 105095978 103749845
12016A03749845j520632j668600j728232j710426j659204j577242j470514j399063
$$ 103749845 102229213 100560613 98832381 97121955 95462751 93885509 92414995 91015932
12008I1015932j405477j447402j464610j457369j447630j434488j441892j519658
$$ 91015932 89610455 88163053 86698443 85241074 83793444 82358956 80917064 79397406
12000G9397406j623856j599936j394675j189283j171756j242628j130335p86303
$$ 79397406 77773550 76173614 74778939 73589656 72417900 71175272 70044937 69258634
11992F9258634m70179l89365m30121l61803j79396p9701j47575k38978k10601
$$ 69258634 68788455 68399090 67968969 67607166 67427770 67348069 67200494 66961516 66750915
11983F6750915j25610j30422k08346j97848n1932O7912K6776p6543o4899L6491
$$ 66750915 66625305 66494883 66286537 66088689 66036757 66104669 66131445 66054902 65990003 66026494
11973F6026494M6564p2022j57764j29220j16351k16742l08247k56261j50341j39127
$$ 66026494 66073058 66001036 65843272 65714052 65597701 65380959 65072712 64816451 64666110 64526983
11963F4526983j48594L151K76289M44491M51217M85792O64655Q68244R75636J051743
$$ 64526983 64378389 64381540 64657829 65102320 65553537 66039329 66703984 67572228 68547864 69599607
11953F9599607J187796J337427J445972J589037J834498K094341K266936K417661
$$ 69599607 70787403 72124830 73570802 75159839 76994337 79088678 81355614 83773275
11945H3773275K656780K926908L077543L078582K989932K778725K351015J734585
$$ 83773275 86430055 89356963 92434506 95513088 98503020 101281745 103632760 105367345
11937A05367345J052218L34667m52689j206727j725097j986040k178823k380232
$$ 105367345 106419563 106754230 106301541 105094814 103369717 101383677 99204854 96824622
11929I6824622k412905k155046j797119j596611j512071j306935r45031o37613
$$ 96824622 94411717 92256671 90459552 88862941 87350870 86043935 85098904 84461291
11921H4461291m94460l66539j13736J73310L54660M91515P34720J050615J262037
$$ 84461291 83966831 83600292 83486556 83659866 84014526 84506041 85240761 86291376 87553413
11912H7553413J347168J496392J823819K206039K509449K817202L272505L813688
$$ 87553413 88900581 90396973 92220792 94426831 96936280 99753482 103025987 106839675
11904A06839675M265772M633357N069906N543157N761300N514559M896807M076395
$$ 106839675 111105447 115738804 120808710 126351867 132113167 137627726 142524533 146600928
11896A46600928L029232J660962N5125j581115l113539m438977n351194n690937
$$ 146600928 149630160 151291122 151346247 149765132 146651593 142212616 136861422 131170485
11888A31170485n602931n415407n248510m943761m401193l767818l227741k804791
$$ 131170485 125567554 120152147 114903637 109959876 105558683 101790865 98563124 95758333
11880I5758333k460137k201424j989488j707342j344965j061424r34421q04070
$$ 95758333 93298196 91096772 89107284 87399942 86054977 84993553 84059132 83255062
11872H3255062n22190k08181n9486k1825J26723M29962P23879R29313J143777
$$ 83255062 82732872 82524691 82465205 82443380 82570103 83000065 83723944 84653257 85797034
11863H5797034J418189J657663J810380J969449K193381K378924K422609K380137
$$ 85797034 87215223 88872886 90683266 92652715 94846096 97225020 99647629 102027766
11855A02027766K330660K172272J710480R34250P9569o03502j060715j376793
$$ 102027766 104358426 106530698 108241178 109175428 109254997 108651495 107590780 106213987
11847A06213987j582443j604684j416448j160095j039798j094549j162113j102368
$$ 106213987 104631544 103026860 101610412 100450317 99410519 98315970 97153857 96051489
11839I6051489r67960q77194q02441o24768l71086k31450k89027l67638k51348
$$ 96051489 95083529 94206335 93403894 92779126 92408040 92176590 91887563 91519925 91268577
11830I1268577K2621K11262J85102Q3516J10082K56535L27291K28359J21650K19376
$$ 91268577 91291198 91502460 91687562 91771078 91881160 92137695 92464986 92693345 92814995 93034371
11820I3034371M99665P54049Q95394J057451J343976J643871J804527J848828
$$ 93034371 93534036 94288085 95183479 96240930 97584906 99228777 101033304 102882132
11812A02882132J867213J804856J548256J161310Q30522N90864L01923q7962m34156
$$ 102882132 104749345 106554201 108102457 109263767 110094289 110685153 110987076 110899114 110464958
11803A10464958n86376n33289l36592p9142J07935J42875J37928K59542M36483
$$ 110464958 109878582 109345293 109008701 108929559 109037494 109180369 109318297 109577839 110014322
11794A10014322M45405L19701L77256P36768J121950J324756J536879J942308
$$ 110014322 110459727 110779428 111156684 111893452 113015402 114340158 115877037 117819345
11786A17819345K278965K197795J858910J720275J819518J733831J283436Q27634
$$ 117819345 120098310 122296105 124155015 125875290 127694808 129428639 130712075 131539709
11778A31539709P23648Q74325J020729J166970J443117J760437J890790J785237
$$ 131539709 132263357 133137682 134158411 135325381 136768498 138528935 140419725 142204962
11770A42204962J576359J313490Q86333K01660o88264j618079k398360k931938
$$ 142204962 143781321 145094811 145981144 146182804 145494540 143876461 141478101 138546163
11762A38546163l313297l732064m201112m484315m397302m068370l758795l518500
$$ 138546163 135232866 131500802 127299690 122815375 118418073 114349703 110590908 107072408
11754A07072408l198824k754462k331076k036384j800391j528346j261382j093361
$$ 107072408 103873584 101119122 98788046 96751662 94951271 93422925 92161543 91068182
11746I1068182j004965q74966o35122l47556j19838K1585J50732L43522N92477
$$ 91068182 90063217 89188251 88553129 88205573 88085735 88107320 88258052 88601574 89194051
11737H9194051Q43166J085651J356051J660579J968900K286754K654621L054577
$$ 89194051 90037217 91122868 92478919 94139498 96108398 98395152 101049773 104104350
11729A04104350L405012L678993L929559M145333M189157L970085L585142L175679
$$ 104104350 107509362 111188355 115117914 119263247 123452404 127422489 131007631 134183310
11721A34183310K711019K048962J181296K87439m62444j051533j546282j970386
$$ 134183310 136894329 138943291 140124587 140412026 139949582 138898049 137351767 135381381
11713A35381381k278678k400190k290378j985953j617132j329432j187806j170829
$$ 135381381 133102703 130702513 128412135 126426182 124809050 123479618 122291812 121120983
11705A21120983j231100j335471j483443j714695k047272k376428k511776k377554
$$ 121120983 119889883 118554412 117070969 115356274 113309002 110932574 108420798 106043244
11697A06043244k104179j848375j602918j281509r13743o27065m81351m43473
$$ 106043244 103939065 102090690 100487772 99206263 98292520 97665455 97184104 96740631
11689I6740631m84389n74653o19953n36508l69884k18326p9730Q2935J74059N0299
$$ 96740631 96256242 95681589 95061636 94525128 94155244 93936918 93857188 93940123 94114182 94164481
11679I4164481k42063n12811p23271j030819j496828j956556k253850k412197
$$ 94164481 93922418 93409607 92686336 91655517 90158689 88202133 85948283 83536086
11671H3536086k481178k404462k163928j887135j673136j455421j175006r46938
$$ 83536086 81054908 78650446 76486518 74599383 72926247 71470826 70295820 69348882
11663F9348882q97204r57019r86133r96784j082063j207114j250726j199516j140961
$$ 69348882 68451678 67494659 66508526 65511742 64429679 63222565 61971839 60772323 59631362
11654E9631362j112795j103910j143515j237828j285418j223152j189735j349186
$$ 59631362 58518567 57414657 56271142 55033314 53747896 52524744 51335009 49985823
11646D9985823j598166j667470j507757j354100j373914j456276j419546j256353
$$ 49985823 48387657 46720187 45212430 43858330 42484416 41028140 39608594 38352241
11638C8352241j087128r98804r99976j032511r86018q05894o06793n57249o41582
$$ 38352241 37265113 36266309 35266333 34233822 33247804 32441910 31835117 31277868 30636286
11629C0636286o81849o07274n25693m96708m38613l32191l03722l87769m10501
$$ 30636286 29954437 29347163 28821470 28324762 27886149 27553958 27250236 26862467 26451966
11620B6451966k66799j31053j98687l70741m18520l45879l39613m27501m48422
$$ 26451966 26185167 26054114 25855427 25484686 25066166 24720287 24380674 23953173 23504751
11611B3504751l56022l01343l64457m21654l65960k81248k86420l41555l30989
$$ 23504751 23148729 22847386 22482929 22061275 21695315 21414067 21127647 20786092 20455103
11602B0455103k50098j93146k03040k29023k16193j73195j53989j98173k77589
$$ 20455103 20205005 20011859 19808819 19579796 19363603 19190408 19036419 18838246 18560657
11593A8560657l05320k35899j45023j44080k20629k54815k09396j91411k68826
$$ 18560657 18255337 18019438 17874415 17730335 17509706 17254891 17045495 16854084 16585258
11584A6585258l34817k57524r3490k7817j25429k56938k80095j97222j05114o9667
$$ 16585258 16250441 15992917 15899427 15871610 15746181 15489243 15209148 15011926 14906812 14837145
11574A4837145r2314j41821j75265j67709j50925j76518k17043j77246n5877o592
$$ 14837145 14744831 14603010 14427745 14260036 14109111 13932593 13715550 13538304 13482427 13475835
11564A3475835j29740k73985k09933J5017R5637r6685l01431k35113j176P9524
$$ 13475835 13346095 13072110 12862177 12877194 12972831 12876146 12574715 12339602 12338426 12417950
11554A2417950n9853j87145j62612j01488j06074j01220m1128m0368j46450j91341
$$ 12417950 12358097 12170952 12008340 11906852 11800778 11699558 11658430 11618062 11471612 11280271
11544A1280271n9310P6085N005j72768k04112p9084j130k7521k9396Q794m6453
$$ 11280271 11220961 11297046 11302051 11129283 10925171 10846087 10844957 10817436 10788040 10796834 10750381
11533A0750381j76421j73254R43R8627k5679j66483r7652O3317N8747r3506j49032
$$ 10750381 10573960 10400706 10401649 10500276 10474597 10308114 10210462 10273779 10332526 10239020 10089988
11522A0089988k8445Q7489N1468o3153j10104o5893k1963n1671j20128j17041
$$ 10089988 10061543 10149032 10200500 10137347 10027243 9961350 9939387 9887716 9767588 9650547
11512I650547l694Q8940R290j64372j88189k1491P8099m5963j82671r9370N6511
$$ 9650547 9646853 9735793 9745083 9580711 9392522 9371031 9449130 9403167 9220496 9121126 9177637
11501I177637K111j88026j98978j4731N6450q5141j71035m3629P7883q744j51779
$$ 9177637 9179748 8991722 8792744 8778013 8834463 8749322 8578287 8534658 8612541 8603797 8452018
11490H452018j32402k4346j3652p2071p0745m6012r1331j30241n7029K5665k5060
$$ 8452018 8319616 8295270 8281618 8209547 8138802 8092790 8001459 7871218 7814189 7839854 7814794
11479G814794j06912l9442Q6678M0898j34232j75072l8784M7546k489k1990M7106
$$ 7814794 7707882 7668440 7755118 7796016 7661784 7486712 7447928 7495474 7492985 7470995 7518101
11468G518101K8535j28311j91249k4897J58061J27863k7401j08759j17602j31223
$$ 7518101 7546636 7418325 7227076 7202179 7360240 7488103 7460702 7351943 7234341 7103118
11458G103118q4539O4333J39391k65j71697j28798K8087K8142r7422q5521P2783
$$ 7103118 7018579 7082912 7222303 7222038 7050341 6921543 6949630 6977772 6880350 6794829 6867612
11447F867612J09635l8105j15499o065O8365m3727j50480n9516Q9351P6530l9674
$$ 6867612 6977247 6939142 6823643 6817578 6885943 6842216 6691736 6632220 6721571 6798101 6758427
11436F758427p4286m1429o1833q7361K384J22142Q0478q5850j43403k7364O9782
$$ 6758427 6684141 6642712 6580879 6493518 6495902 6618044 6698522 6612672 6469269 6441905 6511687
11425F511687J2036r3116r0207J2358J03691J16261M6099o8770j40311r2429L0868
$$ 6511687 6523723 6430607 6340400 6352758 6456449 6572710 6618809 6550039 6409728 6317299 6348167
11414F348167J01190P2222K5173L1507O2093N8120J2125m3784o6340j8878P2850
$$ 6348167 6449357 6521579 6546752 6578259 6640352 6698472 6710597 6666813 6600473 6581595 6654445
11403F654445J07181L2376n3482l5037L7418L6565j9622j2221M3270J9560o4020
$$ 6654445 6761626 6794002 6740520 6705483 6742901 6779466 6759844 6747623 6790893 6810453 6746433
11392F746433m5615P6689J03710j8927q1563K6539J03977j4974j49420o9279J03611
$$ 6746433 6700818 6777507 6881217 6862290 6780727 6807266 6911243 6896269 6746849 6677570 6781181
11381F781181J00546l8943n7579O2766R3686j0102l3272R5883J61757L8686q3721
$$ 6781181 6881727 6842784 6785205 6847971 6941657 6931555 6898283 6994166 7155923 7194609 7110888
11370G110888j7765J20099J17316l313n7903J2879J09445J44877J07851J7827
$$ 7110888 7093123 7213222 7330538 7327225 7269322 7282201 7391646 7536523 7644374 7662201
11360G662201o9422p4100O19M6617Q677l0995j293L9971K8121P251J6066q516
$$ 7662201 7592779 7518679 7519298 7565915 7574592 7543597 7542304 7582275 7610396 7617647 7633713 7625197
11348G625197q3213p6011P8169J93107P8028j31147j36472P5774K16168J24506
$$ 7625197 7541984 7465973 7544142 7737249 7815277 7684130 7547658 7623432 7839600 7964106
11338G964106l5467o9969j1075J9731J1751J0022P116J656M3949J26778J46562
$$ 7964106 7928639 7858670 7847595 7867326 7879077 7889099 7896215 7897871 7941820 8068598 8215160
11327H215160O3522j7845j8331m502l5034k8632P2114J36827L2021j25487j09578
$$ 8215160 8278682 8260837 8242506 8238004 8202970 8174338 8246452 8383279 8415300 8289813 8180235
11316H180235O8809J71195Q3330n0316p8062l2788k232K1163O1285O6478P518
$$ 8180235 8249044 8420239 8503569 8453253 8375191 8342403 8340171 8361334 8422619 8489097 8496615
11305H496615l8993j1279K9428J9165K2646J12420J98030J36273k9596j05926
$$ 8496615 8457622 8446343 8475771 8494936 8517582 8630002 8828032 8964305 8934709 8828783
11295H828783j8846J04292J37447R3595L1782k6945m3004L8004J58594J68283
$$ 8828783 8809937 8914229 9051676 9145271 9177053 9150108 9107104 9145108 9303702 9471985
11285I471985N1100j4983O6381J38115N3298m7094N0166K48836K61389P0807l1649
$$ 9471985 9523085 9508102 9574483 9712598 9765896 9718802 9768968 10017804 10279193 10350000 10318351
11274A0318351R1310K26470J84461Q5730R7702J34896N3224n0738j858J26222
$$ 10318351 10409661 10636131 10820592 10906322 11004024 11138920 11192144 11141406 11139548 11265770
11264A1265770J24185L754l7514L7476P5150L7815N5813J42321J38860K1085j1884
$$ 11265770 11389955 11393709 11356195 11393671 11468821 11506636 11562449 11704770 11843630 11864715 11852831
11253A1852831J28926K48996J82821N6011N2741J17056R8531L8451P6304J78877
$$ 11852831 11981757 12230753 12413574 12469585 12522326 12639382 12737913 12776364 12852668 13031545
11243A3031545J97847J32582J14866J69853J99249J81680J90603K16747J67139
$$ 13031545 13229392 13361974 13476840 13646693 13845942 14027622 14218225 14434972 14602111
11234A4602111N8694L0117J22783K11180J97599J33469J01974J12108J52604K24482
$$ 14602111 14660805 14690922 14813705 15024885 15222484 15355953 15457927 15570035 15722639 15947121
11224A5947121K77868K40395J48177J22544J79741K02695J47000J18681J76165
$$ 15947121 16224989 16465384 16613561 16736105 16915846 17118541 17265541 17384222 17560387
11215A7560387K16295J62737J18104J91670K99679K95341K06351J75807K24927
$$ 17560387 17776682 17939419 18057523 18249193 18548872 18844213 19050564 19226371 19451298
11206A9451298K42974J89881J51699J86684K47406K76567K73848K48607K02087
$$ 19451298 19694272 19884153 20035852 20222536 20469942 20746509 21020357 21268964 21471051
11197B1471051J75500K22661L07093L14156K07650R9526J06883J92967K20227
$$ 21471051 21646551 21869212 22176305 22490461 22698111 22797637 22904520 23097487 23317714
11188B3317714J41336O3894R8619J95898K04920R1989O240O9368J87768J91654
$$ 23317714 23459050 23522944 23621563 23817461 24022381 24114370 24120610 24189978 24377746 24569400
11178B4569400J00790Q3729J68280J99362J30392J28733K70633L52140K01465
$$ 24569400 24670190 24753919 24922199 25121561 25251953 25380686 25651319 26003459 26204924
11169B6204924L24L9759K72991L90882K84383J47701J32139J79320K30127L27511
$$ 26204924 26205248 26245007 26517998 26908880 27193263 27340964 27473103 27652423 27882550 28210061
11159B8210061M47569M85864M90405O45124R19424J015351Q14560N93082N79019
$$ 28210061 28657630 29143494 29633899 30279023 31198447 32213798 33028358 33621440 34200459
11150C4200459N70980K86539j37058l50172l56211m77642q01028j041874j011165
$$ 34200459 34771439 35057978 34920920 34570748 34214537 33736895 32935867 31893993 30882828
11141C0882828q74450q35384q45476p72428o31426m99458l80062k89371l12295
$$ 30882828 30008378 29172994 28327518 27555090 26923664 26424206 26044144 25754773 25442478
11132B5442478m37897m91132l69724k12558j90424k59960k79340k46725k48385
$$ 25442478 25004581 24513449 24143725 23931167 23740743 23480783 23201443 22954718 22706333
11123B2706333k64923k14805j28714j03763j28060j17969q9610j18905j61149
$$ 22706333 22441410 22226605 22097891 21994128 21866068 21748099 21658489 21539584 21378435
11114B1378435j01208J9642K6676j04930j84389r5476K4534N706r8650j14503
$$ 21378435 21277227 21296869 21323545 21218615 21034226 20938750 20963284 20968990 20870340 20755837
11104B0755837j0173Q5836Q3642K4746j1171J988M2104P4492P8962P3051R2853
$$ 20755837 20745664 20831500 20915142 20939888 20928717 20930705 20972809 21047301 21126263 21199314 21292167
11093B1292167J32930J48075J39118J71656K61283L13260K56475J77162K13250
$$ 21292167 21425097 21573172 21712290 21883946 22145229 22458489 22714964 22892126 23105376
11084B3105376L47875M25669L75255L00702L20010M12307M80556M88814M68833
$$ 23105376 23453251 23878920 24254175 24554877 24874887 25287194 25767750 26256564 26725397
11075B6725397M45054M30215M65997N87416P44660Q28555Q00766P53679Q02371
$$ 26725397 27170451 27600666 28066663 28654079 29398739 30227294 31028060 31781739 32584110
11066C2584110R39981J045427J036717R70400R53028R80084R26498P14556M31373
$$ 32584110 33524091 34569518 35606235 36576635 37529663 38509747 39436245 40150801 40582174
11057D0582174K24426J17507J2166j30213k05929j22550L9072J13212P7154Q3709
$$ 40582174 40806600 40924107 40936273 40806060 40600131 40477581 40516653 40629865 40707019 40790728
11047D0790728K35867M22219M56560L30552K23155K57286L49532L50110K49476
$$ 40790728 41026595 41448814 41905374 42235926 42459081 42716367 43065899 43416009 43665485
11038D3665485J58542J30349J11886P1585N9786R7553J04769K0874p3843o2683
$$ 43665485 43824027 43954376 44066262 44137847 44197633 44295186 44399955 44420829 44346986 44284303
11028D4284303K3323M9088l221M409J36886K51499J98183O0769N0585J92670K81525
$$ 44284303 44307626 44356714 44353493 44357902 44494788 44746287 44944470 45005239 45055824 45248494 45530019
11017D5530019J84373L8621M7255J81759K32322J17068j0184J0204J32735K00892
$$ 45530019 45714392 45753013 45800268 45982027 46214349 46331417 46321233 46331437 46464172 46665064
11007D6665064J66794J18761J29547J74997K03419K08351K11972K24486K36074
$$ 46665064 46831858 46950619 47080166 47255163 47458582 47666933 47878905 48103391 48339465
10998D8339465K20614J53466N9055J6460O1117J05993M0611j07698k12256k41745
$$ 48339465 48560079 48713545 48772600 48789060 48850177 48956170 48996781 48889083 48676827 48435082
10988D8435082k86238l64559l63726k49922j81988k78170m02219l59203k02233
$$ 48435082 48148844 47784285 47420559 47170637 46988649 46710479 46308260 45949057 45746824
10979D5746824j30593j49332q3744P6473J26157M045o7703O0764K15134J94724
$$ 45746824 45616231 45466899 45383155 45459628 45585785 45589830 45522127 45582891 45798025 45992749
10969D5992749J14865K00537L87687M26278L09939K90902M53354N71100M83483
$$ 45992749 46107614 46308151 46695838 47122116 47432055 47722957 48176311 48747411 49230894
10960D9230894L55975M10948N90673O74293O07003N24419N13434N21778M90080
$$ 49230894 49586869 49997817 50588490 51262783 51869786 52394205 52907639 53429417 53919497
10951E3919497M35085L90575L65214L68991M03637M23486L77329K93500K57776
$$ 53919497 54354582 54745157 55110371 55479362 55882999 56306485 56683814 56977314 57235090
10942E7235090K98939L54544L61821L33201L27373L80884M76783N56712N69867
$$ 57235090 57534029 57888573 58250394 58583595 58910968 59291852 59768635 60325347 60895214
10933F0895214N34463N31999O08921P12739P71119Q00949Q71750R84988J074454
$$ 60895214 61429677 61961676 62570597 63283336 64054455 64855404 65727154 66712142 67786596
10924F7786596J122136J181991J273506J346825J391400J486886J681531J895129
$$ 67786596 68908732 70090723 71364229 72711054 74102454 75589340 77270871 79166000
10916G9166000K024724K094329K213425K423386K673802K924462L173334L396193
$$ 79166000 81190724 83285053 85498478 87921864 90595666 93520128 96693462 100089655
10908A00089655L566860L746303M036305M407932M690294M795031M843410M972240
$$ 100089655 103656515 107402818 111439123 115847055 120537349 125332380 130175790 135148030
10900A35148030N106097N054618M776441M394276L975039L467905K882670K352798
$$ 135148030 140254127 145308745 150085186 154479462 158454501 161922406 164805076 167157874
10892A67157874J939145J514217R54541L39568j67070n51049r22454j311097j631510
$$ 167157874 169097019 170611236 171565777 171905345 171738275 171187226 170264772 168953675 167322165
10883A67322165j829976j929739j931756j798984j554202j277657r84893o12692
$$ 167322165 165492189 163562450 161630694 159831710 158277508 156999851 156014958 155402266
10875A55402266j49361L26126P65518J214552J725134K294132K904885L527711
$$ 155402266 155252905 155579031 156344549 157559101 159284235 161578367 164483252 168010963
10867A68010963M076951M506787M968022N693891O668257P596779Q317491R048605
$$ 168010963 172087914 176594701 181562723 187256614 193924871 201521650 209839141 218887746
10859B18887746J0058796J1256728J2329695J3171672J3912540J4566978J4915298
$$ 218887746 228946542 240203270 252532965 265704637 279617177 294184155 309099453
10852C09099453J4759190J4080486J2902717J1192504Q968767O351483L444243
$$ 309099453 323858643 337939129 350841846 362034350 371003117 377354600 380798843
10845C80798843L23649k804767n628820q011929j0088959j1951598j3392177j4143157
$$ 380798843 381122492 378317725 372688905 364676976 354588017 342636419 329244242 315101085
10837C15101085j4276412j4159657j4033798j3811707j3323617j2602253j1832967
$$ 315101085 300824673 286665016 272631218 258819511 245495894 232893641 221060674
10830B21060674j1116531j0405339r663092q976115q443354q016986p551918p005935
$$ 221060674 209944143 199538804 189875712 180899597 172456243 164439257 156887339 149881404
10822A49881404o481482o042371n615562n146642m719631m400146m085516l680692
$$ 149881404 143399922 137357551 131741989 126595347 121875716 117475570 113390054 109709362
10814A09709362l312271l146727l075482k847061k479489k243401k215567k167207
$$ 109709362 106397091 103250364 100174882 97327821 94848332 92604931 90389364 88222157
10806H8222157j971871j796440j752479j685830j507999j419644j547256j648854
$$ 88222157 86250286 84453846 82701367 81015537 79507538 78087894 76540638 74891784
10798G4891784j493472j274833j282563j382776j251485r68856r06793j090297
$$ 74891784 73398312 72123479 70840916 69458140 68206655 67237799 66331006 65240709
10790F5240709j157350r76848q31072q82755r11434p56581o20145o91422q05818
$$ 65240709 64083359 63106511 62275439 61392684 60481250 59724669 59104524 58413102 57607284
10781E7607284p42685n93356n60596o06742n69875m64328m14330m15702l85660
$$ 57607284 56864599 56271243 55710647 55103905 54534030 54069702 53655372 53239670 52854010
10772E2854010l43198l47802l58792l18721k69037k45882j96014j24657j53282
$$ 52854010 52510812 52163010 51804218 51485497 51216460 50970578 50774564 50649907 50496625
10763E0496625k84756l16414j66397n9527j63452k79009j79103k4451q4159k32881
$$ 50496625 50211869 49895455 49729058 49669531 49506079 49227070 49047967 49023516 48939357 48706476
10753D8706476j46360J22362K14402P0325Q086J64203K96115K39543J61230K14245
$$ 48706476 48560116 48682478 48896880 48967205 48975291 49139494 49435609 49675152 49836382 50050627
10743E0050627K97302L14577L50453M22673L73326J81411Q3101J89531K76948
$$ 50050627 50347929 50662506 51012959 51435632 51808958 51990369 52073470 52263001 52539949
10734E2539949J65155J5269J5540N3722k5068r7412o780J01646K6700j04690n5811
$$ 52539949 52705104 52720373 52735913 52789635 52764567 52667155 52660375 52762021 52788721 52684031 52628220
10723E2628220P9764L6867j42279j87654r1182j06201k68304l25857j99920j25122
$$ 52628220 52707984 52744851 52602572 52414918 52323736 52217535 51949231 51623374 51423454 51298332
10713E1298332k27994l22946k74394k35168l35210m15777k99268j02653m7358
$$ 51298332 51070338 50747392 50472998 50237830 49902620 49486843 49187575 49084922 49037564
10704D9037564j20236j48138q8016l1395o746K7071M5431j1318j02574j27980
$$ 49037564 48917328 48769190 48681174 48649779 48643033 48670104 48715535 48704217 48601643 48473663
10694D8473663q7503q3121j67243k80684l42280l43273l54668m54234o14811o85405
$$ 48473663 48386160 48303039 48135796 47855112 47512832 47169559 46814891 46360657 45745846 45060441
10684D5060441n70109m03585m03606n42755n59756l59186j83050k48768m16228
$$ 45060441 44490332 44086747 43683141 43140386 42580630 42221444 42038394 41789626 41373398
10675D1373398m15285k53721j61636k18068k75165k24994j24777n0111m943O643
$$ 41373398 40958113 40704392 40542756 40324688 40049523 39824529 39699752 39649641 39644698 39651341
10665C9651341k8021n7779k2378K9673J6068j3456M9736J56421J48220K7990k2430
$$ 39651341 39623320 39565541 39543163 39572836 39588904 39575448 39625184 39781605 39929825 39957815 39935385
10654C9935385O9860J66551J64258J41967J74943J95597J57761J63633K84252
$$ 39935385 40005245 40171796 40336054 40478021 40652964 40848561 41006322 41169955 41454207
10645D1454207M02442L88061L04453K85493L21569L32524L50463M46439N51329
$$ 41454207 41856649 42244710 42549163 42834656 43156225 43488749 43839212 44285651 44836980
10636D4836980N40698M52772M39413N27619O04156O19027O29862O50249O28750
$$ 44836980 45377678 45830450 46269863 46797482 47401638 48020665 48650527 49300776 49929526
10627D9929526N85717N98879O39283N99904N10835N32504O86168P92541P59045
$$ 49929526 50515243 51114122 51753405 52353309 52864144 53396648 54082816 54875357 55634402
10618E5634402P25871Q09500Q97678Q63030Q12010R18243J126344J235081J202661
$$ 55634402 56360273 57169773 58067451 58930481 59742491 60660734 61787078 63022159 64224820
10609F4224820J166824J209033J291224J391422J513493J593505J591744J645419
$$ 64224820 65391644 66600677 67891901 69283323 70796816 72390321 73982065 75627484
10601G5627484J905145K235776K345380K241128K262000K564423K886377L000996
$$ 75627484 77532629 79768405 82113785 84354913 86616913 89181336 92067713 95068709
10593I5068709L102779L459335L915936M114384M079574M194875M610470N054047
$$ 95068709 98171488 101630823 105546759 109661143 113740717 117935592 122546062 127600109
10585A27600109N297909N461809N704617N927374O004747O060775O224193O262392
$$ 127600109 132898018 138359827 144064444 149991818 155996565 162057340 168281533 174543925
10577A74543925N781888M762509L603440K583264J520081J16141j501468k770766
$$ 174543925 180325813 185088322 188691762 191275026 192795107 192911248 191409780 188639014
10569A88639014l221698k896556k201821j425279n18702O37110J920228L079878
$$ 188639014 185417316 182520760 180318939 178893660 178374958 179012068 180932296 184012174
10561A84012174M066862M994909N739011N858158N105732L814644K523056J343307
$$ 184012174 188079036 193073945 198812956 204671114 209776846 213591490 216114546 217457853
10553B17457853r338j614560l093691m015975m290505m052125l405861k460822
$$ 217457853 217448515 215833955 212740264 208724289 204433784 200381659 196975798 194514976
10545A94514976j442851n60446J75876Q58729J479969J966119K371518K890547
$$ 194514976 193072125 192511679 192687555 193546284 195026253 196992372 199363890 202254437
10537B02254437L665659M664920N754749O851678Q016542R407061J1081889J2857229
$$ 202254437 205920096 210585016 216339765 223191443 231207985 240615046 251696935 264554164
10529B64554164J4462143J5819665J6958201J7551509J6795612J4009184R282887
$$ 264554164 279016307 294835972 311794173 329345682 346141294 360150478 369433365
10522C69433365L356837l006569r254108j4758624j8751508k0761606k0963377
$$ 369433365 372790202 369783633 360529525 345770901 327019393 306257787 285294410
10515B85294410j9963685j8357757j6541947j4753833j3104794j1616362j0310792
$$ 285294410 265330725 246972968 230431021 215677188 202572394 190956032 180645240
10508A80645240r224146q317013p486041o705369o043282n509162n026604m595025
$$ 180645240 171421094 163104081 155618040 148912671 142869389 137360227 132333623 127738598
10500A27738598m301607m109639l839111l462124l196035l145224l076304k772331
$$ 127738598 123436991 119327352 115488241 112026117 108830082 105684858 102608554 99836223
10492I9836223k400533k233650k171422j902269j456728j197945j239383j261526
$$ 99836223 97435690 95202040 93030618 91128349 89671621 88473676 87234293 85972767
10484H5972767j021671p02662n76564o02783n71511m28474k45083m2020J56384
$$ 85972767 84951096 84248434 83671870 83069087 82497576 82069102 81824019 81781999 81938383
10475H1938383K51691K53201L74778P41490J152000J363386J460102J662705J897147
$$ 81938383 82190074 82443275 82818053 83559543 84711543 86074929 87535031 89197736 91094883
10466I1094883J884234J588606J220717Q00214J04376q61348j712359k181505
$$ 91094883 92979117 94567723 95788440 96588654 96693030 95831682 94119323 91937818
10458I1937818k456576k801855l114543l137382k909497k689386k547483k347578
$$ 91937818 89481242 86679387 83564844 80427462 77517965 74828579 72281096 69933518
10450F9933518k078007j897503j843196j763671j589504j434987j368337j301224
$$ 69933518 67855511 65958008 64114812 62351141 60761637 59326650 57958313 56657089
10442E6657089j189252j131272j160328j136313r88355q78994r45650j037037
$$ 56657089 55467837 54336565 53176237 52039924 51051569 50172575 49226925 48189888
10434D8189888r31886p08210o34201p39725p75884o28564m95702n43133o26656
$$ 48189888 47258002 46549792 45915591 45175866 44399982 43771418 43275716 42732583 42105927
10425D2105927n39902l59411l11897m01462m20671l06588k35643l14621m01968
$$ 42105927 41566025 41206614 40894717 40493255 40072584 39765996 39530353 39215732 38813764
10416C8813764l50477k47729k56073l41384l50255k86047l01206m20187m73246
$$ 38813764 38463287 38215558 37959485 37618101 37267846 36981799 36680593 36260406 35787160
10407C5787160l68274k55698l05824m43950m58399l13976j97855k43743l48599
$$ 35787160 35418886 35163188 34857364 34413414 33955015 33641039 33443184 33199441 32850842
10398C2850842l30813j81746o2956q2827j74030k16958k04956k15716k59341k56011
$$ 32850842 32520029 32338283 32275327 32192500 32018470 31801512 31596556 31380840 31121499 30865488
10388C0865488j78344j15068j35368j76954j58578j27810j68724k15526j27719
$$ 30865488 30687144 30572076 30436708 30259754 30101176 29973366 29804642 29589116 29461397
10379B9461397N3333J14230j0121j14380k9242J20271J20010o328p0589l2348
$$ 29461397 29514730 29628960 29618839 29504459 29475217 29595488 29715498 29709170 29638581 29606233
10369B9606233k6478j17613k31190l20821m08487m50885l67342k31859k30516
$$ 29606233 29579755 29462142 29230952 28910131 28501644 28050759 27683417 27451558 27221042
10360B7221042l67236m19657k79537j29357j47187k32221k03600j07297j07381
$$ 27221042 26853806 26434149 26154612 26025255 25878068 25645847 25442247 25334950 25227569
10351B5227569j89345k07606j59234j71523k43306k32589j16365m5870r8714j70218
$$ 25227569 25038224 24830618 24671384 24499861 24256555 24023966 23907601 23861731 23763017 23592799
10341B3592799j70300j47497j47343j24189p9634j11579k15016k11304k5473J29969
$$ 23592799 23422499 23275002 23127659 23003470 22923836 22812257 22597241 22385937 22360464 22490433
10331B2490433M3311j55509j78990k5660L1883j07684k26343j61261o4317j28919
$$ 22490433 22533744 22378235 22199245 22173585 22205468 22097784 21871441 21710180 21645863 21516944
10321B1516944k66394k72580j78717j82462k88545k86109j10789K1701n3528j95011
$$ 21516944 21250550 20977970 20799253 20616791 20328246 20042137 19931348 19953049 19899521 19704510
10311A9704510j87864p4466n4671j53027k05611j48287j01835j42460j81150j39313
$$ 19704510 19516646 19442180 19387509 19234482 19028871 18880584 18778749 18636289 18455139 18315826
10301A8315826q1345q3134j05327r5308r3859j33858j44599p5680j6177o1851
$$ 18315826 18234481 18151347 18046020 17950712 17856853 17722995 17578396 17502716 17486539 17424688
10291A7424688j52390j75140j44154j29798j00778j3025K4891j09189k92479k76661
$$ 17424688 17272298 17097158 16953004 16823206 16722428 16709403 16734294 16625105 16332626 16055965
10281A6055965o4672P4673L871j15300j22263q2868r7887j10948o1490l6615r8673
$$ 16055965 15991293 16065966 16069837 15954537 15832274 15749406 15651519 15540571 15479081 15442466 15343793
10270A5343793j30766l8571M8249j9686j42327j31923l3041l2162j23190j28198
$$ 15343793 15213027 15174456 15222705 15203019 15060692 14928769 14895728 14863566 14740376 14612178
10260A4612178k1348L3222k1997n8377k2592l2058j26892j54633k6783R9890M9983
$$ 14612178 14590830 14624052 14602055 14543678 14521086 14489028 14362136 14207503 14180720 14280610 14330593
10249A4330593j04200j60577p5304J7374J7981l6707o6657m8924k1857l1146o6130
$$ 14330593 14226393 14065816 13990512 14007886 14025867 13989160 13922503 13873579 13851722 13820576 13754446
10238A3754446n6545K1312O5759k0334j40838j02645P7228J47353j1326j80243
$$ 13754446 13697901 13719213 13784972 13764638 13623800 13521155 13598383 13745736 13734410 13554167
10228A3554167j12950J01581J81176N9750o3894n5350p261l5424q9631n7350N1901
$$ 13554167 13441217 13542798 13723974 13783724 13719830 13664480 13657219 13621795 13532164 13474814 13526715
10217A3526715J22989R2340J7307r427K1758L0349l2891r3059m5681P0327J04149
$$ 13526715 13649704 13742044 13759351 13749924 13771682 13802031 13769140 13676081 13630400 13700727 13804876
10206A3804876K4052j7638P3061J65202J10265r087j8974M8807K2532r0985j07219
$$ 13804876 13828928 13811290 13884351 14049553 14159818 14150731 14131757 14180564 14203096 14112111 14004892
10195A4004892m664r83j88421l33780k17539R789L4751j60331k86663j73975J9154
$$ 14004892 14000228 13999245 13810824 13477044 13259505 13269294 13304045 13143714 12857051 12683076 12702230
10184A2702230O8680k3922j02954r5224n1472j5137K5668O1850L9223n6284j47855
$$ 12702230 12770910 12746988 12644034 12548810 12497338 12482201 12507869 12569719 12608942 12552658 12404803
10173A2404803j43261l6915Q6992J34138P1344m8639j13198m2044J08420J73479
$$ 12404803 12261542 12224627 12311619 12445757 12517101 12468462 12355264 12313220 12421640 12595119
10163A2595119O7606r4422j36850m7956L4112L7196K3539L2903J3827l1853M570
$$ 12595119 12662725 12568303 12431453 12383497 12417609 12454805 12478344 12511247 12525074 12493221 12497791
10152A2497791J44467K20642J13562l5102k1263J04844J25154m1r4591o3929p297
$$ 12497791 12642258 12862900 12976462 12941360 12920097 13024941 13150095 13150054 13055463 12991534 12984237
10141A2984237j094J9557R2636J24646M7932n7568q4368k4374P9020J80409J94875
$$ 12984237 12983143 13002700 13095336 13219982 13267914 13210346 13125978 13101604 13180624 13361033 13555908
10130A3555908O5150q5742m7997J59806K69342J56209L4020J02732K25940J80315
$$ 13555908 13621058 13535316 13487319 13647125 13916467 14072676 14106696 14209428 14435368 14615683
10120A4615683M2579N5873K29023L50576L38674L07402L13595K93439K48425K57830
$$ 14615683 14658262 14714135 14943158 15293734 15632408 15939810 16253405 16546844 16795269 17053099
10110A7053099K99086K77736K34102K86281L71965L14552J66388J85994M05047
$$ 17053099 17352185 17629921 17864023 18150304 18522269 18836821 19003209 19189203 19594250
10101A9594250N34521M30412L38247M81003O98818P57962P64682R52624J246940
$$ 19594250 20128771 20559183 20897430 21378433 22077251 22835213 23599895 24552519 25799459
10092B5799459J397437J433238J607829J915116K019100J715972J155522N27591
$$ 25799459 27196896 28630134 30237963 32153079 34172179 35888151 37043673 37571264
10084C7571264j67127r01237j452082j651103j616406j546518j433266j173598
$$ 37571264 37404137 36502900 35050818 33399715 31783309 30236791 28803525 27629927
10076B7629927q39865o16498n30013m45416l05080j87373j31654p8107l756L5486
$$ 27629927 26790062 26173564 25643551 25198135 24893055 24705682 24574028 24495921 24492165 24527651
10066B4527651L4892P3514J70655K42001K57427L10762M50660N68665N69625N44975
$$ 24527651 24562543 24636057 24806712 25048713 25306140 25616902 26067562 26636227 27205852 27750827
10056B7750827O30456P70869Q04201P47801Q04211J050171J306983J412300J466187
$$ 27750827 28381283 29152152 29956353 30704154 31508365 32558536 33865519 35277819 36744006
10047C6744006J666775K006101K298897K469530K632681K862432L024361K904073
$$ 36744006 38410781 40416882 42715779 45185309 47817990 50680422 53704783 56608856
10039E6608856K408978J580628M99990p13980j852842k685588l117953l240837
$$ 56608856 59017834 60598462 61098452 60384472 58531630 55846042 52728089 49487252
10031D9487252l199337l050493k776350k402059k038942j788048j636716j495098
$$ 49487252 46287915 43237422 40461072 38059013 36020071 34232023 32595307 31100209
10023C1100209j326291j188165j131872j114366j056583r52019q60434q11842
$$ 31100209 29773918 28585753 27453881 26339515 25282932 24330913 23470479 22658637
10015B2658637p77151p32133o92213o69132o38972n76165m92582m26759m07109
$$ 22658637 21881486 21149353 20457140 19788008 19149036 18572871 18080289 17653530 17246421
10006A7246421m23560m22351l49877k29510j66206k27992l45300l83659l00204
$$ 17246421 16822861 16400510 16050633 15821123 15654917 15426925 15081625 14697966 14397762
9997A4397762j70331p8167m9964q0748j44654j79946j44054q5986q7564j41759
$$ 14397762 14227431 14149264 14099300 14018552 13873898 13693952 13549898 13463912 13376348 13234589
9987A3234589j81036k10028k85859l67928l41284k23283j80416k67196l15159
$$ 13234589 13053553 12843525 12557666 12189738 11848454 11625171 11444755 11177559 10862400
9978A0862400j95211l7706l8546j65467k31234j77274j06414q4340q2412r2214
$$ 10862400 10667189 10629483 10590937 10425470 10194236 10016962 9910548 9826208 9743796 9651582
9968I651582j33716j59189j00762j1736j5629j10855j68361j33373q6752q5783
$$ 9651582 9517866 9358677 9257915 9246179 9230550 9119695 8951334 8817961 8731209 8645426
9958H645426q7140o4673o9181j19164j47556j11096n5619k9437k4300l6127q6153
$$ 8645426 8558286 8493613 8424432 8305268 8157712 8046616 7990997 7961560 7937260 7901133 7814980
9947G814980j45876j39597o2545o154k9183q7895j20179j13830p7521l5183m7128
$$ 7814980 7669104 7529507 7466962 7460808 7431625 7343730 7223551 7109721 7032200 6997017 6949889
9936F949889j29192j69080o4399P6446N5504r4991j39349j9707M6845n8688j57852
$$ 6949889 6820697 6651617 6587218 6663664 6719168 6624177 6484828 6465121 6511966 6453278 6295426
9925F295426r8280j2349m5503p2453M9659J56386K5675k00625k00951N648R3144
$$ 6295426 6197146 6184797 6139294 6066841 6116500 6272886 6298561 6097936 5896985 5902633 5995777
9914E995777l6746j26400k3496Q2923J6550r6122o8018M4477O9739r010q3178
$$ 5995777 5959031 5832631 5809135 5892058 5908608 5812486 5744468 5788945 5858684 5849674 5766496
9903E766496r9274p0339j0237L0970k7274j54121j87287n9831P3689N5818m5798
$$ 5766496 5667222 5596883 5586646 5617616 5590342 5436221 5248934 5189103 5262792 5318610 5272812
9892E272812o5320N993M3767M619l3200j6846J3059j810o4918j16308p3405O3750
$$ 5272812 5207492 5213485 5257252 5261871 5228671 5211825 5224884 5223074 5158156 5041848 4968443 5032193
9880E032193J45597K9439j76843j99847L315J42399K2266j46724q5572R9965J03511
$$ 5032193 5177790 5207229 5030386 4830539 4833854 4976253 4998519 4851795 4766223 4866188 4969699
9869D969699o9431j25613J2319R0963k5364j33038n4292P0093M7076m4469k3564
$$ 4969699 4900268 4774655 4786974 4877937 4852573 4719535 4665243 4735336 4782412 4737943 4714379
9858D714379P0338O5126m2891j05232p4052k9585M290P2099J32713Q7077l1250
$$ 4714379 4784717 4849843 4806952 4701720 4627668 4598083 4602373 4674472 4807185 4894262 4863012
9847D863012p3019o876L4463j6658n7036n016O2022O2483N9580J24480J67775
$$ 4863012 4789993 4783117 4817580 4800922 4743886 4738870 4800892 4863375 4922955 5047435 5215210
9836E215210P2195p7417p9128Q3773J99485J25804j6228k7009J00609K00484J67346
$$ 5215210 5287405 5209988 5130860 5214633 5414118 5539922 5523694 5496685 5597294 5797778 5965124
9825E965124O5898J3634L6664O6012L4065n2932j28833j43387j18486j16980j59397
$$ 5965124 6031022 6044656 6081320 6147332 6181397 6128465 5999632 5856245 5737759 5620779 5461382
9814E461382j99327j89434j41294j02575j00585j24693j40704j13142m4677J984
$$ 5461382 5262055 5072621 4931327 4828752 4728167 4603474 4462770 4349628 4304951 4306935
9804D306935l1328j04322j15157n0666j4325o2301j12358r0869o2610r7131j08138
$$ 4306935 4275607 4171285 4056128 4005462 3991137 3928836 3816478 3725609 3662999 3565868 3457730
9793C457730O432J36218Q0972j17549j95341n5991Q6964M6578p3874r0957k4671
$$ 3457730 3464162 3600380 3681352 3563803 3368462 3312471 3399435 3446013 3372139 3281182 3256511
9782C256511M793P836M7923N3429o4943j87429j19227Q1179J52457J9403j09227
$$ 3256511 3261304 3269140 3317063 3370492 3305549 3118120 2998893 3080072 3232529 3251932 3142705
9771C142705q2424j1233k9924o5774k327Q8927O4579m3191q0520k2754N790m4696
$$ 3142705 3060281 3049048 3019124 2953350 2951023 3039950 3104529 3061338 2980818 2958064 2963854 2919158
9759B919158p1792o958N7620J1897r0128r8549J2115R9215N5361l6234k9237N8864
$$ 2919158 2847366 2840408 2898028 2909925 2819797 2721248 2733363 2832578 2887939 2851705 2822468 2881332
9747B881332P0636l7727j09703k8315Q6219N3567q0040j08598J1803J00496M0689
$$ 2881332 2951968 2914241 2804538 2776223 2862442 2916009 2835969 2727371 2739174 2839670 2880359
9736B880359n2256l4211M5728M7047l8427r5260o7201j6172j0609l7450l3418
$$ 2880359 2828103 2793892 2839620 2886667 2848240 2752980 2685779 2669607 2658998 2621548 2588130
9725B588130L3079J09436R0554n2641j84111j31123P5559J96660Q0432j35047
$$ 2588130 2621209 2730645 2821199 2768558 2584447 2453324 2528883 2725543 2805975 2670928
9715B670928k04254p9200P5101J16925O2451k58k6793k5389j5682p257J051P378
$$ 2670928 2466674 2387474 2462575 2579500 2641951 2641693 2614900 2589511 2573829 2566572 2567623 2575001
9703B575001l440l4222n1310l1163j3017l5330m4224K7672J08418O2794o7807
$$ 2575001 2571561 2537339 2486029 2454866 2441849 2406519 2362295 2389967 2498385 2561179 2493372
9692B493372q6115M6038J18829O723j21101q4085J6604M399n0148J6158J14774
$$ 2493372 2407257 2453295 2572124 2578847 2457746 2373661 2390265 2394664 2344516 2360674 2475448
9681B475448L1900j65848j86555J8303J62670P1477p6804o8578L7789P0802J0672
$$ 2475448 2507348 2341500 2154945 2173248 2335918 2407395 2330591 2262013 2299802 2370604 2381276
9670B381276n5194q5540o6478K0393J06585O2616q5079j29683Q244J26243M1919
$$ 2381276 2326082 2240542 2174064 2194457 2301042 2363658 2278579 2148896 2157140 2283383 2325302
9659B325302j20083j27966Q409R4076N7212n758l3164n1222n4102l974N9452N3795
$$ 2325302 2205219 2077253 2085662 2179738 2236950 2231192 2198028 2146806 2092704 2088730 2148182 2201977
9647B201977r736m5761l1956j5823j1542R87M303k4938m7580k4081K134j6153
$$ 2201977 2192241 2146480 2114524 2098701 2087159 2088146 2092449 2067511 2019931 1995850 1997984 1981831
9635A981831k9587J6103N9372K6111j8784K3336R2790N8649n0124q6457k8087
$$ 1981831 1952244 1968347 2027719 2053830 2035046 2058382 2151172 2209821 2159697 2073240 2045153
9624B045153J2424L077J8033N0268R302p3992n6844N7219Q9984r644n8782N0969
$$ 2045153 2057577 2060654 2078687 2128955 2138257 2064265 2007421 2064640 2154624 2144980 2086198 2137167
9612B137167J49028N3332j25546j45225N261J01999J3257j35415j46199P65J26694
$$ 2137167 2286195 2339527 2213981 2068756 2074017 2176016 2189273 2053858 1907659 1908424 2035118
9601B035118O5045j24272j97869l3282J81405J83042k029j13795n4449P809l3531
$$ 2035118 2100163 1975891 1778022 1744740 1926145 2109187 2107158 1993363 1938914 1946723 1913192
9590A913192n3745L5904J00201K4465o8604l8704K8365P597j8893N5471J04086
$$ 1913192 1859447 1895351 1995552 2020017 1951413 1912709 1941074 1948671 1929778 1985249 2089335
9579B089335k3586j76783j11154P6029P4404j18092j81306q157J27998M5529o4244
$$ 2089335 2065749 1888966 1777812 1853841 1928245 1810153 1628847 1620690 1748688 1794217 1729973
9568A729973k161J03423N3096p6958r3539j0267L0872K4031N2239Q3321L6987
$$ 1729973 1727812 1831235 1884331 1807373 1713834 1703567 1734439 1758470 1810709 1894030 1931017
9557A931017k8721j2027K5653l6722j32368r4143M5721Q5200j5203p0758J2572
$$ 1931017 1902296 1890269 1915922 1879200 1746832 1652689 1698410 1783610 1768407 1697649 1710221
9546A710221R0869L7544n5466n3718M680J1766j3065K0690R6176J09354L3604
$$ 1710221 1801090 1838634 1783168 1729450 1734130 1745896 1732831 1753521 1849697 1959051 1992655
9535A992655m9997p0980l2343K7609O4747M1717k4575n4639r086L6236m527q1454
$$ 1992655 1942658 1871678 1839335 1866944 1931691 1973408 1948833 1894194 1885108 1921344 1916817 1835363
9523A835363p0701K8033P2688j0939j07037p0296O4070J27870N3702l6078j636
$$ 1835363 1764662 1792695 1865383 1854444 1747407 1677111 1741181 1869051 1922753 1886675 1885039
9512A885039J21451J64622M4178j28419j83331r8385r397j8854o4821k5481R2157
$$ 1885039 2006490 2171112 2215290 2086871 1903540 1805155 1795758 1776904 1712083 1686602 1778759
9501A778759J45074L9838j38434k18351j32234K2801J03349O6032j5197n6964
$$ 1778759 1923833 1963671 1825237 1606886 1474652 1497453 1600802 1666834 1651637 1594673
9491A594673n5767n1428l7365K4605R5524N9518j01149k12013j06787J17312J92333
$$ 1594673 1538906 1487478 1450113 1474718 1570242 1629760 1528611 1316598 1209811 1327123 1519456
9480A519456L6453j40136j40589l1443K0033R599L1434N7657r810j15111r5785
$$ 1519456 1555909 1415773 1275184 1243741 1263774 1273373 1304807 1362464 1352654 1237543 1141758
9469A141758M1234J06542L4266j5168N5228J01990o13j16106o2188O8990M8251
$$ 1141758 1182992 1289534 1323800 1308632 1363860 1465850 1465237 1349131 1286943 1355933 1404184
9458A404184j09503j59809j7874J14959P1666m8630p2377n083L5640J8624l863
$$ 1404184 1294681 1134872 1116998 1231957 1303623 1254993 1182616 1177533 1213173 1231797 1227934
9447A227934j8799m7754o7463m0700N043J5861j194m514K581m004J51M6626Q8353
$$ 1227934 1209135 1161381 1093918 1053218 1058261 1074122 1072928 1068414 1070995 1066991 1067142 1113768 1202121
9434A202121M8412n2604j08338p1733l203L9310O8396R1766N9023m6625j26410
$$ 1202121 1250533 1197929 1089591 1017858 1014655 1053965 1122361 1214127 1273150 1226525 1100115
9423A100115p0005P5877J35248K3412j32991j51135k1801R2789Q0719R737j752
$$ 1100115 1030110 1105987 1241235 1264647 1131656 980521 958720 1051509 1132228 1141965 1140213
9412A140213L9429L9208j5690l8627N721L9200k30n6881m8892O752L5878K5496
$$ 1140213 1179642 1218850 1203160 1164533 1170254 1209454 1209224 1152343 1103451 1110203 1146081 1171577
9400A171577K0268L0260K2326q140k8192k7089k3406j6078J1170L8979K8592r047
$$ 1171577 1191845 1222105 1244431 1236291 1208099 1181010 1157604 1141526 1152696 1191675 1220267 1211220
9388A211220k3420q041o776k7606k5887M024K133m8654o6045J1155J07418J01251
$$ 1211220 1187800 1179759 1172983 1145377 1119490 1123514 1125647 1076993 1010948 1022103 1129521 1230772
9376A230772m403r1899r2022m6643r808J7078K9323l939n7387l5462Q1558J56272
$$ 1230772 1226369 1134470 1042448 995805 985997 1003075 1032398 1028459 971072 935610 1017168 1173440
9364A173440O8661q2877r6043L5006R8845j1968j28627o6112Q5402J00660l0360
$$ 1173440 1242101 1159224 1063181 1098187 1197032 1185064 1056437 990325 1075727 1176387 1146027
9353A146027r4585J1179J37429J24187J6925n0730n5767n2541l9425J3861O4844
$$ 1146027 1051442 1062621 1200050 1324237 1341162 1290432 1234665 1182124 1142699 1156560 1221404
9342A221404M5505j8877m2284j2268J576l3143o6274m4705K2778Q2490P9485L921
$$ 1221404 1266909 1248032 1205748 1193480 1195056 1161913 1095639 1050934 1073712 1156202 1235687 1239608
9330A239608p0718m0258Q7803J61839P2532q3341j25454l4557M3965K3197k5876
$$ 1239608 1168890 1128632 1216435 1378274 1450806 1367465 1242011 1207454 1251419 1274616 1248740
9319A248740j2815M7324Q4481O6229P655m8928n0798P831M9021M087o9168n4069
$$ 1248740 1235925 1283249 1367730 1433959 1441614 1392686 1341888 1349719 1398740 1402827 1333659 1279590
9307A279590M6572J07115O4213n503j9228N825J8701J5459J2527J1863J7112K0651
$$ 1279590 1326162 1433277 1497490 1491987 1472759 1478584 1497285 1512744 1525271 1537134 1554246 1574897
9295A574897j7017r2157r8481K9726J55405R8727o1252p3823P4481J11937o8248
$$ 1574897 1557880 1465723 1367242 1396968 1552373 1651100 1589848 1516025 1590506 1702443 1634195
9284A634195k03008p9399J13927J04006k8273l4276N3305J2823j24461j04845
$$ 1634195 1431187 1351788 1465715 1569721 1541448 1507172 1560477 1573300 1448839 1343994
9274A343994Q7532J69532K1918j21234o5451N4524M1260n1233o2153k51K2117
$$ 1343994 1431526 1601058 1622976 1501742 1436291 1490815 1532075 1480842 1418689 1418438 1440555
9263A440555L274J6514M7450K8332k4604m1059j7464k809j0778k8909n7385o8410
$$ 1440555 1443829 1460343 1507793 1536125 1511521 1470462 1452998 1450189 1439411 1410502 1353117 1284707
9251A284707m341J09074J39924L1482q7354p8465R229L9876J548k1941k0644m5428
$$ 1284707 1280366 1389440 1529364 1560846 1473492 1395027 1404256 1444132 1445680 1423739 1403095 1357667
9239A357667o9208j9993O5004P1103m609l8699K3905R2349Q1702K5780p190j2384
$$ 1357667 1288459 1268466 1333470 1404573 1399964 1361265 1385170 1477519 1559221 1585001 1577811 1565427
9227A565427j1995l372P962p902m5675n0849m033L8136K4391k0528m1736k4312
$$ 1565427 1553432 1550060 1558022 1550120 1504445 1453596 1449563 1487699 1512090 1491562 1449826 1425514
9215A425514J2036M3052M0665p279n6370m0952K6893N9811K6964L461L7283N6311
$$ 1425514 1437550 1480602 1521267 1513988 1457618 1416666 1443559 1503370 1530334 1533795 1571078 1627389
9203A627389l946n9889L182J18658J03879n3243j42926l9668R6332N5657j00174
$$ 1627389 1623443 1563554 1566736 1685394 1789273 1736030 1593104 1553436 1649768 1705425 1605251
9192A605251j36810p412R4144N1569j3997J8843O8039K0915m5178k54Q7451N2081
$$ 1605251 1468441 1461029 1555173 1606742 1592745 1611588 1679627 1700542 1655364 1655110 1742561 1794642
9180A794642p2579q6122M5558J18586J2587j20532r4029N1823J50787J46789R7525
$$ 1794642 1722063 1635941 1681499 1800085 1812672 1692140 1598111 1649934 1800721 1947510 2045035
9169B045035L6531l7519r2597r2205n3047n576M5763P4633L4327l9093l8218L6453
$$ 2045035 2081566 2044047 1951450 1859245 1806198 1800622 1846385 1921018 1955345 1916252 1878034 1914487
9157A914487M7564m3108p8538K3948R2687j6118j31958k5257J84674J87351k3803
$$ 1914487 1962051 1918943 1840405 1864353 1957040 1940922 1808964 1783707 1968381 2155732 2131929
9146B131929j48337o3714K8347m380k3694O2111R3724l9664j59230q0933O6584
$$ 2131929 1983592 1919878 1948225 1943845 1920151 1982262 2075986 2036322 1877092 1796159 1862743
9135A862743N4013p5582j03216J27O2118J5480k5226N816K7312j9194o6521m5530
$$ 1862743 1916756 1841174 1737958 1738085 1800203 1815683 1790457 1796273 1823585 1804391 1737870 1692340
9123A692340P204K1121q262l3048j6976L4659P7170O2757O73m4066l7731j8553
$$ 1692340 1699544 1720665 1712403 1679355 1662379 1697038 1774208 1836965 1837638 1793572 1755841 1737288
9111A737288j7854l731M5315P6140L8398k7083m5639j0644K7928L0453j8593j01270
$$ 1737288 1719434 1715703 1761018 1837158 1875556 1848473 1802834 1792190 1820118 1850571 1831978 1730708
9099A730708j36734m9674R1983J22174J4965o1417r408M2630k5008j04791n6053
$$ 1730708 1593974 1544300 1636283 1758457 1773422 1712005 1702597 1745227 1720219 1615428 1559375
9088A559375L6223J7460m8203n85R8508N5118r6594j25490L004O8673j8359p2491
$$ 1559375 1595598 1613058 1564855 1564270 1662778 1717896 1621302 1495812 1498816 1567489 1549130 1476639
9076A476639K7278J27768P5534l5419n4466j4111p231K709O8388J00670R745j08416
$$ 1476639 1503917 1631685 1707219 1671800 1617334 1603223 1595992 1598701 1667089 1767759 1777504 1669088
9064A669088j02912M719Q3462R8277R7152P1768r810r0185q8243k9271J2515L6607
$$ 1669088 1566176 1570895 1654357 1752634 1849786 1921554 1911744 1821559 1733316 1704045 1716560 1753167
9052A753167O2591L9411n3801j06794l7245L9113j8306j16166o4326Q5839R9686
$$ 1753167 1815758 1855169 1801368 1694574 1657329 1696442 1678136 1561970 1497644 1583483 1683169
9041A683169m8806j19619j784J02515J8133j12449o9418Q3320J05209m1169j46895
$$ 1683169 1634363 1514744 1512960 1615475 1633608 1521159 1451741 1535061 1640270 1599101 1452206
9030A452206q3480K8784L2800l8763m7359L0650Q2468L4761n0506q0689n6215
$$ 1452206 1368726 1397510 1430310 1391547 1344188 1374838 1457306 1492067 1441561 1360872 1304657
9019A304657l4382k2595J0669M2596J4298m9209m6211L4259O4971k5094j16981
$$ 1304657 1270275 1247680 1258349 1300945 1315243 1266034 1219823 1254082 1319053 1293959 1176978
9008A176978p3443M4524P2569o775o5286m7099j7809j071N5818J22238O9932j04621
$$ 1176978 1103535 1148059 1220628 1213853 1148567 1101468 1083659 1082588 1138406 1260644 1330576 1225955
8996A225955k01520p6273J38712J99853O3651r4010j25686n8041L061J2993N718
$$ 1225955 1024435 948162 1086874 1286727 1350378 1256368 1130682 1072641 1075702 1088695 1094413
8985A094413K0643M1795J4195o8323j13874l1371J22446J78369O5894r3838j51029
$$ 1094413 1115056 1156851 1171046 1102723 988849 957478 1079924 1258293 1324187 1230349 1079320
8974A079320r9971k8166K3148N9974O2034J1420m0532l0409J4598J7962k0739
$$ 1079320 979349 951183 974331 1034305 1096339 1107759 1067227 1036818 1051416 1069378 1048639
8963A048639l1026P194L9209L7374L7843N4331L7887l6611j06571r4020n457Q0653
$$ 1048639 1017613 1024807 1064016 1101390 1139233 1193564 1231451 1194840 1088269 994249 988792 1069445
8951A069445J02554O2242N369j9849k99K4832K320n9620p7660P585J28944J40969
$$ 1069445 1171999 1234241 1239610 1219761 1219462 1244294 1246614 1186994 1109334 1116919 1245863 1386832
8939A386832m120j67798j65561J2193J79042J71404L1052p4426o2483L825L7539
$$ 1386832 1382712 1214914 1049353 1061546 1240588 1411992 1443044 1368618 1306135 1309960 1347499
8928A347499K3628j0549m1802m5243m468M6810M5764j6130q0044j00937q2705
$$ 1347499 1371127 1360578 1318776 1273533 1269065 1315875 1361639 1345509 1265465 1164528 1081823
8917A081823k6913P2052J59680J42851K2825q0793q9339n5278l4858J5185J16439
$$ 1081823 1054910 1126962 1286642 1429493 1452318 1371525 1282186 1226908 1192050 1207235 1323674
8906A323674J56814M3880j08000j11739J2467O9395o241o5547n330P0363L9472
$$ 1323674 1480488 1524368 1416368 1304629 1317096 1386491 1380250 1314703 1309373 1379736 1419208
8895A419208l7589l3239L6657N9151J9777P678M4433M3801l5316j07160q2020
$$ 1419208 1381619 1348380 1385037 1444188 1463965 1471643 1516076 1559877 1524561 1417401 1335381
8884A335381N806N3981K7726k1381m2511l0176M098M2645M5033j5076q3752o7040
$$ 1335381 1341187 1395168 1422894 1401513 1359002 1328826 1332924 1375569 1420602 1405526 1321774 1254734
8872A254734L2014R0774L4443n0238m9988J056J029k5809K3879J13860Q8715n5200
$$ 1254734 1286748 1377522 1411965 1361727 1311739 1312795 1313824 1288015 1311894 1425754 1514469 1459269
8860A459269j19037q173J00451L4323r7329q2741N9710J33577P3858k222j7903
$$ 1459269 1340232 1332059 1432510 1466833 1369504 1286763 1346473 1480050 1553908 1551686 1533783
8849A533783j5139j8631K486L2348K2061K574L5787P1764J9356o3096l8343N9972
$$ 1533783 1518644 1500013 1502499 1534847 1556908 1559482 1595269 1667033 1686389 1623293 1584950 1644922
8837A644922O3869l1967m9304N1166Q0923m7594j51248p7324M7537M2903m1051
$$ 1644922 1708791 1676824 1627520 1678686 1759609 1712015 1560767 1483443 1530980 1573883 1532832
8826A532832n5871j2088n161j5414K0859N2342J4895j4342M3335Q3241j8384j53410
$$ 1532832 1476961 1464873 1459712 1444298 1465157 1517499 1532394 1518052 1561387 1644628 1626244 1472834
8814A472834j24726L4487J20576Q1246L4512J1550n5689j08888r071J67323J65328
$$ 1472834 1348108 1382595 1503171 1584417 1618929 1630479 1574790 1465902 1456831 1624154 1789482
8803A789482m2976j66770l0294J55726J24043n8590j34402l9150O9247Q2167M5029
$$ 1789482 1746506 1579736 1549442 1705168 1829211 1770621 1636219 1597069 1666316 1748483 1793512
8792A793512K1633J1636O101J5478L0993K6668L377r727P205M2690N6222J3666
$$ 1793512 1815145 1826781 1832882 1848360 1879353 1906021 1909398 1899671 1906876 1949566 2005788 2019454
8780B019454m9141l8068O2233J24539N7332k6248K1049J08391L5520j33093j15425
$$ 2019454 1970313 1932245 1994478 2119017 2176349 2150101 2171150 2279541 2315061 2181968 2066543
8769B066543J15794K29256M6749j52759p0331J43788J59424n289p5382k416K0210
$$ 2066543 2182337 2411593 2458342 2305583 2235252 2379040 2538464 2533175 2457793 2455377 2475587
8758B475587l4206J5100J69710J90392J0274j19163l1702R5707O5574j5090M3664
$$ 2475587 2441381 2456481 2626191 2816583 2826857 2707694 2675992 2771699 2837273 2822183 2865847
8747B865847J64548J32036m2577j35551m9204P6379R4268K5858k3391k691O2928
$$ 2865847 3030395 3162431 3119854 2984303 2935099 3011478 3105746 3131604 3108213 3105522 3168450
8736C168450J12923R5723K4226k1286R351O5736P7013N9708P4318J12569J13248
$$ 3168450 3281373 3377096 3401322 3380036 3389387 3455123 3532136 3591844 3666162 3778731 3891979
8725C891979O8898L3008L1758M5553O8790J09483J33784R3211J5633q138N2043
$$ 3891979 3960877 3993885 4025643 4071196 4139986 4249469 4383253 4476464 4492097 4483959 4536002
8714D536002J21827J24352O9186J8827J7461O8600J33335J43270P6061K1806Q9203
$$ 4536002 4657829 4782181 4851367 4870194 4887655 4956255 5089590 5232860 5308921 5330727 5419930
8703E419930K26124K44008Q2173o6988j0363J60224J96434O2726k0421P1737J77513
$$ 5419930 5646054 5890062 5972235 5905247 5894884 6055108 6251542 6314268 6293847 6365584 6543097
8692F543097J16821k2078l6712O1603Q7692R166K957J44877K54011J61478k0292
$$ 6543097 6659918 6637840 6601128 6662731 6750423 6759589 6762546 6907423 7161434 7322912 7302620
8681G302620m9288J13254K73135K69801J43039L9201N0869J55003K42011K14943
$$ 7302620 7253332 7366586 7639721 7909522 8052561 8091762 8142631 8297634 8539645 8754588
8671H754588J12640R5183K36557L87664L54534J72613O6136J40191K59844K69360
$$ 8754588 8867228 8962411 9198968 9586632 9941166 10113779 10179915 10320106 10579950 10849310
8661A0849310J95673J64773K18495K94262L20384K69546J71672J13367J59118
$$ 10849310 11044983 11209756 11428251 11722513 12042897 12312443 12484115 12597482 12756600
8652A2756600K40582K10414N1060p2173l9345M5931J5635j06885j49858n4802
$$ 12756600 12997182 13207596 13258656 13186483 13147138 13193069 13208704 13101819 12951961 12897159
8642A2897159M8100L6011n4631j07858p1489K0912J05625J26049O7312m117K2508
$$ 12897159 12945259 12981270 12926639 12818781 12747292 12768204 12873829 12999878 13067190 13063073 13085581
8631A3085581J75269L33589L47487K29972J74986L33403N94245O70165M35885
$$ 13085581 13260850 13594439 13941926 14171898 14346884 14680287 15274532 15944697 16380582
8622A6380582J07177k860J36589K53417J28450j59437l90728m84526n24536n86417
$$ 16380582 16487759 16484899 16621488 16874905 17003355 16843918 16453190 15968664 15444128 14857711
8612A4857711o51532o64668n96062m63495l44503l27231l94491m09410k85906
$$ 14857711 14206179 13541511 12945449 12481954 12137451 11810220 11415729 11006319 10720413
8603A0720413j20009o8123j42149k20870k28130j95256j66081j43755j29927j27752
$$ 10720413 10600404 10532281 10390132 10169262 9941132 9745876 9579795 9436040 9306113 9178361
8593I178361j06867m2760K0187K5112L913L2379J01162J31134J07534R3976J15318
$$ 9178361 9071494 9028734 9048921 9074033 9077946 9110325 9211487 9342621 9450155 9544131 9659449
8582I659449J35379J56804K31379L52865M44665M79070N18125O20747P90227R96203
$$ 9659449 9794828 9951632 10183011 10535876 10980541 11459611 11977736 12598483 13388710 14384913
8572A4384913J140956J045164O40621J72629N58J44053K33622l655m22435p44140
$$ 14384913 15525869 16571033 17211654 17384283 17384841 17528894 17762516 17758861 17336426 16592286
8562A6592286r35878j104120j199310j096827q74879p41025p11574o10170l91308
$$ 16592286 15656408 14552288 13352978 12256151 11381272 10640247 9928673 9318503 8927195
8553H927195k30786k43785l18164l11769k50554k31379k53806k51528k06090j44574
$$ 8927195 8696409 8452624 8134460 7822691 7572137 7340758 7086952 6835424 6629334 6484760
8543F484760q6764n6297q3559j44689j56319q1215J2024L8374N23l1804o469P1158
$$ 6484760 6397996 6341699 6258140 6113451 5957132 5875917 5887941 5926315 5926838 5895034 5888565 5959723
8531E959723J43526J37598M6186k7909K3653J64693K52088K34205K15008K90039
$$ 5959723 6103249 6240847 6287033 6259124 6282777 6447470 6699558 6933763 7148771 7438810
8521G438810M16647M95221M88036M01399K41215N8359m4693l7805k9632j30300
$$ 7438810 7855457 8350678 8838714 9240113 9481328 9539687 9494994 9457189 9427557 9297257
8511I297257l09848m71189n88142o68550o53615m93267k85049j91909k26714k56188
$$ 9297257 8987409 8516220 7928078 7259528 6605913 6112646 5827597 5635688 5408974 5152786
8501E152786k22832k08118k39818k07068o4652K5130r2452k98823l30438j43988
$$ 5152786 4929954 4721836 4482018 4274950 4210298 4235428 4142976 3844153 3513715 3369727
8491C369727K6598N404j03013j11157k8874o810p7773j16292m9243L6283L5039
$$ 3369727 3396325 3401729 3298716 3187559 3158685 3151875 3074102 2957810 2908567 2944850 2979889
8480B979889l5351r2424j04884q7664m8543o892r188n5395o2321J9157R6961M6069
$$ 2979889 2944538 2852114 2747230 2659566 2611023 2604131 2594943 2539548 2477227 2496384 2593345 2639414
8468B639414j02572j87340j27894j1065M8220L5959Q60k5960l1618j0483Q191
$$ 2639414 2536842 2349502 2221608 2210543 2258763 2294722 2295582 2269622 2238004 2227521 2235712
8457B235712j9572p4031p6895p200N5887M6359o95k4083l2655o1871q8283o2937
$$ 2235712 2216140 2142109 2065214 2058014 2113901 2160260 2159565 2135482 2102827 2040956 1952673 1889736
8445A889736p53L1152L399m5111n8476j7394M2614N2575j8264j02503r6195M629
$$ 1889736 1888983 1920135 1923534 1878423 1819947 1802553 1845167 1897742 1879478 1776975 1680780 1685409
8433A685409R1299Q7781L4101o482l4200n4301k6581M8814Q0861J7858m7667j3305
$$ 1685409 1776708 1864489 1898590 1892108 1857908 1803607 1777026 1825840 1906701 1924559 1876892 1863587
8421A863587N9481L3795q2434j41616p3522K6765M3215k4949r0361p4041K6943
$$ 1863587 1923068 1956863 1874429 1732813 1659291 1686056 1729271 1704322 1613961 1539920 1566863
8410A566863J19049Q9825m0445j07422k2835P7641K8699j04848j29143k4615M8675
$$ 1566863 1685912 1775737 1735292 1627870 1605035 1682676 1711375 1606527 1477384 1452769 1501444
8399A501444K5527K433J8653q490q1875p7130K2458N4747m7150j11771n593J28302
$$ 1501444 1526971 1529404 1548057 1539567 1457692 1380562 1403020 1457767 1410617 1298846 1293253 1421555
8387A421555Q6221q1474j61780q7686K3744P2555N4901m245o0673m9584J1809
$$ 1421555 1507776 1426302 1264522 1176836 1200580 1273135 1328036 1323791 1263118 1213534 1225343
8376A225343K741j06689j56570l8200R8206O7789m3263l3527N6462K8303r1116
$$ 1225343 1228084 1121395 964825 926625 1024831 1092620 1049357 1015830 1072292 1100595 1009479
8365A009479p2732R7133J51372k1525j81221j17586L7930O5970P63J935N3564
$$ 1009479 936747 1033880 1185252 1163727 982506 864920 902850 968820 969583 971518 1025082
8354A025082K4949p0267r4436j6531N7221N7144J1638m0912q1114p4430j1848
$$ 1025082 1050031 979764 885328 868797 926018 983162 994800 953888 872774 798344 786496
8343G86496M2365K9693j3716k2894m367O025J8789M1364K8300k9453m9304J0058
$$ 786496 828861 858554 844838 821944 817577 823602 842391 883755 912055 882602 833298 843356
8331H43356N4117M850n5576l0834P089m7910j16306n2112Q7421J16377K6756j4105
$$ 843356 897473 902323 846747 815913 823002 775092 658786 606674 694095 810472 837228 823123
8319H23123L7447M8019k4935n5853K351K7641l4761o6093k043M4111p29l3133
$$ 823123 860570 908589 883654 827801 830152 857793 823032 756939 754896 799007 798278 765145
8307G65145J7749M5871k1886p1080k0117O320q0288j19497K5233J67109O7279
$$ 765145 782894 828765 806879 735799 715682 722002 641714 522217 547450 714559 781838
8296G81838j38887j30154P0329J28702m2882j48446r656J52991J02346n0932p7629
$$ 781838 642951 512797 583126 711828 668946 520500 510844 663835 766181 715249 637620
8285F37620N050K8709k6772n3397k7827n338J9631P0782P6861k9323j52478j38344
$$ 637620 642670 671379 644607 591210 563383 558045 577676 648458 725319 695996 543518 405174
8273D05174n17J03606R5705L8601j64j3838l18L7736M8441n687o2142m3819N707
$$ 405174 404657 508263 603968 642569 642405 628567 628249 665985 714426 708739 646597 602778 608485
8260F08485n325m8100k2303N2015N5941j6545l9389K9025P9283M5959M446R277
$$ 608485 603160 555060 532757 584772 640713 624168 584779 613804 693087 739046 743492 752769
8248G52769k523o0646o9859J8132Q0833R987r4672p1469M8289R5759K3095n6412
$$ 752769 750246 689600 619741 637873 718706 728693 634021 562552 610841 706600 729695 673283
8236F73283o5334m4917l5447j2972K6832L7099Q872j968K8098M8736K6647J795
$$ 673283 607949 563032 527585 514613 541445 578544 587416 585448 613546 662282 688929 690724
8224F90724J2507L0099J3644k0171k5858N179L9427L8479j0529p2862p8002p21
$$ 690724 703231 733330 746974 726803 700945 706124 745551 784030 773501 700639 622637 621916
8212F21916P5320M5023n9820q9208J2961J14555Q7801M646J5801R0381M4887j49141
$$ 621916 697236 742259 682439 593231 606192 720747 808548 813194 828995 919376 964263 815122
8200H15122k60472j07384J54010K13691K5606j42500r2382N6973R2601J8439j0659
$$ 815122 554650 447266 601276 814967 840573 698073 605691 662664 755265 773704 763045
8189G63045L7546N3769M569j9411J6219L4722J2341L0887J02360J02683k5123
$$ 763045 800591 854360 858929 839518 855737 890459 902800 933687 1036047 1138730 1113607
8178A113607j46517j27487k3555M2644O5692Q3352M7939o0447j09382j02J20248
$$ 1113607 967090 839603 816048 858692 924384 1007736 1055675 995228 885846 885744 1005992
8167A005992N7098r6992q4569R5996J76203M5751q9950n9619L1262L1744j1864
$$ 1005992 1063090 966098 881529 977525 1153728 1199479 1109529 1049910 1081172 1112916 1101052
8156A101052J545L3576J7415O095N0974O9635j0071r7362p8779L435N2470P6163
$$ 1101052 1102597 1136173 1153588 1159683 1210657 1280292 1270221 1172859 1094080 1097515 1149985 1226148
8144A226148J04384P6994k9672r2506k5914M9968M352p1645k8883P1570Q1566
$$ 1226148 1330532 1407526 1377854 1285348 1259434 1309402 1313754 1242109 1213226 1284796 1366362
8133A366362L8529O1493Q2068l1767j64253q7895J24531J64805k0041j45522n7126
$$ 1366362 1404891 1466384 1548452 1516685 1352432 1264537 1389068 1553873 1533832 1388310 1331184
8122A331184O1301N2989L1455J00556J32368K4481p6476k6740N5541Q077q4765
$$ 1331184 1392485 1445474 1476929 1577485 1709853 1734334 1657858 1631118 1686659 1694736 1609971
8111A609971n2159O3819J01746N5845L6931N2442L0689j0685m351K6147K3458
$$ 1609971 1557812 1621631 1723377 1779222 1816153 1868595 1899284 1888599 1884248 1910395 1933853
8100A933853J5864L8871L9739J153K7970J47460J77779J107j86615j48178J0454
$$ 1933853 1949717 1988588 2028327 2029480 2057450 2204910 2382689 2383796 2197181 2049003 2059457
8089B059457J7111j13429j30830L326O5588k6670r6543m3793Q562j6264j7833
$$ 2059457 2076568 1963139 1832309 1835635 1901223 1874553 1778010 1734217 1742779 1726515 1708682
8078A708682M5196N4204k2793l6585O7841J25249L9496l6452K7100J03932M0625
$$ 1708682 1753878 1808082 1785289 1748704 1816545 1941794 1981290 1944838 1971938 2075870 2116495
8067B116495p2327o4101L3770P2949L6653R976J356k6608l3385K6100Q1262N1381
$$ 2116495 2044168 1980067 2013837 2086786 2123439 2133415 2134771 2108163 2074778 2100878 2182140 2233521
8055B233521n653O937N8852O8848N9568Q7358J03292M0873l6147l2163Q899q534
$$ 2233521 2227868 2234805 2293657 2362505 2422073 2509431 2612723 2653596 2617449 2585286 2594185 2585651
8043B585651m7562j4253M9924L2987m2016n9254j7218j0117l2649J0501J13447
$$ 2585651 2538089 2523836 2573760 2606747 2564731 2505477 2488259 2478142 2445493 2455994 2569441
8032B569441J64775J32077Q9691P0464M6076L7429Q1677J11125L8106o3613n1672
$$ 2569441 2734216 2866293 2955984 3026448 3072524 3109953 3191630 3302755 3340861 3277248 3225576
8021C225576L2110J3657j14713j80238j34858j27817k16070k49063j39768k3430
$$ 3225576 3257686 3271343 3156630 2976392 2841534 2713717 2497647 2248584 2108816 2085386
8011B085386k3492o3115m4048k3287o2858p9217q267L4669n9986j79642j47165
$$ 2085386 2061894 1998779 1954731 1931444 1868586 1789369 1781102 1815771 1755785 1576143 1428978
8000A428978Q36P7621K2256n7243p3046m2721j4613k3698q6436j51028j16090
$$ 1428978 1429814 1507435 1529691 1472448 1399402 1356681 1342068 1318370 1231934 1080906 964816
7989I64816J4384Q6022R954q2411l7656O9531N7330o6359j21041l8494N2424L3850
$$ 964816 979200 1065222 1075176 992765 955109 1024640 1081970 1015611 894570 856076 908500 942350
7977I42350n8073j18697r0649J3036J11453R9268k6324j24141q8526n384j0534
$$ 942350 884277 765580 674931 687967 799420 898688 872364 748223 659697 654313 643779
7966F43779o8682m8903M1455P8678M1350J9133K1859k5284r5499o9655M3381Q9054
$$ 643779 575097 526194 567649 646327 687677 706810 728669 703385 607886 538231 581612 670666
7954F70666J0872p1421p3092m9834l9291J0251Q1311N3500p5362j25763j4026
$$ 670666 681538 610117 537025 487191 447900 458151 539462 592962 517600 391837 377811
7943C77811Q9852K7518r4065q8550J3674N3898K2854L7150R8154Q4849k2457r4352
$$ 377811 467663 495181 401116 312566 326240 380138 402992 440142 538296 623145 600688 506336
7931E06336n2195K6745M0014r852n2245m4985p670N900k8374n5095k156Q8069
$$ 506336 454141 480886 520900 511048 458803 413818 406148 412048 383674 328579 326423 414492
7919D14492Q2388l8486j16020m6262M7565J2128p9794n4793N9616P9756j6687
$$ 414492 496880 458394 342374 296112 343677 355805 276011 221218 280834 360590 343903
7908C43903n4195L0486P3899k9400j32536o9247P2882Q7644l1785r4398o686J02153
$$ 343903 289708 320194 394093 364693 232157 162910 235792 323436 291651 197253 190567 292720
$$ [...]
##END NTUPLES=NMR SPECTRUM
##END=
